EESchema Schematic File Version 4
EELAYER 30 0
EELAYER END
$Descr A4 11693 8268
encoding utf-8
Sheet 4 5
Title ""
Date ""
Rev ""
Comp ""
Comment1 ""
Comment2 ""
Comment3 ""
Comment4 ""
$EndDescr
$Comp
L Device:C C?
U 1 1 5D691AA7
P 4700 4000
AR Path="/5D691AA7" Ref="C?"  Part="1" 
AR Path="/5D62837F/5D691AA7" Ref="C28"  Part="1" 
AR Path="/5D9D4420/5D691AA7" Ref="C25"  Part="1" 
F 0 "C28" H 4815 4046 50  0000 L CNN
F 1 "1u" H 4815 3955 50  0000 L CNN
F 2 "Capacitor_SMD:C_0603_1608Metric" H 4738 3850 50  0001 C CNN
F 3 "" H 4700 4000 50  0001 C CNN
F 4 "Kemet" H 4700 4000 50  0001 C CNN "Manufacturer"
F 5 "C0603C105K8PACTU" H 4700 4000 50  0001 C CNN "Part Number"
	1    4700 4000
	1    0    0    -1  
$EndComp
$Comp
L Device:C C?
U 1 1 5D691AAD
P 5050 4000
AR Path="/5D691AAD" Ref="C?"  Part="1" 
AR Path="/5D62837F/5D691AAD" Ref="C29"  Part="1" 
AR Path="/5D9D4420/5D691AAD" Ref="C26"  Part="1" 
F 0 "C29" H 5165 4046 50  0000 L CNN
F 1 "10n" H 5165 3955 50  0000 L CNN
F 2 "Capacitor_SMD:C_0201_0603Metric" H 5088 3850 50  0001 C CNN
F 3 "" H 5050 4000 50  0001 C CNN
F 4 "TDK" H 5050 4000 50  0001 C CNN "Manufacturer"
F 5 "CGA1A2X7R1A103K030BA" H 5050 4000 50  0001 C CNN "Part Number"
	1    5050 4000
	1    0    0    -1  
$EndComp
$Comp
L Device:C C?
U 1 1 5D691AB3
P 6650 3800
AR Path="/5D691AB3" Ref="C?"  Part="1" 
AR Path="/5D62837F/5D691AB3" Ref="C30"  Part="1" 
AR Path="/5D9D4420/5D691AB3" Ref="C27"  Part="1" 
F 0 "C30" H 6765 3846 50  0000 L CNN
F 1 "1u" H 6765 3755 50  0000 L CNN
F 2 "Capacitor_SMD:C_0603_1608Metric" H 6688 3650 50  0001 C CNN
F 3 "" H 6650 3800 50  0001 C CNN
F 4 "Kemet" H 6650 3800 50  0001 C CNN "Manufacturer"
F 5 "C0603C105K8PACTU" H 6650 3800 50  0001 C CNN "Part Number"
	1    6650 3800
	1    0    0    -1  
$EndComp
$Comp
L Device:R R?
U 1 1 5D691AB9
P 6250 3700
AR Path="/5D691AB9" Ref="R?"  Part="1" 
AR Path="/5D62837F/5D691AB9" Ref="R9"  Part="1" 
AR Path="/5D9D4420/5D691AB9" Ref="R7"  Part="1" 
F 0 "R9" H 6320 3746 50  0000 L CNN
F 1 "38.3k" H 6320 3655 50  0000 L CNN
F 2 "Resistor_SMD:R_0201_0603Metric" V 6180 3700 50  0001 C CNN
F 3 "" H 6250 3700 50  0001 C CNN
F 4 "Yageo" H 6250 3700 50  0001 C CNN "Manufacturer"
F 5 "RC0201FR-0738K3L" H 6250 3700 50  0001 C CNN "Part Nmber"
F 6 "RC0201FR-0718K7L" H 6250 3700 50  0001 C CNN "Bak"
	1    6250 3700
	1    0    0    -1  
$EndComp
Wire Wire Line
	5300 3500 5200 3500
Wire Wire Line
	5200 3500 5200 3600
Connection ~ 5200 3600
Wire Wire Line
	5200 3600 5300 3600
Wire Wire Line
	5300 3700 5200 3700
Wire Wire Line
	5200 3700 5200 3600
Wire Wire Line
	5600 4200 5600 4300
Wire Wire Line
	5050 4150 5050 4300
Wire Wire Line
	5050 4300 5300 4300
Connection ~ 5600 4300
Wire Wire Line
	5300 4000 5300 4300
Connection ~ 5300 4300
Wire Wire Line
	5300 4300 5600 4300
Wire Wire Line
	5050 3850 5050 3800
Wire Wire Line
	5050 3800 5300 3800
Wire Wire Line
	4700 4150 4700 4300
Wire Wire Line
	4700 4300 5050 4300
Connection ~ 5050 4300
$Comp
L Device:R R?
U 1 1 5D691AD8
P 6250 4100
AR Path="/5D691AD8" Ref="R?"  Part="1" 
AR Path="/5D62837F/5D691AD8" Ref="R10"  Part="1" 
AR Path="/5D9D4420/5D691AD8" Ref="R8"  Part="1" 
F 0 "R10" H 6320 4146 50  0000 L CNN
F 1 "12.1k" H 6320 4055 50  0000 L CNN
F 2 "Resistor_SMD:R_0201_0603Metric" V 6180 4100 50  0001 C CNN
F 3 "" H 6250 4100 50  0001 C CNN
F 4 "Yageo" H 6250 4100 50  0001 C CNN "Manufacturer"
F 5 "RC0201FR-0712K1L" H 6250 4100 50  0001 C CNN "Part Number"
	1    6250 4100
	1    0    0    -1  
$EndComp
Connection ~ 5200 3500
Wire Wire Line
	4700 3500 4700 3850
Wire Wire Line
	4700 3500 5200 3500
$Comp
L bids_symbol:LP38798-ADJ U?
U 1 1 5D691AE1
P 5600 3750
AR Path="/5D691AE1" Ref="U?"  Part="1" 
AR Path="/5D62837F/5D691AE1" Ref="U19"  Part="1" 
AR Path="/5D9D4420/5D691AE1" Ref="U18"  Part="1" 
F 0 "U19" H 5600 4265 50  0000 C CNN
F 1 "LP38798-ADJ" H 5600 4174 50  0000 C CNN
F 2 "000_footprint:LP38798_WSON-12-1EP_4x4mm_P0.5mm_EP2.6x3mm_ThermalVias" H 5600 3750 50  0001 C CNN
F 3 "" H 5600 3750 50  0001 C CNN
F 4 "Texas Instruments" H 5600 3750 50  0001 C CNN "Manufacturer"
F 5 "LP38798SD-ADJ/NOPB" H 5600 3750 50  0001 C CNN "Part Number"
	1    5600 3750
	1    0    0    -1  
$EndComp
Wire Wire Line
	5900 3900 6250 3900
Wire Wire Line
	6250 3900 6250 3850
Wire Wire Line
	6250 3950 6250 3900
Connection ~ 6250 3900
Wire Wire Line
	6250 4250 6250 4300
Wire Wire Line
	6250 4300 5900 4300
Wire Wire Line
	5900 3500 6000 3500
Wire Wire Line
	6650 3650 6650 3500
Connection ~ 6650 3500
Wire Wire Line
	5900 3600 6000 3600
Wire Wire Line
	6000 3600 6000 3500
Connection ~ 6000 3500
Wire Wire Line
	6000 3500 6650 3500
Wire Wire Line
	5900 3700 6000 3700
Wire Wire Line
	6000 3700 6000 3600
Connection ~ 6000 3600
Wire Wire Line
	5900 3800 6100 3800
Wire Wire Line
	6100 3800 6100 3550
Wire Wire Line
	6100 3550 6250 3550
Wire Wire Line
	6650 3950 6650 4300
Wire Wire Line
	6650 4300 6250 4300
Connection ~ 6250 4300
Wire Wire Line
	5900 4000 5900 4300
Connection ~ 5900 4300
Wire Wire Line
	5900 4300 5600 4300
Wire Wire Line
	6650 3500 7050 3500
Text HLabel 7050 3500 2    50   Output ~ 0
Vout5V0
Text HLabel 4500 3500 0    50   Input ~ 0
Vin6V3
Text HLabel 4500 4300 0    50   Input ~ 0
GND
Wire Wire Line
	4500 3500 4700 3500
Connection ~ 4700 3500
Wire Wire Line
	4500 4300 4700 4300
Connection ~ 4700 4300
$EndSCHEMATC
