EESchema Schematic File Version 4
EELAYER 30 0
EELAYER END
$Descr A4 11693 8268
encoding utf-8
Sheet 1 5
Title ""
Date ""
Rev ""
Comp ""
Comment1 ""
Comment2 ""
Comment3 ""
Comment4 ""
$EndDescr
Text Notes 10750 1200 2    208  ~ 0
IF1
Text Notes 9900 5550 0    208  ~ 0
RF
$Comp
L Mechanical:MountingHole H1
U 1 1 5CF390EE
P 700 7600
F 0 "H1" H 800 7646 50  0000 L CNN
F 1 "MountingHole" H 800 7555 50  0000 L CNN
F 2 "MountingHole:MountingHole_3.2mm_M3" H 700 7600 50  0001 C CNN
F 3 "" H 700 7600 50  0001 C CNN
	1    700  7600
	1    0    0    -1  
$EndComp
$Comp
L Mechanical:MountingHole H2
U 1 1 5CF395B1
P 1000 7600
F 0 "H2" H 1100 7646 50  0000 L CNN
F 1 "MountingHole" H 1100 7555 50  0000 L CNN
F 2 "MountingHole:MountingHole_3.2mm_M3" H 1000 7600 50  0001 C CNN
F 3 "" H 1000 7600 50  0001 C CNN
	1    1000 7600
	1    0    0    -1  
$EndComp
$Comp
L Mechanical:MountingHole H3
U 1 1 5CF398A4
P 1300 7600
F 0 "H3" H 1400 7646 50  0000 L CNN
F 1 "MountingHole" H 1400 7555 50  0000 L CNN
F 2 "MountingHole:MountingHole_3.2mm_M3" H 1300 7600 50  0001 C CNN
F 3 "" H 1300 7600 50  0001 C CNN
	1    1300 7600
	1    0    0    -1  
$EndComp
$Comp
L Mechanical:MountingHole H4
U 1 1 5CF39C94
P 1600 7600
F 0 "H4" H 1700 7646 50  0000 L CNN
F 1 "MountingHole" H 1700 7555 50  0000 L CNN
F 2 "MountingHole:MountingHole_3.2mm_M3" H 1600 7600 50  0001 C CNN
F 3 "" H 1600 7600 50  0001 C CNN
	1    1600 7600
	1    0    0    -1  
$EndComp
$Comp
L bids_symbol:142-0771-831 J1
U 1 1 5D28837F
P 1000 5850
F 0 "J1" H 1078 6075 50  0000 C CNN
F 1 "142-0771-831" H 1078 5984 50  0000 C CNN
F 2 "000_footprint:Rf_SMA_Receptical_SMD_EDGE_142-0771-831" H 1200 6050 60  0001 L CNN
F 3 "" H 1200 6150 60  0001 L CNN
F 4 "Cinch Connectivity Solutions Johnson" H 1200 6950 60  0001 L CNN "Manufacturer"
F 5 "142-0771-831" H 1000 5850 50  0001 C CNN "Part Number"
	1    1000 5850
	1    0    0    -1  
$EndComp
$Comp
L power:GND #PWR0101
U 1 1 5D3889C3
P 1000 6150
F 0 "#PWR0101" H 1000 5900 50  0001 C CNN
F 1 "GND" H 1005 5977 50  0000 C CNN
F 2 "" H 1000 6150 50  0001 C CNN
F 3 "" H 1000 6150 50  0001 C CNN
	1    1000 6150
	1    0    0    -1  
$EndComp
Wire Wire Line
	1000 6050 1000 6150
Text Notes 800  5500 0    208  ~ 0
LO
Wire Wire Line
	5150 5650 5050 5650
Wire Wire Line
	5150 5750 5050 5750
Wire Wire Line
	5050 5750 5050 5650
Wire Wire Line
	5150 5950 5050 5950
Wire Wire Line
	5050 5950 5050 5750
Connection ~ 5050 5750
Wire Wire Line
	5150 6050 5050 6050
Wire Wire Line
	5050 6050 5050 5950
Connection ~ 5050 5950
Wire Wire Line
	5150 6150 5050 6150
Wire Wire Line
	5050 6150 5050 6050
Connection ~ 5050 6050
Wire Wire Line
	6050 6450 6050 6550
Wire Wire Line
	6050 6550 5950 6550
Wire Wire Line
	5050 6550 5050 6150
Connection ~ 5050 6150
Wire Wire Line
	5450 6450 5450 6550
Connection ~ 5450 6550
Wire Wire Line
	5450 6550 5050 6550
Wire Wire Line
	5550 6450 5550 6550
Connection ~ 5550 6550
Wire Wire Line
	5550 6550 5450 6550
Wire Wire Line
	5650 6450 5650 6550
Connection ~ 5650 6550
Wire Wire Line
	5650 6550 5550 6550
Wire Wire Line
	5750 6450 5750 6550
Connection ~ 5750 6550
Wire Wire Line
	5750 6550 5650 6550
Wire Wire Line
	5850 6450 5850 6550
Connection ~ 5850 6550
Wire Wire Line
	5850 6550 5750 6550
Wire Wire Line
	5950 6450 5950 6550
Connection ~ 5950 6550
Wire Wire Line
	5950 6550 5850 6550
Wire Wire Line
	6250 5650 6350 5650
Wire Wire Line
	6350 5650 6350 5250
Wire Wire Line
	6250 5750 6350 5750
Wire Wire Line
	6350 5750 6350 5650
Connection ~ 6350 5650
Wire Wire Line
	6250 5950 6350 5950
Wire Wire Line
	6350 5950 6350 5750
Connection ~ 6350 5750
Wire Wire Line
	6250 6050 6350 6050
Wire Wire Line
	6350 6050 6350 5950
Connection ~ 6350 5950
Wire Wire Line
	6250 6150 6350 6150
Wire Wire Line
	6350 6150 6350 6050
Connection ~ 6350 6050
Wire Wire Line
	6250 5850 6500 5850
$Comp
L bids_symbol:Attenuator_GAT-0+ U1
U 1 1 5D72B7EB
P 1900 5900
F 0 "U1" H 2094 5996 50  0000 L CNN
F 1 "PAT0510S-C-0DB-T10" H 1450 5700 50  0000 L CNN
F 2 "000_footprint:RF_Attenuator_Susumu_PAT0510S_with_Transition_Pad" H 1900 5900 50  0001 C CNN
F 3 "" H 1900 5900 50  0001 C CNN
F 4 "Susumu" H 0   0   50  0001 C CNN "Manufacturer"
F 5 "PAT0510S-C-0DB-T10" H 1900 5900 50  0001 C CNN "Part Number"
	1    1900 5900
	1    0    0    -1  
$EndComp
$Comp
L bids_symbol:Attenuator_GAT-0+ U3
U 1 1 5D7316C1
P 4500 5900
F 0 "U3" H 4694 5996 50  0000 L CNN
F 1 "PAT0510S-C-0DB-T10" H 4050 5800 50  0000 L CNN
F 2 "000_footprint:RF_Attenuator_Susumu_PAT0510S_with_Transition_Pad" H 4500 5900 50  0001 C CNN
F 3 "" H 4500 5900 50  0001 C CNN
F 4 "Susumu" H 0   0   50  0001 C CNN "Manufacturer"
F 5 "PAT0510S-C-0DB-T10" H 4500 5900 50  0001 C CNN "Part Number"
	1    4500 5900
	1    0    0    -1  
$EndComp
$Comp
L Device:C C4
U 1 1 5D33B14E
P 5500 1800
F 0 "C4" H 5550 1900 50  0000 L CNN
F 1 "1.5p" H 5550 1700 50  0000 L CNN
F 2 "Capacitor_SMD:C_0402_1005Metric" H 5538 1650 50  0001 C CNN
F 3 "" H 5500 1800 50  0001 C CNN
F 4 "Yageo" H 5500 1800 50  0001 C CNN "Manufacturer"
F 5 "CC0402CRNPO9BN1R5" H 5500 1800 50  0001 C CNN "Part Number"
F 6 "Murata GRM1555C1H1R5CZ01" H 5500 1800 50  0001 C CNN "Bak"
	1    5500 1800
	1    0    0    -1  
$EndComp
$Comp
L Device:L L5
U 1 1 5D2804C3
P 7300 1350
F 0 "L5" H 7352 1396 50  0000 L CNN
F 1 "15u" H 7352 1305 50  0000 L CNN
F 2 "Inductor_SMD:L_1210_3225Metric" H 7300 1350 50  0001 C CNN
F 3 "" H 7300 1350 50  0001 C CNN
F 4 "Murata" H 7300 1350 50  0001 C CNN "Manufacturer"
F 5 "LQH32DN150K53L" H 7300 1350 50  0001 C CNN "Part Number"
	1    7300 1350
	1    0    0    -1  
$EndComp
$Comp
L power:GND #PWR0103
U 1 1 5D33B153
P 7850 1100
F 0 "#PWR0103" H 7850 850 50  0001 C CNN
F 1 "GND" H 7855 927 50  0000 C CNN
F 2 "" H 7850 1100 50  0001 C CNN
F 3 "" H 7850 1100 50  0001 C CNN
	1    7850 1100
	1    0    0    -1  
$EndComp
$Comp
L power:GND #PWR0104
U 1 1 5D33B14C
P 5500 2050
F 0 "#PWR0104" H 5500 1800 50  0001 C CNN
F 1 "GND" H 5505 1877 50  0000 C CNN
F 2 "" H 5500 2050 50  0001 C CNN
F 3 "" H 5500 2050 50  0001 C CNN
	1    5500 2050
	1    0    0    -1  
$EndComp
Wire Wire Line
	2550 6050 2550 6300
Connection ~ 2550 6050
Wire Wire Line
	2600 6050 2550 6050
Wire Wire Line
	2950 6250 2950 6300
Wire Wire Line
	2600 5850 2350 5850
Wire Wire Line
	2550 5950 2550 6050
Connection ~ 2550 5950
Wire Wire Line
	2600 5950 2550 5950
Wire Wire Line
	3350 5950 3350 6050
Connection ~ 3350 5950
Wire Wire Line
	3300 5950 3350 5950
Wire Wire Line
	3350 5750 3350 5950
Wire Wire Line
	3300 5750 3350 5750
Connection ~ 2950 6300
Wire Wire Line
	2550 6300 2950 6300
Wire Wire Line
	2550 5750 2550 5950
Wire Wire Line
	2600 5750 2550 5750
Wire Wire Line
	2350 6150 2350 6200
Wire Wire Line
	3300 5850 3500 5850
Connection ~ 3250 5150
Wire Wire Line
	3500 5150 3250 5150
$Comp
L Device:C C1
U 1 1 5D8C62B9
P 2950 5300
F 0 "C1" H 2750 5350 50  0000 L CNN
F 1 "0.01u" H 2650 5250 50  0000 L CNN
F 2 "Capacitor_SMD:C_0402_1005Metric" H 2988 5150 50  0001 C CNN
F 3 "" H 2950 5300 50  0001 C CNN
F 4 "Murata" H 2950 5300 50  0001 C CNN "Manufacturer"
F 5 "GRM155R71E103KA01D" H 2950 5300 50  0001 C CNN "Part Number"
	1    2950 5300
	1    0    0    -1  
$EndComp
$Comp
L Device:C C2
U 1 1 5D8C62C3
P 3250 5300
F 0 "C2" H 3365 5346 50  0000 L CNN
F 1 "10p" H 3365 5255 50  0000 L CNN
F 2 "Capacitor_SMD:C_0402_1005Metric" H 3288 5150 50  0001 C CNN
F 3 "" H 3250 5300 50  0001 C CNN
F 4 "Murata" H 3250 5300 50  0001 C CNN "Manufacturer"
F 5 "GJM1555C1H100JB01D" H 3250 5300 50  0001 C CNN "Part Number"
	1    3250 5300
	1    0    0    -1  
$EndComp
Wire Wire Line
	2950 5150 3250 5150
$Comp
L Device:L L2
U 1 1 5D8C62CE
P 3500 5300
F 0 "L2" H 3552 5346 50  0000 L CNN
F 1 "39n" H 3552 5255 50  0000 L CNN
F 2 "Inductor_SMD:L_0402_1005Metric" H 3500 5300 50  0001 C CNN
F 3 "" H 3500 5300 50  0001 C CNN
F 4 "TE Connectivity Passive Product" H 3500 5300 50  0001 C CNN "Manufacturer"
F 5 "36501E39NJTDG " H 3500 5300 50  0001 C CNN "Part Number"
F 6 "Coilcraft 0402CS-39NXGLW" H 3500 5300 50  0001 C CNN "Bak"
	1    3500 5300
	1    0    0    -1  
$EndComp
$Comp
L power:GND #PWR0105
U 1 1 5D8C62D8
P 3100 5450
F 0 "#PWR0105" H 3100 5200 50  0001 C CNN
F 1 "GND" H 3105 5277 50  0000 C CNN
F 2 "" H 3100 5450 50  0001 C CNN
F 3 "" H 3100 5450 50  0001 C CNN
	1    3100 5450
	1    0    0    -1  
$EndComp
Connection ~ 3100 5450
Wire Wire Line
	2950 5450 3100 5450
Wire Wire Line
	3250 5450 3100 5450
$Comp
L power:GND #PWR0106
U 1 1 5D8C62E5
P 2950 6300
F 0 "#PWR0106" H 2950 6050 50  0001 C CNN
F 1 "GND" H 2955 6127 50  0000 C CNN
F 2 "" H 2950 6300 50  0001 C CNN
F 3 "" H 2950 6300 50  0001 C CNN
	1    2950 6300
	1    0    0    -1  
$EndComp
$Comp
L Device:C C3
U 1 1 5D8C62EF
P 3650 5850
F 0 "C3" V 3398 5850 50  0000 C CNN
F 1 "100p" V 3489 5850 50  0000 C CNN
F 2 "Capacitor_SMD:C_0402_1005Metric" H 3688 5700 50  0001 C CNN
F 3 "" H 3650 5850 50  0001 C CNN
F 4 "Murata" V 3650 5850 50  0001 C CNN "Manufacturer"
F 5 "GRM1555C1H101JA01D" V 3650 5850 50  0001 C CNN "Part Number"
	1    3650 5850
	0    1    1    0   
$EndComp
$Comp
L Device:L L1
U 1 1 5D8C62F9
P 2350 6000
F 0 "L1" H 2402 6046 50  0000 L CNN
F 1 "18n" H 2402 5955 50  0000 L CNN
F 2 "Inductor_SMD:L_0402_1005Metric" H 2350 6000 50  0001 C CNN
F 3 "" H 2350 6000 50  0001 C CNN
F 4 "Murata" H 2350 6000 50  0001 C CNN "Manufacturer"
F 5 "LQG15HS18NJ02D" H 2350 6000 50  0001 C CNN "Part Number"
	1    2350 6000
	1    0    0    -1  
$EndComp
$Comp
L power:GND #PWR0107
U 1 1 5D8C6303
P 2350 6200
F 0 "#PWR0107" H 2350 5950 50  0001 C CNN
F 1 "GND" H 2355 6027 50  0000 C CNN
F 2 "" H 2350 6200 50  0001 C CNN
F 3 "" H 2350 6200 50  0001 C CNN
	1    2350 6200
	1    0    0    -1  
$EndComp
$Comp
L Device:C C6
U 1 1 5D28007B
P 6100 1600
F 0 "C6" V 5848 1600 50  0000 C CNN
F 1 "2.2u" V 5939 1600 50  0000 C CNN
F 2 "Capacitor_SMD:C_0603_1608Metric" H 6138 1450 50  0001 C CNN
F 3 "" H 6100 1600 50  0001 C CNN
F 4 "Samsung Electro-Mechanics" V 6100 1600 50  0001 C CNN "Manufacturer"
F 5 "CL10A225KO8NNNC " V 6100 1600 50  0001 C CNN "Part Number"
F 6 "Murata GRM188R61C225KE15" V 6100 1600 50  0001 C CNN "Bak"
	1    6100 1600
	0    1    1    0   
$EndComp
$Comp
L power:GND #PWR0108
U 1 1 5D65BC51
P 9050 2100
F 0 "#PWR0108" H 9050 1850 50  0001 C CNN
F 1 "GND" H 9055 1927 50  0000 C CNN
F 2 "" H 9050 2100 50  0001 C CNN
F 3 "" H 9050 2100 50  0001 C CNN
	1    9050 2100
	1    0    0    -1  
$EndComp
$Comp
L power:GND #PWR0109
U 1 1 5D33B15F
P 10550 1900
F 0 "#PWR0109" H 10550 1650 50  0001 C CNN
F 1 "GND" H 10555 1727 50  0000 C CNN
F 2 "" H 10550 1900 50  0001 C CNN
F 3 "" H 10550 1900 50  0001 C CNN
	1    10550 1900
	1    0    0    -1  
$EndComp
$Comp
L bids_symbol:142-0771-831 J4
U 1 1 5D33B159
P 10550 1600
F 0 "J4" H 10628 1825 50  0000 C CNN
F 1 "142-0771-831" H 10700 1750 50  0000 C CNN
F 2 "000_footprint:Rf_SMA_Receptical_SMD_EDGE_142-0771-831" H 10750 1800 60  0001 L CNN
F 3 "" H 10750 1900 60  0001 L CNN
F 4 "Cinch Connectivity Solutions Johnson" H 10550 1600 50  0001 C CNN "Manufacturer"
F 5 "142-0771-831" H 10550 1600 50  0001 C CNN "Part Number"
	1    10550 1600
	-1   0    0    -1  
$EndComp
Wire Wire Line
	10550 1800 10550 1900
$Comp
L bids_symbol:Attenuator_GAT-0+ U11
U 1 1 5DA8C0F1
P 8400 1650
F 0 "U11" H 8594 1746 50  0000 L CNN
F 1 "PAT0510S-C-0DB-T10" H 7950 1450 50  0000 L CNN
F 2 "000_footprint:RF_Attenuator_Susumu_PAT0510S_with_Transition_Pad" H 8400 1650 50  0001 C CNN
F 3 "" H 8400 1650 50  0001 C CNN
F 4 "Susumu" H 0   0   50  0001 C CNN "Manufacturer"
F 5 "PAT0510S-C-0DB-T10" H 8400 1650 50  0001 C CNN "Part Number"
	1    8400 1650
	1    0    0    -1  
$EndComp
$Comp
L power:GND #PWR0110
U 1 1 5DABAB4E
P 1850 5550
F 0 "#PWR0110" H 1850 5300 50  0001 C CNN
F 1 "GND" H 1850 5400 50  0000 C CNN
F 2 "" H 1850 5550 50  0001 C CNN
F 3 "" H 1850 5550 50  0001 C CNN
	1    1850 5550
	1    0    0    -1  
$EndComp
$Comp
L power:GND #PWR0111
U 1 1 5DABBC1D
P 1700 6150
F 0 "#PWR0111" H 1700 5900 50  0001 C CNN
F 1 "GND" H 1700 6000 50  0000 C CNN
F 2 "" H 1700 6150 50  0001 C CNN
F 3 "" H 1700 6150 50  0001 C CNN
	1    1700 6150
	1    0    0    -1  
$EndComp
$Comp
L power:GND #PWR0112
U 1 1 5DABC830
P 4450 5550
F 0 "#PWR0112" H 4450 5300 50  0001 C CNN
F 1 "GND" H 4450 5400 50  0000 C CNN
F 2 "" H 4450 5550 50  0001 C CNN
F 3 "" H 4450 5550 50  0001 C CNN
	1    4450 5550
	1    0    0    -1  
$EndComp
$Comp
L power:GND #PWR0113
U 1 1 5DABD070
P 4300 6150
F 0 "#PWR0113" H 4300 5900 50  0001 C CNN
F 1 "GND" H 4300 6000 50  0000 C CNN
F 2 "" H 4300 6150 50  0001 C CNN
F 3 "" H 4300 6150 50  0001 C CNN
	1    4300 6150
	1    0    0    -1  
$EndComp
$Comp
L power:GND #PWR0114
U 1 1 5DAC04B9
P 5050 1900
F 0 "#PWR0114" H 5050 1650 50  0001 C CNN
F 1 "GND" H 5050 1750 50  0000 C CNN
F 2 "" H 5050 1900 50  0001 C CNN
F 3 "" H 5050 1900 50  0001 C CNN
	1    5050 1900
	1    0    0    -1  
$EndComp
$Comp
L power:GND #PWR0115
U 1 1 5DAC37DD
P 5200 1300
F 0 "#PWR0115" H 5200 1050 50  0001 C CNN
F 1 "GND" H 5200 1150 50  0000 C CNN
F 2 "" H 5200 1300 50  0001 C CNN
F 3 "" H 5200 1300 50  0001 C CNN
	1    5200 1300
	1    0    0    -1  
$EndComp
$Comp
L power:GND #PWR0116
U 1 1 5DAC3EFA
P 8200 1900
F 0 "#PWR0116" H 8200 1650 50  0001 C CNN
F 1 "GND" H 8200 1750 50  0000 C CNN
F 2 "" H 8200 1900 50  0001 C CNN
F 3 "" H 8200 1900 50  0001 C CNN
	1    8200 1900
	1    0    0    -1  
$EndComp
$Comp
L power:GND #PWR0117
U 1 1 5DAC443A
P 8350 1300
F 0 "#PWR0117" H 8350 1050 50  0001 C CNN
F 1 "GND" H 8350 1150 50  0000 C CNN
F 2 "" H 8350 1300 50  0001 C CNN
F 3 "" H 8350 1300 50  0001 C CNN
	1    8350 1300
	1    0    0    -1  
$EndComp
Wire Wire Line
	1200 5850 1400 5850
Wire Wire Line
	1750 5650 1750 5550
Wire Wire Line
	1750 5550 1850 5550
Wire Wire Line
	1700 6050 1700 6150
Wire Wire Line
	2050 5850 2350 5850
Connection ~ 2350 5850
Wire Wire Line
	4300 6050 4300 6150
Wire Wire Line
	4450 5550 4350 5550
Wire Wire Line
	4350 5550 4350 5650
Wire Wire Line
	5100 1400 5100 1300
Wire Wire Line
	5100 1300 5200 1300
Wire Wire Line
	5050 1800 5050 1900
Wire Wire Line
	8550 1600 8650 1600
Wire Wire Line
	8200 1800 8200 1900
Wire Wire Line
	8250 1400 8250 1300
Wire Wire Line
	8250 1300 8350 1300
Wire Wire Line
	9050 2000 9050 2100
$Comp
L bids_symbol:RF_Shield_S0981-46R S1
U 1 1 5DED4596
P 1150 7150
F 0 "S1" H 1228 7221 50  0000 L CNN
F 1 "RF_Shield_S0981-46R" H 1228 7130 50  0000 L CNN
F 2 "000_footprint:RF_Shielding_Harwin_S0981-46R" H 1050 7250 50  0001 C CNN
F 3 "" H 1050 7250 50  0001 C CNN
F 4 "Harwin" H -1300 -450 50  0001 C CNN "Manufacturer"
F 5 "S0981-46R" H 1150 7150 50  0001 C CNN "Part Number"
	1    1150 7150
	1    0    0    -1  
$EndComp
$Comp
L bids_symbol:RF_Shield_S0981-46R S2
U 1 1 5DED4858
P 1400 7150
F 0 "S2" H 1478 7221 50  0000 L CNN
F 1 "RF_Shield_S0981-46R" H 1478 7130 50  0000 L CNN
F 2 "000_footprint:RF_Shielding_Harwin_S0981-46R" H 1300 7250 50  0001 C CNN
F 3 "" H 1300 7250 50  0001 C CNN
F 4 "Harwin" H -1300 -450 50  0001 C CNN "Manufacturer"
F 5 "S0981-46R" H 1400 7150 50  0001 C CNN "Part Number"
	1    1400 7150
	1    0    0    -1  
$EndComp
$Comp
L bids_symbol:RF_Shield_S0991-46R S5
U 1 1 5DED513A
P 1700 7150
F 0 "S5" H 1700 7315 50  0000 C CNN
F 1 "RF_Shield_S0991-46R" H 1700 7224 50  0000 C CNN
F 2 "000_footprint:RF_Shielding_Harwin_S0991-46R" H 1600 7250 50  0001 C CNN
F 3 "" H 1600 7250 50  0001 C CNN
F 4 "Harwin" H -1850 -350 50  0001 C CNN "Manufacturer"
F 5 "S0991-46R" H 1700 7150 50  0001 C CNN "Part Number"
	1    1700 7150
	1    0    0    -1  
$EndComp
$Comp
L bids_symbol:RF_Shield_S0991-46R S6
U 1 1 5DED5465
P 2100 7150
F 0 "S6" H 2100 7315 50  0000 C CNN
F 1 "RF_Shield_S0991-46R" H 2100 7224 50  0000 C CNN
F 2 "000_footprint:RF_Shielding_Harwin_S0991-46R" H 2000 7250 50  0001 C CNN
F 3 "" H 2000 7250 50  0001 C CNN
F 4 "Harwin" H -1850 -350 50  0001 C CNN "Manufacturer"
F 5 "S0991-46R" H 2100 7150 50  0001 C CNN "Part Number"
	1    2100 7150
	1    0    0    -1  
$EndComp
$Comp
L bids_symbol:142-0771-831 J3
U 1 1 5D558B59
P 10100 5850
F 0 "J3" H 10178 6075 50  0000 C CNN
F 1 "142-0771-831" H 10178 5984 50  0000 C CNN
F 2 "000_footprint:Rf_SMA_Receptical_SMD_EDGE_142-0771-831" H 10300 6050 60  0001 L CNN
F 3 "" H 10300 6150 60  0001 L CNN
F 4 "Cinch Connectivity Solutions Johnson" H 10100 5850 50  0001 C CNN "Manufacturer"
F 5 "142-0771-831" H 10100 5850 50  0001 C CNN "Part Number"
	1    10100 5850
	-1   0    0    -1  
$EndComp
$Comp
L power:GND #PWR0118
U 1 1 5D558B63
P 10100 6150
F 0 "#PWR0118" H 10100 5900 50  0001 C CNN
F 1 "GND" H 10105 5977 50  0000 C CNN
F 2 "" H 10100 6150 50  0001 C CNN
F 3 "" H 10100 6150 50  0001 C CNN
	1    10100 6150
	-1   0    0    -1  
$EndComp
Wire Wire Line
	10100 6050 10100 6150
$Comp
L bids_symbol:Attenuator_GAT-0+ U13
U 1 1 5D558B6F
P 9200 5900
F 0 "U13" H 9394 5996 50  0000 L CNN
F 1 "PAT0510S-C-0DB-T10" H 8750 5700 50  0000 L CNN
F 2 "000_footprint:RF_Attenuator_Susumu_PAT0510S_with_Transition_Pad" H 9200 5900 50  0001 C CNN
F 3 "" H 9200 5900 50  0001 C CNN
F 4 "Susumu" H 0   0   50  0001 C CNN "Manufacturer"
F 5 "PAT0510S-C-0DB-T10" H 9200 5900 50  0001 C CNN "Part Number"
	1    9200 5900
	-1   0    0    -1  
$EndComp
$Comp
L bids_symbol:Attenuator_GAT-0+ U7
U 1 1 5D558B79
P 6650 5900
F 0 "U7" H 6844 5996 50  0000 L CNN
F 1 "PAT0510S-C-0DB-T10" H 6150 5750 50  0000 L CNN
F 2 "000_footprint:RF_Attenuator_Susumu_PAT0510S_with_Transition_Pad" H 6650 5900 50  0001 C CNN
F 3 "" H 6650 5900 50  0001 C CNN
F 4 "Susumu" H 0   0   50  0001 C CNN "Manufacturer"
F 5 "PAT0510S-C-0DB-T10" H 6650 5900 50  0001 C CNN "Part Number"
	1    6650 5900
	-1   0    0    -1  
$EndComp
Wire Wire Line
	8550 6050 8550 6300
Connection ~ 8550 6050
Wire Wire Line
	8500 6050 8550 6050
Wire Wire Line
	8150 6250 8150 6300
Wire Wire Line
	8500 5850 8750 5850
Wire Wire Line
	8550 5950 8550 6050
Connection ~ 8550 5950
Wire Wire Line
	8500 5950 8550 5950
Wire Wire Line
	7750 5950 7750 6050
Connection ~ 7750 5950
Wire Wire Line
	7800 5950 7750 5950
Wire Wire Line
	7750 5750 7750 5950
Wire Wire Line
	7800 5750 7750 5750
Connection ~ 8150 6300
Wire Wire Line
	8550 6300 8150 6300
Wire Wire Line
	8550 5750 8550 5950
Wire Wire Line
	8500 5750 8550 5750
Wire Wire Line
	8750 6150 8750 6200
Connection ~ 7600 5850
Wire Wire Line
	7800 5850 7600 5850
Connection ~ 7850 5150
Wire Wire Line
	7600 5150 7850 5150
$Comp
L Device:C C18
U 1 1 5D558C12
P 8150 5300
F 0 "C18" H 7950 5350 50  0000 L CNN
F 1 "0.01u" H 7850 5250 50  0000 L CNN
F 2 "Capacitor_SMD:C_0402_1005Metric" H 8188 5150 50  0001 C CNN
F 3 "" H 8150 5300 50  0001 C CNN
F 4 "Murata" H 8150 5300 50  0001 C CNN "Manufacturer"
F 5 "GRM155R71E103KA01D" H 8150 5300 50  0001 C CNN "Part Number"
	1    8150 5300
	-1   0    0    -1  
$EndComp
$Comp
L Device:C C17
U 1 1 5D558C1C
P 7850 5300
F 0 "C17" H 7965 5346 50  0000 L CNN
F 1 "10p" H 7965 5255 50  0000 L CNN
F 2 "Capacitor_SMD:C_0402_1005Metric" H 7888 5150 50  0001 C CNN
F 3 "" H 7850 5300 50  0001 C CNN
F 4 "Murata" H 7850 5300 50  0001 C CNN "Manufacturer"
F 5 "GJM1555C1H100JB01D" H 7850 5300 50  0001 C CNN "Part Number"
	1    7850 5300
	-1   0    0    -1  
$EndComp
Wire Wire Line
	8150 5150 7850 5150
$Comp
L power:GND #PWR0119
U 1 1 5D558C31
P 8000 5450
F 0 "#PWR0119" H 8000 5200 50  0001 C CNN
F 1 "GND" H 8005 5277 50  0000 C CNN
F 2 "" H 8000 5450 50  0001 C CNN
F 3 "" H 8000 5450 50  0001 C CNN
	1    8000 5450
	-1   0    0    -1  
$EndComp
Connection ~ 8000 5450
Wire Wire Line
	8150 5450 8000 5450
Wire Wire Line
	7850 5450 8000 5450
$Comp
L power:GND #PWR0120
U 1 1 5D558C3E
P 8150 6300
F 0 "#PWR0120" H 8150 6050 50  0001 C CNN
F 1 "GND" H 8155 6127 50  0000 C CNN
F 2 "" H 8150 6300 50  0001 C CNN
F 3 "" H 8150 6300 50  0001 C CNN
	1    8150 6300
	-1   0    0    -1  
$EndComp
$Comp
L Device:C C10
U 1 1 5D558C48
P 7450 5850
F 0 "C10" V 7198 5850 50  0000 C CNN
F 1 "100p" V 7289 5850 50  0000 C CNN
F 2 "Capacitor_SMD:C_0402_1005Metric" H 7488 5700 50  0001 C CNN
F 3 "" H 7450 5850 50  0001 C CNN
F 4 "Murata" V 7450 5850 50  0001 C CNN "Manufacturer"
F 5 "GRM1555C1H101JA01D" V 7450 5850 50  0001 C CNN "Part Number"
	1    7450 5850
	0    -1   1    0   
$EndComp
$Comp
L Device:L L8
U 1 1 5D558C52
P 8750 6000
F 0 "L8" H 8802 6046 50  0000 L CNN
F 1 "18n" H 8802 5955 50  0000 L CNN
F 2 "Inductor_SMD:L_0402_1005Metric" H 8750 6000 50  0001 C CNN
F 3 "" H 8750 6000 50  0001 C CNN
F 4 "Murata" H 8750 6000 50  0001 C CNN "Manufacturer"
F 5 "LQG15HS18NJ02D" H 8750 6000 50  0001 C CNN "Part Number"
	1    8750 6000
	-1   0    0    -1  
$EndComp
$Comp
L power:GND #PWR0121
U 1 1 5D558C5C
P 8750 6200
F 0 "#PWR0121" H 8750 5950 50  0001 C CNN
F 1 "GND" H 8755 6027 50  0000 C CNN
F 2 "" H 8750 6200 50  0001 C CNN
F 3 "" H 8750 6200 50  0001 C CNN
	1    8750 6200
	-1   0    0    -1  
$EndComp
$Comp
L power:GND #PWR0122
U 1 1 5D558C70
P 9250 5550
F 0 "#PWR0122" H 9250 5300 50  0001 C CNN
F 1 "GND" H 9250 5400 50  0000 C CNN
F 2 "" H 9250 5550 50  0001 C CNN
F 3 "" H 9250 5550 50  0001 C CNN
	1    9250 5550
	-1   0    0    -1  
$EndComp
$Comp
L power:GND #PWR0123
U 1 1 5D558C7A
P 9400 6150
F 0 "#PWR0123" H 9400 5900 50  0001 C CNN
F 1 "GND" H 9400 6000 50  0000 C CNN
F 2 "" H 9400 6150 50  0001 C CNN
F 3 "" H 9400 6150 50  0001 C CNN
	1    9400 6150
	-1   0    0    -1  
$EndComp
$Comp
L power:GND #PWR0124
U 1 1 5D558C84
P 6700 5550
F 0 "#PWR0124" H 6700 5300 50  0001 C CNN
F 1 "GND" H 6700 5400 50  0000 C CNN
F 2 "" H 6700 5550 50  0001 C CNN
F 3 "" H 6700 5550 50  0001 C CNN
	1    6700 5550
	-1   0    0    -1  
$EndComp
$Comp
L power:GND #PWR0125
U 1 1 5D558C8E
P 6850 6150
F 0 "#PWR0125" H 6850 5900 50  0001 C CNN
F 1 "GND" H 6850 6000 50  0000 C CNN
F 2 "" H 6850 6150 50  0001 C CNN
F 3 "" H 6850 6150 50  0001 C CNN
	1    6850 6150
	-1   0    0    -1  
$EndComp
Wire Wire Line
	9900 5850 9700 5850
Wire Wire Line
	9350 5650 9350 5550
Wire Wire Line
	9350 5550 9250 5550
Wire Wire Line
	9400 6050 9400 6150
Wire Wire Line
	9050 5850 8750 5850
Connection ~ 8750 5850
Wire Wire Line
	6850 6050 6850 6150
Wire Wire Line
	6700 5550 6800 5550
Wire Wire Line
	6800 5550 6800 5650
$Comp
L dk_Rectangular-Connectors-Headers-Male-Pins:640456-2 J2
U 1 1 5D558CB0
P 2150 3000
F 0 "J2" V 1925 3008 50  0000 C CNN
F 1 "0022053021" V 2050 3050 50  0000 C CNN
F 2 "000_footprint:PinHeader_1x2_P2.54mm_Drill1.02mm_TE_640456-2" H 2350 3200 60  0001 L CNN
F 3 "" H 2350 3300 60  0001 L CNN
F 4 "0022053021" H 2350 3500 60  0001 L CNN "Part Number"
F 5 "Molex" H 2350 3600 60  0001 L CNN "Manufacturer"
	1    2150 3000
	0    1    1    0   
$EndComp
Text Notes 1800 3050 0    50   ~ 0
+6.3V
Text Notes 1850 3150 0    50   ~ 0
GND
Wire Wire Line
	7150 5850 7300 5850
Wire Wire Line
	5150 5850 4650 5850
$Comp
L bids_symbol:Attenuator_GAT-6+ U4
U 1 1 5D89867D
P 5250 1650
F 0 "U4" H 5444 1746 50  0000 L CNN
F 1 "PAT0510S-C-0DB-T10" H 4700 1450 50  0000 L CNN
F 2 "000_footprint:RF_Attenuator_Susumu_PAT0510S_with_Transition_Pad" H 5250 1650 50  0001 C CNN
F 3 "" H 5250 1650 50  0001 C CNN
F 4 "Susumu" H 0   0   50  0001 C CNN "Manufacturer"
F 5 "PAT0510S-C-0DB-T10" H 5250 1650 50  0001 C CNN "Part Number"
	1    5250 1650
	1    0    0    -1  
$EndComp
$Comp
L bids_symbol:Amplifier_LHA-13LN+ U8
U 1 1 5D9DE235
P 6750 1500
F 0 "U8" H 7144 1546 50  0000 L CNN
F 1 "Amplifier_LHA-13LN+" H 6500 1150 50  0000 L CNN
F 2 "000_footprint:Mini-Circuits_DQ1225_LandPatternPL-594" H 6800 1400 50  0001 C CNN
F 3 "" H 6800 1400 50  0001 C CNN
F 4 "Mini-Circuits" H 6750 1500 50  0001 C CNN "Manufacturer"
F 5 "LHA-13LN+" H 6750 1500 50  0001 C CNN "Part Number"
	1    6750 1500
	1    0    0    -1  
$EndComp
$Comp
L Device:L L3
U 1 1 5D9F2627
P 5700 1600
F 0 "L3" V 5890 1600 50  0000 C CNN
F 1 "5.1n" V 5799 1600 50  0000 C CNN
F 2 "Inductor_SMD:L_0603_1608Metric" H 5700 1600 50  0001 C CNN
F 3 "" H 5700 1600 50  0001 C CNN
F 4 "Murata" V 5700 1600 50  0001 C CNN "Manufacturer"
F 5 "LQW18AS5N1G0ZD" V 5700 1600 50  0001 C CNN "Part Number"
F 6 "Coilcraft 0603CS-5N1XJL" V 5700 1600 50  0001 C CNN "Bak"
	1    5700 1600
	0    -1   -1   0   
$EndComp
Wire Wire Line
	5400 1600 5500 1600
Wire Wire Line
	5500 1650 5500 1600
Connection ~ 5500 1600
Wire Wire Line
	5500 1600 5550 1600
Wire Wire Line
	5500 1950 5500 2050
Wire Wire Line
	5850 1600 5950 1600
Wire Wire Line
	6250 1600 6300 1600
$Comp
L Device:C C12
U 1 1 5DA9AA70
P 7550 1000
F 0 "C12" V 7600 1100 50  0000 C CNN
F 1 "1000p" V 7600 900 50  0000 C CNN
F 2 "Capacitor_SMD:C_0402_1005Metric" H 7588 850 50  0001 C CNN
F 3 "" H 7550 1000 50  0001 C CNN
F 4 "Murata" V 7550 1000 50  0001 C CNN "Manufacturer"
F 5 "GRM1555C1H102JA01" V 7550 1000 50  0001 C CNN "Part Number"
	1    7550 1000
	0    -1   -1   0   
$EndComp
$Comp
L Device:C C8
U 1 1 5DAAD7AB
P 6550 2400
F 0 "C8" V 6802 2400 50  0000 C CNN
F 1 "0.1u" V 6711 2400 50  0000 C CNN
F 2 "Capacitor_SMD:C_0402_1005Metric" H 6588 2250 50  0001 C CNN
F 3 "" H 6550 2400 50  0001 C CNN
F 4 "Murata" V 6550 2400 50  0001 C CNN "Manufacturer"
F 5 "GRM155R71C104KA88" V 6550 2400 50  0001 C CNN "Part Number"
	1    6550 2400
	0    -1   -1   0   
$EndComp
$Comp
L Device:C C11
U 1 1 5DAADABA
P 7550 750
F 0 "C11" V 7600 850 50  0000 C CNN
F 1 "10u" V 7600 650 50  0000 C CNN
F 2 "Capacitor_SMD:C_0805_2012Metric" H 7588 600 50  0001 C CNN
F 3 "" H 7550 750 50  0001 C CNN
F 4 "Murata" V 7550 750 50  0001 C CNN "Manufacturer"
F 5 "GRM21BR61C106KE15" V 7550 750 50  0001 C CNN "Part Number"
	1    7550 750 
	0    -1   -1   0   
$EndComp
$Comp
L Device:R R1
U 1 1 5DABDEF5
P 6950 2400
F 0 "R1" V 7157 2400 50  0000 C CNN
F 1 "1500" V 7066 2400 50  0000 C CNN
F 2 "Resistor_SMD:R_0402_1005Metric" V 6880 2400 50  0001 C CNN
F 3 "" H 6950 2400 50  0001 C CNN
F 4 "Koa" V 6950 2400 50  0001 C CNN "Manufacturer"
F 5 "RK73H1ETTP1501F" V 6950 2400 50  0001 C CNN "Part Number"
F 6 "Koa RK73H1ET1501F" V 6950 2400 50  0001 C CNN "Bak"
	1    6950 2400
	0    -1   -1   0   
$EndComp
$Comp
L RF_Filter:LFCN-530D FL1
U 1 1 5DAEFB38
P 9050 1600
F 0 "FL1" H 9050 2067 50  0000 C CNN
F 1 "LFCN-530D+" H 9050 1976 50  0000 C CNN
F 2 "Filter:Filter_Mini-Circuits_FV1206" H 9050 2100 50  0001 C CNN
F 3 "" H 9050 1600 50  0001 C CNN
F 4 "Mini-Circuits" H 9050 1600 50  0001 C CNN "Manufacturer"
F 5 "LFCN-530D+" H 9050 1600 50  0001 C CNN "Part Number"
	1    9050 1600
	1    0    0    -1  
$EndComp
$Comp
L Device:C C13
U 1 1 5DAF13E5
P 7600 1600
F 0 "C13" V 7852 1600 50  0000 C CNN
F 1 "2.2u" V 7761 1600 50  0000 C CNN
F 2 "Capacitor_SMD:C_0603_1608Metric" H 7638 1450 50  0001 C CNN
F 3 "" H 7600 1600 50  0001 C CNN
F 4 "Samsung Electro-Mechanics" V 7600 1600 50  0001 C CNN "Manufacturer"
F 5 "CL10A225KO8NNNC" V 7600 1600 50  0001 C CNN "Part Number"
F 6 "Murata GRM188R61C225KE15" V 7600 1600 50  0001 C CNN "Bak"
	1    7600 1600
	0    -1   -1   0   
$EndComp
Wire Wire Line
	6400 2400 6300 2400
Wire Wire Line
	6300 2400 6300 1600
Connection ~ 6300 1600
Wire Wire Line
	6300 1600 6400 1600
Wire Wire Line
	6700 2400 6800 2400
Wire Wire Line
	7100 1600 7200 1600
Wire Wire Line
	7200 2400 7200 1600
Wire Wire Line
	7100 2400 7200 2400
Connection ~ 7200 1600
Wire Wire Line
	7200 1600 7300 1600
Wire Wire Line
	7750 1600 7900 1600
Wire Wire Line
	7300 1500 7300 1600
Connection ~ 7300 1600
Wire Wire Line
	7300 1600 7450 1600
Wire Wire Line
	7700 1000 7850 1000
Wire Wire Line
	7850 1000 7850 1100
Wire Wire Line
	7700 750  7850 750 
Wire Wire Line
	7850 750  7850 1000
Connection ~ 7850 1000
Wire Wire Line
	7300 750  7400 750 
Wire Wire Line
	7300 1000 7400 1000
Wire Wire Line
	7300 750  7300 1000
Connection ~ 7300 1000
Wire Wire Line
	7300 1000 7300 1200
$Comp
L power:GND #PWR0126
U 1 1 5DBF3493
P 7000 1050
F 0 "#PWR0126" H 7000 800 50  0001 C CNN
F 1 "GND" H 7005 877 50  0000 C CNN
F 2 "" H 7000 1050 50  0001 C CNN
F 3 "" H 7000 1050 50  0001 C CNN
	1    7000 1050
	1    0    0    -1  
$EndComp
Wire Wire Line
	6550 1200 6550 1050
Wire Wire Line
	6550 1050 6650 1050
Wire Wire Line
	6650 1200 6650 1050
Connection ~ 6650 1050
Wire Wire Line
	6650 1050 6750 1050
Wire Wire Line
	6750 1200 6750 1050
Connection ~ 6750 1050
Wire Wire Line
	6750 1050 6850 1050
Wire Wire Line
	6850 1200 6850 1050
Connection ~ 6850 1050
Wire Wire Line
	6850 1050 7000 1050
Wire Wire Line
	6400 1400 6400 1050
Wire Wire Line
	6400 1050 6550 1050
Connection ~ 6550 1050
Wire Wire Line
	6400 1500 6400 1400
Connection ~ 6400 1400
Wire Wire Line
	6650 1800 6650 1900
Wire Wire Line
	6850 1800 6850 1900
Wire Wire Line
	7100 1400 7100 1050
Wire Wire Line
	7100 1050 7000 1050
Connection ~ 7000 1050
Wire Wire Line
	7100 1500 7100 1400
Connection ~ 7100 1400
$Comp
L power:GND #PWR0127
U 1 1 5D558CBA
P 2550 3100
F 0 "#PWR0127" H 2550 2850 50  0001 C CNN
F 1 "GND" H 2555 2927 50  0000 C CNN
F 2 "" H 2550 3100 50  0001 C CNN
F 3 "" H 2550 3100 50  0001 C CNN
	1    2550 3100
	1    0    0    -1  
$EndComp
Text Label 2550 3100 0    50   ~ 0
GND
Wire Wire Line
	2250 3100 2550 3100
Wire Wire Line
	2250 3000 2550 3000
Text Label 2550 3000 0    50   ~ 0
Vin6V3
$Sheet
S 1950 4700 750  350 
U 5D69EB35
F0 "DCDC6V3_6V0_LO" 50
F1 "DCDC6V3_6V0_LP38798.sch" 50
F2 "Vout6V0" O R 2700 4850 50 
F3 "Vin6V3" I L 1950 4800 50 
F4 "GND" I L 1950 4950 50 
$EndSheet
Text Label 1700 4800 0    50   ~ 0
Vin6V3
Wire Wire Line
	1700 4800 1950 4800
Wire Wire Line
	1950 4950 1700 4950
Text Label 1700 4950 0    50   ~ 0
GND
Connection ~ 5050 5650
Wire Wire Line
	5050 5650 5050 5250
Wire Wire Line
	5450 5350 5450 5250
Wire Wire Line
	5450 5250 5050 5250
Wire Wire Line
	5950 5350 5950 5250
Wire Wire Line
	5850 5350 5850 5250
Wire Wire Line
	5950 5250 5850 5250
Connection ~ 5450 5250
Connection ~ 5850 5250
Wire Wire Line
	5850 5250 5450 5250
Connection ~ 5950 5250
Wire Wire Line
	6350 5250 5950 5250
$Comp
L bids_symbol:IQMixer_HMC8193 U6
U 1 1 5D276FBF
P 5700 5900
F 0 "U6" V 5800 5850 50  0000 L CNN
F 1 "IQMixer_HMC8193" V 5700 5600 50  0000 L CNN
F 2 "digikey-footprints:TFQFN-24-1EP_4x4mm" H 5700 5950 50  0001 C CNN
F 3 "" H 5700 5950 50  0001 C CNN
F 4 "Analog Devices" H 5700 5900 50  0001 C CNN "Manufacturer"
F 5 "HMC8193" H 5700 5900 50  0001 C CNN "Part Number"
	1    5700 5900
	-1   0    0    1   
$EndComp
$Comp
L bids_symbol:Amplifier_CMA-83LN+ U2
U 1 1 5D79CA77
P 2900 5900
F 0 "U2" V 2485 5850 50  0000 C CNN
F 1 "Amplifier_CMA-83LN+" V 3200 5850 50  0000 C CNN
F 2 "000_footprint:Mini-Circuits_DL1721_LandPatternPL-606" H 2950 5800 50  0001 C CNN
F 3 "" H 2950 5800 50  0001 C CNN
F 4 "Mini-Circuits" H 2900 5900 50  0001 C CNN "Manufacturer"
F 5 "CMA-83LN+" H 2900 5900 50  0001 C CNN "Part Number"
	1    2900 5900
	0    -1   1    0   
$EndComp
Wire Wire Line
	3350 6050 3300 6050
Connection ~ 3350 6050
Wire Wire Line
	3350 6300 2950 6300
Wire Wire Line
	3350 6050 3350 6300
Wire Wire Line
	3500 5450 3500 5850
Connection ~ 3500 5850
Wire Wire Line
	4000 5850 3800 5850
Wire Wire Line
	7600 5450 7600 5850
$Comp
L bids_symbol:Amplifier_CMA-83LN+ U10
U 1 1 5D8E564C
P 8200 5900
F 0 "U10" V 7785 5850 50  0000 C CNN
F 1 "Amplifier_CMA-83LN+" V 8500 5850 50  0000 C CNN
F 2 "000_footprint:Mini-Circuits_DL1721_LandPatternPL-606" H 8250 5800 50  0001 C CNN
F 3 "" H 8250 5800 50  0001 C CNN
F 4 "Mini-Circuits" H 8200 5900 50  0001 C CNN "Manufacturer"
F 5 "CMA-83LN+" H 8200 5900 50  0001 C CNN "Part Number"
	1    8200 5900
	0    1    1    0   
$EndComp
Wire Wire Line
	7800 6050 7750 6050
Connection ~ 7750 6050
Wire Wire Line
	7750 6300 8150 6300
Wire Wire Line
	7750 6050 7750 6300
$Sheet
S 6650 4700 750  350 
U 5D98E79D
F0 "DCDC6V3_6V0_RF" 50
F1 "DCDC6V3_6V0_LP38798.sch" 50
F2 "Vout6V0" O R 7400 4850 50 
F3 "Vin6V3" I L 6650 4800 50 
F4 "GND" I L 6650 4950 50 
$EndSheet
Text Label 6400 4800 0    50   ~ 0
Vin6V3
Wire Wire Line
	6400 4800 6650 4800
Wire Wire Line
	6650 4950 6400 4950
Text Label 6400 4950 0    50   ~ 0
GND
Wire Wire Line
	2700 4850 2950 4850
Wire Wire Line
	2950 4850 2950 5150
Connection ~ 2950 5150
Wire Wire Line
	7400 4850 7600 4850
Wire Wire Line
	7600 4850 7600 5150
Wire Wire Line
	5250 2650 5000 2650
Wire Wire Line
	5250 2800 5000 2800
Text Label 5000 2800 0    50   ~ 0
GND
Text Label 5000 2650 0    50   ~ 0
Vin6V3
$Comp
L bids_symbol:Attenuator_GAT-0+ U14
U 1 1 5DA8139C
P 10050 1650
F 0 "U14" H 10244 1746 50  0000 L CNN
F 1 "PAT0510S-C-0DB-T10" H 9600 1450 50  0000 L CNN
F 2 "000_footprint:RF_Attenuator_Susumu_PAT0510S_with_Transition_Pad" H 10050 1650 50  0001 C CNN
F 3 "" H 10050 1650 50  0001 C CNN
F 4 "Susumu" H 0   0   50  0001 C CNN "Manufacturer"
F 5 "PAT0510S-C-0DB-T10" H 10050 1650 50  0001 C CNN "Part Number"
	1    10050 1650
	1    0    0    -1  
$EndComp
$Comp
L power:GND #PWR0128
U 1 1 5DA813A2
P 9850 1900
F 0 "#PWR0128" H 9850 1650 50  0001 C CNN
F 1 "GND" H 9850 1750 50  0000 C CNN
F 2 "" H 9850 1900 50  0001 C CNN
F 3 "" H 9850 1900 50  0001 C CNN
	1    9850 1900
	1    0    0    -1  
$EndComp
$Comp
L power:GND #PWR0129
U 1 1 5DA813A8
P 10000 1300
F 0 "#PWR0129" H 10000 1050 50  0001 C CNN
F 1 "GND" H 10000 1150 50  0000 C CNN
F 2 "" H 10000 1300 50  0001 C CNN
F 3 "" H 10000 1300 50  0001 C CNN
	1    10000 1300
	1    0    0    -1  
$EndComp
Wire Wire Line
	9850 1800 9850 1900
Wire Wire Line
	9900 1400 9900 1300
Wire Wire Line
	9900 1300 10000 1300
Wire Wire Line
	9450 1600 9550 1600
Wire Wire Line
	10200 1600 10350 1600
Text Label 5000 700  0    50   ~ 0
Vin6V3
Text Label 5000 850  0    50   ~ 0
GND
Wire Wire Line
	5250 850  5000 850 
Wire Wire Line
	5250 700  5000 700 
$Sheet
S 5250 600  750  350 
U 5D62837F
F0 "DCDC6V3_5V0_IF1" 50
F1 "DCDC6V3_5V0_LP38798.sch" 50
F2 "Vout5V0" O R 6000 750 50 
F3 "Vin6V3" I L 5250 700 50 
F4 "GND" I L 5250 850 50 
$EndSheet
Text Notes 10750 3150 2    208  ~ 0
IF2
$Comp
L Device:C C5
U 1 1 5DB1E628
P 5550 3750
F 0 "C5" H 5600 3850 50  0000 L CNN
F 1 "1.5p" H 5600 3650 50  0000 L CNN
F 2 "Capacitor_SMD:C_0402_1005Metric" H 5588 3600 50  0001 C CNN
F 3 "" H 5550 3750 50  0001 C CNN
F 4 "Yageo" H 5550 3750 50  0001 C CNN "Manufacturer"
F 5 "CC0402CRNPO9BN1R5" H 5550 3750 50  0001 C CNN "Part Number"
F 6 "Murata GRM1555C1H1R5CZ01" H 5550 3750 50  0001 C CNN "Bak"
	1    5550 3750
	1    0    0    -1  
$EndComp
$Comp
L Device:L L6
U 1 1 5DB1E62E
P 7350 3300
F 0 "L6" H 7402 3346 50  0000 L CNN
F 1 "15u" H 7402 3255 50  0000 L CNN
F 2 "Inductor_SMD:L_1210_3225Metric" H 7350 3300 50  0001 C CNN
F 3 "" H 7350 3300 50  0001 C CNN
F 4 "Murata" H 7350 3300 50  0001 C CNN "Manufacturer"
F 5 "LQH32DN150K53L" H 7350 3300 50  0001 C CNN "Part Number"
	1    7350 3300
	1    0    0    -1  
$EndComp
$Comp
L power:GND #PWR0130
U 1 1 5DB1E634
P 6800 3900
F 0 "#PWR0130" H 6800 3650 50  0001 C CNN
F 1 "GND" H 6805 3727 50  0000 C CNN
F 2 "" H 6800 3900 50  0001 C CNN
F 3 "" H 6800 3900 50  0001 C CNN
	1    6800 3900
	1    0    0    -1  
$EndComp
$Comp
L power:GND #PWR0131
U 1 1 5DB1E63A
P 7900 3050
F 0 "#PWR0131" H 7900 2800 50  0001 C CNN
F 1 "GND" H 7905 2877 50  0000 C CNN
F 2 "" H 7900 3050 50  0001 C CNN
F 3 "" H 7900 3050 50  0001 C CNN
	1    7900 3050
	1    0    0    -1  
$EndComp
$Comp
L power:GND #PWR0132
U 1 1 5DB1E640
P 5550 4000
F 0 "#PWR0132" H 5550 3750 50  0001 C CNN
F 1 "GND" H 5555 3827 50  0000 C CNN
F 2 "" H 5550 4000 50  0001 C CNN
F 3 "" H 5550 4000 50  0001 C CNN
	1    5550 4000
	1    0    0    -1  
$EndComp
$Comp
L Device:C C7
U 1 1 5DB1E646
P 6150 3550
F 0 "C7" V 5898 3550 50  0000 C CNN
F 1 "2.2u" V 5989 3550 50  0000 C CNN
F 2 "Capacitor_SMD:C_0603_1608Metric" H 6188 3400 50  0001 C CNN
F 3 "" H 6150 3550 50  0001 C CNN
F 4 "Samsung Electro-Mechanics" V 6150 3550 50  0001 C CNN "Manufacturer"
F 5 "CL10A225KO8NNNC" V 6150 3550 50  0001 C CNN "Part Number"
F 6 "Murata GRM188R61C225KE15" V 6150 3550 50  0001 C CNN "Bak"
	1    6150 3550
	0    1    1    0   
$EndComp
$Comp
L power:GND #PWR0133
U 1 1 5DB1E64C
P 9100 4050
F 0 "#PWR0133" H 9100 3800 50  0001 C CNN
F 1 "GND" H 9105 3877 50  0000 C CNN
F 2 "" H 9100 4050 50  0001 C CNN
F 3 "" H 9100 4050 50  0001 C CNN
	1    9100 4050
	1    0    0    -1  
$EndComp
$Comp
L power:GND #PWR0134
U 1 1 5DB1E652
P 10600 3850
F 0 "#PWR0134" H 10600 3600 50  0001 C CNN
F 1 "GND" H 10605 3677 50  0000 C CNN
F 2 "" H 10600 3850 50  0001 C CNN
F 3 "" H 10600 3850 50  0001 C CNN
	1    10600 3850
	1    0    0    -1  
$EndComp
$Comp
L bids_symbol:142-0771-831 J5
U 1 1 5DB1E661
P 10600 3550
F 0 "J5" H 10678 3775 50  0000 C CNN
F 1 "142-0771-831" H 10750 3700 50  0000 C CNN
F 2 "000_footprint:Rf_SMA_Receptical_SMD_EDGE_142-0771-831" H 10800 3750 60  0001 L CNN
F 3 "" H 10800 3850 60  0001 L CNN
F 4 "Cinch Connectivity Solutions Johnson" H 10600 3550 50  0001 C CNN "Manufacturer"
F 5 "142-0771-831" H 10600 3550 50  0001 C CNN "Part Number"
	1    10600 3550
	-1   0    0    -1  
$EndComp
Wire Wire Line
	10600 3750 10600 3850
$Comp
L bids_symbol:Attenuator_GAT-0+ U12
U 1 1 5DB1E668
P 8450 3600
F 0 "U12" H 8644 3696 50  0000 L CNN
F 1 "PAT0510S-C-0DB-T10" H 8000 3400 50  0000 L CNN
F 2 "000_footprint:RF_Attenuator_Susumu_PAT0510S_with_Transition_Pad" H 8450 3600 50  0001 C CNN
F 3 "" H 8450 3600 50  0001 C CNN
F 4 "Susumu" H 0   0   50  0001 C CNN "Manufacturer"
F 5 "PAT0510S-C-0DB-T10" H 8450 3600 50  0001 C CNN "Part Number"
	1    8450 3600
	1    0    0    -1  
$EndComp
$Comp
L power:GND #PWR0135
U 1 1 5DB1E66E
P 5100 3850
F 0 "#PWR0135" H 5100 3600 50  0001 C CNN
F 1 "GND" H 5100 3700 50  0000 C CNN
F 2 "" H 5100 3850 50  0001 C CNN
F 3 "" H 5100 3850 50  0001 C CNN
	1    5100 3850
	1    0    0    -1  
$EndComp
$Comp
L power:GND #PWR0136
U 1 1 5DB1E674
P 5250 3250
F 0 "#PWR0136" H 5250 3000 50  0001 C CNN
F 1 "GND" H 5250 3100 50  0000 C CNN
F 2 "" H 5250 3250 50  0001 C CNN
F 3 "" H 5250 3250 50  0001 C CNN
	1    5250 3250
	1    0    0    -1  
$EndComp
$Comp
L power:GND #PWR0137
U 1 1 5DB1E67A
P 8250 3850
F 0 "#PWR0137" H 8250 3600 50  0001 C CNN
F 1 "GND" H 8250 3700 50  0000 C CNN
F 2 "" H 8250 3850 50  0001 C CNN
F 3 "" H 8250 3850 50  0001 C CNN
	1    8250 3850
	1    0    0    -1  
$EndComp
$Comp
L power:GND #PWR0138
U 1 1 5DB1E680
P 8400 3250
F 0 "#PWR0138" H 8400 3000 50  0001 C CNN
F 1 "GND" H 8400 3100 50  0000 C CNN
F 2 "" H 8400 3250 50  0001 C CNN
F 3 "" H 8400 3250 50  0001 C CNN
	1    8400 3250
	1    0    0    -1  
$EndComp
Wire Wire Line
	5150 3350 5150 3250
Wire Wire Line
	5150 3250 5250 3250
Wire Wire Line
	5100 3750 5100 3850
Wire Wire Line
	8600 3550 8700 3550
Wire Wire Line
	8250 3750 8250 3850
Wire Wire Line
	8300 3350 8300 3250
Wire Wire Line
	8300 3250 8400 3250
Wire Wire Line
	9100 3950 9100 4050
$Comp
L bids_symbol:Attenuator_GAT-6+ U5
U 1 1 5DB1E68E
P 5300 3600
F 0 "U5" H 5494 3696 50  0000 L CNN
F 1 "PAT0510S-C-0DB-T10" H 4750 3400 50  0000 L CNN
F 2 "000_footprint:RF_Attenuator_Susumu_PAT0510S_with_Transition_Pad" H 5300 3600 50  0001 C CNN
F 3 "" H 5300 3600 50  0001 C CNN
F 4 "Susumu" H 0   0   50  0001 C CNN "Manufacturer"
F 5 "PAT0510S-C-0DB-T10" H 5300 3600 50  0001 C CNN "Part Number"
	1    5300 3600
	1    0    0    -1  
$EndComp
$Comp
L bids_symbol:Amplifier_LHA-13LN+ U9
U 1 1 5DB1E694
P 6800 3450
F 0 "U9" H 7194 3496 50  0000 L CNN
F 1 "Amplifier_LHA-13LN+" H 6550 3100 50  0000 L CNN
F 2 "000_footprint:Mini-Circuits_DQ1225_LandPatternPL-594" H 6850 3350 50  0001 C CNN
F 3 "" H 6850 3350 50  0001 C CNN
F 4 "Mini-Circuits" H 6800 3450 50  0001 C CNN "Manufacturer"
F 5 "LHA-13LN+" H 6800 3450 50  0001 C CNN "Part Number"
	1    6800 3450
	1    0    0    -1  
$EndComp
$Comp
L Device:L L4
U 1 1 5DB1E69A
P 5750 3550
F 0 "L4" V 5940 3550 50  0000 C CNN
F 1 "5.1n" V 5849 3550 50  0000 C CNN
F 2 "Inductor_SMD:L_0603_1608Metric" H 5750 3550 50  0001 C CNN
F 3 "" H 5750 3550 50  0001 C CNN
F 4 "Murata" V 5750 3550 50  0001 C CNN "Manufacturer"
F 5 "LQW18AS5N1G0ZD" V 5750 3550 50  0001 C CNN "Part Number"
F 6 "Coilcraft 0603CS-5N1XJL" V 5750 3550 50  0001 C CNN "Bak"
	1    5750 3550
	0    -1   -1   0   
$EndComp
Wire Wire Line
	5450 3550 5550 3550
Wire Wire Line
	5550 3600 5550 3550
Connection ~ 5550 3550
Wire Wire Line
	5550 3550 5600 3550
Wire Wire Line
	5550 3900 5550 4000
Wire Wire Line
	5900 3550 6000 3550
Wire Wire Line
	6300 3550 6350 3550
$Comp
L Device:C C15
U 1 1 5DB1E6A7
P 7600 2950
F 0 "C15" V 7650 3050 50  0000 C CNN
F 1 "1000p" V 7650 2850 50  0000 C CNN
F 2 "Capacitor_SMD:C_0402_1005Metric" H 7638 2800 50  0001 C CNN
F 3 "" H 7600 2950 50  0001 C CNN
F 4 "Murata" V 7600 2950 50  0001 C CNN "Manufacturer"
F 5 "GRM1555C1H102JA01" V 7600 2950 50  0001 C CNN "Part Number"
	1    7600 2950
	0    -1   -1   0   
$EndComp
$Comp
L Device:C C9
U 1 1 5DB1E6AD
P 6600 4350
F 0 "C9" V 6852 4350 50  0000 C CNN
F 1 "0.1u" V 6761 4350 50  0000 C CNN
F 2 "Capacitor_SMD:C_0402_1005Metric" H 6638 4200 50  0001 C CNN
F 3 "" H 6600 4350 50  0001 C CNN
F 4 "Murata" V 6600 4350 50  0001 C CNN "Manufacturer"
F 5 "GRM155R71C104KA88" V 6600 4350 50  0001 C CNN "Part Number"
	1    6600 4350
	0    -1   -1   0   
$EndComp
$Comp
L Device:C C14
U 1 1 5DB1E6B3
P 7600 2700
F 0 "C14" V 7650 2800 50  0000 C CNN
F 1 "10u" V 7650 2600 50  0000 C CNN
F 2 "Capacitor_SMD:C_0805_2012Metric" H 7638 2550 50  0001 C CNN
F 3 "" H 7600 2700 50  0001 C CNN
F 4 "Murata" V 7600 2700 50  0001 C CNN "Manufacturer"
F 5 "GRM21BR61C106KE15" V 7600 2700 50  0001 C CNN "Part Number"
	1    7600 2700
	0    -1   -1   0   
$EndComp
$Comp
L Device:R R2
U 1 1 5DB1E6B9
P 7000 4350
F 0 "R2" V 7207 4350 50  0000 C CNN
F 1 "1500" V 7116 4350 50  0000 C CNN
F 2 "Resistor_SMD:R_0402_1005Metric" V 6930 4350 50  0001 C CNN
F 3 "" H 7000 4350 50  0001 C CNN
F 4 "Koa" V 7000 4350 50  0001 C CNN "Manufacturer"
F 5 "RK73H1ETTP1501F" V 7000 4350 50  0001 C CNN "Part Number"
F 6 "Koa RK73H1ET1501F" V 7000 4350 50  0001 C CNN "Bak"
	1    7000 4350
	0    -1   -1   0   
$EndComp
$Comp
L RF_Filter:LFCN-530D FL2
U 1 1 5DB1E6BF
P 9100 3550
F 0 "FL2" H 9100 4017 50  0000 C CNN
F 1 "LFCN-530D+" H 9100 3926 50  0000 C CNN
F 2 "Filter:Filter_Mini-Circuits_FV1206" H 9100 4050 50  0001 C CNN
F 3 "" H 9100 3550 50  0001 C CNN
F 4 "Mini-Circuits" H 9100 3550 50  0001 C CNN "Manufacturer"
F 5 "LFCN-530D+" H 9100 3550 50  0001 C CNN "Part Number"
	1    9100 3550
	1    0    0    -1  
$EndComp
$Comp
L Device:C C16
U 1 1 5DB1E6C5
P 7650 3550
F 0 "C16" V 7902 3550 50  0000 C CNN
F 1 "2.2u" V 7811 3550 50  0000 C CNN
F 2 "Capacitor_SMD:C_0603_1608Metric" H 7688 3400 50  0001 C CNN
F 3 "" H 7650 3550 50  0001 C CNN
F 4 "Samsung Electro-Mechanics" V 7650 3550 50  0001 C CNN "Manufacturer"
F 5 "CL10A225KO8NNNC " V 7650 3550 50  0001 C CNN "Part Number"
F 6 "Murata GRM188R61C225KE15" V 7650 3550 50  0001 C CNN "Bak"
	1    7650 3550
	0    -1   -1   0   
$EndComp
Wire Wire Line
	6450 4350 6350 4350
Wire Wire Line
	6350 4350 6350 3550
Connection ~ 6350 3550
Wire Wire Line
	6350 3550 6450 3550
Wire Wire Line
	6750 4350 6850 4350
Wire Wire Line
	7150 3550 7250 3550
Wire Wire Line
	7250 4350 7250 3550
Wire Wire Line
	7150 4350 7250 4350
Connection ~ 7250 3550
Wire Wire Line
	7250 3550 7350 3550
Wire Wire Line
	7800 3550 7950 3550
Wire Wire Line
	7350 3450 7350 3550
Connection ~ 7350 3550
Wire Wire Line
	7350 3550 7500 3550
Wire Wire Line
	7750 2950 7900 2950
Wire Wire Line
	7900 2950 7900 3050
Wire Wire Line
	7750 2700 7900 2700
Wire Wire Line
	7900 2700 7900 2950
Connection ~ 7900 2950
Wire Wire Line
	7350 2700 7450 2700
Wire Wire Line
	7350 2950 7450 2950
Wire Wire Line
	7350 2700 7350 2950
Connection ~ 7350 2950
Wire Wire Line
	7350 2950 7350 3150
$Comp
L power:GND #PWR0139
U 1 1 5DB1E6E3
P 7050 3000
F 0 "#PWR0139" H 7050 2750 50  0001 C CNN
F 1 "GND" H 7055 2827 50  0000 C CNN
F 2 "" H 7050 3000 50  0001 C CNN
F 3 "" H 7050 3000 50  0001 C CNN
	1    7050 3000
	1    0    0    -1  
$EndComp
Wire Wire Line
	6600 3150 6600 3000
Wire Wire Line
	6600 3000 6700 3000
Wire Wire Line
	6700 3150 6700 3000
Connection ~ 6700 3000
Wire Wire Line
	6700 3000 6800 3000
Wire Wire Line
	6800 3150 6800 3000
Connection ~ 6800 3000
Wire Wire Line
	6800 3000 6900 3000
Wire Wire Line
	6900 3150 6900 3000
Connection ~ 6900 3000
Wire Wire Line
	6900 3000 7050 3000
Wire Wire Line
	6450 3350 6450 3000
Wire Wire Line
	6450 3000 6600 3000
Connection ~ 6600 3000
Wire Wire Line
	6450 3450 6450 3350
Connection ~ 6450 3350
Wire Wire Line
	6800 3750 6800 3850
Wire Wire Line
	6700 3750 6700 3850
Wire Wire Line
	6700 3850 6800 3850
Connection ~ 6800 3850
Wire Wire Line
	6800 3850 6800 3900
Wire Wire Line
	6900 3750 6900 3850
Wire Wire Line
	6900 3850 6800 3850
Wire Wire Line
	7150 3350 7150 3000
Wire Wire Line
	7150 3000 7050 3000
Connection ~ 7050 3000
Wire Wire Line
	7150 3450 7150 3350
Connection ~ 7150 3350
$Comp
L bids_symbol:Attenuator_GAT-0+ U15
U 1 1 5DB1E707
P 10100 3600
F 0 "U15" H 10294 3696 50  0000 L CNN
F 1 "PAT0510S-C-0DB-T10" H 9650 3400 50  0000 L CNN
F 2 "000_footprint:RF_Attenuator_Susumu_PAT0510S_with_Transition_Pad" H 10100 3600 50  0001 C CNN
F 3 "" H 10100 3600 50  0001 C CNN
F 4 "Susumu" H 0   0   50  0001 C CNN "Manufacturer"
F 5 "PAT0510S-C-0DB-T10" H 10100 3600 50  0001 C CNN "Part Number"
	1    10100 3600
	1    0    0    -1  
$EndComp
$Comp
L power:GND #PWR0140
U 1 1 5DB1E70D
P 9900 3850
F 0 "#PWR0140" H 9900 3600 50  0001 C CNN
F 1 "GND" H 9900 3700 50  0000 C CNN
F 2 "" H 9900 3850 50  0001 C CNN
F 3 "" H 9900 3850 50  0001 C CNN
	1    9900 3850
	1    0    0    -1  
$EndComp
$Comp
L power:GND #PWR0141
U 1 1 5DB1E713
P 10050 3250
F 0 "#PWR0141" H 10050 3000 50  0001 C CNN
F 1 "GND" H 10050 3100 50  0000 C CNN
F 2 "" H 10050 3250 50  0001 C CNN
F 3 "" H 10050 3250 50  0001 C CNN
	1    10050 3250
	1    0    0    -1  
$EndComp
Wire Wire Line
	9900 3750 9900 3850
Wire Wire Line
	9950 3350 9950 3250
Wire Wire Line
	9950 3250 10050 3250
Wire Wire Line
	9500 3550 9600 3550
Wire Wire Line
	10250 3550 10400 3550
Wire Wire Line
	6000 750  7300 750 
Connection ~ 7300 750 
Wire Wire Line
	6000 2700 7350 2700
Connection ~ 7350 2700
Wire Wire Line
	4750 1600 4550 1600
Wire Wire Line
	4550 1600 4550 5000
Wire Wire Line
	4550 5000 5750 5000
Wire Wire Line
	5750 5000 5750 5350
Wire Wire Line
	4800 3550 4700 3550
Wire Wire Line
	4700 3550 4700 5150
Wire Wire Line
	4700 5150 5550 5150
Wire Wire Line
	5550 5150 5550 5350
$Comp
L power:GND #PWR0142
U 1 1 5EEB2B91
P 5750 6650
F 0 "#PWR0142" H 5750 6400 50  0001 C CNN
F 1 "GND" H 5755 6477 50  0000 C CNN
F 2 "" H 5750 6650 50  0001 C CNN
F 3 "" H 5750 6650 50  0001 C CNN
	1    5750 6650
	1    0    0    -1  
$EndComp
Wire Wire Line
	5750 6550 5750 6650
$Comp
L bids_symbol:RF_Shield_S0991-46R S7
U 1 1 5D73FE06
P 2500 7150
F 0 "S7" H 2500 7315 50  0000 C CNN
F 1 "RF_Shield_S0991-46R" H 2500 7224 50  0000 C CNN
F 2 "000_footprint:RF_Shielding_Harwin_S0991-46R" H 2400 7250 50  0001 C CNN
F 3 "" H 2400 7250 50  0001 C CNN
F 4 "Harwin" H -1850 -350 50  0001 C CNN "Manufacturer"
F 5 "S0991-46R" H 2500 7150 50  0001 C CNN "Part Number"
	1    2500 7150
	1    0    0    -1  
$EndComp
$Comp
L bids_symbol:RF_Shield_S0991-46R S8
U 1 1 5D7405E6
P 2900 7150
F 0 "S8" H 2900 7315 50  0000 C CNN
F 1 "RF_Shield_S0991-46R" H 2900 7224 50  0000 C CNN
F 2 "000_footprint:RF_Shielding_Harwin_S0991-46R" H 2800 7250 50  0001 C CNN
F 3 "" H 2800 7250 50  0001 C CNN
F 4 "Harwin" H -1850 -350 50  0001 C CNN "Manufacturer"
F 5 "S0991-46R" H 2900 7150 50  0001 C CNN "Part Number"
	1    2900 7150
	1    0    0    -1  
$EndComp
$Comp
L bids_symbol:RF_Shield_S0991-46R S9
U 1 1 5D742C57
P 3300 7150
F 0 "S9" H 3300 7315 50  0000 C CNN
F 1 "RF_Shield_S0991-46R" H 3300 7224 50  0000 C CNN
F 2 "000_footprint:RF_Shielding_Harwin_S0991-46R" H 3200 7250 50  0001 C CNN
F 3 "" H 3200 7250 50  0001 C CNN
F 4 "Harwin" H -1850 -350 50  0001 C CNN "Manufacturer"
F 5 "S0991-46R" H 3300 7150 50  0001 C CNN "Part Number"
	1    3300 7150
	1    0    0    -1  
$EndComp
$Comp
L bids_symbol:RF_Shield_S0991-46R S10
U 1 1 5D742C61
P 3700 7150
F 0 "S10" H 3700 7315 50  0000 C CNN
F 1 "RF_Shield_S0991-46R" H 3700 7224 50  0000 C CNN
F 2 "000_footprint:RF_Shielding_Harwin_S0991-46R" H 3600 7250 50  0001 C CNN
F 3 "" H 3600 7250 50  0001 C CNN
F 4 "Harwin" H -1850 -350 50  0001 C CNN "Manufacturer"
F 5 "S0991-46R" H 3700 7150 50  0001 C CNN "Part Number"
	1    3700 7150
	1    0    0    -1  
$EndComp
$Comp
L bids_symbol:RF_Shield_S0991-46R S11
U 1 1 5D742C6B
P 4100 7150
F 0 "S11" H 4100 7315 50  0000 C CNN
F 1 "RF_Shield_S0991-46R" H 4100 7224 50  0000 C CNN
F 2 "000_footprint:RF_Shielding_Harwin_S0991-46R" H 4000 7250 50  0001 C CNN
F 3 "" H 4000 7250 50  0001 C CNN
F 4 "Harwin" H -1850 -350 50  0001 C CNN "Manufacturer"
F 5 "S0991-46R" H 4100 7150 50  0001 C CNN "Part Number"
	1    4100 7150
	1    0    0    -1  
$EndComp
$Comp
L bids_symbol:RF_Shield_S0991-46R S12
U 1 1 5D742C75
P 4500 7150
F 0 "S12" H 4500 7315 50  0000 C CNN
F 1 "RF_Shield_S0991-46R" H 4500 7224 50  0000 C CNN
F 2 "000_footprint:RF_Shielding_Harwin_S0991-46R" H 4400 7250 50  0001 C CNN
F 3 "" H 4400 7250 50  0001 C CNN
F 4 "Harwin" H -1850 -350 50  0001 C CNN "Manufacturer"
F 5 "S0991-46R" H 4500 7150 50  0001 C CNN "Part Number"
	1    4500 7150
	1    0    0    -1  
$EndComp
$Comp
L Device:L L7
U 1 1 5D7E55E2
P 7600 5300
F 0 "L7" H 7652 5346 50  0000 L CNN
F 1 "39n" H 7652 5255 50  0000 L CNN
F 2 "Inductor_SMD:L_0402_1005Metric" H 7600 5300 50  0001 C CNN
F 3 "" H 7600 5300 50  0001 C CNN
F 4 "TE Connectivity Passive Product" H 7600 5300 50  0001 C CNN "Manufacturer"
F 5 "36501E39NJTDG " H 7600 5300 50  0001 C CNN "Part Number"
F 6 "Coilcraft 0402CS-39NXGLW" H 7600 5300 50  0001 C CNN "Bak"
	1    7600 5300
	1    0    0    -1  
$EndComp
Connection ~ 7600 5150
$Comp
L bids_symbol:RF_Shield_S0991-46R S13
U 1 1 5D8B0833
P 4900 7150
F 0 "S13" H 4900 7315 50  0000 C CNN
F 1 "RF_Shield_S0991-46R" H 4900 7224 50  0000 C CNN
F 2 "000_footprint:RF_Shielding_Harwin_S0991-46R" H 4800 7250 50  0001 C CNN
F 3 "" H 4800 7250 50  0001 C CNN
F 4 "Harwin" H -250 -350 50  0001 C CNN "Manufacturer"
F 5 "S0991-46R" H 4900 7150 50  0001 C CNN "Part Number"
	1    4900 7150
	1    0    0    -1  
$EndComp
$Comp
L bids_symbol:RF_Shield_S0991-46R S14
U 1 1 5D8B10C8
P 5300 7150
F 0 "S14" H 5300 7315 50  0000 C CNN
F 1 "RF_Shield_S0991-46R" H 5300 7224 50  0000 C CNN
F 2 "000_footprint:RF_Shielding_Harwin_S0991-46R" H 5200 7250 50  0001 C CNN
F 3 "" H 5200 7250 50  0001 C CNN
F 4 "Harwin" H 150 -350 50  0001 C CNN "Manufacturer"
F 5 "S0991-46R" H 5300 7150 50  0001 C CNN "Part Number"
	1    5300 7150
	1    0    0    -1  
$EndComp
$Comp
L bids_symbol:RF_Shield_S0991-46R S15
U 1 1 5D8B133B
P 5700 7150
F 0 "S15" H 5700 7315 50  0000 C CNN
F 1 "RF_Shield_S0991-46R" H 5700 7224 50  0000 C CNN
F 2 "000_footprint:RF_Shielding_Harwin_S0991-46R" H 5600 7250 50  0001 C CNN
F 3 "" H 5600 7250 50  0001 C CNN
F 4 "Harwin" H 550 -350 50  0001 C CNN "Manufacturer"
F 5 "S0991-46R" H 5700 7150 50  0001 C CNN "Part Number"
	1    5700 7150
	1    0    0    -1  
$EndComp
$Comp
L power:GND #PWR0143
U 1 1 5D8A44A5
P 4100 7450
F 0 "#PWR0143" H 4100 7200 50  0001 C CNN
F 1 "GND" H 4100 7300 50  0000 C CNN
F 2 "" H 4100 7450 50  0001 C CNN
F 3 "" H 4100 7450 50  0001 C CNN
	1    4100 7450
	1    0    0    -1  
$EndComp
Wire Wire Line
	6100 7300 5700 7300
Connection ~ 1400 7300
Wire Wire Line
	1400 7300 1150 7300
Connection ~ 1700 7300
Wire Wire Line
	1700 7300 1400 7300
Connection ~ 2100 7300
Wire Wire Line
	2100 7300 1700 7300
Connection ~ 2500 7300
Wire Wire Line
	2500 7300 2100 7300
Connection ~ 2900 7300
Wire Wire Line
	2900 7300 2500 7300
Connection ~ 3300 7300
Wire Wire Line
	3300 7300 2900 7300
Connection ~ 3700 7300
Wire Wire Line
	3700 7300 3300 7300
Connection ~ 4100 7300
Wire Wire Line
	4100 7300 3700 7300
Connection ~ 4500 7300
Wire Wire Line
	4500 7300 4100 7300
Connection ~ 4900 7300
Wire Wire Line
	4900 7300 4500 7300
Connection ~ 5300 7300
Wire Wire Line
	5300 7300 4900 7300
Connection ~ 5700 7300
Wire Wire Line
	5700 7300 5300 7300
Wire Wire Line
	4100 7450 4100 7300
$Comp
L bids_symbol:RF_Shield_S0991-46R S16
U 1 1 5D8B15AA
P 6100 7150
F 0 "S16" H 6100 7315 50  0000 C CNN
F 1 "RF_Shield_S0991-46R" H 6100 7224 50  0000 C CNN
F 2 "000_footprint:RF_Shielding_Harwin_S0991-46R" H 6000 7250 50  0001 C CNN
F 3 "" H 6000 7250 50  0001 C CNN
F 4 "Harwin" H 950 -350 50  0001 C CNN "Manufacturer"
F 5 "" H 6100 7150 50  0001 C CNN "Part Number"
	1    6100 7150
	1    0    0    -1  
$EndComp
$Sheet
S 5250 2550 750  350 
U 5D9D4420
F0 "DCDC6V3_5V0_IF2" 50
F1 "DCDC6V3_5V0_LP38798.sch" 50
F2 "Vout5V0" O R 6000 2700 50 
F3 "Vin6V3" I L 5250 2650 50 
F4 "GND" I L 5250 2800 50 
$EndSheet
Wire Wire Line
	6650 1900 6750 1900
Wire Wire Line
	6750 1800 6750 1900
Connection ~ 6750 1900
Wire Wire Line
	6750 1900 6850 1900
Wire Wire Line
	6750 1900 6750 1950
$Comp
L power:GND #PWR0102
U 1 1 5E1E402B
P 6750 1950
F 0 "#PWR0102" H 6750 1700 50  0001 C CNN
F 1 "GND" H 6755 1777 50  0000 C CNN
F 2 "" H 6750 1950 50  0001 C CNN
F 3 "" H 6750 1950 50  0001 C CNN
	1    6750 1950
	1    0    0    -1  
$EndComp
$EndSCHEMATC
