{
    "architecture": [
        "linux/amd64",
        "linux/arm/v7",
        "linux/arm64"
    ],
    "arguments": [],
    "description": "roscore services",
    "inputs": [],
    "metadata": {},
    "id": 1000,
    "name": "roscore",
    "namespace": "waggle",
    "source": "URL for repo",
    "version": "0.1.0"
}
