{
	"amount": 46600,
	"countGoods": 2,
	"contents": [
		{
			"id_product": 123,
			"product_name": "Ноутбук",
			"price": 4560000,
			"quantity": 1
		},
		{
			"id_product": 456,
			"product_name": "Мышка",
			"price": 100000,
			"quantity": 1
		}
	]
}
