{
  "type" : "license",
  "db": {
    "hosts": "license_system_mongodb:27017",
    "database": "license",
    "username": "admin",
    "password": "hotice1234",
    "user_collection": "user",
    "usage_collection": "usage",
    "key_collection": "license",
    "policy_collection": "policy"
  },
  "server": {
    "control": {
      "http_hosts": ":8088",
      "grpc_hosts": ":16010"
    },
    "usage": {
      "grpc_hosts": ":16011"
    },
    "key": {
      "grpc_hosts": ":16012"
    },
    "policy": {
      "grpc_hosts": ":16013"
    }
  },
  "client": {
    "control":{
      "http_hosts": "license_license_control:8088",
      "grpc_hosts": "license_license_control:16010"
    },
    "usage": {
      "grpc_hosts": "license_license_usage:16011"
    },
    "key": {
      "grpc_hosts": "license_license_key:16012"
    },
    "policy": {
      "grpc_hosts": "license_license_policy:16013"
    }
  }
}