<?xml version="1.0" encoding="UTF-8"?>
<svg width="47px" height="48px" viewBox="0 0 47 48" version="1.1" xmlns="http://www.w3.org/2000/svg" xmlns:xlink="http://www.w3.org/1999/xlink">
    <!-- Generator: Sketch 52.6 (67491) - http://www.bohemiancoding.com/sketch -->
    <title>MKD</title>
    <desc>Created with Sketch.</desc>
    <defs>
        <path d="M1.07345455,24.1305 C1.07345455,37.299 11.4254545,47.9715 24.1934545,47.9715 C36.96,47.9715 47.3105455,37.299 47.3105455,24.1305 C47.3105455,10.9635 36.96,0.291 24.1934545,0.291 C11.4254545,0.291 1.07345455,10.9635 1.07345455,24.1305 Z" id="path-1"></path>
    </defs>
    <g id="Welcome" stroke="none" stroke-width="1" fill="none" fill-rule="evenodd">
        <g id="flags-v1" transform="translate(-267.000000, -531.000000)">
            <g id="MKD" transform="translate(266.000000, 531.000000)">
                <mask id="mask-2" fill="white">
                    <use xlink:href="#path-1"></use>
                </mask>
                <g id="Clip-1307"></g>
                <polygon id="Fill-1306" fill="#D10201" mask="url(#mask-2)" points="-14.7156364 48.9855 63.1025455 48.9855 63.1025455 -0.7215 -14.7156364 -0.7215"></polygon>
                <path d="M28.1393455,23.69025 C28.1393455,26.47575 26.2949818,28.73175 24.0229818,28.73175 C21.7480727,28.73175 19.9095273,26.47575 19.9095273,23.69025 C19.9095273,20.90625 21.7480727,18.65025 24.0229818,18.65025 C26.2949818,18.65025 28.1393455,20.90625 28.1393455,23.69025" id="Fill-1308" fill="#FEE51B" mask="url(#mask-2)"></path>
                <path d="M27.4190545,19.00485 L50.4285091,-0.72165 L62.5594182,-0.72165 L28.8692364,20.15235 C28.8692364,20.15235 28.2205091,19.47885 27.4190545,19.00485" id="Fill-1309" fill="#FEE51B" mask="url(#mask-2)"></path>
                <path d="M22.8609455,17.7282 L19.8820364,-0.7218 L27.6158545,-0.7218 L24.7431273,17.7057 C24.7431273,17.7057 23.6056727,17.6097 22.8609455,17.7282" id="Fill-1310" fill="#FEE51B" mask="url(#mask-2)"></path>
                <path d="M-2.60218182,-0.7221 L-14.7156364,-0.7221 L-14.7156364,-0.6561 L19.2741818,20.2254 C19.9112727,19.4994 20.832,19.0089 20.832,19.0089 L-2.60218182,-0.7221 Z" id="Fill-1311" fill="#FEE51B" mask="url(#mask-2)"></path>
                <path d="M-14.7157818,19.2195 L-14.7157818,29.1885 L18.6034909,25.038 C18.3154909,24.06 18.4536727,23.2995 18.4536727,23.2995 L-14.7157818,19.2195 Z" id="Fill-1312" fill="#FEE51B" mask="url(#mask-2)"></path>
                <path d="M-2.35214545,48.98505 L20.6878545,29.50305 L21.4994909,28.88955 C21.4994909,28.88955 20.7024,28.54755 19.8064,27.80505 L-14.7157818,48.98505 L-2.35214545,48.98505 Z" id="Fill-1313" fill="#FEE51B" mask="url(#mask-2)"></path>
                <path d="M27.6464,48.98505 L24.7125818,29.83755 C24.7125818,29.83755 23.6871273,29.93055 22.8013091,29.80455 L19.9198545,48.98505 L27.6464,48.98505 Z" id="Fill-1314" fill="#FEE51B" mask="url(#mask-2)"></path>
                <path d="M62.3522909,48.98505 L28.3450182,27.87555 C28.3450182,27.87555 27.5261091,28.55505 26.5646545,28.99155 L50.1341091,48.98505 L62.3522909,48.98505 Z" id="Fill-1315" fill="#FEE51B" mask="url(#mask-2)"></path>
                <path d="M29.8907636,23.29905 L63.1024,19.10055 L63.1024,29.17605 L29.7424,25.03755 C29.7424,25.03755 30.0100364,24.29655 29.8907636,23.29905" id="Fill-1316" fill="#FEE51B" mask="url(#mask-2)"></path>
            </g>
        </g>
    </g>
</svg>