<?xml version="1.0" encoding="UTF-8"?>
<svg width="56px" height="56px" viewBox="0 0 56 56" version="1.1" xmlns="http://www.w3.org/2000/svg" xmlns:xlink="http://www.w3.org/1999/xlink">
    <!-- Generator: Sketch 58 (84663) - https://sketch.com -->
    <title>health</title>
    <desc>Created with Sketch.</desc>
    <g id="SplitTransaction" stroke="none" stroke-width="1" fill="none" fill-rule="evenodd">
        <g id="SplitTransaction-1_CategorySearch_Modal00" transform="translate(-869.000000, -577.000000)" fill-rule="nonzero">
            <g id="health" transform="translate(869.325581, 577.279070)">
                <circle id="Oval" fill="#8DB917" cx="27.8580465" cy="27.9266977" r="27.6184186"></circle>
                <path d="M23.5929302,16.5534884 L32.1231628,16.5534884 C32.5177674,16.5534884 32.8537674,16.6915349 33.1298605,16.9682791 C33.3670698,17.2049302 33.5023787,17.4851163 33.5361974,17.8092473 L33.5446512,17.9749767 L33.544,17.9749767 L33.544,20.3445581 L35.9135814,20.3445581 L35.9135814,39.3005581 L19.8012093,39.3005581 L19.8012093,20.3445581 L22.1707907,20.3445581 L22.1707907,17.9749767 C22.1707907,17.5803721 22.3088372,17.2443721 22.5855814,16.9682791 C22.8227907,16.7310698 23.1035349,16.5957608 23.4274039,16.5619421 L23.5929302,16.5534884 L32.1231628,16.5534884 Z M37.8104186,20.3445581 C38.7187907,20.3445581 39.4982326,20.6701395 40.1500465,21.3219535 C40.8012093,21.9737674 41.1274419,22.7538605 41.1274419,23.6622326 L41.1274419,23.6622326 L41.1274419,35.9835349 C41.1274419,36.8912558 40.8012093,37.6713488 40.1500465,38.3231628 C39.4988837,38.9749767 38.7187907,39.3005581 37.8104186,39.3005581 L37.8104186,39.3005581 L37.3363721,39.3005581 L37.3363721,20.3445581 Z M18.3810233,20.343907 L18.3810233,39.299907 L17.9069767,39.299907 C16.9979535,39.299907 16.2185116,38.9743256 15.5666977,38.3225116 C14.9692016,37.7256124 14.6458314,37.020376 14.5960856,36.2073039 L14.5893023,35.9828837 L14.5893023,23.6615814 C14.5893023,22.7538605 14.9148837,21.9737674 15.5666977,21.3219535 C16.1635969,20.7244574 16.8688333,20.4010872 17.682407,20.3508399 L17.9069767,20.343907 L18.3810233,20.343907 Z M29.280186,24.1369302 L26.4372093,24.1369302 C26.2991628,24.1369302 26.1852093,24.1818605 26.0966512,24.2704186 C26.0297442,24.3368372 25.9881105,24.4175407 25.9714753,24.5119797 L25.9631628,24.6109767 L25.9631628,27.928 L22.6461395,27.928 C22.508093,27.928 22.3941395,27.9722791 22.3055814,28.0608372 C22.2386744,28.1272558 22.1970407,28.207593 22.1804055,28.3021235 L22.172093,28.4013953 L22.172093,31.2443721 C22.172093,31.3824186 22.2170233,31.4957209 22.3055814,31.5849302 C22.3724884,31.6513488 22.4529477,31.6928605 22.547234,31.7094651 L22.6461395,31.7177674 L25.9631628,31.7177674 L25.9631628,35.0347907 C25.9631628,35.1728372 26.008093,35.2867907 26.0966512,35.3753488 C26.1630698,35.4422558 26.243407,35.4838895 26.3379375,35.5005247 L26.4372093,35.5088372 L29.2808372,35.5088372 C29.4188837,35.5088372 29.5328372,35.463907 29.6207442,35.3753488 C29.6871628,35.3089302 29.7290407,35.2282267 29.7458285,35.1337878 L29.7542326,35.0347907 L29.7542326,31.7177674 L33.0712558,31.7177674 C33.2093023,31.7177674 33.3232558,31.6734884 33.411814,31.5849302 C33.4782326,31.5185116 33.5197442,31.4381744 33.5363488,31.3436439 L33.5446512,31.2443721 L33.5446512,28.4013953 C33.5446512,28.2633488 33.5003721,28.1493953 33.411814,28.0608372 C33.344907,27.9944186 33.2644477,27.952907 33.1701613,27.9363023 L33.0712558,27.928 L29.7542326,27.928 L29.7542326,24.6109767 C29.7542326,24.4729302 29.7093023,24.3596279 29.6207442,24.2704186 C29.532186,24.1812093 29.4182326,24.1369302 29.280186,24.1369302 Z M31.6497674,18.4490233 L24.0669767,18.4490233 L24.0669767,20.3445581 L31.6497674,20.3445581 L31.6497674,18.4490233 Z" id="Combined-Shape" fill="#FFFFFF"></path>
            </g>
        </g>
    </g>
</svg>