<?xml version="1.0" encoding="UTF-8"?>
<svg width="48px" height="47px" viewBox="0 0 48 47" version="1.1" xmlns="http://www.w3.org/2000/svg" xmlns:xlink="http://www.w3.org/1999/xlink">
    <!-- Generator: Sketch 52.6 (67491) - http://www.bohemiancoding.com/sketch -->
    <title>CAN</title>
    <desc>Created with Sketch.</desc>
    <defs>
        <path d="M0.0285,24.3112727 C0.0285,37.0778182 10.7025,47.4298182 23.868,47.4298182 C37.035,47.4298182 47.7105,37.0778182 47.7105,24.3112727 C47.7105,11.5432727 37.035,1.19272727 23.868,1.19272727 C10.7025,1.19272727 0.0285,11.5432727 0.0285,24.3112727 Z" id="path-1"></path>
    </defs>
    <g id="Welcome" stroke="none" stroke-width="1" fill="none" fill-rule="evenodd">
        <g id="flags-v1" transform="translate(-376.000000, -532.000000)">
            <g id="CAN" transform="translate(376.000000, 531.000000)">
                <mask id="mask-2" fill="white">
                    <use xlink:href="#path-1"></use>
                </mask>
                <g id="Clip-2944"></g>
                <polygon id="Fill-2943" fill="#FF0000" mask="url(#mask-2)" points="44.121 48.6181818 64.374 48.6181818 64.374 0.00290909091 44.121 0.00290909091"></polygon>
                <polygon id="Fill-2945" fill="#FF0000" mask="url(#mask-2)" points="-16.6365 48.6181818 3.5145 48.6181818 3.5145 0.00290909091 -16.6365 0.00290909091"></polygon>
                <polygon id="Fill-2946" fill="#FFFFFF" mask="url(#mask-2)" points="3.5145 48.6181818 44.121 48.6181818 44.121 0.00290909091 3.5145 0.00290909091"></polygon>
                <path d="M24.2403,32.7997091 L24.4098,40.1495273 L23.1948,40.1495273 L23.4978,32.7997091 L23.1438,32.3648 L15.2943,33.2884364 L15.9018,31.5793455 C15.9018,31.5793455 16.2408,30.8797091 15.7698,30.4535273 C15.2943,30.0273455 8.0883,24.8418909 8.0883,24.8418909 L9.7263,24.1262545 C9.7263,24.1262545 10.2153,24.0346182 10.0278,23.1793455 C9.8433,22.3255273 8.7468,18.9568 8.7468,18.9568 L12.9828,19.7640727 C12.9828,19.7640727 13.6743,19.9793455 13.9278,19.2622545 C14.1453,18.6498909 14.4108,17.8018909 14.4828,17.5706182 C14.4948,17.5313455 14.5023,17.5095273 14.5023,17.5095273 L18.0123,21.1226182 C18.0123,21.1226182 18.4758,21.5924364 18.8823,21.4077091 C19.3548,21.1953455 19.2138,20.5815273 19.2138,20.5815273 C18.9108,19.0571636 17.6568,13.1197091 17.6568,13.1197091 L19.9023,14.2324364 C19.9023,14.2324364 20.8143,14.5669818 21.1188,13.9735273 C21.4203,13.3771636 23.8518,9.2928 23.8518,9.2928 C23.8518,9.2928 26.3058,13.4455273 26.6088,14.0418909 C26.9118,14.6368 27.8238,14.2993455 27.8238,14.2993455 L30.0693,13.1866182 C30.0693,13.1866182 28.8168,19.1240727 28.5138,20.6498909 C28.5138,20.6498909 28.3728,21.2637091 28.8453,21.4775273 C29.2518,21.6608 29.7138,21.1924364 29.7138,21.1924364 L33.2253,17.5778909 C33.2253,17.5778909 33.2328,17.5997091 33.2448,17.6375273 C33.3168,17.8702545 33.5823,18.7182545 33.7998,19.3320727 C34.0533,20.0477091 34.7448,19.8338909 34.7448,19.8338909 L38.9793,19.0266182 C38.9793,19.0266182 37.8828,22.3953455 37.6983,23.2491636 C37.5123,24.1029818 38.0028,24.1960727 38.0028,24.1960727 L39.6393,24.9117091 C39.6393,24.9117091 32.4333,30.0942545 31.9593,30.5204364 C31.4853,30.9495273 31.8258,31.6491636 31.8258,31.6491636 L32.4333,33.3568 L24.6858,32.3648 L24.2403,32.7997091 Z" id="Fill-2947" fill="#FF0000" mask="url(#mask-2)"></path>
            </g>
        </g>
    </g>
</svg>