<?xml version="1.0" encoding="UTF-8"?>
<svg width="56px" height="56px" viewBox="0 0 56 56" version="1.1" xmlns="http://www.w3.org/2000/svg" xmlns:xlink="http://www.w3.org/1999/xlink">
    <!-- Generator: Sketch 58 (84663) - https://sketch.com -->
    <title>bars</title>
    <desc>Created with Sketch.</desc>
    <g id="SplitTransaction" stroke="none" stroke-width="1" fill="none" fill-rule="evenodd">
        <g id="SplitTransaction-1_CategorySearch_Modal00" transform="translate(-688.000000, -431.000000)" fill-rule="nonzero">
            <g id="bars" transform="translate(688.325581, 430.627907)">
                <circle id="Oval" fill="#8DB917" cx="27.8580465" cy="28.5563721" r="27.6184186"></circle>
                <path d="M35.9930233,16.4460465 C36.1805581,16.2585116 36.484,16.2591628 36.6715349,16.4466977 C36.8688372,16.644 36.8694884,16.9643721 36.6708837,17.1629767 L36.6708837,17.1629767 L32.2605581,21.5739535 C32.0613023,21.7732093 32.0613023,22.0948837 32.2605581,22.2941395 C32.4591628,22.4927442 32.7808372,22.4933953 32.980093,22.2941395 L32.980093,22.2941395 L37.3904186,17.8831628 C37.5890233,17.6852093 37.9093953,17.6852093 38.1066977,17.8825116 L38.1066977,17.8825116 C38.3092093,18.0843721 38.3092093,18.4047442 38.1106047,18.6033488 L38.1106047,18.6033488 L33.7002791,23.0143256 C33.5010233,23.2129302 33.5010233,23.5346047 33.7002791,23.7338605 C33.8995349,23.9324651 34.2218605,23.9331163 34.4204651,23.7338605 L34.4204651,23.7338605 L38.8314419,19.3228837 C39.0293953,19.1249302 39.3504186,19.1249302 39.5477209,19.3222326 L39.5477209,19.3222326 C39.7489302,19.5234419 39.7495814,19.843814 39.5509767,20.0424186 L39.5509767,20.0424186 L35.1406512,24.4533953 C34.9413953,24.652 34.9413953,24.9736744 35.1406512,25.1729302 C35.3392558,25.3715349 35.6609302,25.372186 35.860186,25.1729302 L35.860186,25.1729302 L40.2705116,20.7619535 C40.4684651,20.5633488 40.7894884,20.564 40.9867907,20.7613023 C41.1743256,20.9488372 41.1743256,21.2522791 40.9867907,21.439814 C39.8706977,22.555907 36.3765581,26.0500465 36.228093,26.1985116 C34.7733953,27.6532093 33.4964651,27.9553488 32.3992558,27.5978605 C31.5143256,27.3100465 30.5414884,27.5939535 29.9502326,28.3134884 L29.9502326,28.3134884 L28.5887127,29.9687205 L36.963907,36.8502326 C37.3917209,37.2018605 37.6681591,37.7011721 37.74053,38.245158 L37.7570233,38.428 C37.7869767,39.0426977 37.555814,39.6411163 37.1208372,40.076093 C36.6858605,40.5117209 36.0874419,40.7428837 35.4727442,40.7122791 C34.8586977,40.6829767 34.2856744,40.3945116 33.8943256,39.9191628 L33.8943256,39.9191628 L27.1537127,31.7157205 L20.3065116,40.0506977 C19.971293,40.458586 19.4952474,40.7219553 18.977112,40.7909623 L18.8029767,40.8066977 C18.2169302,40.8353488 17.6471628,40.6152558 17.2323721,40.2004651 C16.8175814,39.7856744 16.5974884,39.2152558 16.6261395,38.6298605 C16.6547907,38.0451163 16.9295814,37.4987907 17.3821395,37.1263256 L17.3821395,37.1263256 L25.8687127,30.1527205 L24.6295814,28.6436279 C24.4955504,28.7776589 24.3135866,28.849739 24.1266486,28.8463023 L24.0142326,28.8350698 C21.7045581,28.4085581 19.7054884,26.9701395 18.5666047,24.9163721 L18.5666047,24.9163721 L14.6746047,17.8948837 C14.5261395,17.6272558 14.5736744,17.2938605 14.7898605,17.0776744 C15.039907,16.8276279 15.4442791,16.8276279 15.6936744,17.0770233 L15.6936744,17.0770233 L25.6877209,27.0710698 C25.8303256,27.2136744 25.8303256,27.4435349 25.6877209,27.5861395 L25.6877209,27.5861395 L27.3407127,28.9437205 L29.12,27.4826047 C29.7939535,26.9283023 30.0867478,26.039198 29.8830265,25.2005287 L29.8356279,25.0335814 C29.4774884,23.9363721 29.7796279,22.6594419 31.2343256,21.2047442 C31.3827907,21.0562791 34.8769302,17.5621395 35.9930233,16.4460465 Z" id="Combined-Shape" fill="#FFFFFF"></path>
            </g>
        </g>
    </g>
</svg>