<?xml version="1.0" encoding="UTF-8"?>
<svg width="56px" height="56px" viewBox="0 0 56 56" version="1.1" xmlns="http://www.w3.org/2000/svg" xmlns:xlink="http://www.w3.org/1999/xlink">
    <!-- Generator: Sketch 58 (84663) - https://sketch.com -->
    <title>shopping</title>
    <desc>Created with Sketch.</desc>
    <g id="SplitTransaction" stroke="none" stroke-width="1" fill="none" fill-rule="evenodd">
        <g id="SplitTransaction-1_CategorySearch_Modal00" transform="translate(-869.000000, -431.000000)" fill-rule="nonzero">
            <g id="shopping" transform="translate(869.000000, 431.000000)">
                <circle id="Oval" fill="#F9662B" cx="27.8326512" cy="28.1732093" r="27.6184186"></circle>
                <path d="M36.2632558,30.5818605 C36.7392558,30.5818605 37.1703256,30.3018605 37.3637209,29.8668837 L42.1810233,19.0276279 C42.3470698,18.6551628 42.3125581,18.224093 42.0905116,17.8822326 C41.8684651,17.5403721 41.488186,17.3339535 41.0805581,17.3339535 L20.0043721,17.3339535 L18.5587907,15.4071628 C18.3315349,15.1037209 17.9746977,14.9253023 17.5957209,14.9253023 L14.5847442,14.9253023 C13.919907,14.9253023 13.380093,15.4644651 13.380093,16.1299535 C13.380093,16.7947907 13.9192558,17.3339535 14.5847442,17.3339535 L16.9933953,17.3339535 L18.1980465,18.9397209 L18.1980465,29.3772093 L18.1980465,33.592186 C18.1980465,34.2570233 18.7372093,34.796186 19.4026977,34.796186 L36.2632558,34.796186 C36.928093,34.796186 37.467907,34.2570233 37.467907,33.592186 C37.467907,32.9273488 36.9287442,32.3875349 36.2632558,32.3875349 L20.6066977,32.3875349 L20.6066977,30.5812093 L36.2632558,30.5812093 L36.2632558,30.5818605 Z M20.6066977,19.7432558 L39.2273488,19.7432558 L35.4805581,28.1738605 L20.6066977,28.1738605 L20.6066977,19.7432558 Z M23.6176744,35.3991628 C21.9578605,35.3991628 20.6066977,36.7496744 20.6066977,38.4101395 C20.6066977,40.0706047 21.9572093,41.4211163 23.6176744,41.4211163 C25.2781395,41.4211163 26.6286512,40.0706047 26.6286512,38.4101395 C26.6286512,36.7496744 25.2774884,35.3991628 23.6176744,35.3991628 Z M23.6176744,39.0124651 C23.2855814,39.0124651 23.0153488,38.7422326 23.0153488,38.4101395 C23.0153488,38.0780465 23.2855814,37.807814 23.6176744,37.807814 C23.9497674,37.807814 24.22,38.0780465 24.22,38.4101395 C24.22,38.7422326 23.9497674,39.0124651 23.6176744,39.0124651 Z M31.4459535,35.3991628 C29.7861395,35.3991628 28.4349767,36.7496744 28.4349767,38.4101395 C28.4349767,40.0706047 29.7854884,41.4211163 31.4459535,41.4211163 C33.1064186,41.4211163 34.4569302,40.0706047 34.4569302,38.4101395 C34.4569302,36.7496744 33.1057674,35.3991628 31.4459535,35.3991628 Z M31.4459535,39.0124651 C31.1138605,39.0124651 30.8436279,38.7422326 30.8436279,38.4101395 C30.8436279,38.0780465 31.1132093,37.807814 31.4459535,37.807814 C31.7786977,37.807814 32.0482791,38.0780465 32.0482791,38.4101395 C32.0482791,38.7422326 31.7780465,39.0124651 31.4459535,39.0124651 Z" id="Shape" fill="#FFFFFF"></path>
            </g>
        </g>
    </g>
</svg>