<?xml version="1.0" encoding="UTF-8"?>
<svg width="56px" height="56px" viewBox="0 0 56 56" version="1.1" xmlns="http://www.w3.org/2000/svg" xmlns:xlink="http://www.w3.org/1999/xlink">
    <!-- Generator: Sketch 58 (84663) - https://sketch.com -->
    <title>entertainment</title>
    <desc>Created with Sketch.</desc>
    <g id="SplitTransaction" stroke="none" stroke-width="1" fill="none" fill-rule="evenodd">
        <g id="SplitTransaction-1_CategorySearch_Modal00" transform="translate(-869.000000, -503.000000)" fill-rule="nonzero">
            <g id="entertainment" transform="translate(868.325581, 502.976744)">
                <circle id="Oval" fill="#C43788" cx="28.608" cy="28.1788837" r="27.6184186"></circle>
                <path d="M31.7446512,19.5197209 C32.1861395,19.5197209 32.6074419,19.6844651 32.9317209,19.984 L32.9317209,19.984 L36.2676279,23.064 C36.3985116,23.1844651 36.5984186,23.1792558 36.724093,23.0535814 L36.724093,23.0535814 L39.1034419,20.6488372 C39.7155349,20.0373953 40.7059535,20.0386977 41.3141395,20.6468837 L41.3141395,20.6468837 L41.3786047,20.7113488 C41.6690233,21.0017674 41.8285581,21.387907 41.8298605,21.7987907 C41.8298605,22.2090233 41.6696744,22.5951628 41.3792558,22.8855814 L41.3792558,22.8855814 L37.4475349,26.8173023 C36.8627907,27.4026977 35.8430698,27.4026977 35.2576744,26.8173023 L35.2576744,26.8173023 L33.1622326,24.7225116 L30.155814,27.7243721 L33.9397209,31.5037209 C34.0465116,31.6098605 34.0933953,31.7622326 34.0660465,31.9100465 L34.0660465,31.9100465 L32.6484651,39.5156279 C32.520186,40.0671628 32.1685581,40.5106047 31.6788837,40.7528372 C31.4255814,40.8785116 31.1501395,40.9416744 30.8733953,40.9416744 C30.6168372,40.9416744 30.3583256,40.8869767 30.1147907,40.7775814 C29.3249302,40.424 28.9036279,39.5286512 29.1126512,38.6502326 L29.1126512,38.6502326 L29.9428837,33.3458605 L27.1936744,30.4709767 L23.924186,33.9605581 C23.8375814,34.0530233 23.7171163,34.1051163 23.5914419,34.1051163 L23.5914419,34.1051163 L17.2106977,34.1051163 C16.7125581,34.1051163 16.2306977,33.8980465 15.888186,33.5366512 C15.5404651,33.1700465 15.364,32.6894884 15.3906977,32.184186 C15.4408372,31.2165581 16.2743256,30.4586047 17.288186,30.4586047 L17.288186,30.4586047 L21.5643721,30.4586047 L28.4973023,22.7104186 L27.4339535,22.7104186 L24.4633488,25.8542326 C24.1748837,26.1693953 23.7574884,26.3543256 23.3231628,26.3562791 L23.3231628,26.3562791 C22.8771163,26.3562791 22.4694884,26.1778605 22.168,25.8542326 C21.6034419,25.2493023 21.6457674,24.2549767 22.2617674,23.6383256 L22.2617674,23.6383256 L26.4682791,19.6447442 C26.5529302,19.5646512 26.6649302,19.5197209 26.7821395,19.5197209 L26.7821395,19.5197209 Z M36.3516279,15.4173953 C37.8597209,15.4173953 39.0865116,16.644186 39.0865116,18.1522791 C39.0865116,19.6603721 37.8597209,20.8871628 36.3516279,20.8871628 C34.8435349,20.8871628 33.6173953,19.6603721 33.6167442,18.1522791 C33.6167442,16.644186 34.8435349,15.4173953 36.3516279,15.4173953 Z" id="Combined-Shape" fill="#FFFFFF"></path>
            </g>
        </g>
    </g>
</svg>