<?xml version="1.0" encoding="UTF-8"?>
<svg width="48px" height="47px" viewBox="0 0 48 47" version="1.1" xmlns="http://www.w3.org/2000/svg" xmlns:xlink="http://www.w3.org/1999/xlink">
    <!-- Generator: Sketch 52.6 (67491) - http://www.bohemiancoding.com/sketch -->
    <title>Den</title>
    <desc>Created with Sketch.</desc>
    <defs>
        <path d="M0.099,23.5476364 C0.099,36.3156364 10.7745,46.6661818 23.9415,46.6661818 C37.107,46.6661818 47.781,36.3156364 47.781,23.5476364 C47.781,10.7796364 37.107,0.429090909 23.9415,0.429090909 C10.7745,0.429090909 0.099,10.7796364 0.099,23.5476364 Z" id="path-1"></path>
    </defs>
    <g id="Welcome" stroke="none" stroke-width="1" fill="none" fill-rule="evenodd">
        <g id="flags-v1" transform="translate(-376.000000, -403.000000)">
            <g id="Den" transform="translate(376.000000, 403.000000)">
                <mask id="mask-2" fill="white">
                    <use xlink:href="#path-1"></use>
                </mask>
                <g id="Clip-545"></g>
                <polygon id="Fill-544" fill="#C50D2F" mask="url(#mask-2)" points="22.749 20.0698182 68.9355 20.0698182 68.9355 -0.802909091 22.749 -0.802909091"></polygon>
                <polygon id="Fill-546" fill="#C50D2F" mask="url(#mask-2)" points="-12.054 47.8981818 13.9935 47.8981818 13.9935 27.0269091 -12.054 27.0269091"></polygon>
                <polygon id="Fill-547" fill="#C50D2F" mask="url(#mask-2)" points="-12.054 20.0698182 13.9935 20.0698182 13.9935 -0.802909091 -12.054 -0.802909091"></polygon>
                <polygon id="Fill-548" fill="#C50D2F" mask="url(#mask-2)" points="22.749 47.8981818 68.9355 47.8981818 68.9355 27.0269091 22.749 27.0269091"></polygon>
                <polygon id="Fill-549" fill="#FFFFFF" mask="url(#mask-2)" points="68.93565 20.0696727 68.93565 27.0267636 22.74915 27.0267636 22.74915 47.8980364 13.99365 47.8980364 13.99365 27.0267636 -12.05385 27.0267636 -12.05385 20.0696727 13.99365 20.0696727 13.99365 -0.803054545 22.74915 -0.803054545 22.74915 20.0696727"></polygon>
            </g>
        </g>
    </g>
</svg>