<?xml version="1.0" encoding="UTF-8"?>
<svg width="48px" height="47px" viewBox="0 0 48 47" version="1.1" xmlns="http://www.w3.org/2000/svg" xmlns:xlink="http://www.w3.org/1999/xlink">
    <!-- Generator: Sketch 52.6 (67491) - http://www.bohemiancoding.com/sketch -->
    <title>HUN</title>
    <desc>Created with Sketch.</desc>
    <defs>
        <path d="M0.0285,24.2225455 C0.0285,36.9905455 10.7025,47.3410909 23.868,47.3410909 C37.035,47.3410909 47.7105,36.9905455 47.7105,24.2225455 C47.7105,11.4545455 37.035,1.104 23.868,1.104 C10.7025,1.104 0.0285,11.4545455 0.0285,24.2225455 Z" id="path-1"></path>
    </defs>
    <g id="Welcome" stroke="none" stroke-width="1" fill="none" fill-rule="evenodd">
        <g id="flags-v1" transform="translate(-266.000000, -338.000000)">
            <g id="HUN" transform="translate(266.000000, 337.000000)">
                <mask id="mask-2" fill="white">
                    <use xlink:href="#path-1"></use>
                </mask>
                <g id="Clip-2934"></g>
                <polygon id="Fill-2933" fill="#CD1225" mask="url(#mask-2)" points="-16.551 15.8225455 64.287 15.8225455 64.287 -0.122181818 -16.551 -0.122181818"></polygon>
                <polygon id="Fill-2935" fill="#008651" mask="url(#mask-2)" points="-16.5495 48.5687273 64.2885 48.5687273 64.2885 32.1367273 -16.5495 32.1367273"></polygon>
                <polygon id="Fill-2936" fill="#FFFFFF" mask="url(#mask-2)" points="-16.5495 32.1352727 64.2885 32.1352727 64.2885 15.8225455 -16.5495 15.8225455"></polygon>
            </g>
        </g>
    </g>
</svg>