<?xml version="1.0" encoding="UTF-8"?>
<svg width="56px" height="56px" viewBox="0 0 56 56" version="1.1" xmlns="http://www.w3.org/2000/svg" xmlns:xlink="http://www.w3.org/1999/xlink">
    <!-- Generator: Sketch 58 (84663) - https://sketch.com -->
    <title>transfers</title>
    <desc>Created with Sketch.</desc>
    <g id="SplitTransaction" stroke="none" stroke-width="1" fill="none" fill-rule="evenodd">
        <g id="SplitTransaction-1_CategorySearch_Modal00" transform="translate(-1051.000000, -431.000000)" fill-rule="nonzero">
            <g id="transfers" transform="translate(1050.004612, 430.023624)">
                <circle id="Oval" fill="#0089C8" cx="28.9387294" cy="28.9197176" r="27.9433412"></circle>
                <path d="M20.3094588,17.5424941 C20.712,17.5424941 21.0374588,17.8679529 21.0374588,18.2704941 C21.0374588,18.6730353 20.712,18.9984941 20.3094588,18.9984941 L20.3094588,18.9984941 L18.2960941,18.9984941 C17.4251294,18.9984941 16.7208471,19.7034353 16.7208471,20.5737412 L16.7208471,20.5737412 L16.7208471,37.2419765 C16.7208471,38.1122824 17.4257882,38.8172235 18.2960941,38.8172235 L18.2960941,38.8172235 L32.1043765,38.8172235 L30.1858824,36.8987294 C29.9019294,36.6141176 29.9012706,36.1582118 30.1858824,35.8742588 C30.4704941,35.5903059 30.9264,35.5903059 31.2103529,35.8742588 L31.2103529,35.8742588 L34.3661176,39.0300235 C34.5084235,39.1723294 34.5795765,39.3554824 34.5795765,39.5452235 C34.5795765,39.7349647 34.5084235,39.9181176 34.3661176,40.0604235 L34.3661176,40.0604235 L31.2103529,43.2161882 C30.9257412,43.5001412 30.4698353,43.5008 30.1858824,43.2161882 C29.9019294,42.9315765 29.9019294,42.4756706 30.1858824,42.1917176 L30.1858824,42.1917176 L32.0984471,40.2791529 L18.2960941,40.2791529 C16.6259765,40.2791529 15.2701176,38.9226353 15.2701176,37.2531765 L15.2701176,37.2531765 L15.2701176,20.5796706 C15.2701176,18.9161412 16.6319059,17.5602824 18.2960941,17.5424941 L18.2960941,17.5424941 Z M26.6736941,14.6219294 C26.9583059,14.3379765 27.4142118,14.3379765 27.6981647,14.6219294 C27.9821176,14.9058824 27.9821176,15.3624471 27.6981647,15.6464 L27.6981647,15.6464 L25.7796706,17.5648941 L39.5820235,17.5648941 C41.2521412,17.5648941 42.608,18.9214118 42.608,20.5908706 L42.608,20.5908706 L42.608,37.2584471 C42.608,38.9285647 41.2514824,40.2844235 39.5820235,40.2844235 L39.5820235,40.2844235 L37.5686588,40.2844235 C37.1661176,40.2844235 36.8406588,39.9589647 36.8406588,39.5564235 C36.8406588,39.1538824 37.1661176,38.8284235 37.5686588,38.8284235 L37.5686588,38.8284235 L39.5820235,38.8284235 C40.4523294,38.8284235 41.1572706,38.1234824 41.1572706,37.2531765 L41.1572706,37.2531765 L41.1572706,20.5796706 C41.1572706,19.7087059 40.4523294,19.0044235 39.5820235,19.0044235 L39.5820235,19.0044235 L25.7796706,19.0044235 L27.6981647,20.9229176 C27.8404706,21.0652235 27.9116235,21.2483765 27.9116235,21.4381176 C27.9116235,21.6278588 27.8404706,21.8110118 27.6981647,21.9533176 C27.4135529,22.2372706 26.9576471,22.2372706 26.6736941,21.9533176 L26.6736941,21.9533176 L23.5179294,18.7975529 C23.2458353,18.5254588 23.2458353,18.0399059 23.5179294,17.7776941 L23.5179294,17.7776941 Z" id="Combined-Shape" fill="#FFFFFF"></path>
            </g>
        </g>
    </g>
</svg>