year	inference	linmodel	pvalue	confint	statpow	probdist	bayeslaw	effectsize	BF
D2	2	1	3	1	2	2	0	2	0
D3 and more	2	2	2	2	2	2	2	2	2
D2	3	3	3	1	2	1	0	2	0
D2	1	0	2	2	1	0	0	1	0
D2	3	2	3	3	2	2	1	2	1
D3 and more	3	2	3	3	2	2	0	2	0
D2	2	2	2	2	2	2	2	3	2
D3 and more	2	1	3	2	2	2	2	3	1
D2	0	1	2	1	0	0	0	0	0
D3 and more	2	2	3	2	1	1	1	2	0
D2	2	2	2	2	2	2	1	1	1
D3 and more	2	3	3	2	1	3	1	1	1
D1	1	1	3	2	1	2	0	1	0
D3 and more	2	2	2	1	1	1	1	1	1
D3 and more	1	1	2	2	2	1	1	2	1
D2	2	1	2	2	2	0	1	2	0
D2	2	2	2	2	1	2	0	1	0
D2	1	1	2	2	2	1	1	1	0
D1	2	1	3	2	1	1	2	3	2
D1	3	3	3	2	2	2	2	2	1
D1	2	2	2	2	2	2	1	2	1
D1	2	1	3	2	2	1	0	2	0
D2	1	1	2	1	2	1	0	0	0
D3 and more	2	3	3	3	1	2	0	2	0
D2	0	1	2	3	2	2	0	0	0
D2	0	1	3	1	1	2	0	1	0
D3 and more	3	2	3	2	2	0	0	3	0
D1	2	2	3	2	2	3	2	2	2
D2	3	3	3	3	3	3	0	2	0
D1	1	1	2	2	1	1	1	1	1
D1	1	1	2	1	2	0	0	1	0
D1	2	2	2	2	2	2	0	1	0
D1	2	2	2	2	2	2	0	2	0
D1	2	2	1	1	1	2	1	1	1
D1	3	1	3	3	2	2	2	3	2
D2	1	0	2	2	2	2	0	0	0
D3 and more	3	2	1	2	1	3	0	1	1
D2	1	0	1	2	2	0	0	2	0
D2	3	3	3	3	2	2	1	2	1
D1	1	2	1	1	1	2	2	1	1
D1	1	1	1	1	1	2	2	1	0
D1	2	3	3	2	3	2	1	3	1
D3 and more	0	0	0	0	0	0	0	0	0
D1	3	2	3	3	2	2	3	3	3
D2									
D3 and more									
									

