"subject","block_num","condition","stim_time","stim_side","response","response_time"
"Anna",1,"easy",1.531,"L","L",
"Anna",1,"easy",4.76,"L","L",4.915
"Anna",1,,6.855,"R","R",7.895
"Anna",2,"hard",1.168,"R","R",2.437
"Anna",2,"hard",,"R","R",6.784
"Anna",2,"hard",9.122,"L","R",9.981
"Boris",1,"hard",1.496,"R","R",2.255
"Boris",1,,4.32,"L","R",5.015
"Boris",1,"hard",6.228,"R",,6.985
"Boris",2,"easy",1.05,"R","L",2.22
"Boris",2,"easy",4.834,"R","R",6.784
"Boris",2,"easy",8.831,"L","L",10.12
