<?xml version="1.0" standalone="no"?>
<!DOCTYPE svg PUBLIC "-//W3C//DTD SVG 20010904//EN"
 "http://www.w3.org/TR/2001/REC-SVG-20010904/DTD/svg10.dtd">
<svg version="1.0" xmlns="http://www.w3.org/2000/svg"
 width="300.000000pt" height="184.000000pt" viewBox="0 0 300.000000 184.000000"
 preserveAspectRatio="xMidYMid meet">
<metadata>
Created by potrace 1.10, written by Peter Selinger 2001-2011
</metadata>
<g transform="translate(0.000000,184.000000) scale(0.100000,-0.100000)"
fill="#000000" stroke="none">
<path d="M146 1779 c-4 -13 -22 -97 -41 -187 l-35 -163 30 -64 c190 -407 597
-880 1055 -1227 57 -43 67 -47 155 -58 123 -17 293 -17 402 -1 70 10 101 21
167 58 323 183 693 622 967 1148 l73 141 -19 109 c-11 61 -22 137 -25 169 -9
107 5 100 -174 93 -745 -31 -1393 -31 -2348 0 l-202 6 -5 -24z m754 -15 c656
-16 1080 -13 1776 13 l171 6 6 -29 c3 -16 5 -30 4 -30 -1 -1 -74 -7 -162 -14
-236 -18 -1681 -25 -2155 -10 -212 6 -386 13 -387 14 -2 2 2 17 8 34 9 27 16
32 42 32 18 0 331 -7 697 -16z m1969 -167 c7 -43 11 -80 9 -81 -1 -1 -55 -31
-118 -65 -304 -167 -591 -412 -762 -652 -132 -183 -224 -400 -253 -594 -8 -54
-17 -100 -19 -102 -21 -22 -286 -25 -408 -6 l-38 6 0 87 c0 103 -30 283 -66
395 -134 413 -490 730 -996 887 -60 18 -108 38 -108 43 1 6 9 48 19 95 16 79
19 85 42 83 536 -33 2305 -29 2612 5 72 8 68 13 86 -101z m24 -133 c4 -24 -1
-29 -62 -57 -235 -109 -502 -309 -670 -502 -188 -216 -311 -458 -358 -708 -14
-72 -20 -87 -36 -87 -15 0 -17 6 -12 38 29 181 68 309 132 437 128 254 394
535 700 738 111 75 272 167 289 167 7 0 14 -12 17 -26z m-2650 -20 c242 -77
470 -210 638 -371 239 -230 359 -501 376 -851 5 -107 4 -122 -9 -117 -11 5
-17 30 -22 97 -30 401 -210 721 -541 960 -157 114 -396 227 -582 274 -16 4 -4
44 13 44 8 0 65 -16 127 -36z m-67 -87 c28 -61 198 -316 289 -432 181 -232
556 -618 718 -738 16 -12 27 -30 27 -44 0 -22 -5 -19 -67 29 -424 329 -781
736 -983 1120 -33 63 -60 118 -60 121 0 3 13 1 29 -4 19 -7 34 -23 47 -52z
m2693 11 c-227 -447 -513 -831 -799 -1070 -110 -93 -253 -184 -259 -167 -2 7
9 22 25 33 16 12 76 62 135 113 275 238 577 615 796 997 55 97 88 134 116 136
4 0 -2 -19 -14 -42z m-2617 -2 c282 -106 563 -308 719 -516 69 -92 153 -259
184 -365 24 -83 60 -283 52 -291 -6 -6 -220 188 -342 311 -137 137 -289 308
-393 441 -115 149 -307 444 -288 444 3 0 34 -11 68 -24z m2522 -43 c-195 -337
-403 -618 -632 -855 -136 -140 -314 -296 -320 -278 -6 16 48 196 81 275 111
263 330 526 601 721 83 61 275 182 289 183 5 1 -4 -20 -19 -46z"/>
</g>
</svg>
