StartTime::7/10/2022 10:20:13 PM	ControllerName::User	ActionName::GetAllUsers	EndTime::7/10/2022 10:20:17 PM	TotalTime::00:00:04.1160516
StartTime::7/10/2022 10:20:40 PM	ControllerName::User	ActionName::UserRegister	EndTime::7/10/2022 10:20:40 PM	TotalTime::00:00:00.1673589
StartTime::7/10/2022 10:21:39 PM	ControllerName::User	ActionName::GetAllUsers	EndTime::7/10/2022 10:21:44 PM	TotalTime::00:00:04.4106219
StartTime::7/10/2022 11:35:50 PM	ControllerName::User	ActionName::UserRegister	EndTime::7/10/2022 11:35:50 PM	TotalTime::00:00:00.1713372
StartTime::7/10/2022 11:36:36 PM	ControllerName::User	ActionName::UserLogin	EndTime::7/10/2022 11:36:36 PM	TotalTime::00:00:00.0006614
StartTime::7/10/2022 11:36:43 PM	ControllerName::User	ActionName::UserLogin	EndTime::7/10/2022 11:36:44 PM	TotalTime::00:00:00.7993959
StartTime::7/10/2022 11:37:06 PM	ControllerName::User	ActionName::UserRegister	EndTime::7/10/2022 11:37:06 PM	TotalTime::00:00:00.0004182
StartTime::7/10/2022 11:37:08 PM	ControllerName::User	ActionName::GetAllUsers	EndTime::7/10/2022 11:37:09 PM	TotalTime::00:00:01.5622536
StartTime::7/10/2022 11:37:19 PM	ControllerName::User	ActionName::UserLogin	EndTime::7/10/2022 11:37:36 PM	TotalTime::00:00:16.9041079
StartTime::7/10/2022 11:37:36 PM	ControllerName::User	ActionName::Dashboard	EndTime::7/10/2022 11:37:36 PM	TotalTime::00:00:00.1169711
StartTime::7/10/2022 11:38:06 PM	ControllerName::User	ActionName::UserLogin	EndTime::7/10/2022 11:38:06 PM	TotalTime::00:00:00.0003162
StartTime::7/10/2022 11:38:12 PM	ControllerName::User	ActionName::UserLogin	EndTime::7/10/2022 11:38:12 PM	TotalTime::00:00:00.0639488
StartTime::7/10/2022 11:38:12 PM	ControllerName::User	ActionName::Dashboard	EndTime::7/10/2022 11:38:12 PM	TotalTime::00:00:00.0005409
StartTime::7/10/2022 11:38:27 PM	ControllerName::User	ActionName::Dashboard	EndTime::7/10/2022 11:38:28 PM	TotalTime::00:00:00.0082318
StartTime::7/10/2022 11:39:15 PM	ControllerName::User	ActionName::UserLogin	EndTime::7/10/2022 11:39:15 PM	TotalTime::00:00:00.0007392
StartTime::7/10/2022 11:39:20 PM	ControllerName::User	ActionName::UserLogin	EndTime::7/10/2022 11:39:21 PM	TotalTime::00:00:01.0802931
StartTime::7/10/2022 11:39:21 PM	ControllerName::User	ActionName::Dashboard	EndTime::7/10/2022 11:39:21 PM	TotalTime::00:00:00.0444540
StartTime::7/10/2022 11:40:17 PM	ControllerName::User	ActionName::UserRegister	EndTime::7/10/2022 11:40:17 PM	TotalTime::00:00:00.0539676
StartTime::7/10/2022 11:40:35 PM	ControllerName::User	ActionName::UserLogin	EndTime::7/10/2022 11:40:35 PM	TotalTime::00:00:00.0009365
StartTime::7/10/2022 11:40:41 PM	ControllerName::User	ActionName::UserLogin	EndTime::7/10/2022 11:40:42 PM	TotalTime::00:00:01.1369296
StartTime::7/10/2022 11:40:42 PM	ControllerName::User	ActionName::Dashboard	EndTime::7/10/2022 11:40:42 PM	TotalTime::00:00:00.0477822
StartTime::7/10/2022 11:42:16 PM	ControllerName::User	ActionName::UserLogin	EndTime::7/10/2022 11:42:16 PM	TotalTime::00:00:00.0006684
StartTime::7/10/2022 11:42:21 PM	ControllerName::User	ActionName::UserLogin	EndTime::7/10/2022 11:42:21 PM	TotalTime::00:00:00.0224087
StartTime::7/10/2022 11:42:21 PM	ControllerName::User	ActionName::Dashboard	EndTime::7/10/2022 11:42:21 PM	TotalTime::00:00:00.0020732
StartTime::7/10/2022 11:45:43 PM	ControllerName::User	ActionName::UserRegister	EndTime::7/10/2022 11:45:43 PM	TotalTime::00:00:00.0520490
StartTime::7/10/2022 11:45:50 PM	ControllerName::User	ActionName::UserLogin	EndTime::7/10/2022 11:45:50 PM	TotalTime::00:00:00.0004981
StartTime::7/10/2022 11:45:55 PM	ControllerName::User	ActionName::UserLogin	EndTime::7/10/2022 11:45:56 PM	TotalTime::00:00:01.1181292
StartTime::7/10/2022 11:45:56 PM	ControllerName::User	ActionName::Dashboard	EndTime::7/10/2022 11:45:56 PM	TotalTime::00:00:00.0473102
StartTime::7/10/2022 11:46:31 PM	ControllerName::User	ActionName::UserLogin	EndTime::7/10/2022 11:46:31 PM	TotalTime::00:00:00.0004129
StartTime::7/10/2022 11:46:37 PM	ControllerName::User	ActionName::UserLogin	EndTime::7/10/2022 11:46:37 PM	TotalTime::00:00:00.0091572
StartTime::7/10/2022 11:46:37 PM	ControllerName::User	ActionName::Dashboard	EndTime::7/10/2022 11:46:37 PM	TotalTime::00:00:00.0006340
StartTime::7/10/2022 11:52:16 PM	ControllerName::User	ActionName::UserRegister	EndTime::7/10/2022 11:52:16 PM	TotalTime::00:00:00.0526912
StartTime::7/10/2022 11:52:42 PM	ControllerName::User	ActionName::UserLogin	EndTime::7/10/2022 11:52:42 PM	TotalTime::00:00:00.0006461
StartTime::7/10/2022 11:52:47 PM	ControllerName::User	ActionName::UserLogin	EndTime::7/10/2022 11:52:48 PM	TotalTime::00:00:01.1513356
StartTime::7/10/2022 11:52:48 PM	ControllerName::User	ActionName::Dashboard	EndTime::7/10/2022 11:52:48 PM	TotalTime::00:00:00.0509137
StartTime::7/10/2022 11:53:10 PM	ControllerName::User	ActionName::UserLogin	EndTime::7/10/2022 11:53:10 PM	TotalTime::00:00:00.0005568
StartTime::7/10/2022 11:53:16 PM	ControllerName::User	ActionName::UserLogin	EndTime::7/10/2022 11:53:16 PM	TotalTime::00:00:00.0228699
StartTime::7/10/2022 11:53:16 PM	ControllerName::User	ActionName::Dashboard	EndTime::7/10/2022 11:53:16 PM	TotalTime::00:00:00.0021013
StartTime::7/10/2022 11:53:16 PM	ControllerName::User	ActionName::UserLogin	EndTime::7/10/2022 11:53:16 PM	TotalTime::00:00:00.0004229
StartTime::7/10/2022 11:53:22 PM	ControllerName::User	ActionName::UserLogin	EndTime::7/10/2022 11:53:22 PM	TotalTime::00:00:00.0630140
StartTime::7/10/2022 11:53:22 PM	ControllerName::User	ActionName::Dashboard	EndTime::7/10/2022 11:53:22 PM	TotalTime::00:00:00.0004751
StartTime::7/10/2022 11:53:22 PM	ControllerName::User	ActionName::UserLogin	EndTime::7/10/2022 11:53:22 PM	TotalTime::00:00:00.0002763
StartTime::7/10/2022 11:54:49 PM	ControllerName::User	ActionName::Dashboard	EndTime::7/10/2022 11:54:49 PM	TotalTime::00:00:00.0011394
StartTime::7/10/2022 11:55:29 PM	ControllerName::User	ActionName::UserRegister	EndTime::7/10/2022 11:55:29 PM	TotalTime::00:00:00.0007841
StartTime::7/10/2022 11:55:40 PM	ControllerName::User	ActionName::Dashboard	EndTime::7/10/2022 11:55:40 PM	TotalTime::00:00:00.0006554
StartTime::7/10/2022 11:59:36 PM	ControllerName::User	ActionName::Dashboard	EndTime::7/10/2022 11:59:36 PM	TotalTime::00:00:00.0100958
StartTime::7/10/2022 11:59:36 PM	ControllerName::User	ActionName::UserLogin	EndTime::7/10/2022 11:59:36 PM	TotalTime::00:00:00.0010273
StartTime::7/10/2022 11:59:45 PM	ControllerName::User	ActionName::Dashboard	EndTime::7/10/2022 11:59:45 PM	TotalTime::00:00:00.0005004
StartTime::7/10/2022 11:59:45 PM	ControllerName::User	ActionName::UserLogin	EndTime::7/10/2022 11:59:45 PM	TotalTime::00:00:00.0003153
StartTime::7/11/2022 12:00:52 AM	ControllerName::User	ActionName::UserRegister	EndTime::7/11/2022 12:00:52 AM	TotalTime::00:00:00.0445320
StartTime::7/11/2022 12:01:48 AM	ControllerName::User	ActionName::Dashboard	EndTime::7/11/2022 12:01:48 AM	TotalTime::00:00:00.0005164
StartTime::7/11/2022 12:01:48 AM	ControllerName::User	ActionName::UserLogin	EndTime::7/11/2022 12:01:48 AM	TotalTime::00:00:00.0005291
StartTime::7/11/2022 12:03:47 AM	ControllerName::User	ActionName::UserRegister	EndTime::7/11/2022 12:03:47 AM	TotalTime::00:00:00.0423300
StartTime::7/11/2022 12:45:31 AM	ControllerName::User	ActionName::Dashboard	EndTime::7/11/2022 12:45:32 AM	TotalTime::00:00:01.0957462
StartTime::7/11/2022 12:45:32 AM	ControllerName::User	ActionName::UserLogin	EndTime::7/11/2022 12:45:32 AM	TotalTime::00:00:00.0078381
StartTime::7/11/2022 12:45:42 AM	ControllerName::User	ActionName::Dashboard	EndTime::7/11/2022 12:45:47 AM	TotalTime::00:00:04.6948978
StartTime::7/11/2022 12:45:47 AM	ControllerName::User	ActionName::UserLogin	EndTime::7/11/2022 12:45:49 AM	TotalTime::00:00:02.4196494
StartTime::7/11/2022 12:48:26 AM	ControllerName::User	ActionName::Dashboard	EndTime::7/11/2022 12:48:26 AM	TotalTime::00:00:00.0197944
StartTime::7/11/2022 12:48:26 AM	ControllerName::User	ActionName::UserLogin	EndTime::7/11/2022 12:48:26 AM	TotalTime::00:00:00.0049498
StartTime::7/11/2022 12:48:44 AM	ControllerName::User	ActionName::Dashboard	EndTime::7/11/2022 12:48:44 AM	TotalTime::00:00:00.0099980
StartTime::7/11/2022 12:48:44 AM	ControllerName::User	ActionName::UserLogin	EndTime::7/11/2022 12:48:44 AM	TotalTime::00:00:00.0095521
StartTime::7/11/2022 12:50:17 AM	ControllerName::User	ActionName::Dashboard	EndTime::7/11/2022 12:50:17 AM	TotalTime::00:00:00.0108146
StartTime::7/11/2022 12:50:17 AM	ControllerName::User	ActionName::UserLogin	EndTime::7/11/2022 12:50:17 AM	TotalTime::00:00:00.0071666
StartTime::7/11/2022 12:52:47 AM	ControllerName::User	ActionName::UserRegister	EndTime::7/11/2022 12:52:48 AM	TotalTime::00:00:01.3636963
StartTime::7/11/2022 12:53:56 AM	ControllerName::User	ActionName::UserRegister	EndTime::7/11/2022 12:53:56 AM	TotalTime::00:00:00.0524015
StartTime::7/11/2022 12:54:23 AM	ControllerName::User	ActionName::Dashboard	EndTime::7/11/2022 12:54:23 AM	TotalTime::00:00:00.0012576
StartTime::7/11/2022 12:54:24 AM	ControllerName::User	ActionName::UserLogin	EndTime::7/11/2022 12:54:24 AM	TotalTime::00:00:00.0004999
StartTime::7/11/2022 12:54:43 AM	ControllerName::User	ActionName::UserRegister	EndTime::7/11/2022 12:54:44 AM	TotalTime::00:00:00.0498349
StartTime::7/12/2022 10:20:41 AM	ControllerName::User	ActionName::UserRegister	EndTime::7/12/2022 10:20:41 AM	TotalTime::00:00:00.3951027
StartTime::7/12/2022 10:23:53 AM	ControllerName::User	ActionName::UserLogin	EndTime::7/12/2022 10:23:53 AM	TotalTime::00:00:00.0008870
StartTime::7/12/2022 10:24:04 AM	ControllerName::User	ActionName::UserLogin	EndTime::7/12/2022 10:24:08 AM	TotalTime::00:00:03.5827346
StartTime::7/12/2022 10:24:10 AM	ControllerName::User	ActionName::UserLogin	EndTime::7/12/2022 10:24:10 AM	TotalTime::00:00:00.0010835
StartTime::7/12/2022 10:24:30 AM	ControllerName::User	ActionName::UserLogin	EndTime::7/12/2022 10:24:31 AM	TotalTime::00:00:01.7096080
StartTime::7/12/2022 10:25:18 AM	ControllerName::User	ActionName::UserRegister	EndTime::7/12/2022 10:25:18 AM	TotalTime::00:00:00.0004275
StartTime::7/12/2022 10:25:21 AM	ControllerName::User	ActionName::GetAllUsers	EndTime::7/12/2022 10:25:22 AM	TotalTime::00:00:00.0658740
StartTime::7/12/2022 10:25:28 AM	ControllerName::User	ActionName::UserRegister	EndTime::7/12/2022 10:25:28 AM	TotalTime::00:00:00.0009913
StartTime::7/12/2022 10:25:48 AM	ControllerName::User	ActionName::UserLogin	EndTime::7/12/2022 10:25:48 AM	TotalTime::00:00:00.0003469
StartTime::7/12/2022 10:25:54 AM	ControllerName::User	ActionName::UserLogin	EndTime::7/12/2022 10:25:54 AM	TotalTime::00:00:00.0071617
StartTime::7/12/2022 10:26:36 AM	ControllerName::User	ActionName::UserLogin	EndTime::7/12/2022 10:26:36 AM	TotalTime::00:00:00.0004777
StartTime::7/12/2022 10:26:43 AM	ControllerName::User	ActionName::UserLogin	EndTime::7/12/2022 10:26:43 AM	TotalTime::00:00:00.0051404
StartTime::7/12/2022 10:26:46 AM	ControllerName::User	ActionName::UserLogin	EndTime::7/12/2022 10:26:46 AM	TotalTime::00:00:00.0003211
StartTime::7/12/2022 10:29:13 AM	ControllerName::User	ActionName::UserRegister	EndTime::7/12/2022 10:29:13 AM	TotalTime::00:00:00.3192639
StartTime::7/12/2022 10:29:38 AM	ControllerName::User	ActionName::GetAllUsers	EndTime::7/12/2022 10:29:43 AM	TotalTime::00:00:04.5483465
StartTime::7/12/2022 10:30:23 AM	ControllerName::User	ActionName::UserLogin	EndTime::7/12/2022 10:30:23 AM	TotalTime::00:00:00.0005230
StartTime::7/12/2022 10:30:29 AM	ControllerName::User	ActionName::UserLogin	EndTime::7/12/2022 10:30:31 AM	TotalTime::00:00:02.2929794
StartTime::7/12/2022 10:30:31 AM	ControllerName::User	ActionName::Dashboard	EndTime::7/12/2022 10:30:31 AM	TotalTime::00:00:00.1720680
