%YAML 1.1
%TAG !u! tag:unity3d.com,2011:
--- !u!1045 &1
EditorBuildSettings:
  m_ObjectHideFlags: 0
  serializedVersion: 2
  m_Scenes:
  - enabled: 0
    path: Assets/Scenes/SampleScene.unity
    guid: 99c9720ab356a0642a771bea13969a05
  - enabled: 1
    path: Assets/Scenes/Escena1.unity
    guid: 937ace61355c6a14faeca61dfb5bfb39
  - enabled: 1
    path: Assets/Scenes/Escena2.unity
    guid: 1e24d03c7be83d9469e57194ef4b6e05
  m_configObjects: {}
