hulk

rock lee

orochimaru
nagato uzumaki

kakashi hatake

rock lee

captain america

orochimaru

thor

naruto uzumaki

itachi uchiha

sakura haruno

nagato uzumaki

rock lee

tsunade

sakura haruno

hulk

captain america
