5878 3778 236
8057 1093 262
5619 4696 236
6922 1686 262
6105 1375 238
6545 3453 262
7044 4033 262
7672 2202 262
5802 4651 236
5321 4470 210
6110 4937 236
3580 3248 194
8685 718 262
5638 3780 236
6065 3622 238
8210 2858 262
8523 2416 262
4943 642 238
8308 553 262
4135 4482 215
5121 1695 238
7934 2218 262
6258 3201 262
6720 1508 262
7623 3612 262
7907 1849 262
6025 4824 236
6260 962 262
5519 178 238
4018 72 238
6682 4804 262
4528 65 238
7175 2031 262
4173 471 238
5164 1911 238
4841 1745 238
5380 4432 210
5235 4146 215
5925 2995 238
4713 1909 238
5847 664 238
4946 2789 238
7993 4348 262
7027 361 262
7183 1301 262
4385 4566 184
4208 2650 238
5044 73 238
3120 203 217
3612 2283 217
3757 4603 215
6580 3316 262
3903 3095 238
4264 4725 215
5380 3372 238
8165 2278 262
7016 2190 262
4916 3196 238
7696 216 262
4502 1343 238
3683 2874 217
4756 4948 210
8357 3675 262
4859 2442 238
6625 1646 262
7760 2374 262
7595 1754 262
6341 4613 262
6321 1660 262
5429 2423 238
5840 2639 238
4318 1080 238
5697 1298 238
6549 4468 262
5922 2367 238
3108 4220 238
5784 2160 238
3862 3554 238
8274 1782 262
4604 2192 238
5944 3177 238
3640 1243 217
3983 3052 238
6973 4215 262
5479 2106 238
6281 4005 262
8016 565 262
4075 1778 238
7492 1788 262
3015 3586 199
4916 376 238
3271 1491 217
4272 1296 238
8320 1393 262
8960 3961 262
6293 1747 262
7656 860 262
6679 439 262
3763 4808 215
8951 577 262
3580 464 217
4149 577 238
5355 3388 238
3672 371 217
5368 3385 238
6578 4631 262
3066 3080 155
4605 172 238
6833 992 262
5193 161 238
4678 4867 197
5673 2435 238
5182 2585 238
8427 4742 262
3536 4338 238
7228 1489 262
7092 2650 262
3279 1025 217
6840 422 262
5929 2877 238
5267 3879 215
6922 1140 262
3757 277 238
6558 1779 262
3523 4119 238
5767 4349 236
7472 2949 262
5452 3676 238
6479 3979 262
4014 4861 215
3588 3187 194
4778 2917 238
6380 2442 262
3673 4953 238
6589 2667 262
6690 1194 262
7519 1513 262
8037 2468 262
6423 1437 262
4551 2849 238
5725 698 238
8544 231 262
4111 332 238
6854 4869 262
4201 2749 238
3507 1123 217
8346 3722 262
3613 825 217
3261 4111 238
8088 1207 262
4585 4748 184
6059 2057 238
8666 3220 262
3096 4219 238
3167 4064 238
8263 1189 262
6011 4588 236
3514 2162 217
3992 2910 238
5797 4393 236
5221 2380 238
6847 1587 262
4600 1771 238
8960 1373 262
5616 3431 238
3874 1807 238
7198 1503 262
3481 1856 217
3501 173 217
4671 2974 238
6118 1952 238
4136 1166 238
5332 3483 238
5679 1046 238
6641 1888 262
5322 87 238
7562 2875 262
4834 3980 215
5671 2805 238
8602 4836 262
6406 987 262
7206 4941 262
8728 3895 262
6582 1707 262
6814 32 262
7404 2644 262
7013 113 262
3003 128 217
5983 3038 238
6764 3534 262
6613 1723 262
4625 1708 238
4444 22 238
3978 433 238
6957 1733 262
6345 3141 262
8199 3118 262
8991 1520 262
8768 1406 262
4878 578 238
4963 2708 238
4173 2229 238
3790 1530 238
4417 2793 238
3883 4202 189
5161 2946 238
3202 3204 62
8282 4266 262
6144 657 238
4255 1440 238
4838 1593 238
4245 862 238
8172 3126 262
7723 2119 262
5801 4764 236
4223 3122 238
6556 2407 262
6102 469 238
5822 2872 238
5066 2412 238
4538 4601 184
7150 724 262
3477 756 217
8115 840 262
4176 320 238
4045 3243 238
5954 3671 238
4073 4144 189
4501 4515 184
6558 4162 262
6742 617 262
5907 3483 238
7128 4133 262
5967 3096 238
3361 3909 238
7862 4159 262
3942 647 238
8666 693 262
5438 1558 238
8665 783 262
6002 3881 236
4474 4157 215
6657 4799 262
7334 1454 262
3830 3965 189
7989 4240 262
8116 115 262
6720 2578 262
3219 1466 217
7680 421 262
7931 1902 262
7754 3970 262
4859 4845 166
4571 1908 238
8460 718 262
