-40 944
-40 -24 912
40 -24 912
72 -24 880
-32 -32 -24 -16 -40 -16 784
80 -24 -48 -16 -72 712
-40 -40 72 -16 -8 -80 -80 600
24 -32 -48 8 -8 -80 744
-32 -32 56 -24 -8 -40 -48 696
-40 -48 560 -40 -32 232
-64 -80 216 -80 -48 40 -280 128
-80 16 -24 -8 80 -24 -64 -72 560
-40 -48 -64 -32 -8 48 -48 -40 32 -56 -64 -120 -120 168
