-8 -96 872
88 -176 -264 440
-168 -248 -24 -96 -8 -8 392
-992
-800 24 -8 136
24 -40 -16 -8 512 -8 336
64 -32 -24 384 -96 352
24 -16 -104 -16 -8 -24 -24 720
992
992
-24 -24 8 -8 -64 32 -24 752
-24 40 -272 -32 144 -16 -336 72
-8 -16 -24 -32 -40 -48 -56 -64 -72 -64 488
