[gd_scene load_steps=5 format=2]

[ext_resource path="res://Assets/meshes/Material_020.material" type="Material" id=1]
[ext_resource path="res://Assets/materials/LowGreenAppleUV.png" type="Texture" id=2]

[sub_resource type="ArrayMesh" id=1]
resource_name = "Cylinder.010"
surfaces/0 = {
"aabb": AABB( -1.0902, -0.740985, -1.11824, 2.18041, 3.00371, 2.12574 ),
"array_data": PoolByteArray( 0, 0, 0, 0, 0, 0, 128, 63, 0, 0, 128, 191, 54, 245, 143, 0, 142, 0, 201, 127, 165, 55, 119, 42, 133, 193, 35, 63, 53, 177, 61, 191, 76, 151, 2, 191, 54, 245, 143, 0, 142, 0, 201, 127, 158, 54, 103, 52, 0, 0, 0, 0, 53, 177, 61, 191, 163, 115, 81, 191, 54, 245, 143, 0, 142, 0, 201, 127, 165, 55, 103, 52, 28, 38, 72, 63, 0, 0, 128, 63, 7, 157, 31, 191, 123, 245, 228, 0, 228, 0, 133, 127, 158, 54, 119, 42, 70, 51, 76, 63, 53, 177, 61, 191, 246, 109, 58, 62, 123, 245, 228, 0, 228, 0, 133, 127, 151, 53, 103, 52, 133, 193, 35, 63, 53, 177, 61, 191, 76, 151, 2, 191, 123, 245, 228, 0, 228, 0, 133, 127, 158, 54, 103, 52, 224, 148, 121, 63, 0, 0, 128, 63, 133, 220, 99, 62, 98, 245, 78, 0, 79, 0, 157, 127, 151, 53, 119, 42, 91, 193, 181, 62, 53, 177, 61, 191, 159, 181, 60, 63, 98, 245, 78, 0, 79, 0, 157, 127, 144, 52, 103, 52, 70, 51, 76, 63, 53, 177, 61, 191, 246, 109, 58, 62, 98, 245, 78, 0, 79, 0, 157, 127, 151, 53, 103, 52, 254, 37, 222, 62, 0, 0, 128, 63, 230, 165, 102, 63, 0, 245, 126, 0, 127, 0, 0, 127, 144, 52, 119, 42, 97, 193, 181, 190, 53, 177, 61, 191, 159, 181, 60, 63, 0, 245, 126, 0, 126, 0, 0, 127, 18, 51, 103, 52, 91, 193, 181, 62, 53, 177, 61, 191, 159, 181, 60, 63, 0, 245, 126, 0, 126, 0, 0, 127, 144, 52, 103, 52, 1, 38, 222, 190, 0, 0, 128, 63, 230, 165, 102, 63, 158, 245, 78, 0, 79, 0, 99, 127, 18, 51, 119, 42, 70, 51, 76, 191, 53, 177, 61, 191, 246, 109, 58, 62, 158, 245, 78, 0, 79, 0, 99, 127, 4, 49, 103, 52, 97, 193, 181, 190, 53, 177, 61, 191, 159, 181, 60, 63, 158, 245, 78, 0, 79, 0, 99, 127, 18, 51, 103, 52, 224, 148, 121, 191, 0, 0, 128, 63, 140, 220, 99, 62, 133, 245, 228, 0, 228, 0, 123, 127, 4, 49, 119, 42, 134, 193, 35, 191, 53, 177, 61, 191, 73, 151, 2, 191, 133, 245, 228, 0, 228, 0, 123, 127, 237, 45, 103, 52, 70, 51, 76, 191, 53, 177, 61, 191, 246, 109, 58, 62, 133, 245, 228, 0, 228, 0, 123, 127, 4, 49, 103, 52, 30, 38, 72, 191, 0, 0, 128, 63, 5, 157, 31, 191, 202, 245, 143, 0, 142, 0, 55, 127, 237, 45, 119, 42, 0, 0, 0, 0, 53, 177, 61, 191, 163, 115, 81, 191, 202, 245, 143, 0, 142, 0, 55, 127, 69, 39, 103, 52, 134, 193, 35, 191, 53, 177, 61, 191, 73, 151, 2, 191, 202, 245, 143, 0, 142, 0, 55, 127, 237, 45, 103, 52, 30, 38, 72, 191, 0, 0, 128, 63, 5, 157, 31, 191, 248, 130, 254, 0, 211, 5, 138, 127, 173, 57, 26, 46, 198, 139, 139, 191, 114, 248, 128, 63, 202, 205, 126, 62, 248, 130, 254, 0, 130, 8, 13, 127, 93, 57, 162, 51, 133, 208, 95, 191, 114, 248, 128, 63, 113, 124, 50, 191, 248, 130, 254, 0, 218, 4, 136, 127, 196, 57, 46, 47, 0, 0, 0, 0, 53, 177, 61, 191, 163, 115, 81, 191, 0, 129, 0, 0, 0, 0, 127, 127, 68, 44, 113, 57, 133, 193, 35, 63, 53, 177, 61, 191, 76, 151, 2, 191, 0, 129, 0, 0, 0, 0, 127, 127, 128, 48, 238, 58, 0, 0, 0, 0, 53, 177, 61, 191, 0, 0, 0, 128, 0, 129, 0, 0, 0, 0, 127, 127, 53, 52, 113, 57, 70, 51, 76, 63, 53, 177, 61, 191, 246, 109, 58, 62, 0, 129, 0, 0, 0, 0, 127, 127, 232, 52, 76, 59, 91, 193, 181, 62, 53, 177, 61, 191, 159, 181, 60, 63, 0, 129, 0, 0, 0, 0, 127, 127, 10, 55, 68, 58, 97, 193, 181, 190, 53, 177, 61, 191, 159, 181, 60, 63, 0, 129, 0, 0, 0, 0, 127, 127, 10, 55, 157, 56, 70, 51, 76, 191, 53, 177, 61, 191, 246, 109, 58, 62, 0, 129, 0, 0, 0, 0, 126, 127, 232, 52, 44, 55, 134, 193, 35, 191, 53, 177, 61, 191, 73, 151, 2, 191, 0, 129, 0, 0, 0, 0, 127, 127, 128, 48, 232, 55, 224, 148, 121, 63, 0, 0, 128, 63, 133, 220, 99, 62, 7, 130, 5, 0, 208, 249, 140, 127, 133, 59, 21, 53, 80, 106, 248, 62, 114, 248, 128, 63, 195, 245, 128, 63, 7, 130, 5, 0, 22, 252, 132, 127, 171, 58, 85, 54, 254, 37, 222, 62, 0, 0, 128, 63, 230, 165, 102, 63, 7, 130, 5, 0, 31, 253, 133, 127, 179, 58, 171, 54, 28, 38, 72, 63, 0, 0, 128, 63, 7, 157, 31, 191, 3, 130, 248, 0, 3, 248, 126, 127, 133, 59, 22, 49, 0, 0, 0, 0, 114, 248, 128, 63, 125, 34, 143, 191, 3, 130, 248, 0, 74, 252, 102, 127, 171, 58, 44, 45, 131, 208, 95, 63, 114, 248, 128, 63, 114, 124, 50, 191, 3, 130, 248, 0, 255, 248, 126, 127, 100, 59, 97, 49, 1, 38, 222, 190, 0, 0, 128, 63, 230, 165, 102, 63, 249, 130, 5, 0, 9, 5, 126, 127, 173, 57, 26, 54, 198, 139, 139, 191, 114, 248, 128, 63, 202, 205, 126, 62, 249, 130, 5, 0, 137, 8, 40, 127, 93, 57, 162, 51, 224, 148, 121, 191, 0, 0, 128, 63, 140, 220, 99, 62, 249, 130, 5, 0, 133, 8, 27, 127, 57, 57, 161, 51, 28, 38, 72, 63, 0, 0, 128, 63, 7, 157, 31, 191, 8, 130, 254, 0, 186, 250, 105, 127, 133, 59, 22, 49, 206, 139, 139, 63, 114, 248, 128, 63, 195, 205, 126, 62, 8, 130, 254, 0, 141, 249, 204, 127, 100, 59, 239, 52, 224, 148, 121, 63, 0, 0, 128, 63, 133, 220, 99, 62, 8, 130, 254, 0, 148, 250, 191, 127, 133, 59, 21, 53, 30, 38, 72, 191, 0, 0, 128, 63, 5, 157, 31, 191, 253, 130, 248, 0, 99, 1, 178, 127, 173, 57, 26, 46, 0, 0, 0, 0, 114, 248, 128, 63, 125, 34, 143, 191, 253, 130, 248, 0, 101, 1, 181, 127, 171, 58, 44, 45, 0, 0, 0, 0, 0, 0, 128, 63, 0, 0, 128, 191, 253, 130, 248, 0, 102, 1, 181, 127, 179, 58, 175, 43, 254, 37, 222, 62, 0, 0, 128, 63, 230, 165, 102, 63, 0, 130, 9, 0, 125, 1, 19, 127, 179, 58, 171, 54, 83, 106, 248, 190, 114, 248, 128, 63, 186, 245, 128, 63, 0, 130, 9, 0, 122, 2, 34, 127, 196, 57, 214, 53, 1, 38, 222, 190, 0, 0, 128, 63, 230, 165, 102, 63, 0, 130, 9, 0, 121, 2, 36, 127, 173, 57, 26, 54, 80, 106, 248, 62, 114, 248, 128, 63, 195, 245, 128, 63, 0, 0, 127, 0, 125, 20, 0, 127, 162, 56, 144, 49, 83, 106, 248, 190, 10, 100, 172, 63, 186, 245, 128, 63, 0, 0, 127, 0, 123, 31, 0, 127, 90, 56, 167, 48, 83, 106, 248, 190, 114, 248, 128, 63, 186, 245, 128, 63, 0, 0, 127, 0, 122, 34, 0, 127, 67, 56, 39, 49, 133, 208, 95, 191, 114, 248, 128, 63, 113, 124, 50, 191, 201, 0, 142, 0, 112, 25, 203, 127, 67, 56, 84, 43, 0, 0, 0, 0, 10, 100, 172, 63, 125, 34, 143, 191, 201, 0, 142, 0, 111, 27, 203, 127, 152, 56, 31, 44, 0, 0, 0, 0, 114, 248, 128, 63, 125, 34, 143, 191, 201, 0, 142, 0, 111, 27, 203, 127, 162, 56, 174, 41, 131, 208, 95, 63, 114, 248, 128, 63, 114, 124, 50, 191, 123, 0, 228, 0, 9, 136, 40, 127, 238, 56, 35, 45, 206, 139, 139, 63, 10, 100, 172, 63, 195, 205, 126, 62, 123, 0, 228, 0, 249, 134, 224, 127, 207, 56, 23, 48, 206, 139, 139, 63, 114, 248, 128, 63, 195, 205, 126, 62, 123, 0, 228, 0, 244, 143, 201, 127, 238, 56, 105, 48, 83, 106, 248, 190, 114, 248, 128, 63, 186, 245, 128, 63, 157, 0, 79, 0, 51, 96, 64, 127, 67, 56, 39, 49, 198, 139, 139, 191, 10, 100, 172, 63, 202, 205, 126, 62, 157, 0, 79, 0, 10, 125, 13, 127, 60, 56, 15, 47, 198, 139, 139, 191, 114, 248, 128, 63, 202, 205, 126, 62, 157, 0, 79, 0, 252, 126, 251, 127, 25, 56, 253, 46, 0, 0, 0, 0, 114, 248, 128, 63, 125, 34, 143, 191, 55, 0, 142, 0, 99, 193, 47, 127, 162, 56, 174, 41, 131, 208, 95, 63, 10, 100, 172, 63, 114, 124, 50, 191, 55, 0, 142, 0, 73, 159, 35, 127, 205, 56, 167, 45, 131, 208, 95, 63, 114, 248, 128, 63, 114, 124, 50, 191, 55, 0, 142, 0, 61, 150, 29, 127, 238, 56, 35, 45, 206, 139, 139, 63, 114, 248, 128, 63, 195, 205, 126, 62, 99, 0, 79, 0, 61, 176, 180, 127, 238, 56, 105, 48, 80, 106, 248, 62, 10, 100, 172, 63, 195, 245, 128, 63, 99, 0, 79, 0, 65, 186, 174, 127, 156, 56, 231, 48, 80, 106, 248, 62, 114, 248, 128, 63, 195, 245, 128, 63, 99, 0, 79, 0, 67, 190, 172, 127, 162, 56, 144, 49, 198, 139, 139, 191, 114, 248, 128, 63, 202, 205, 126, 62, 133, 0, 228, 0, 6, 123, 229, 127, 25, 56, 253, 46, 133, 208, 95, 191, 10, 100, 172, 63, 113, 124, 50, 191, 133, 0, 228, 0, 16, 103, 185, 127, 87, 56, 192, 44, 133, 208, 95, 191, 114, 248, 128, 63, 113, 124, 50, 191, 133, 0, 228, 0, 19, 92, 172, 127, 67, 56, 84, 43, 0, 0, 0, 0, 10, 100, 172, 63, 71, 91, 148, 190, 201, 3, 114, 0, 240, 131, 252, 127, 240, 57, 34, 59, 135, 77, 89, 62, 41, 56, 43, 63, 19, 75, 45, 190, 201, 3, 114, 0, 209, 140, 237, 127, 53, 58, 61, 58, 207, 250, 103, 62, 10, 100, 172, 63, 104, 255, 56, 190, 201, 3, 114, 0, 252, 130, 1, 127, 158, 57, 69, 58, 17, 163, 144, 62, 10, 100, 172, 63, 183, 12, 132, 61, 157, 3, 177, 0, 191, 181, 78, 127, 247, 57, 111, 57, 22, 48, 241, 61, 41, 56, 43, 63, 122, 106, 122, 62, 157, 3, 177, 0, 185, 199, 87, 127, 154, 58, 222, 57, 42, 189, 0, 62, 10, 100, 172, 63, 40, 170, 133, 62, 157, 3, 177, 0, 194, 175, 74, 127, 182, 58, 61, 57, 42, 189, 0, 190, 10, 100, 172, 63, 40, 170, 133, 62, 99, 3, 177, 0, 1, 126, 6, 127, 78, 59, 209, 57, 113, 124, 135, 190, 41, 56, 43, 63, 239, 99, 119, 61, 99, 3, 177, 0, 241, 125, 242, 127, 204, 58, 101, 58, 17, 163, 144, 190, 10, 100, 172, 63, 183, 12, 132, 61, 99, 3, 177, 0, 7, 125, 14, 127, 78, 59, 189, 58, 207, 250, 103, 190, 10, 100, 172, 63, 97, 255, 56, 190, 55, 3, 114, 0, 167, 179, 45, 127, 181, 58, 84, 59, 0, 0, 0, 0, 41, 56, 43, 63, 103, 248, 138, 190, 55, 3, 114, 0, 152, 206, 51, 127, 71, 58, 146, 58, 0, 0, 0, 0, 10, 100, 172, 63, 71, 91, 148, 190, 55, 3, 114, 0, 174, 170, 42, 127, 240, 57, 34, 59, 207, 250, 103, 62, 10, 100, 172, 63, 104, 255, 56, 190, 133, 3, 28, 0, 1, 131, 20, 127, 158, 57, 69, 58, 113, 124, 135, 62, 41, 56, 43, 63, 223, 99, 119, 61, 133, 3, 28, 0, 254, 130, 4, 127, 87, 58, 242, 57, 17, 163, 144, 62, 10, 100, 172, 63, 183, 12, 132, 61, 133, 3, 28, 0, 2, 132, 26, 127, 247, 57, 111, 57, 42, 189, 0, 62, 10, 100, 172, 63, 40, 170, 133, 62, 0, 3, 130, 0, 218, 121, 2, 127, 182, 58, 61, 57, 22, 48, 241, 189, 41, 56, 43, 63, 115, 106, 122, 62, 0, 3, 130, 0, 176, 98, 2, 127, 207, 58, 17, 58, 42, 189, 0, 190, 10, 100, 172, 63, 40, 170, 133, 62, 0, 3, 130, 0, 235, 125, 3, 127, 78, 59, 209, 57, 207, 250, 103, 190, 10, 100, 172, 63, 97, 255, 56, 190, 123, 3, 28, 0, 244, 119, 39, 127, 181, 58, 84, 59, 113, 124, 135, 190, 41, 56, 43, 63, 239, 99, 119, 61, 123, 3, 28, 0, 237, 102, 72, 127, 204, 58, 101, 58, 135, 77, 89, 190, 41, 56, 43, 63, 12, 75, 45, 190, 123, 3, 28, 0, 235, 93, 83, 127, 144, 58, 165, 58, 207, 250, 103, 62, 10, 100, 172, 63, 104, 255, 56, 190, 0, 127, 0, 0, 123, 0, 226, 127, 156, 58, 40, 51, 0, 0, 0, 0, 10, 100, 172, 63, 125, 34, 143, 191, 0, 127, 0, 0, 124, 0, 231, 127, 147, 58, 38, 48, 0, 0, 0, 0, 10, 100, 172, 63, 71, 91, 148, 190, 0, 127, 0, 0, 124, 0, 232, 127, 119, 58, 167, 50, 17, 163, 144, 62, 10, 100, 172, 63, 183, 12, 132, 61, 0, 127, 0, 0, 124, 0, 232, 127, 158, 58, 2, 52, 131, 208, 95, 63, 10, 100, 172, 63, 114, 124, 50, 191, 0, 127, 0, 0, 124, 0, 230, 127, 21, 59, 2, 50, 42, 189, 0, 62, 10, 100, 172, 63, 40, 170, 133, 62, 0, 127, 0, 0, 124, 0, 233, 127, 124, 58, 74, 52, 206, 139, 139, 63, 10, 100, 172, 63, 195, 205, 126, 62, 0, 127, 0, 0, 124, 0, 233, 127, 25, 59, 139, 52, 83, 106, 248, 190, 10, 100, 172, 63, 186, 245, 128, 63, 0, 127, 0, 0, 124, 0, 230, 127, 253, 57, 59, 53, 80, 106, 248, 62, 10, 100, 172, 63, 195, 245, 128, 63, 0, 127, 0, 0, 124, 0, 232, 127, 156, 58, 136, 53, 42, 189, 0, 190, 10, 100, 172, 63, 40, 170, 133, 62, 0, 127, 0, 0, 124, 0, 230, 127, 80, 58, 55, 52, 198, 139, 139, 191, 10, 100, 172, 63, 202, 205, 126, 62, 0, 127, 0, 0, 124, 0, 231, 127, 179, 57, 184, 51, 207, 250, 103, 190, 10, 100, 172, 63, 97, 255, 56, 190, 0, 127, 0, 0, 124, 0, 233, 127, 76, 58, 227, 50, 17, 163, 144, 190, 10, 100, 172, 63, 183, 12, 132, 61, 0, 127, 0, 0, 124, 0, 230, 127, 58, 58, 173, 51, 133, 208, 95, 191, 10, 100, 172, 63, 113, 124, 50, 191, 0, 127, 0, 0, 124, 0, 233, 127, 246, 57, 233, 48, 103, 181, 168, 61, 41, 56, 43, 63, 225, 41, 47, 62, 0, 6, 126, 0, 236, 125, 250, 127, 61, 57, 46, 56, 126, 130, 244, 60, 21, 225, 192, 63, 159, 159, 3, 62, 0, 6, 126, 0, 135, 35, 255, 127, 137, 57, 49, 56, 103, 181, 168, 189, 41, 56, 43, 63, 219, 41, 47, 62, 0, 6, 126, 0, 248, 126, 250, 127, 91, 57, 203, 55, 87, 0, 24, 190, 41, 56, 43, 63, 16, 111, 242, 189, 134, 19, 229, 0, 247, 137, 215, 127, 208, 57, 6, 56, 111, 233, 65, 189, 21, 225, 192, 63, 110, 8, 2, 61, 134, 19, 229, 0, 247, 137, 215, 127, 137, 57, 49, 56, 159, 37, 162, 188, 21, 225, 192, 63, 47, 44, 182, 189, 134, 19, 229, 0, 228, 253, 123, 129, 138, 57, 49, 56, 87, 0, 24, 62, 41, 56, 43, 63, 30, 111, 242, 189, 55, 0, 142, 0, 226, 134, 242, 127, 155, 57, 139, 56, 143, 230, 187, 61, 21, 225, 192, 63, 83, 23, 18, 190, 55, 0, 142, 0, 226, 134, 242, 127, 138, 57, 49, 56, 58, 43, 80, 62, 21, 225, 192, 63, 55, 44, 182, 189, 55, 0, 142, 0, 114, 1, 55, 129, 138, 57, 49, 56, 225, 138, 61, 62, 41, 56, 43, 63, 16, 12, 45, 61, 99, 252, 79, 0, 17, 124, 241, 127, 89, 57, 122, 56, 55, 86, 29, 62, 21, 225, 192, 63, 159, 159, 3, 62, 99, 252, 79, 0, 79, 15, 158, 127, 138, 57, 49, 56, 103, 181, 168, 61, 41, 56, 43, 63, 225, 41, 47, 62, 99, 252, 79, 0, 10, 126, 251, 127, 61, 57, 46, 56, 103, 181, 168, 189, 41, 56, 43, 63, 219, 41, 47, 62, 158, 17, 78, 0, 204, 80, 173, 127, 91, 57, 203, 55, 111, 233, 65, 189, 21, 225, 192, 63, 110, 8, 2, 61, 158, 17, 78, 0, 179, 13, 157, 127, 137, 57, 49, 56, 225, 138, 61, 190, 41, 56, 43, 63, 16, 12, 45, 61, 158, 17, 78, 0, 208, 86, 177, 127, 156, 57, 172, 55, 0, 0, 0, 0, 41, 56, 43, 63, 182, 106, 66, 190, 202, 12, 143, 0, 249, 130, 246, 127, 208, 57, 88, 56, 159, 37, 162, 188, 21, 225, 192, 63, 47, 44, 182, 189, 202, 12, 143, 0, 249, 130, 246, 127, 138, 57, 49, 56, 143, 230, 187, 61, 21, 225, 192, 63, 83, 23, 18, 190, 202, 12, 143, 0, 114, 1, 202, 129, 138, 57, 49, 56, 225, 138, 61, 62, 41, 56, 43, 63, 16, 12, 45, 61, 123, 249, 228, 0, 241, 89, 168, 127, 89, 57, 122, 56, 58, 43, 80, 62, 21, 225, 192, 63, 55, 44, 182, 189, 123, 249, 228, 0, 241, 89, 168, 127, 138, 57, 49, 56, 231, 96, 108, 62, 21, 225, 192, 63, 110, 8, 2, 61, 123, 249, 228, 0, 28, 1, 123, 129, 138, 57, 49, 56, 87, 0, 24, 62, 41, 56, 43, 63, 30, 111, 242, 189, 0, 127, 0, 0, 159, 0, 81, 127, 77, 58, 62, 58, 0, 0, 0, 0, 41, 56, 43, 63, 103, 248, 138, 190, 0, 127, 0, 0, 151, 0, 70, 127, 71, 58, 146, 58, 0, 0, 0, 0, 41, 56, 43, 63, 182, 106, 66, 190, 0, 127, 0, 0, 148, 0, 66, 127, 92, 58, 117, 58, 113, 124, 135, 62, 41, 56, 43, 63, 223, 99, 119, 61, 0, 127, 0, 0, 157, 0, 78, 127, 87, 58, 242, 57, 135, 77, 89, 62, 41, 56, 43, 63, 19, 75, 45, 190, 0, 127, 0, 0, 161, 0, 84, 127, 53, 58, 61, 58, 103, 181, 168, 61, 41, 56, 43, 63, 225, 41, 47, 62, 0, 127, 0, 0, 157, 0, 78, 127, 146, 58, 249, 57, 225, 138, 61, 62, 41, 56, 43, 63, 16, 12, 45, 61, 0, 127, 0, 0, 156, 0, 77, 127, 100, 58, 8, 58, 22, 48, 241, 189, 41, 56, 43, 63, 115, 106, 122, 62, 0, 127, 0, 0, 166, 0, 89, 127, 207, 58, 17, 58, 22, 48, 241, 61, 41, 56, 43, 63, 122, 106, 122, 62, 0, 127, 0, 0, 157, 0, 78, 127, 154, 58, 222, 57, 103, 181, 168, 189, 41, 56, 43, 63, 219, 41, 47, 62, 0, 127, 0, 0, 172, 0, 95, 127, 182, 58, 25, 58, 113, 124, 135, 190, 41, 56, 43, 63, 239, 99, 119, 61, 0, 127, 0, 0, 192, 0, 109, 127, 204, 58, 101, 58, 87, 0, 24, 190, 41, 56, 43, 63, 16, 111, 242, 189, 0, 127, 0, 0, 158, 0, 80, 127, 138, 58, 127, 58, 225, 138, 61, 190, 41, 56, 43, 63, 16, 12, 45, 61, 0, 127, 0, 0, 206, 0, 116, 127, 177, 58, 69, 58, 135, 77, 89, 190, 41, 56, 43, 63, 12, 75, 45, 190, 0, 127, 0, 0, 158, 0, 79, 127, 144, 58, 165, 58, 55, 86, 29, 62, 21, 225, 192, 63, 159, 159, 3, 62, 1, 1, 126, 0, 126, 3, 255, 127, 48, 58, 172, 56, 121, 139, 244, 62, 234, 235, 15, 64, 250, 111, 239, 61, 21, 249, 124, 0, 120, 225, 234, 127, 36, 58, 39, 56, 126, 130, 244, 60, 21, 225, 192, 63, 159, 159, 3, 62, 0, 1, 126, 0, 126, 6, 0, 127, 204, 57, 171, 56, 159, 37, 162, 188, 21, 225, 192, 63, 47, 44, 182, 189, 149, 63, 234, 0, 64, 109, 3, 127, 188, 57, 54, 55, 111, 91, 205, 62, 125, 208, 16, 64, 128, 33, 70, 61, 146, 62, 250, 0, 62, 110, 3, 127, 36, 58, 40, 56, 84, 158, 206, 62, 11, 155, 16, 64, 47, 207, 103, 189, 146, 62, 252, 0, 251, 255, 126, 129, 35, 58, 39, 56, 58, 43, 80, 62, 21, 225, 192, 63, 55, 44, 182, 189, 52, 232, 144, 0, 224, 134, 11, 127, 123, 58, 202, 55, 255, 96, 247, 62, 210, 115, 15, 64, 166, 152, 243, 189, 32, 239, 135, 0, 225, 134, 8, 127, 35, 58, 38, 56, 247, 120, 20, 63, 38, 57, 14, 64, 223, 218, 187, 189, 30, 240, 134, 0, 135, 13, 224, 129, 35, 58, 37, 56, 231, 96, 108, 62, 21, 225, 192, 63, 110, 8, 2, 61, 91, 206, 71, 0, 216, 140, 227, 127, 123, 58, 96, 56, 13, 86, 19, 63, 116, 153, 14, 64, 16, 130, 199, 61, 99, 203, 57, 0, 47, 223, 144, 127, 37, 58, 38, 56, 55, 86, 29, 62, 21, 225, 192, 63, 159, 159, 3, 62, 91, 206, 72, 0, 210, 140, 234, 127, 48, 58, 172, 56, 126, 130, 244, 60, 21, 225, 192, 63, 159, 159, 3, 62, 167, 51, 73, 0, 69, 106, 9, 127, 204, 57, 171, 56, 111, 91, 205, 62, 125, 208, 16, 64, 128, 33, 70, 61, 181, 46, 90, 0, 93, 244, 84, 127, 36, 58, 40, 56, 111, 233, 65, 189, 21, 225, 192, 63, 110, 8, 2, 61, 166, 52, 72, 0, 65, 108, 3, 127, 133, 57, 47, 56, 143, 230, 187, 61, 21, 225, 192, 63, 83, 23, 18, 190, 202, 34, 147, 0, 109, 51, 219, 127, 49, 58, 27, 55, 84, 158, 206, 62, 11, 155, 16, 64, 47, 207, 103, 189, 189, 39, 156, 0, 103, 56, 209, 127, 35, 58, 39, 56, 255, 96, 247, 62, 210, 115, 15, 64, 166, 152, 243, 189, 188, 39, 157, 0, 156, 15, 75, 129, 35, 58, 38, 56, 231, 96, 108, 62, 21, 225, 192, 63, 110, 8, 2, 61, 109, 198, 230, 0, 199, 144, 10, 127, 123, 58, 96, 56, 247, 120, 20, 63, 38, 57, 14, 64, 223, 218, 187, 189, 103, 198, 211, 0, 198, 144, 10, 127, 35, 58, 37, 56, 14, 255, 30, 63, 241, 215, 13, 64, 254, 132, 149, 59, 102, 198, 209, 0, 52, 254, 115, 129, 36, 58, 37, 56, 247, 120, 20, 63, 38, 57, 14, 64, 223, 218, 187, 189, 25, 124, 253, 0, 81, 237, 161, 127, 13, 57, 242, 58, 255, 96, 247, 62, 210, 115, 15, 64, 166, 152, 243, 189, 25, 124, 253, 0, 81, 237, 161, 127, 221, 56, 123, 58, 80, 137, 1, 63, 247, 89, 15, 64, 0, 0, 0, 128, 25, 124, 253, 0, 81, 237, 161, 127, 142, 56, 247, 58, 84, 158, 206, 62, 11, 155, 16, 64, 47, 207, 103, 189, 25, 124, 253, 0, 81, 237, 161, 127, 114, 56, 97, 58, 111, 91, 205, 62, 125, 208, 16, 64, 128, 33, 70, 61, 25, 124, 253, 0, 81, 237, 161, 127, 28, 56, 184, 58, 121, 139, 244, 62, 234, 235, 15, 64, 250, 111, 239, 61, 25, 124, 253, 0, 81, 237, 161, 127, 28, 56, 62, 59, 13, 86, 19, 63, 116, 153, 14, 64, 16, 130, 199, 61, 25, 124, 253, 0, 81, 237, 161, 127, 114, 56, 142, 59, 14, 255, 30, 63, 241, 215, 13, 64, 254, 132, 149, 59, 25, 124, 253, 0, 81, 237, 161, 127, 221, 56, 109, 59, 28, 38, 72, 63, 0, 0, 128, 63, 7, 157, 31, 191, 54, 245, 143, 0, 142, 0, 201, 127, 158, 54, 119, 42, 224, 148, 121, 63, 0, 0, 128, 63, 133, 220, 99, 62, 123, 245, 228, 0, 228, 0, 133, 127, 151, 53, 119, 42, 254, 37, 222, 62, 0, 0, 128, 63, 230, 165, 102, 63, 98, 245, 78, 0, 79, 0, 157, 127, 144, 52, 119, 42, 1, 38, 222, 190, 0, 0, 128, 63, 230, 165, 102, 63, 0, 245, 126, 0, 127, 0, 0, 127, 18, 51, 119, 42, 224, 148, 121, 191, 0, 0, 128, 63, 140, 220, 99, 62, 158, 245, 78, 0, 79, 0, 99, 127, 4, 49, 119, 42, 30, 38, 72, 191, 0, 0, 128, 63, 5, 157, 31, 191, 133, 245, 228, 0, 228, 0, 123, 127, 237, 45, 119, 42, 0, 0, 0, 0, 0, 0, 128, 63, 0, 0, 128, 191, 202, 245, 143, 0, 142, 0, 55, 127, 69, 39, 119, 42, 224, 148, 121, 191, 0, 0, 128, 63, 140, 220, 99, 62, 248, 130, 254, 0, 133, 8, 27, 127, 57, 57, 161, 51, 206, 139, 139, 63, 114, 248, 128, 63, 195, 205, 126, 62, 7, 130, 5, 0, 203, 248, 141, 127, 100, 59, 239, 52, 0, 0, 0, 0, 0, 0, 128, 63, 0, 0, 128, 191, 3, 130, 248, 0, 81, 253, 97, 127, 179, 58, 175, 43, 83, 106, 248, 190, 114, 248, 128, 63, 186, 245, 128, 63, 249, 130, 5, 0, 17, 4, 125, 127, 196, 57, 214, 53, 131, 208, 95, 63, 114, 248, 128, 63, 114, 124, 50, 191, 8, 130, 254, 0, 193, 250, 109, 127, 100, 59, 97, 49, 133, 208, 95, 191, 114, 248, 128, 63, 113, 124, 50, 191, 253, 130, 248, 0, 99, 1, 177, 127, 196, 57, 46, 47, 80, 106, 248, 62, 114, 248, 128, 63, 195, 245, 128, 63, 0, 130, 9, 0, 125, 1, 18, 127, 171, 58, 85, 54, 80, 106, 248, 62, 10, 100, 172, 63, 195, 245, 128, 63, 0, 0, 127, 0, 125, 16, 0, 127, 156, 56, 231, 48, 133, 208, 95, 191, 10, 100, 172, 63, 113, 124, 50, 191, 201, 0, 142, 0, 112, 25, 202, 127, 87, 56, 192, 44, 131, 208, 95, 63, 10, 100, 172, 63, 114, 124, 50, 191, 123, 0, 228, 0, 14, 147, 62, 127, 205, 56, 167, 45, 83, 106, 248, 190, 10, 100, 172, 63, 186, 245, 128, 63, 157, 0, 79, 0, 62, 78, 77, 127, 90, 56, 167, 48, 0, 0, 0, 0, 10, 100, 172, 63, 125, 34, 143, 191, 55, 0, 142, 0, 105, 208, 50, 127, 152, 56, 31, 44, 206, 139, 139, 63, 10, 100, 172, 63, 195, 205, 126, 62, 99, 0, 79, 0, 59, 172, 182, 127, 207, 56, 23, 48, 198, 139, 139, 191, 10, 100, 172, 63, 202, 205, 126, 62, 133, 0, 228, 0, 2, 126, 246, 127, 60, 56, 15, 47, 0, 0, 0, 0, 41, 56, 43, 63, 103, 248, 138, 190, 201, 3, 114, 0, 198, 147, 231, 127, 71, 58, 146, 58, 113, 124, 135, 62, 41, 56, 43, 63, 223, 99, 119, 61, 157, 3, 177, 0, 183, 207, 90, 127, 87, 58, 242, 57, 22, 48, 241, 189, 41, 56, 43, 63, 115, 106, 122, 62, 99, 3, 177, 0, 235, 123, 234, 127, 207, 58, 17, 58, 135, 77, 89, 190, 41, 56, 43, 63, 12, 75, 45, 190, 55, 3, 114, 0, 148, 218, 53, 127, 144, 58, 165, 58, 135, 77, 89, 62, 41, 56, 43, 63, 19, 75, 45, 190, 133, 3, 28, 0, 253, 130, 254, 127, 53, 58, 61, 58, 22, 48, 241, 61, 41, 56, 43, 63, 122, 106, 122, 62, 0, 3, 130, 0, 163, 85, 2, 127, 154, 58, 222, 57, 17, 163, 144, 190, 10, 100, 172, 63, 183, 12, 132, 61, 123, 3, 28, 0, 247, 123, 26, 127, 78, 59, 189, 58, 55, 86, 29, 62, 21, 225, 192, 63, 159, 159, 3, 62, 0, 6, 126, 0, 131, 20, 255, 127, 138, 57, 49, 56, 225, 138, 61, 190, 41, 56, 43, 63, 16, 12, 45, 61, 134, 19, 229, 0, 247, 137, 215, 127, 156, 57, 172, 55, 0, 0, 0, 0, 41, 56, 43, 63, 182, 106, 66, 190, 55, 0, 142, 0, 226, 134, 242, 127, 208, 57, 88, 56, 231, 96, 108, 62, 21, 225, 192, 63, 110, 8, 2, 61, 99, 252, 79, 0, 79, 255, 157, 127, 138, 57, 49, 56, 126, 130, 244, 60, 21, 225, 192, 63, 159, 159, 3, 62, 158, 17, 78, 0, 178, 3, 157, 127, 137, 57, 49, 56, 87, 0, 24, 190, 41, 56, 43, 63, 16, 111, 242, 189, 202, 12, 143, 0, 249, 130, 246, 127, 208, 57, 6, 56, 87, 0, 24, 62, 41, 56, 43, 63, 30, 111, 242, 189, 123, 249, 228, 0, 241, 89, 168, 127, 155, 57, 139, 56, 13, 86, 19, 63, 116, 153, 14, 64, 16, 130, 199, 61, 23, 248, 124, 0, 119, 223, 232, 127, 37, 58, 38, 56, 111, 233, 65, 189, 21, 225, 192, 63, 110, 8, 2, 61, 150, 63, 232, 0, 64, 109, 3, 127, 133, 57, 47, 56, 143, 230, 187, 61, 21, 225, 192, 63, 83, 23, 18, 190, 54, 231, 144, 0, 224, 134, 11, 127, 49, 58, 27, 55, 14, 255, 30, 63, 241, 215, 13, 64, 254, 132, 149, 59, 100, 203, 56, 0, 51, 234, 143, 127, 36, 58, 37, 56, 121, 139, 244, 62, 234, 235, 15, 64, 250, 111, 239, 61, 182, 46, 92, 0, 91, 234, 84, 127, 36, 58, 39, 56, 159, 37, 162, 188, 21, 225, 192, 63, 47, 44, 182, 189, 203, 34, 146, 0, 110, 51, 220, 127, 188, 57, 54, 55, 58, 43, 80, 62, 21, 225, 192, 63, 55, 44, 182, 189, 110, 198, 231, 0, 199, 144, 10, 127, 123, 58, 202, 55 ),
"array_index_data": PoolByteArray( 0, 0, 2, 0, 1, 0, 3, 0, 5, 0, 4, 0, 6, 0, 8, 0, 7, 0, 9, 0, 11, 0, 10, 0, 12, 0, 14, 0, 13, 0, 15, 0, 17, 0, 16, 0, 18, 0, 20, 0, 19, 0, 21, 0, 23, 0, 22, 0, 24, 0, 26, 0, 25, 0, 25, 0, 26, 0, 27, 0, 27, 0, 26, 0, 28, 0, 28, 0, 26, 0, 29, 0, 29, 0, 26, 0, 30, 0, 30, 0, 26, 0, 31, 0, 31, 0, 26, 0, 24, 0, 32, 0, 34, 0, 33, 0, 35, 0, 37, 0, 36, 0, 38, 0, 40, 0, 39, 0, 41, 0, 43, 0, 42, 0, 44, 0, 46, 0, 45, 0, 47, 0, 49, 0, 48, 0, 50, 0, 52, 0, 51, 0, 53, 0, 55, 0, 54, 0, 56, 0, 58, 0, 57, 0, 59, 0, 61, 0, 60, 0, 62, 0, 64, 0, 63, 0, 65, 0, 67, 0, 66, 0, 68, 0, 70, 0, 69, 0, 71, 0, 73, 0, 72, 0, 74, 0, 76, 0, 75, 0, 77, 0, 79, 0, 78, 0, 80, 0, 82, 0, 81, 0, 83, 0, 85, 0, 84, 0, 86, 0, 88, 0, 87, 0, 89, 0, 91, 0, 90, 0, 92, 0, 94, 0, 93, 0, 95, 0, 92, 0, 96, 0, 97, 0, 95, 0, 98, 0, 97, 0, 100, 0, 99, 0, 101, 0, 99, 0, 102, 0, 103, 0, 104, 0, 102, 0, 103, 0, 105, 0, 93, 0, 106, 0, 108, 0, 107, 0, 109, 0, 111, 0, 110, 0, 112, 0, 114, 0, 113, 0, 115, 0, 117, 0, 116, 0, 118, 0, 120, 0, 119, 0, 121, 0, 123, 0, 122, 0, 124, 0, 126, 0, 125, 0, 127, 0, 129, 0, 128, 0, 127, 0, 131, 0, 130, 0, 132, 0, 133, 0, 130, 0, 132, 0, 135, 0, 134, 0, 136, 0, 134, 0, 137, 0, 138, 0, 139, 0, 137, 0, 138, 0, 140, 0, 128, 0, 141, 0, 143, 0, 142, 0, 144, 0, 146, 0, 145, 0, 147, 0, 149, 0, 148, 0, 150, 0, 152, 0, 151, 0, 153, 0, 155, 0, 154, 0, 156, 0, 158, 0, 157, 0, 159, 0, 161, 0, 160, 0, 162, 0, 164, 0, 163, 0, 163, 0, 164, 0, 165, 0, 165, 0, 164, 0, 166, 0, 166, 0, 164, 0, 167, 0, 167, 0, 164, 0, 168, 0, 168, 0, 164, 0, 169, 0, 169, 0, 164, 0, 162, 0, 0, 0, 1, 0, 170, 0, 3, 0, 4, 0, 171, 0, 6, 0, 7, 0, 172, 0, 9, 0, 10, 0, 173, 0, 12, 0, 13, 0, 174, 0, 15, 0, 16, 0, 175, 0, 18, 0, 19, 0, 176, 0, 21, 0, 22, 0, 177, 0, 32, 0, 33, 0, 178, 0, 35, 0, 36, 0, 179, 0, 38, 0, 39, 0, 180, 0, 41, 0, 42, 0, 181, 0, 44, 0, 45, 0, 182, 0, 47, 0, 48, 0, 183, 0, 50, 0, 51, 0, 184, 0, 53, 0, 54, 0, 185, 0, 56, 0, 57, 0, 186, 0, 59, 0, 60, 0, 187, 0, 62, 0, 63, 0, 188, 0, 65, 0, 66, 0, 189, 0, 68, 0, 69, 0, 190, 0, 71, 0, 72, 0, 191, 0, 74, 0, 75, 0, 192, 0, 77, 0, 78, 0, 193, 0, 80, 0, 81, 0, 194, 0, 83, 0, 84, 0, 195, 0, 86, 0, 87, 0, 196, 0, 89, 0, 90, 0, 197, 0, 92, 0, 93, 0, 96, 0, 95, 0, 96, 0, 98, 0, 97, 0, 98, 0, 100, 0, 97, 0, 99, 0, 101, 0, 101, 0, 102, 0, 104, 0, 103, 0, 102, 0, 105, 0, 103, 0, 93, 0, 94, 0, 106, 0, 107, 0, 198, 0, 109, 0, 110, 0, 199, 0, 112, 0, 113, 0, 200, 0, 115, 0, 116, 0, 201, 0, 118, 0, 119, 0, 202, 0, 121, 0, 122, 0, 203, 0, 124, 0, 125, 0, 204, 0, 127, 0, 128, 0, 131, 0, 127, 0, 130, 0, 133, 0, 132, 0, 130, 0, 135, 0, 132, 0, 134, 0, 136, 0, 136, 0, 137, 0, 139, 0, 138, 0, 137, 0, 140, 0, 138, 0, 128, 0, 129, 0, 141, 0, 142, 0, 205, 0, 144, 0, 145, 0, 206, 0, 147, 0, 148, 0, 207, 0, 150, 0, 151, 0, 208, 0, 153, 0, 154, 0, 209, 0, 156, 0, 157, 0, 210, 0, 159, 0, 160, 0, 211, 0 ),
"blend_shape_data": [  ],
"format": 97559,
"index_count": 378,
"material": ExtResource( 1 ),
"name": "Material.020",
"primitive": 4,
"skeleton_aabb": [  ],
"vertex_count": 212
}

[sub_resource type="SpatialMaterial" id=2]
albedo_texture = ExtResource( 2 )

[node name="mustard" type="Spatial"]

[node name="Cylinder" type="MeshInstance" parent="."]
transform = Transform( 1, 0, 0, 0, 1.59478, 1.62921e-07, 0, -2.59823e-07, 1, 0, 0.88225, 0 )
mesh = SubResource( 1 )
material/0 = SubResource( 2 )
