[gd_scene load_steps=3 format=2]

[ext_resource path="res://Assets/materials/Material_017.material" type="Material" id=1]

[sub_resource type="ArrayMesh" id=1]
resource_name = "Cylinder.009"
surfaces/0 = {
"aabb": AABB( -1.04574, -2.22934, -1.3938, 2.09147, 24.6198, 2.81956 ),
"array_data": PoolByteArray( 0, 0, 0, 0, 0, 0, 128, 63, 0, 0, 128, 191, 39, 0, 136, 0, 232, 132, 249, 127, 126, 49, 255, 54, 25, 121, 22, 63, 0, 0, 128, 191, 189, 27, 79, 191, 39, 0, 136, 0, 139, 225, 218, 127, 83, 52, 171, 56, 0, 0, 0, 0, 0, 0, 128, 191, 0, 0, 128, 191, 39, 0, 136, 0, 136, 252, 217, 127, 79, 52, 167, 56, 25, 121, 22, 63, 0, 0, 128, 63, 189, 27, 79, 191, 102, 0, 182, 0, 253, 130, 252, 127, 204, 46, 48, 56, 112, 120, 115, 63, 0, 0, 128, 191, 122, 55, 158, 190, 102, 0, 182, 0, 185, 222, 158, 127, 90, 52, 172, 56, 25, 121, 22, 63, 0, 0, 128, 191, 189, 27, 79, 191, 102, 0, 182, 0, 182, 251, 154, 127, 83, 52, 171, 56, 112, 120, 115, 63, 0, 0, 128, 63, 122, 55, 158, 190, 126, 0, 0, 0, 0, 136, 39, 127, 167, 46, 14, 57, 112, 120, 115, 63, 0, 0, 128, 191, 122, 55, 158, 62, 127, 0, 0, 0, 0, 236, 125, 127, 98, 52, 172, 56, 112, 120, 115, 63, 0, 0, 128, 191, 122, 55, 158, 190, 127, 0, 0, 0, 0, 3, 126, 127, 90, 52, 172, 56, 112, 120, 115, 63, 0, 0, 128, 63, 122, 55, 158, 62, 102, 0, 74, 0, 216, 150, 55, 127, 77, 49, 197, 57, 23, 121, 22, 63, 0, 0, 128, 191, 191, 27, 79, 63, 102, 0, 74, 0, 182, 246, 102, 127, 103, 52, 169, 56, 112, 120, 115, 63, 0, 0, 128, 191, 122, 55, 158, 62, 102, 0, 74, 0, 182, 4, 102, 127, 98, 52, 172, 56, 23, 121, 22, 63, 0, 0, 128, 63, 191, 27, 79, 63, 39, 0, 120, 0, 193, 107, 21, 127, 73, 52, 14, 58, 0, 0, 0, 0, 0, 0, 128, 191, 0, 0, 128, 63, 39, 0, 120, 0, 137, 17, 38, 127, 104, 52, 165, 56, 23, 121, 22, 63, 0, 0, 128, 191, 191, 27, 79, 63, 39, 0, 120, 0, 136, 4, 39, 127, 103, 52, 169, 56, 0, 0, 0, 0, 0, 0, 128, 63, 0, 0, 128, 63, 217, 0, 120, 0, 232, 124, 249, 127, 243, 53, 206, 57, 27, 121, 22, 191, 0, 0, 128, 191, 189, 27, 79, 63, 217, 0, 120, 0, 139, 31, 218, 127, 99, 52, 161, 56, 0, 0, 0, 0, 0, 0, 128, 191, 0, 0, 128, 63, 217, 0, 120, 0, 136, 4, 217, 127, 104, 52, 165, 56, 27, 121, 22, 191, 0, 0, 128, 63, 189, 27, 79, 63, 154, 0, 74, 0, 253, 126, 252, 127, 0, 55, 30, 57, 112, 120, 115, 191, 0, 0, 128, 191, 125, 55, 158, 62, 154, 0, 74, 0, 185, 34, 158, 127, 91, 52, 160, 56, 27, 121, 22, 191, 0, 0, 128, 191, 189, 27, 79, 63, 154, 0, 74, 0, 182, 4, 154, 127, 99, 52, 161, 56, 112, 120, 115, 191, 0, 0, 128, 63, 125, 55, 158, 62, 130, 0, 0, 0, 0, 120, 39, 127, 10, 55, 63, 56, 112, 120, 115, 191, 0, 0, 128, 191, 125, 55, 158, 190, 129, 0, 0, 0, 0, 20, 125, 127, 84, 52, 161, 56, 112, 120, 115, 191, 0, 0, 128, 191, 125, 55, 158, 62, 129, 0, 0, 0, 0, 252, 126, 127, 91, 52, 160, 56, 244, 210, 92, 191, 0, 0, 128, 63, 16, 128, 143, 190, 0, 127, 0, 0, 154, 0, 182, 127, 83, 58, 81, 56, 16, 122, 8, 191, 0, 0, 128, 63, 26, 216, 59, 63, 0, 127, 0, 0, 154, 0, 182, 127, 127, 57, 112, 55, 12, 122, 8, 63, 0, 0, 128, 63, 28, 216, 59, 63, 0, 127, 0, 0, 154, 0, 182, 127, 171, 56, 81, 56, 112, 120, 115, 191, 0, 0, 128, 63, 125, 55, 158, 190, 154, 0, 182, 0, 216, 106, 55, 127, 12, 54, 17, 55, 20, 121, 22, 191, 0, 0, 128, 191, 194, 27, 79, 191, 154, 0, 182, 0, 182, 10, 102, 127, 79, 52, 164, 56, 112, 120, 115, 191, 0, 0, 128, 191, 125, 55, 158, 190, 154, 0, 182, 0, 182, 252, 102, 127, 84, 52, 161, 56, 20, 121, 22, 191, 0, 0, 128, 63, 194, 27, 79, 191, 217, 0, 136, 0, 193, 149, 20, 127, 104, 52, 127, 54, 0, 0, 0, 0, 0, 0, 128, 191, 0, 0, 128, 191, 217, 0, 136, 0, 137, 239, 38, 127, 79, 52, 167, 56, 20, 121, 22, 191, 0, 0, 128, 191, 194, 27, 79, 191, 217, 0, 136, 0, 136, 252, 39, 127, 79, 52, 164, 56, 61, 16, 22, 63, 149, 31, 179, 65, 108, 139, 78, 191, 0, 127, 0, 0, 217, 0, 136, 127, 17, 58, 100, 57, 0, 0, 0, 0, 149, 31, 179, 65, 39, 190, 140, 191, 0, 127, 0, 0, 217, 0, 136, 127, 134, 58, 237, 56, 0, 0, 0, 0, 149, 31, 179, 65, 158, 77, 127, 191, 0, 127, 0, 0, 217, 0, 136, 127, 110, 58, 229, 56, 182, 218, 133, 191, 149, 31, 179, 65, 192, 247, 173, 190, 130, 0, 0, 0, 0, 126, 1, 127, 202, 54, 236, 53, 112, 120, 115, 191, 0, 0, 128, 63, 125, 55, 158, 190, 130, 0, 0, 0, 0, 123, 29, 127, 12, 54, 17, 55, 182, 218, 133, 63, 149, 31, 179, 65, 185, 247, 173, 62, 126, 0, 0, 0, 0, 130, 1, 127, 202, 47, 82, 58, 112, 120, 115, 63, 0, 0, 128, 63, 122, 55, 158, 62, 126, 0, 0, 0, 0, 133, 29, 127, 77, 49, 197, 57, 14, 122, 8, 63, 0, 0, 128, 63, 26, 216, 59, 191, 217, 0, 120, 0, 241, 125, 251, 127, 7, 49, 235, 51, 0, 0, 0, 0, 149, 31, 179, 65, 158, 77, 127, 191, 217, 0, 120, 0, 248, 126, 253, 127, 232, 51, 158, 52, 0, 0, 0, 0, 0, 0, 128, 63, 42, 48, 104, 191, 217, 0, 120, 0, 241, 125, 251, 127, 116, 50, 147, 51, 244, 210, 92, 191, 0, 0, 128, 63, 16, 128, 143, 190, 126, 0, 0, 0, 0, 126, 251, 127, 63, 51, 32, 49, 201, 206, 114, 191, 149, 31, 179, 65, 63, 201, 157, 62, 126, 0, 0, 0, 0, 126, 255, 127, 222, 51, 243, 43, 244, 210, 92, 191, 0, 0, 128, 63, 16, 128, 143, 62, 126, 0, 0, 0, 0, 126, 251, 127, 150, 50, 229, 47, 0, 0, 0, 0, 149, 31, 179, 65, 39, 190, 140, 191, 217, 0, 136, 0, 250, 130, 2, 127, 175, 47, 246, 53, 0, 0, 0, 0, 0, 0, 128, 63, 0, 0, 128, 191, 217, 0, 136, 0, 198, 146, 19, 127, 126, 49, 255, 54, 0, 0, 0, 0, 149, 31, 179, 65, 39, 190, 140, 63, 39, 0, 120, 0, 251, 126, 2, 127, 203, 54, 80, 58, 0, 0, 0, 0, 0, 0, 128, 63, 0, 0, 128, 63, 39, 0, 120, 0, 197, 110, 19, 127, 243, 53, 206, 57, 244, 210, 92, 191, 0, 0, 128, 63, 16, 128, 143, 62, 102, 0, 182, 0, 248, 126, 246, 127, 150, 50, 229, 47, 65, 16, 22, 191, 149, 31, 179, 65, 108, 139, 78, 63, 102, 0, 182, 0, 251, 126, 249, 127, 49, 49, 213, 40, 16, 122, 8, 191, 0, 0, 128, 63, 26, 216, 59, 63, 102, 0, 182, 0, 248, 126, 246, 127, 85, 49, 215, 46, 16, 122, 8, 191, 0, 0, 128, 63, 26, 216, 59, 63, 39, 0, 136, 0, 243, 130, 252, 127, 85, 49, 215, 46, 0, 0, 0, 0, 149, 31, 179, 65, 158, 77, 127, 63, 39, 0, 136, 0, 248, 130, 253, 127, 21, 45, 59, 44, 0, 0, 0, 0, 0, 0, 128, 63, 42, 48, 104, 63, 39, 0, 136, 0, 243, 130, 251, 127, 6, 48, 156, 47, 182, 218, 133, 191, 149, 31, 179, 65, 188, 247, 173, 62, 154, 0, 74, 0, 0, 126, 0, 127, 37, 56, 0, 56, 112, 120, 115, 191, 0, 0, 128, 63, 125, 55, 158, 62, 154, 0, 74, 0, 4, 126, 7, 127, 10, 55, 63, 56, 182, 218, 133, 63, 149, 31, 179, 65, 185, 247, 173, 190, 102, 0, 182, 0, 0, 130, 0, 127, 21, 39, 74, 57, 112, 120, 115, 63, 0, 0, 128, 63, 122, 55, 158, 190, 102, 0, 182, 0, 5, 130, 7, 127, 167, 46, 14, 57, 0, 0, 0, 0, 142, 173, 14, 192, 90, 187, 91, 191, 0, 129, 0, 0, 49, 0, 140, 129, 91, 52, 165, 56, 184, 39, 1, 63, 142, 173, 14, 192, 78, 196, 49, 191, 0, 129, 0, 0, 248, 0, 126, 127, 91, 52, 166, 56, 0, 0, 0, 0, 142, 173, 14, 192, 0, 0, 0, 128, 0, 129, 0, 0, 49, 0, 140, 129, 92, 52, 166, 56, 55, 250, 80, 63, 142, 173, 14, 192, 64, 205, 135, 190, 0, 129, 0, 0, 9, 0, 126, 127, 92, 52, 167, 56, 55, 250, 80, 63, 142, 173, 14, 192, 64, 205, 135, 62, 0, 129, 0, 0, 21, 0, 125, 127, 93, 52, 167, 56, 182, 39, 1, 63, 142, 173, 14, 192, 78, 196, 49, 63, 0, 129, 0, 0, 22, 0, 124, 127, 94, 52, 166, 56, 0, 0, 0, 0, 142, 173, 14, 192, 90, 187, 91, 63, 0, 129, 0, 0, 22, 0, 125, 127, 94, 52, 165, 56, 186, 39, 1, 191, 142, 173, 14, 192, 76, 196, 49, 63, 0, 129, 0, 0, 27, 0, 124, 127, 93, 52, 165, 56, 55, 250, 80, 191, 142, 173, 14, 192, 67, 205, 135, 62, 0, 129, 0, 0, 32, 0, 122, 127, 92, 52, 164, 56, 55, 250, 80, 191, 142, 173, 14, 192, 67, 205, 135, 190, 0, 129, 0, 0, 27, 0, 124, 127, 90, 52, 165, 56, 179, 39, 1, 191, 142, 173, 14, 192, 81, 196, 49, 191, 0, 129, 0, 0, 49, 0, 140, 129, 90, 52, 165, 56, 182, 218, 133, 63, 149, 31, 179, 65, 185, 247, 173, 190, 0, 127, 0, 0, 217, 0, 136, 127, 123, 57, 175, 57, 253, 115, 37, 63, 149, 31, 179, 65, 5, 186, 99, 191, 0, 127, 0, 0, 217, 0, 136, 127, 32, 58, 121, 57, 201, 206, 114, 63, 149, 31, 179, 65, 59, 201, 157, 62, 0, 127, 0, 0, 217, 0, 136, 127, 230, 56, 100, 57, 203, 206, 114, 63, 149, 31, 179, 65, 59, 201, 157, 190, 0, 127, 0, 0, 217, 0, 136, 127, 123, 57, 149, 57, 251, 115, 37, 63, 149, 31, 179, 65, 7, 186, 99, 63, 0, 127, 0, 0, 217, 0, 136, 127, 112, 56, 237, 56, 182, 218, 133, 63, 149, 31, 179, 65, 185, 247, 173, 62, 0, 127, 0, 0, 217, 0, 136, 127, 214, 56, 121, 57, 61, 16, 22, 63, 149, 31, 179, 65, 110, 139, 78, 63, 0, 127, 0, 0, 217, 0, 136, 127, 137, 56, 229, 56, 0, 0, 0, 0, 149, 31, 179, 65, 39, 190, 140, 63, 0, 127, 0, 0, 217, 0, 136, 127, 112, 56, 63, 56, 65, 16, 22, 191, 149, 31, 179, 65, 108, 139, 78, 63, 0, 127, 0, 0, 217, 0, 136, 127, 230, 56, 145, 55, 0, 0, 0, 0, 149, 31, 179, 65, 158, 77, 127, 63, 0, 127, 0, 0, 217, 0, 136, 127, 137, 56, 71, 56, 201, 206, 114, 191, 149, 31, 179, 65, 63, 201, 157, 62, 0, 127, 0, 0, 217, 0, 136, 127, 123, 57, 47, 55, 255, 115, 37, 191, 149, 31, 179, 65, 4, 186, 99, 63, 0, 127, 0, 0, 217, 0, 136, 127, 214, 56, 102, 55, 201, 206, 114, 191, 149, 31, 179, 65, 63, 201, 157, 190, 0, 127, 0, 0, 217, 0, 136, 127, 17, 58, 145, 55, 182, 218, 133, 191, 149, 31, 179, 65, 188, 247, 173, 62, 0, 127, 0, 0, 217, 0, 136, 127, 123, 57, 251, 54, 56, 16, 22, 191, 149, 31, 179, 65, 113, 139, 78, 191, 0, 127, 0, 0, 217, 0, 136, 127, 110, 58, 71, 56, 182, 218, 133, 191, 149, 31, 179, 65, 192, 247, 173, 190, 0, 127, 0, 0, 217, 0, 136, 127, 32, 58, 102, 55, 248, 115, 37, 191, 149, 31, 179, 65, 9, 186, 99, 191, 0, 127, 0, 0, 217, 0, 136, 127, 134, 58, 63, 56, 9, 122, 8, 191, 0, 0, 128, 63, 29, 216, 59, 191, 102, 0, 74, 0, 0, 126, 254, 127, 64, 51, 122, 50, 201, 206, 114, 191, 149, 31, 179, 65, 63, 201, 157, 190, 102, 0, 74, 0, 0, 126, 0, 127, 195, 52, 44, 48, 244, 210, 92, 191, 0, 0, 128, 63, 16, 128, 143, 190, 102, 0, 74, 0, 0, 126, 254, 127, 63, 51, 32, 49, 253, 115, 37, 63, 149, 31, 179, 65, 5, 186, 99, 191, 39, 0, 136, 0, 255, 130, 0, 127, 232, 38, 4, 56, 25, 121, 22, 63, 0, 0, 128, 63, 189, 27, 79, 191, 39, 0, 136, 0, 243, 130, 252, 127, 204, 46, 48, 56, 246, 210, 92, 63, 0, 0, 128, 63, 9, 128, 143, 190, 154, 0, 74, 0, 248, 130, 246, 127, 199, 47, 100, 51, 61, 16, 22, 63, 149, 31, 179, 65, 108, 139, 78, 191, 154, 0, 74, 0, 250, 130, 249, 127, 68, 49, 23, 53, 14, 122, 8, 63, 0, 0, 128, 63, 26, 216, 59, 191, 154, 0, 74, 0, 248, 130, 245, 127, 7, 49, 235, 51, 0, 0, 0, 0, 0, 0, 128, 63, 42, 48, 104, 191, 39, 0, 120, 0, 255, 126, 0, 127, 116, 50, 147, 51, 56, 16, 22, 191, 149, 31, 179, 65, 113, 139, 78, 191, 39, 0, 120, 0, 254, 126, 0, 127, 195, 52, 243, 50, 9, 122, 8, 191, 0, 0, 128, 63, 29, 216, 59, 191, 39, 0, 120, 0, 255, 126, 0, 127, 64, 51, 122, 50, 255, 115, 37, 191, 149, 31, 179, 65, 4, 186, 99, 63, 217, 0, 120, 0, 255, 126, 0, 127, 37, 56, 71, 57, 27, 121, 22, 191, 0, 0, 128, 63, 189, 27, 79, 63, 217, 0, 120, 0, 243, 126, 252, 127, 0, 55, 30, 57, 244, 210, 92, 63, 0, 0, 128, 63, 12, 128, 143, 62, 130, 0, 0, 0, 0, 130, 251, 127, 77, 46, 63, 50, 203, 206, 114, 63, 149, 31, 179, 65, 59, 201, 157, 190, 130, 0, 0, 0, 0, 130, 255, 127, 41, 45, 180, 52, 246, 210, 92, 63, 0, 0, 128, 63, 9, 128, 143, 190, 130, 0, 0, 0, 0, 130, 251, 127, 199, 47, 100, 51, 12, 122, 8, 63, 0, 0, 128, 63, 28, 216, 59, 63, 154, 0, 182, 0, 0, 130, 255, 127, 102, 46, 227, 48, 201, 206, 114, 63, 149, 31, 179, 65, 59, 201, 157, 62, 154, 0, 182, 0, 0, 130, 0, 127, 42, 39, 46, 51, 244, 210, 92, 63, 0, 0, 128, 63, 12, 128, 143, 62, 154, 0, 182, 0, 0, 130, 254, 127, 77, 46, 63, 50, 251, 115, 37, 63, 149, 31, 179, 65, 7, 186, 99, 63, 102, 0, 74, 0, 253, 130, 4, 127, 95, 52, 181, 58, 23, 121, 22, 63, 0, 0, 128, 63, 191, 27, 79, 63, 102, 0, 74, 0, 219, 147, 51, 127, 73, 52, 14, 58, 248, 115, 37, 191, 149, 31, 179, 65, 9, 186, 99, 191, 154, 0, 182, 0, 252, 126, 4, 127, 89, 52, 40, 53, 20, 121, 22, 191, 0, 0, 128, 63, 194, 27, 79, 191, 154, 0, 182, 0, 219, 109, 51, 127, 104, 52, 127, 54, 0, 0, 0, 0, 0, 0, 128, 63, 42, 48, 104, 63, 217, 0, 136, 0, 255, 130, 0, 127, 6, 48, 156, 47, 61, 16, 22, 63, 149, 31, 179, 65, 110, 139, 78, 63, 217, 0, 136, 0, 254, 130, 0, 127, 30, 39, 96, 48, 12, 122, 8, 63, 0, 0, 128, 63, 28, 216, 59, 63, 217, 0, 136, 0, 255, 130, 0, 127, 102, 46, 227, 48, 0, 0, 0, 0, 142, 173, 14, 192, 90, 187, 91, 191, 39, 243, 136, 0, 85, 170, 37, 127, 91, 52, 165, 56, 25, 121, 22, 63, 0, 0, 128, 191, 189, 27, 79, 191, 39, 243, 136, 0, 53, 145, 30, 127, 83, 52, 171, 56, 184, 39, 1, 63, 142, 173, 14, 192, 78, 196, 49, 191, 39, 243, 136, 0, 100, 190, 40, 127, 91, 52, 166, 56, 184, 39, 1, 63, 142, 173, 14, 192, 78, 196, 49, 191, 102, 243, 182, 0, 66, 214, 99, 127, 91, 52, 166, 56, 112, 120, 115, 63, 0, 0, 128, 191, 122, 55, 158, 190, 102, 243, 182, 0, 59, 195, 93, 127, 90, 52, 172, 56, 55, 250, 80, 63, 142, 173, 14, 192, 64, 205, 135, 190, 102, 243, 182, 0, 69, 227, 101, 127, 92, 52, 167, 56, 55, 250, 80, 63, 142, 173, 14, 192, 64, 205, 135, 62, 126, 243, 0, 0, 2, 18, 125, 127, 93, 52, 167, 56, 112, 120, 115, 63, 0, 0, 128, 191, 122, 55, 158, 190, 126, 243, 0, 0, 3, 35, 121, 127, 90, 52, 172, 56, 112, 120, 115, 63, 0, 0, 128, 191, 122, 55, 158, 62, 126, 243, 0, 0, 4, 44, 118, 127, 98, 52, 172, 56, 182, 39, 1, 63, 142, 173, 14, 192, 78, 196, 49, 63, 102, 243, 74, 0, 200, 67, 90, 127, 94, 52, 166, 56, 112, 120, 115, 63, 0, 0, 128, 191, 122, 55, 158, 62, 102, 243, 74, 0, 223, 103, 65, 127, 98, 52, 172, 56, 23, 121, 22, 63, 0, 0, 128, 191, 191, 27, 79, 63, 102, 243, 74, 0, 238, 116, 46, 127, 103, 52, 169, 56, 182, 39, 1, 63, 142, 173, 14, 192, 78, 196, 49, 63, 39, 243, 120, 0, 26, 124, 5, 127, 94, 52, 166, 56, 0, 0, 0, 0, 0, 0, 128, 191, 0, 0, 128, 63, 39, 243, 120, 0, 250, 125, 16, 127, 104, 52, 165, 56, 0, 0, 0, 0, 142, 173, 14, 192, 90, 187, 91, 63, 39, 243, 120, 0, 45, 118, 255, 127, 94, 52, 165, 56, 0, 0, 0, 0, 142, 173, 14, 192, 90, 187, 91, 63, 217, 243, 120, 0, 88, 83, 38, 127, 94, 52, 165, 56, 27, 121, 22, 191, 0, 0, 128, 191, 189, 27, 79, 63, 217, 243, 120, 0, 42, 116, 27, 127, 99, 52, 161, 56, 186, 39, 1, 191, 142, 173, 14, 192, 76, 196, 49, 63, 217, 243, 120, 0, 106, 55, 41, 127, 93, 52, 165, 56, 55, 250, 80, 191, 142, 173, 14, 192, 67, 205, 135, 62, 154, 243, 74, 0, 68, 37, 100, 127, 92, 52, 164, 56, 27, 121, 22, 191, 0, 0, 128, 191, 189, 27, 79, 63, 154, 243, 74, 0, 61, 57, 95, 127, 99, 52, 161, 56, 112, 120, 115, 191, 0, 0, 128, 191, 125, 55, 158, 62, 154, 243, 74, 0, 56, 68, 90, 127, 91, 52, 160, 56, 55, 250, 80, 191, 142, 173, 14, 192, 67, 205, 135, 62, 130, 243, 0, 0, 2, 230, 124, 127, 92, 52, 164, 56, 112, 120, 115, 191, 0, 0, 128, 191, 125, 55, 158, 190, 130, 243, 0, 0, 4, 215, 119, 127, 84, 52, 161, 56, 55, 250, 80, 191, 142, 173, 14, 192, 67, 205, 135, 190, 130, 243, 0, 0, 1, 241, 126, 127, 90, 52, 165, 56, 55, 250, 80, 191, 142, 173, 14, 192, 67, 205, 135, 190, 154, 243, 182, 0, 210, 169, 79, 127, 90, 52, 165, 56, 20, 121, 22, 191, 0, 0, 128, 191, 194, 27, 79, 191, 154, 243, 182, 0, 220, 156, 68, 127, 79, 52, 164, 56, 179, 39, 1, 191, 142, 173, 14, 192, 81, 196, 49, 191, 154, 243, 182, 0, 205, 178, 85, 127, 90, 52, 165, 56, 179, 39, 1, 191, 142, 173, 14, 192, 81, 196, 49, 191, 217, 243, 136, 0, 96, 177, 234, 127, 90, 52, 165, 56, 0, 0, 0, 0, 0, 0, 128, 191, 0, 0, 128, 191, 217, 243, 136, 0, 23, 132, 6, 127, 79, 52, 167, 56, 0, 0, 0, 0, 142, 173, 14, 192, 90, 187, 91, 191, 217, 243, 136, 0, 115, 217, 223, 127, 91, 52, 165, 56, 56, 16, 22, 191, 149, 31, 179, 65, 113, 139, 78, 191, 154, 0, 182, 0, 74, 244, 154, 129, 237, 57, 1, 56, 199, 206, 114, 191, 68, 244, 139, 65, 63, 201, 157, 190, 154, 0, 182, 0, 74, 244, 154, 129, 133, 57, 150, 56, 201, 206, 114, 191, 149, 31, 179, 65, 63, 201, 157, 190, 154, 0, 182, 0, 250, 126, 8, 127, 46, 58, 91, 56, 0, 0, 0, 0, 149, 31, 179, 65, 158, 77, 127, 63, 217, 0, 120, 0, 193, 107, 236, 127, 132, 57, 70, 57, 63, 16, 22, 191, 68, 244, 139, 65, 108, 139, 78, 63, 217, 0, 120, 0, 136, 0, 217, 127, 129, 57, 150, 56, 0, 0, 0, 0, 68, 244, 139, 65, 158, 77, 127, 63, 217, 0, 120, 0, 136, 246, 217, 127, 128, 57, 148, 56, 201, 206, 114, 63, 149, 31, 179, 65, 59, 201, 157, 62, 127, 0, 0, 0, 0, 130, 3, 127, 217, 56, 202, 56, 203, 206, 114, 63, 68, 244, 139, 65, 59, 201, 157, 190, 127, 0, 0, 0, 0, 231, 124, 127, 131, 57, 143, 56, 203, 206, 114, 63, 149, 31, 179, 65, 59, 201, 157, 190, 127, 0, 0, 0, 0, 130, 249, 127, 216, 56, 92, 56, 0, 0, 0, 0, 149, 31, 179, 65, 158, 77, 127, 191, 217, 0, 136, 0, 119, 242, 218, 129, 131, 57, 191, 55, 56, 16, 22, 191, 68, 244, 139, 65, 113, 139, 78, 191, 217, 0, 136, 0, 119, 242, 218, 129, 135, 57, 148, 56, 56, 16, 22, 191, 149, 31, 179, 65, 113, 139, 78, 191, 217, 0, 136, 0, 198, 111, 18, 127, 237, 57, 1, 56, 201, 206, 114, 191, 149, 31, 179, 65, 63, 201, 157, 62, 154, 0, 74, 0, 74, 13, 102, 129, 46, 58, 202, 56, 63, 16, 22, 191, 68, 244, 139, 65, 108, 139, 78, 63, 154, 0, 74, 0, 74, 13, 102, 129, 129, 57, 150, 56, 65, 16, 22, 191, 149, 31, 179, 65, 108, 139, 78, 63, 154, 0, 74, 0, 242, 124, 236, 127, 237, 57, 35, 57, 61, 16, 22, 63, 149, 31, 179, 65, 110, 139, 78, 63, 102, 0, 74, 0, 244, 131, 16, 127, 26, 57, 36, 57, 203, 206, 114, 63, 68, 244, 139, 65, 59, 201, 157, 62, 102, 0, 74, 0, 183, 232, 100, 127, 129, 57, 144, 56, 201, 206, 114, 63, 149, 31, 179, 65, 59, 201, 157, 62, 102, 0, 74, 0, 250, 130, 8, 127, 217, 56, 202, 56, 61, 16, 22, 63, 149, 31, 179, 65, 108, 139, 78, 191, 39, 0, 136, 0, 119, 242, 38, 129, 25, 57, 2, 56, 0, 0, 0, 0, 68, 244, 139, 65, 158, 77, 127, 191, 39, 0, 136, 0, 119, 242, 38, 129, 135, 57, 145, 56, 0, 0, 0, 0, 149, 31, 179, 65, 158, 77, 127, 191, 39, 0, 136, 0, 191, 150, 235, 127, 131, 57, 191, 55, 201, 206, 114, 191, 149, 31, 179, 65, 63, 201, 157, 190, 129, 0, 0, 0, 0, 244, 130, 129, 46, 58, 91, 56, 199, 206, 114, 191, 68, 244, 139, 65, 63, 201, 157, 62, 129, 0, 0, 0, 0, 244, 130, 129, 131, 57, 151, 56, 201, 206, 114, 191, 149, 31, 179, 65, 63, 201, 157, 62, 129, 0, 0, 0, 0, 126, 249, 127, 46, 58, 202, 56, 61, 16, 22, 63, 149, 31, 179, 65, 110, 139, 78, 63, 39, 0, 120, 0, 184, 155, 23, 127, 26, 57, 36, 57, 0, 0, 0, 0, 68, 244, 139, 65, 158, 77, 127, 63, 39, 0, 120, 0, 138, 232, 38, 127, 128, 57, 148, 56, 61, 16, 22, 63, 68, 244, 139, 65, 110, 139, 78, 63, 39, 0, 120, 0, 137, 240, 38, 127, 127, 57, 146, 56, 203, 206, 114, 63, 149, 31, 179, 65, 59, 201, 157, 190, 102, 0, 182, 0, 74, 243, 102, 129, 216, 56, 92, 56, 63, 16, 22, 63, 68, 244, 139, 65, 108, 139, 78, 191, 102, 0, 182, 0, 74, 243, 102, 129, 133, 57, 143, 56, 61, 16, 22, 63, 149, 31, 179, 65, 108, 139, 78, 191, 102, 0, 182, 0, 242, 132, 237, 127, 25, 57, 2, 56, 63, 16, 22, 63, 68, 244, 139, 65, 108, 139, 78, 191, 0, 129, 0, 0, 127, 0, 0, 127, 136, 58, 152, 52, 203, 206, 114, 63, 68, 244, 139, 65, 59, 201, 157, 190, 0, 129, 0, 0, 127, 0, 0, 127, 213, 58, 139, 51, 0, 0, 0, 0, 68, 244, 139, 65, 0, 0, 0, 128, 0, 129, 0, 0, 127, 0, 0, 127, 12, 58, 133, 50, 203, 206, 114, 63, 68, 244, 139, 65, 59, 201, 157, 62, 0, 129, 0, 0, 127, 0, 0, 127, 213, 58, 128, 49, 61, 16, 22, 63, 68, 244, 139, 65, 110, 139, 78, 63, 0, 129, 0, 0, 127, 0, 0, 127, 136, 58, 180, 47, 0, 0, 0, 0, 68, 244, 139, 65, 158, 77, 127, 63, 0, 129, 0, 0, 127, 0, 0, 127, 12, 58, 113, 46, 63, 16, 22, 191, 68, 244, 139, 65, 108, 139, 78, 63, 0, 129, 0, 0, 127, 0, 0, 127, 143, 57, 180, 47, 199, 206, 114, 191, 68, 244, 139, 65, 63, 201, 157, 62, 0, 129, 0, 0, 127, 0, 0, 127, 67, 57, 128, 49, 199, 206, 114, 191, 68, 244, 139, 65, 63, 201, 157, 190, 0, 129, 0, 0, 127, 0, 0, 127, 67, 57, 139, 51, 56, 16, 22, 191, 68, 244, 139, 65, 113, 139, 78, 191, 0, 129, 0, 0, 127, 0, 0, 127, 143, 57, 152, 52, 0, 0, 0, 0, 68, 244, 139, 65, 158, 77, 127, 191, 0, 129, 0, 0, 127, 0, 0, 127, 12, 58, 233, 52, 97, 233, 23, 191, 218, 38, 151, 65, 59, 183, 84, 191, 136, 0, 39, 0, 0, 130, 0, 127, 246, 46, 65, 59, 138, 117, 44, 191, 220, 151, 131, 65, 61, 40, 138, 191, 136, 0, 39, 0, 0, 130, 254, 127, 148, 52, 103, 59, 97, 233, 23, 191, 220, 151, 131, 65, 59, 183, 84, 191, 136, 0, 39, 0, 0, 130, 254, 127, 138, 51, 55, 59, 207, 111, 9, 191, 218, 38, 151, 65, 150, 208, 143, 191, 0, 0, 0, 0, 127, 0, 0, 127, 45, 56, 235, 48, 138, 117, 44, 191, 218, 38, 151, 65, 61, 40, 138, 191, 0, 0, 0, 0, 127, 0, 0, 127, 49, 56, 144, 41, 138, 117, 44, 191, 218, 38, 151, 65, 61, 40, 138, 191, 0, 0, 0, 0, 127, 0, 0, 127, 45, 56, 144, 41, 207, 111, 9, 191, 218, 38, 151, 65, 150, 208, 143, 191, 120, 0, 217, 0, 0, 130, 2, 127, 79, 43, 253, 58, 75, 199, 233, 190, 220, 151, 131, 65, 226, 7, 96, 191, 120, 0, 217, 0, 0, 130, 0, 127, 130, 51, 35, 59, 207, 111, 9, 191, 220, 151, 131, 65, 150, 208, 143, 191, 120, 0, 217, 0, 0, 130, 0, 127, 180, 52, 255, 58, 75, 199, 233, 190, 218, 38, 151, 65, 226, 7, 96, 191, 39, 0, 120, 0, 136, 0, 39, 127, 195, 53, 34, 53, 97, 233, 23, 191, 220, 151, 131, 65, 59, 183, 84, 191, 39, 0, 120, 0, 136, 0, 39, 127, 11, 54, 163, 37, 75, 199, 233, 190, 220, 151, 131, 65, 226, 7, 96, 191, 39, 0, 120, 0, 136, 0, 39, 127, 195, 53, 163, 37, 207, 111, 9, 191, 220, 151, 131, 65, 150, 208, 143, 191, 0, 129, 0, 0, 210, 0, 138, 127, 180, 52, 255, 58, 97, 233, 23, 191, 220, 151, 131, 65, 59, 183, 84, 191, 0, 129, 0, 0, 169, 0, 165, 127, 138, 51, 55, 59, 138, 117, 44, 191, 220, 151, 131, 65, 61, 40, 138, 191, 0, 129, 0, 0, 248, 0, 130, 127, 148, 52, 103, 59, 207, 111, 9, 191, 218, 38, 151, 65, 150, 208, 143, 191, 0, 0, 0, 0, 55, 0, 113, 127, 79, 43, 253, 58, 97, 233, 23, 191, 218, 38, 151, 65, 59, 183, 84, 191, 0, 127, 0, 0, 98, 0, 80, 127, 246, 46, 65, 59, 75, 199, 233, 190, 218, 38, 151, 65, 226, 7, 96, 191, 0, 127, 0, 0, 119, 0, 44, 127, 229, 46, 45, 59, 211, 100, 67, 190, 218, 38, 151, 65, 118, 3, 118, 191, 136, 0, 39, 0, 0, 126, 2, 127, 147, 52, 207, 59, 188, 202, 138, 190, 220, 151, 131, 65, 95, 206, 154, 191, 136, 0, 39, 0, 0, 126, 0, 127, 242, 46, 169, 59, 211, 100, 67, 190, 220, 151, 131, 65, 118, 3, 118, 191, 136, 0, 39, 0, 0, 126, 0, 127, 74, 42, 205, 59, 188, 202, 138, 190, 220, 151, 131, 65, 95, 206, 154, 191, 0, 129, 0, 0, 11, 0, 130, 127, 152, 56, 38, 59, 221, 222, 55, 190, 220, 151, 131, 65, 27, 104, 178, 191, 0, 129, 0, 0, 32, 0, 134, 127, 222, 56, 22, 59, 140, 126, 9, 190, 220, 151, 131, 65, 176, 118, 160, 191, 0, 129, 0, 0, 39, 0, 136, 127, 190, 56, 232, 58, 140, 126, 9, 190, 218, 38, 151, 65, 176, 118, 160, 191, 120, 0, 217, 0, 0, 126, 0, 127, 128, 51, 138, 59, 158, 55, 93, 189, 220, 151, 131, 65, 17, 170, 128, 191, 120, 0, 217, 0, 0, 126, 254, 127, 74, 43, 101, 59, 140, 126, 9, 190, 220, 151, 131, 65, 176, 118, 160, 191, 120, 0, 217, 0, 0, 126, 254, 127, 227, 46, 149, 59, 158, 55, 93, 189, 218, 38, 151, 65, 17, 170, 128, 191, 39, 0, 120, 0, 136, 0, 39, 127, 196, 54, 231, 52, 211, 100, 67, 190, 220, 151, 131, 65, 118, 3, 118, 191, 39, 0, 120, 0, 136, 0, 39, 127, 3, 55, 201, 41, 158, 55, 93, 189, 220, 151, 131, 65, 17, 170, 128, 191, 39, 0, 120, 0, 136, 0, 39, 127, 196, 54, 201, 41, 140, 126, 9, 190, 220, 151, 131, 65, 176, 118, 160, 191, 0, 129, 0, 0, 169, 0, 165, 127, 227, 46, 149, 59, 211, 100, 67, 190, 220, 151, 131, 65, 118, 3, 118, 191, 0, 129, 0, 0, 210, 0, 138, 127, 74, 42, 205, 59, 188, 202, 138, 190, 220, 151, 131, 65, 95, 206, 154, 191, 0, 129, 0, 0, 145, 0, 195, 127, 242, 46, 169, 59, 140, 126, 9, 190, 218, 38, 151, 65, 176, 118, 160, 191, 0, 127, 0, 0, 98, 0, 80, 127, 128, 51, 138, 59, 211, 100, 67, 190, 218, 38, 151, 65, 118, 3, 118, 191, 0, 127, 0, 0, 55, 0, 114, 127, 147, 52, 207, 59, 158, 55, 93, 189, 218, 38, 151, 65, 17, 170, 128, 191, 0, 127, 0, 0, 16, 0, 125, 127, 179, 52, 103, 59, 138, 117, 44, 191, 218, 38, 151, 65, 61, 40, 138, 191, 0, 0, 0, 0, 127, 0, 0, 127, 82, 55, 222, 53, 138, 117, 44, 191, 220, 151, 131, 65, 61, 40, 138, 191, 0, 0, 0, 0, 127, 0, 0, 127, 107, 55, 14, 36, 138, 117, 44, 191, 220, 151, 131, 65, 61, 40, 138, 191, 0, 0, 0, 0, 127, 0, 0, 127, 82, 55, 14, 36, 207, 111, 9, 191, 220, 151, 131, 65, 150, 208, 143, 191, 0, 0, 0, 0, 127, 0, 0, 127, 45, 56, 57, 52, 207, 111, 9, 191, 218, 38, 151, 65, 150, 208, 143, 191, 0, 0, 0, 0, 127, 0, 0, 127, 49, 56, 235, 48, 138, 117, 44, 191, 220, 151, 131, 65, 61, 40, 138, 191, 0, 0, 0, 0, 127, 0, 0, 127, 45, 56, 253, 53, 207, 111, 9, 191, 220, 151, 131, 65, 150, 208, 143, 191, 0, 0, 0, 0, 127, 0, 0, 127, 49, 56, 57, 52, 229, 250, 161, 190, 218, 38, 151, 65, 194, 191, 172, 191, 217, 0, 136, 0, 0, 126, 0, 127, 77, 59, 57, 59, 221, 222, 55, 190, 220, 151, 131, 65, 27, 104, 178, 191, 217, 0, 136, 0, 0, 126, 0, 127, 222, 56, 22, 59, 229, 250, 161, 190, 220, 151, 131, 65, 194, 191, 172, 191, 217, 0, 136, 0, 0, 126, 0, 127, 210, 56, 59, 59, 160, 13, 56, 191, 218, 38, 151, 65, 168, 25, 156, 191, 217, 0, 136, 0, 0, 126, 0, 127, 64, 59, 175, 59, 229, 7, 21, 191, 220, 151, 131, 65, 248, 193, 161, 191, 217, 0, 136, 0, 0, 126, 0, 127, 210, 56, 140, 59, 160, 13, 56, 191, 220, 151, 131, 65, 168, 25, 156, 191, 217, 0, 136, 0, 255, 126, 0, 127, 227, 56, 187, 59, 138, 117, 44, 191, 220, 151, 131, 65, 61, 40, 138, 191, 0, 129, 0, 0, 165, 0, 168, 127, 183, 56, 227, 59, 229, 7, 21, 191, 220, 151, 131, 65, 248, 193, 161, 191, 0, 129, 0, 0, 185, 0, 152, 127, 210, 56, 140, 59, 207, 111, 9, 191, 220, 151, 131, 65, 150, 208, 143, 191, 0, 129, 0, 0, 184, 0, 152, 127, 150, 56, 160, 59, 188, 202, 138, 190, 218, 38, 151, 65, 95, 206, 154, 191, 0, 127, 0, 0, 253, 0, 126, 127, 137, 59, 37, 59, 221, 222, 55, 190, 218, 38, 151, 65, 27, 104, 178, 191, 0, 127, 0, 0, 237, 0, 125, 127, 60, 59, 11, 59, 229, 250, 161, 190, 218, 38, 151, 65, 194, 191, 172, 191, 0, 127, 0, 0, 243, 0, 126, 127, 77, 59, 57, 59, 138, 117, 44, 191, 218, 38, 151, 65, 61, 40, 138, 191, 0, 0, 0, 0, 100, 0, 77, 127, 97, 59, 222, 59, 229, 7, 21, 191, 218, 38, 151, 65, 248, 193, 161, 191, 0, 127, 0, 0, 78, 0, 100, 127, 76, 59, 139, 59, 160, 13, 56, 191, 218, 38, 151, 65, 168, 25, 156, 191, 0, 127, 0, 0, 118, 0, 44, 127, 64, 59, 175, 59, 138, 117, 44, 191, 218, 38, 151, 65, 61, 40, 138, 191, 136, 0, 39, 0, 0, 126, 1, 127, 97, 59, 222, 59, 160, 13, 56, 191, 220, 151, 131, 65, 168, 25, 156, 191, 136, 0, 39, 0, 0, 126, 0, 127, 227, 56, 187, 59, 138, 117, 44, 191, 220, 151, 131, 65, 61, 40, 138, 191, 136, 0, 39, 0, 0, 126, 0, 127, 183, 56, 227, 59, 140, 126, 9, 190, 220, 151, 131, 65, 176, 118, 160, 191, 120, 0, 217, 0, 0, 126, 255, 127, 190, 56, 232, 58, 221, 222, 55, 190, 218, 38, 151, 65, 27, 104, 178, 191, 120, 0, 217, 0, 0, 126, 0, 127, 60, 59, 11, 59, 140, 126, 9, 190, 218, 38, 151, 65, 176, 118, 160, 191, 120, 0, 217, 0, 0, 126, 0, 127, 104, 59, 227, 58, 207, 111, 9, 191, 218, 38, 151, 65, 150, 208, 143, 191, 39, 0, 120, 0, 120, 0, 217, 127, 16, 53, 22, 59, 188, 202, 138, 190, 220, 151, 131, 65, 95, 206, 154, 191, 39, 0, 120, 0, 120, 0, 217, 127, 148, 54, 216, 59, 188, 202, 138, 190, 218, 38, 151, 65, 95, 206, 154, 191, 39, 0, 120, 0, 120, 0, 217, 127, 148, 54, 22, 59, 229, 250, 161, 190, 220, 151, 131, 65, 194, 191, 172, 191, 0, 129, 0, 0, 21, 0, 131, 127, 210, 56, 59, 59, 17, 149, 25, 63, 190, 228, 157, 65, 67, 7, 90, 63, 119, 0, 214, 0, 238, 114, 204, 127, 1, 59, 12, 56, 74, 224, 47, 63, 192, 85, 138, 65, 157, 132, 140, 63, 119, 0, 214, 0, 244, 135, 220, 127, 222, 58, 107, 57, 17, 149, 25, 63, 192, 85, 138, 65, 67, 7, 90, 63, 119, 0, 214, 0, 246, 134, 226, 127, 12, 59, 6, 57, 220, 45, 13, 63, 190, 228, 157, 65, 9, 168, 146, 63, 0, 0, 0, 0, 127, 0, 0, 127, 15, 56, 174, 48, 74, 224, 47, 63, 190, 228, 157, 65, 157, 132, 140, 63, 0, 0, 0, 0, 127, 0, 0, 127, 20, 56, 115, 38, 74, 224, 47, 63, 190, 228, 157, 65, 157, 132, 140, 63, 0, 0, 0, 0, 127, 0, 0, 127, 16, 56, 113, 38, 220, 45, 13, 63, 190, 228, 157, 65, 9, 168, 146, 63, 137, 0, 42, 0, 12, 135, 36, 127, 66, 59, 75, 55, 70, 197, 237, 62, 192, 85, 138, 65, 25, 78, 102, 63, 137, 0, 42, 0, 18, 114, 52, 127, 32, 59, 4, 57, 220, 45, 13, 63, 192, 85, 138, 65, 9, 168, 146, 63, 137, 0, 42, 0, 16, 116, 46, 127, 66, 59, 122, 57, 70, 197, 237, 62, 190, 228, 157, 65, 25, 78, 102, 63, 214, 0, 137, 0, 119, 0, 214, 127, 74, 54, 45, 53, 17, 149, 25, 63, 192, 85, 138, 65, 67, 7, 90, 63, 214, 0, 137, 0, 119, 0, 214, 127, 147, 54, 245, 36, 70, 197, 237, 62, 192, 85, 138, 65, 25, 78, 102, 63, 214, 0, 137, 0, 119, 0, 214, 127, 74, 54, 245, 36, 220, 45, 13, 63, 192, 85, 138, 65, 9, 168, 146, 63, 0, 129, 0, 0, 131, 0, 21, 127, 66, 59, 122, 57, 17, 149, 25, 63, 192, 85, 138, 65, 67, 7, 90, 63, 0, 129, 0, 0, 134, 0, 34, 127, 12, 59, 6, 57, 74, 224, 47, 63, 192, 85, 138, 65, 157, 132, 140, 63, 0, 129, 0, 0, 130, 0, 9, 127, 222, 58, 107, 57, 220, 45, 13, 63, 190, 228, 157, 65, 9, 168, 146, 63, 0, 0, 0, 0, 144, 0, 59, 127, 66, 59, 75, 55, 17, 149, 25, 63, 190, 228, 157, 65, 67, 7, 90, 63, 0, 127, 0, 0, 139, 0, 48, 127, 1, 59, 12, 56, 70, 197, 237, 62, 190, 228, 157, 65, 25, 78, 102, 63, 0, 127, 0, 0, 135, 0, 38, 127, 21, 59, 10, 56, 39, 232, 77, 62, 190, 228, 157, 65, 247, 39, 126, 63, 119, 0, 214, 0, 244, 135, 220, 127, 167, 59, 75, 55, 137, 138, 147, 62, 192, 85, 138, 65, 247, 148, 158, 63, 119, 0, 214, 0, 238, 114, 204, 127, 132, 59, 5, 57, 39, 232, 77, 62, 192, 85, 138, 65, 247, 39, 126, 63, 119, 0, 214, 0, 240, 116, 209, 127, 167, 59, 122, 57, 137, 138, 147, 62, 192, 85, 138, 65, 247, 148, 158, 63, 0, 129, 0, 0, 248, 0, 126, 127, 157, 56, 27, 58, 183, 156, 78, 62, 192, 85, 138, 65, 27, 127, 182, 63, 0, 129, 0, 0, 228, 0, 123, 127, 231, 56, 11, 58, 90, 75, 28, 62, 192, 85, 138, 65, 99, 184, 164, 63, 0, 129, 0, 0, 220, 0, 121, 127, 198, 56, 220, 57, 90, 75, 28, 62, 190, 228, 157, 65, 99, 184, 164, 63, 137, 0, 42, 0, 18, 114, 52, 127, 101, 59, 12, 56, 239, 60, 134, 61, 192, 85, 138, 65, 101, 55, 133, 63, 137, 0, 42, 0, 12, 135, 36, 127, 66, 59, 107, 57, 90, 75, 28, 62, 192, 85, 138, 65, 99, 184, 164, 63, 137, 0, 42, 0, 10, 134, 30, 127, 112, 59, 7, 57, 239, 60, 134, 61, 190, 228, 157, 65, 101, 55, 133, 63, 214, 0, 137, 0, 119, 0, 214, 127, 71, 53, 14, 53, 39, 232, 77, 62, 192, 85, 138, 65, 247, 39, 126, 63, 214, 0, 137, 0, 119, 0, 214, 127, 142, 53, 131, 37, 239, 60, 134, 61, 192, 85, 138, 65, 101, 55, 133, 63, 214, 0, 137, 0, 119, 0, 214, 127, 71, 53, 131, 37, 137, 138, 147, 62, 192, 85, 138, 65, 247, 148, 158, 63, 0, 129, 0, 0, 121, 0, 220, 127, 132, 59, 5, 57, 239, 60, 134, 61, 192, 85, 138, 65, 101, 55, 133, 63, 0, 129, 0, 0, 124, 0, 231, 127, 66, 59, 107, 57, 39, 232, 77, 62, 192, 85, 138, 65, 247, 39, 126, 63, 0, 129, 0, 0, 126, 0, 242, 127, 167, 59, 122, 57, 137, 138, 147, 62, 190, 228, 157, 65, 247, 148, 158, 63, 0, 127, 0, 0, 116, 0, 207, 127, 121, 59, 10, 56, 239, 60, 134, 61, 190, 228, 157, 65, 101, 55, 133, 63, 0, 127, 0, 0, 111, 0, 195, 127, 66, 59, 46, 55, 90, 75, 28, 62, 190, 228, 157, 65, 99, 184, 164, 63, 0, 127, 0, 0, 121, 0, 218, 127, 101, 59, 12, 56, 74, 224, 47, 63, 190, 228, 157, 65, 157, 132, 140, 63, 0, 0, 0, 0, 127, 0, 0, 127, 181, 55, 44, 54, 74, 224, 47, 63, 192, 85, 138, 65, 157, 132, 140, 63, 0, 0, 0, 0, 127, 0, 0, 127, 207, 55, 211, 36, 74, 224, 47, 63, 192, 85, 138, 65, 157, 132, 140, 63, 0, 0, 0, 0, 127, 0, 0, 127, 181, 55, 211, 36, 220, 45, 13, 63, 192, 85, 138, 65, 9, 168, 146, 63, 0, 0, 0, 0, 127, 0, 0, 127, 15, 56, 70, 52, 220, 45, 13, 63, 190, 228, 157, 65, 9, 168, 146, 63, 0, 0, 0, 0, 127, 0, 0, 127, 20, 56, 174, 48, 74, 224, 47, 63, 192, 85, 138, 65, 157, 132, 140, 63, 0, 0, 0, 0, 127, 0, 0, 127, 16, 56, 54, 54, 220, 45, 13, 63, 192, 85, 138, 65, 9, 168, 146, 63, 0, 0, 0, 0, 127, 0, 0, 127, 19, 56, 70, 52, 52, 179, 172, 62, 190, 228, 157, 65, 184, 91, 176, 63, 42, 0, 119, 0, 1, 126, 0, 127, 78, 59, 44, 58, 183, 156, 78, 62, 192, 85, 138, 65, 27, 127, 182, 63, 42, 0, 119, 0, 0, 126, 0, 127, 231, 56, 11, 58, 52, 179, 172, 62, 192, 85, 138, 65, 184, 91, 176, 63, 42, 0, 119, 0, 0, 126, 0, 127, 219, 56, 48, 58, 161, 116, 60, 63, 190, 228, 157, 65, 85, 75, 158, 63, 42, 0, 119, 0, 0, 126, 0, 127, 65, 59, 160, 58, 51, 194, 25, 63, 192, 85, 138, 65, 193, 110, 164, 63, 42, 0, 119, 0, 1, 126, 0, 127, 220, 56, 128, 58, 161, 116, 60, 63, 192, 85, 138, 65, 85, 75, 158, 63, 42, 0, 119, 0, 2, 126, 0, 127, 237, 56, 173, 58, 74, 224, 47, 63, 192, 85, 138, 65, 157, 132, 140, 63, 0, 129, 0, 0, 93, 0, 85, 127, 196, 56, 211, 58, 51, 194, 25, 63, 192, 85, 138, 65, 193, 110, 164, 63, 0, 129, 0, 0, 74, 0, 102, 127, 220, 56, 128, 58, 220, 45, 13, 63, 192, 85, 138, 65, 9, 168, 146, 63, 0, 129, 0, 0, 75, 0, 102, 127, 165, 56, 148, 58, 137, 138, 147, 62, 190, 228, 157, 65, 247, 148, 158, 63, 0, 127, 0, 0, 0, 0, 130, 127, 137, 59, 24, 58, 183, 156, 78, 62, 190, 228, 157, 65, 27, 127, 182, 63, 0, 127, 0, 0, 15, 0, 130, 127, 61, 59, 254, 57, 52, 179, 172, 62, 190, 228, 157, 65, 184, 91, 176, 63, 0, 127, 0, 0, 9, 0, 130, 127, 78, 59, 44, 58, 74, 224, 47, 63, 190, 228, 157, 65, 157, 132, 140, 63, 0, 0, 0, 0, 154, 0, 182, 127, 97, 59, 206, 58, 51, 194, 25, 63, 190, 228, 157, 65, 193, 110, 164, 63, 0, 127, 0, 0, 176, 0, 159, 127, 77, 59, 124, 58, 161, 116, 60, 63, 190, 228, 157, 65, 85, 75, 158, 63, 0, 127, 0, 0, 137, 0, 215, 127, 65, 59, 160, 58, 74, 224, 47, 63, 190, 228, 157, 65, 157, 132, 140, 63, 119, 0, 214, 0, 0, 126, 255, 127, 97, 59, 206, 58, 161, 116, 60, 63, 192, 85, 138, 65, 85, 75, 158, 63, 119, 0, 214, 0, 0, 126, 255, 127, 237, 56, 173, 58, 74, 224, 47, 63, 192, 85, 138, 65, 157, 132, 140, 63, 119, 0, 214, 0, 0, 126, 0, 127, 196, 56, 211, 58, 90, 75, 28, 62, 192, 85, 138, 65, 99, 184, 164, 63, 137, 0, 42, 0, 0, 126, 1, 127, 198, 56, 220, 57, 183, 156, 78, 62, 190, 228, 157, 65, 27, 127, 182, 63, 137, 0, 42, 0, 0, 126, 0, 127, 61, 59, 254, 57, 90, 75, 28, 62, 190, 228, 157, 65, 99, 184, 164, 63, 137, 0, 42, 0, 0, 126, 0, 127, 105, 59, 214, 57, 220, 45, 13, 63, 190, 228, 157, 65, 9, 168, 146, 63, 214, 0, 137, 0, 137, 0, 42, 127, 220, 54, 19, 59, 137, 138, 147, 62, 192, 85, 138, 65, 247, 148, 158, 63, 214, 0, 137, 0, 137, 0, 42, 127, 43, 56, 208, 59, 137, 138, 147, 62, 190, 228, 157, 65, 247, 148, 158, 63, 214, 0, 137, 0, 137, 0, 42, 127, 43, 56, 19, 59, 52, 179, 172, 62, 192, 85, 138, 65, 184, 91, 176, 63, 0, 129, 0, 0, 238, 0, 125, 127, 219, 56, 48, 58, 246, 210, 92, 63, 0, 0, 128, 63, 9, 128, 143, 190, 0, 127, 0, 0, 154, 0, 182, 127, 252, 56, 74, 57, 14, 122, 8, 63, 0, 0, 128, 63, 26, 216, 59, 191, 0, 127, 0, 0, 154, 0, 182, 127, 127, 57, 116, 57, 0, 0, 0, 0, 0, 0, 128, 63, 42, 48, 104, 191, 0, 127, 0, 0, 154, 0, 182, 127, 2, 58, 74, 57, 9, 122, 8, 191, 0, 0, 128, 63, 29, 216, 59, 191, 0, 127, 0, 0, 154, 0, 182, 127, 83, 58, 219, 56, 244, 210, 92, 191, 0, 0, 128, 63, 16, 128, 143, 62, 0, 127, 0, 0, 154, 0, 182, 127, 2, 58, 197, 55, 0, 0, 0, 0, 0, 0, 128, 63, 42, 48, 104, 63, 0, 127, 0, 0, 154, 0, 182, 127, 252, 56, 197, 55, 244, 210, 92, 63, 0, 0, 128, 63, 12, 128, 143, 62, 0, 127, 0, 0, 154, 0, 182, 127, 171, 56, 219, 56, 182, 218, 133, 191, 149, 31, 179, 65, 188, 247, 173, 62, 130, 0, 0, 0, 0, 126, 1, 127, 37, 56, 0, 56, 182, 218, 133, 63, 149, 31, 179, 65, 185, 247, 173, 190, 126, 0, 0, 0, 0, 130, 1, 127, 21, 39, 74, 57, 61, 16, 22, 63, 149, 31, 179, 65, 108, 139, 78, 191, 217, 0, 120, 0, 249, 126, 253, 127, 68, 49, 23, 53, 201, 206, 114, 191, 149, 31, 179, 65, 63, 201, 157, 190, 126, 0, 0, 0, 0, 126, 255, 127, 195, 52, 44, 48, 248, 115, 37, 191, 149, 31, 179, 65, 9, 186, 99, 191, 217, 0, 136, 0, 250, 130, 2, 127, 89, 52, 40, 53, 251, 115, 37, 63, 149, 31, 179, 65, 7, 186, 99, 63, 39, 0, 120, 0, 251, 126, 2, 127, 95, 52, 181, 58, 201, 206, 114, 191, 149, 31, 179, 65, 63, 201, 157, 62, 102, 0, 182, 0, 251, 126, 249, 127, 222, 51, 243, 43, 65, 16, 22, 191, 149, 31, 179, 65, 108, 139, 78, 63, 39, 0, 136, 0, 248, 130, 253, 127, 49, 49, 213, 40, 255, 115, 37, 191, 149, 31, 179, 65, 4, 186, 99, 63, 154, 0, 74, 0, 0, 126, 0, 127, 37, 56, 71, 57, 253, 115, 37, 63, 149, 31, 179, 65, 5, 186, 99, 191, 102, 0, 182, 0, 0, 130, 0, 127, 232, 38, 4, 56, 56, 16, 22, 191, 149, 31, 179, 65, 113, 139, 78, 191, 102, 0, 74, 0, 0, 126, 0, 127, 195, 52, 243, 50, 0, 0, 0, 0, 149, 31, 179, 65, 39, 190, 140, 191, 39, 0, 136, 0, 255, 130, 0, 127, 175, 47, 246, 53, 203, 206, 114, 63, 149, 31, 179, 65, 59, 201, 157, 190, 154, 0, 74, 0, 250, 130, 249, 127, 41, 45, 180, 52, 0, 0, 0, 0, 149, 31, 179, 65, 158, 77, 127, 191, 39, 0, 120, 0, 254, 126, 0, 127, 232, 51, 158, 52, 0, 0, 0, 0, 149, 31, 179, 65, 39, 190, 140, 63, 217, 0, 120, 0, 255, 126, 0, 127, 203, 54, 80, 58, 201, 206, 114, 63, 149, 31, 179, 65, 59, 201, 157, 62, 130, 0, 0, 0, 0, 130, 255, 127, 42, 39, 46, 51, 61, 16, 22, 63, 149, 31, 179, 65, 110, 139, 78, 63, 154, 0, 182, 0, 0, 130, 0, 127, 30, 39, 96, 48, 182, 218, 133, 63, 149, 31, 179, 65, 185, 247, 173, 62, 102, 0, 74, 0, 253, 130, 4, 127, 202, 47, 82, 58, 182, 218, 133, 191, 149, 31, 179, 65, 192, 247, 173, 190, 154, 0, 182, 0, 252, 126, 4, 127, 202, 54, 236, 53, 0, 0, 0, 0, 149, 31, 179, 65, 158, 77, 127, 63, 217, 0, 136, 0, 254, 130, 0, 127, 21, 45, 59, 44, 0, 0, 0, 0, 0, 0, 128, 191, 0, 0, 128, 191, 39, 243, 136, 0, 33, 137, 24, 127, 79, 52, 167, 56, 25, 121, 22, 63, 0, 0, 128, 191, 189, 27, 79, 191, 102, 243, 182, 0, 55, 185, 89, 127, 83, 52, 171, 56, 55, 250, 80, 63, 142, 173, 14, 192, 64, 205, 135, 190, 126, 243, 0, 0, 0, 7, 126, 127, 92, 52, 167, 56, 55, 250, 80, 63, 142, 173, 14, 192, 64, 205, 135, 62, 102, 243, 74, 0, 189, 40, 99, 127, 93, 52, 167, 56, 23, 121, 22, 63, 0, 0, 128, 191, 191, 27, 79, 63, 39, 243, 120, 0, 231, 122, 22, 127, 103, 52, 169, 56, 0, 0, 0, 0, 0, 0, 128, 191, 0, 0, 128, 63, 217, 243, 120, 0, 14, 124, 19, 127, 104, 52, 165, 56, 186, 39, 1, 191, 142, 173, 14, 192, 76, 196, 49, 63, 154, 243, 74, 0, 71, 23, 102, 127, 93, 52, 165, 56, 112, 120, 115, 191, 0, 0, 128, 191, 125, 55, 158, 62, 130, 243, 0, 0, 5, 206, 116, 127, 91, 52, 160, 56, 112, 120, 115, 191, 0, 0, 128, 191, 125, 55, 158, 190, 154, 243, 182, 0, 226, 150, 61, 127, 84, 52, 161, 56, 20, 121, 22, 191, 0, 0, 128, 191, 194, 27, 79, 191, 217, 243, 136, 0, 242, 132, 19, 127, 79, 52, 164, 56, 56, 16, 22, 191, 68, 244, 139, 65, 113, 139, 78, 191, 154, 0, 182, 0, 74, 244, 154, 129, 135, 57, 148, 56, 65, 16, 22, 191, 149, 31, 179, 65, 108, 139, 78, 63, 217, 0, 120, 0, 201, 112, 238, 127, 237, 57, 35, 57, 203, 206, 114, 63, 68, 244, 139, 65, 59, 201, 157, 62, 127, 0, 0, 0, 0, 242, 126, 127, 129, 57, 144, 56, 0, 0, 0, 0, 68, 244, 139, 65, 158, 77, 127, 191, 217, 0, 136, 0, 119, 242, 218, 129, 135, 57, 145, 56, 199, 206, 114, 191, 68, 244, 139, 65, 63, 201, 157, 62, 154, 0, 74, 0, 74, 13, 102, 129, 131, 57, 151, 56, 61, 16, 22, 63, 68, 244, 139, 65, 110, 139, 78, 63, 102, 0, 74, 0, 182, 243, 102, 127, 127, 57, 146, 56, 63, 16, 22, 63, 68, 244, 139, 65, 108, 139, 78, 191, 39, 0, 136, 0, 119, 242, 38, 129, 133, 57, 143, 56, 199, 206, 114, 191, 68, 244, 139, 65, 63, 201, 157, 190, 129, 0, 0, 0, 0, 244, 130, 129, 133, 57, 150, 56, 0, 0, 0, 0, 149, 31, 179, 65, 158, 77, 127, 63, 39, 0, 120, 0, 190, 150, 21, 127, 132, 57, 70, 57, 203, 206, 114, 63, 68, 244, 139, 65, 59, 201, 157, 190, 102, 0, 182, 0, 74, 243, 102, 129, 131, 57, 143, 56, 138, 117, 44, 191, 218, 38, 151, 65, 61, 40, 138, 191, 136, 0, 39, 0, 0, 130, 0, 127, 85, 42, 101, 59, 75, 199, 233, 190, 218, 38, 151, 65, 226, 7, 96, 191, 120, 0, 217, 0, 0, 130, 2, 127, 229, 46, 45, 59, 97, 233, 23, 191, 218, 38, 151, 65, 59, 183, 84, 191, 39, 0, 120, 0, 136, 0, 39, 127, 11, 54, 34, 53, 75, 199, 233, 190, 220, 151, 131, 65, 226, 7, 96, 191, 0, 129, 0, 0, 145, 0, 196, 127, 130, 51, 35, 59, 138, 117, 44, 191, 218, 38, 151, 65, 61, 40, 138, 191, 0, 0, 0, 0, 15, 0, 125, 127, 85, 42, 101, 59, 188, 202, 138, 190, 218, 38, 151, 65, 95, 206, 154, 191, 136, 0, 39, 0, 0, 126, 2, 127, 135, 51, 159, 59, 158, 55, 93, 189, 218, 38, 151, 65, 17, 170, 128, 191, 120, 0, 217, 0, 0, 126, 0, 127, 179, 52, 103, 59, 211, 100, 67, 190, 218, 38, 151, 65, 118, 3, 118, 191, 39, 0, 120, 0, 136, 0, 39, 127, 3, 55, 231, 52, 158, 55, 93, 189, 220, 151, 131, 65, 17, 170, 128, 191, 0, 129, 0, 0, 248, 0, 130, 127, 74, 43, 101, 59, 188, 202, 138, 190, 218, 38, 151, 65, 95, 206, 154, 191, 0, 127, 0, 0, 118, 0, 44, 127, 135, 51, 159, 59, 138, 117, 44, 191, 218, 38, 151, 65, 61, 40, 138, 191, 0, 0, 0, 0, 127, 0, 0, 127, 107, 55, 222, 53, 138, 117, 44, 191, 220, 151, 131, 65, 61, 40, 138, 191, 0, 0, 0, 0, 127, 0, 0, 127, 49, 56, 253, 53, 221, 222, 55, 190, 218, 38, 151, 65, 27, 104, 178, 191, 217, 0, 136, 0, 255, 126, 0, 127, 60, 59, 11, 59, 229, 7, 21, 191, 218, 38, 151, 65, 248, 193, 161, 191, 217, 0, 136, 0, 0, 126, 0, 127, 76, 59, 139, 59, 160, 13, 56, 191, 220, 151, 131, 65, 168, 25, 156, 191, 0, 129, 0, 0, 149, 0, 189, 127, 227, 56, 187, 59, 140, 126, 9, 190, 218, 38, 151, 65, 176, 118, 160, 191, 0, 127, 0, 0, 229, 0, 124, 127, 104, 59, 227, 58, 207, 111, 9, 191, 218, 38, 151, 65, 150, 208, 143, 191, 0, 0, 0, 0, 74, 0, 102, 127, 135, 59, 159, 59, 160, 13, 56, 191, 218, 38, 151, 65, 168, 25, 156, 191, 136, 0, 39, 0, 0, 126, 1, 127, 64, 59, 175, 59, 221, 222, 55, 190, 220, 151, 131, 65, 27, 104, 178, 191, 120, 0, 217, 0, 0, 126, 255, 127, 222, 56, 22, 59, 207, 111, 9, 191, 220, 151, 131, 65, 150, 208, 143, 191, 39, 0, 120, 0, 120, 0, 217, 127, 16, 53, 216, 59, 74, 224, 47, 63, 190, 228, 157, 65, 157, 132, 140, 63, 119, 0, 214, 0, 240, 116, 210, 127, 222, 58, 45, 55, 70, 197, 237, 62, 190, 228, 157, 65, 25, 78, 102, 63, 137, 0, 42, 0, 10, 134, 30, 127, 21, 59, 10, 56, 17, 149, 25, 63, 190, 228, 157, 65, 67, 7, 90, 63, 214, 0, 137, 0, 119, 0, 214, 127, 147, 54, 45, 53, 70, 197, 237, 62, 192, 85, 138, 65, 25, 78, 102, 63, 0, 129, 0, 0, 138, 0, 45, 127, 32, 59, 4, 57, 74, 224, 47, 63, 190, 228, 157, 65, 157, 132, 140, 63, 0, 0, 0, 0, 150, 0, 68, 127, 222, 58, 45, 55, 137, 138, 147, 62, 190, 228, 157, 65, 247, 148, 158, 63, 119, 0, 214, 0, 246, 134, 226, 127, 121, 59, 10, 56, 239, 60, 134, 61, 190, 228, 157, 65, 101, 55, 133, 63, 137, 0, 42, 0, 16, 116, 47, 127, 66, 59, 46, 55, 39, 232, 77, 62, 190, 228, 157, 65, 247, 39, 126, 63, 214, 0, 137, 0, 119, 0, 214, 127, 142, 53, 14, 53, 90, 75, 28, 62, 192, 85, 138, 65, 99, 184, 164, 63, 0, 129, 0, 0, 117, 0, 210, 127, 112, 59, 7, 57, 39, 232, 77, 62, 190, 228, 157, 65, 247, 39, 126, 63, 0, 127, 0, 0, 104, 0, 185, 127, 167, 59, 75, 55, 74, 224, 47, 63, 190, 228, 157, 65, 157, 132, 140, 63, 0, 0, 0, 0, 127, 0, 0, 127, 207, 55, 44, 54, 74, 224, 47, 63, 192, 85, 138, 65, 157, 132, 140, 63, 0, 0, 0, 0, 127, 0, 0, 127, 20, 56, 54, 54, 183, 156, 78, 62, 190, 228, 157, 65, 27, 127, 182, 63, 42, 0, 119, 0, 1, 126, 0, 127, 61, 59, 254, 57, 51, 194, 25, 63, 190, 228, 157, 65, 193, 110, 164, 63, 42, 0, 119, 0, 0, 126, 0, 127, 77, 59, 124, 58, 161, 116, 60, 63, 192, 85, 138, 65, 85, 75, 158, 63, 0, 129, 0, 0, 109, 0, 64, 127, 237, 56, 173, 58, 90, 75, 28, 62, 190, 228, 157, 65, 99, 184, 164, 63, 0, 127, 0, 0, 24, 0, 132, 127, 105, 59, 214, 57, 220, 45, 13, 63, 190, 228, 157, 65, 9, 168, 146, 63, 0, 0, 0, 0, 179, 0, 156, 127, 135, 59, 145, 58, 161, 116, 60, 63, 190, 228, 157, 65, 85, 75, 158, 63, 119, 0, 214, 0, 0, 126, 254, 127, 65, 59, 160, 58, 183, 156, 78, 62, 192, 85, 138, 65, 27, 127, 182, 63, 137, 0, 42, 0, 0, 126, 1, 127, 231, 56, 11, 58, 220, 45, 13, 63, 192, 85, 138, 65, 9, 168, 146, 63, 214, 0, 137, 0, 137, 0, 42, 127, 220, 54, 208, 59 ),
"array_index_data": PoolByteArray( 0, 0, 2, 0, 1, 0, 3, 0, 5, 0, 4, 0, 6, 0, 8, 0, 7, 0, 9, 0, 11, 0, 10, 0, 12, 0, 14, 0, 13, 0, 15, 0, 17, 0, 16, 0, 18, 0, 20, 0, 19, 0, 21, 0, 23, 0, 22, 0, 24, 0, 26, 0, 25, 0, 27, 0, 29, 0, 28, 0, 30, 0, 32, 0, 31, 0, 33, 0, 35, 0, 34, 0, 21, 0, 37, 0, 36, 0, 6, 0, 39, 0, 38, 0, 40, 0, 42, 0, 41, 0, 43, 0, 45, 0, 44, 0, 30, 0, 47, 0, 46, 0, 12, 0, 49, 0, 48, 0, 50, 0, 52, 0, 51, 0, 53, 0, 55, 0, 54, 0, 18, 0, 57, 0, 56, 0, 3, 0, 59, 0, 58, 0, 60, 0, 62, 0, 61, 0, 61, 0, 62, 0, 63, 0, 63, 0, 62, 0, 64, 0, 64, 0, 62, 0, 65, 0, 65, 0, 62, 0, 66, 0, 66, 0, 62, 0, 67, 0, 67, 0, 62, 0, 68, 0, 68, 0, 62, 0, 69, 0, 69, 0, 62, 0, 70, 0, 70, 0, 62, 0, 60, 0, 33, 0, 72, 0, 71, 0, 73, 0, 74, 0, 71, 0, 73, 0, 76, 0, 75, 0, 77, 0, 75, 0, 78, 0, 79, 0, 80, 0, 78, 0, 81, 0, 79, 0, 82, 0, 83, 0, 81, 0, 84, 0, 85, 0, 83, 0, 86, 0, 85, 0, 87, 0, 34, 0, 88, 0, 90, 0, 89, 0, 0, 0, 92, 0, 91, 0, 93, 0, 95, 0, 94, 0, 96, 0, 98, 0, 97, 0, 15, 0, 100, 0, 99, 0, 101, 0, 103, 0, 102, 0, 104, 0, 106, 0, 105, 0, 9, 0, 108, 0, 107, 0, 27, 0, 110, 0, 109, 0, 111, 0, 113, 0, 112, 0, 114, 0, 116, 0, 115, 0, 117, 0, 119, 0, 118, 0, 120, 0, 122, 0, 121, 0, 123, 0, 125, 0, 124, 0, 126, 0, 128, 0, 127, 0, 129, 0, 131, 0, 130, 0, 132, 0, 134, 0, 133, 0, 135, 0, 137, 0, 136, 0, 138, 0, 140, 0, 139, 0, 141, 0, 143, 0, 142, 0, 144, 0, 146, 0, 145, 0, 147, 0, 149, 0, 148, 0, 150, 0, 152, 0, 151, 0, 153, 0, 155, 0, 154, 0, 156, 0, 158, 0, 157, 0, 159, 0, 161, 0, 160, 0, 162, 0, 164, 0, 163, 0, 165, 0, 167, 0, 166, 0, 168, 0, 170, 0, 169, 0, 171, 0, 173, 0, 172, 0, 174, 0, 176, 0, 175, 0, 175, 0, 176, 0, 177, 0, 177, 0, 176, 0, 178, 0, 178, 0, 176, 0, 179, 0, 179, 0, 176, 0, 180, 0, 180, 0, 176, 0, 181, 0, 181, 0, 176, 0, 182, 0, 182, 0, 176, 0, 183, 0, 183, 0, 176, 0, 184, 0, 184, 0, 176, 0, 174, 0, 185, 0, 187, 0, 186, 0, 188, 0, 190, 0, 189, 0, 191, 0, 193, 0, 192, 0, 194, 0, 196, 0, 195, 0, 197, 0, 199, 0, 198, 0, 200, 0, 202, 0, 201, 0, 203, 0, 205, 0, 204, 0, 206, 0, 208, 0, 207, 0, 209, 0, 211, 0, 210, 0, 212, 0, 214, 0, 213, 0, 215, 0, 217, 0, 216, 0, 218, 0, 220, 0, 219, 0, 221, 0, 223, 0, 222, 0, 224, 0, 188, 0, 225, 0, 226, 0, 224, 0, 227, 0, 228, 0, 230, 0, 229, 0, 231, 0, 233, 0, 232, 0, 234, 0, 236, 0, 235, 0, 237, 0, 239, 0, 238, 0, 240, 0, 242, 0, 241, 0, 243, 0, 245, 0, 244, 0, 246, 0, 248, 0, 247, 0, 249, 0, 251, 0, 250, 0, 241, 0, 239, 0, 237, 0, 232, 0, 230, 0, 228, 0, 206, 0, 252, 0, 235, 0, 253, 0, 255, 0, 254, 0, 0, 1, 2, 1, 1, 1, 3, 1, 5, 1, 4, 1, 6, 1, 8, 1, 7, 1, 9, 1, 11, 1, 10, 1, 12, 1, 14, 1, 13, 1, 15, 1, 17, 1, 16, 1, 18, 1, 20, 1, 19, 1, 21, 1, 23, 1, 22, 1, 24, 1, 26, 1, 25, 1, 27, 1, 29, 1, 28, 1, 30, 1, 32, 1, 31, 1, 33, 1, 35, 1, 34, 1, 36, 1, 0, 1, 37, 1, 38, 1, 36, 1, 39, 1, 40, 1, 42, 1, 41, 1, 43, 1, 45, 1, 44, 1, 46, 1, 48, 1, 47, 1, 49, 1, 51, 1, 50, 1, 52, 1, 54, 1, 53, 1, 55, 1, 57, 1, 56, 1, 58, 1, 60, 1, 59, 1, 61, 1, 63, 1, 62, 1, 53, 1, 51, 1, 49, 1, 44, 1, 42, 1, 40, 1, 18, 1, 64, 1, 47, 1, 0, 0, 1, 0, 92, 0, 3, 0, 4, 0, 59, 0, 6, 0, 7, 0, 39, 0, 9, 0, 10, 0, 108, 0, 12, 0, 13, 0, 49, 0, 15, 0, 16, 0, 100, 0, 18, 0, 19, 0, 57, 0, 21, 0, 22, 0, 37, 0, 65, 1, 67, 1, 66, 1, 67, 1, 24, 0, 68, 1, 24, 0, 25, 0, 69, 1, 25, 0, 26, 0, 70, 1, 26, 0, 24, 0, 71, 1, 71, 1, 24, 0, 65, 1, 65, 1, 24, 0, 67, 1, 27, 0, 28, 0, 110, 0, 30, 0, 31, 0, 47, 0, 33, 0, 34, 0, 72, 0, 21, 0, 36, 0, 72, 1, 6, 0, 38, 0, 73, 1, 40, 0, 41, 0, 74, 1, 43, 0, 44, 0, 75, 1, 30, 0, 46, 0, 76, 1, 12, 0, 48, 0, 77, 1, 50, 0, 51, 0, 78, 1, 53, 0, 54, 0, 79, 1, 18, 0, 56, 0, 80, 1, 3, 0, 58, 0, 81, 1, 33, 0, 71, 0, 74, 0, 73, 0, 71, 0, 76, 0, 73, 0, 75, 0, 77, 0, 77, 0, 78, 0, 80, 0, 79, 0, 78, 0, 82, 0, 81, 0, 82, 0, 84, 0, 83, 0, 84, 0, 86, 0, 85, 0, 86, 0, 87, 0, 85, 0, 34, 0, 35, 0, 88, 0, 89, 0, 82, 1, 0, 0, 91, 0, 83, 1, 93, 0, 94, 0, 84, 1, 96, 0, 97, 0, 85, 1, 15, 0, 99, 0, 86, 1, 101, 0, 102, 0, 87, 1, 104, 0, 105, 0, 88, 1, 9, 0, 107, 0, 89, 1, 27, 0, 109, 0, 90, 1, 111, 0, 112, 0, 91, 1, 114, 0, 115, 0, 92, 1, 117, 0, 118, 0, 93, 1, 120, 0, 121, 0, 94, 1, 123, 0, 124, 0, 95, 1, 126, 0, 127, 0, 96, 1, 129, 0, 130, 0, 97, 1, 132, 0, 133, 0, 98, 1, 135, 0, 136, 0, 99, 1, 138, 0, 139, 0, 100, 1, 141, 0, 142, 0, 101, 1, 144, 0, 145, 0, 102, 1, 147, 0, 148, 0, 103, 1, 150, 0, 151, 0, 104, 1, 153, 0, 154, 0, 105, 1, 156, 0, 157, 0, 106, 1, 159, 0, 160, 0, 107, 1, 162, 0, 163, 0, 108, 1, 165, 0, 166, 0, 109, 1, 168, 0, 169, 0, 110, 1, 171, 0, 172, 0, 111, 1, 185, 0, 186, 0, 112, 1, 188, 0, 189, 0, 225, 0, 191, 0, 192, 0, 113, 1, 194, 0, 195, 0, 114, 1, 197, 0, 198, 0, 115, 1, 200, 0, 201, 0, 116, 1, 203, 0, 204, 0, 117, 1, 206, 0, 207, 0, 252, 0, 209, 0, 210, 0, 118, 1, 212, 0, 213, 0, 119, 1, 215, 0, 216, 0, 120, 1, 218, 0, 219, 0, 121, 1, 221, 0, 222, 0, 122, 1, 224, 0, 225, 0, 227, 0, 226, 0, 227, 0, 123, 1, 228, 0, 229, 0, 124, 1, 231, 0, 232, 0, 125, 1, 234, 0, 235, 0, 126, 1, 237, 0, 238, 0, 127, 1, 240, 0, 241, 0, 128, 1, 243, 0, 244, 0, 129, 1, 246, 0, 247, 0, 130, 1, 249, 0, 250, 0, 131, 1, 241, 0, 237, 0, 128, 1, 232, 0, 228, 0, 125, 1, 206, 0, 235, 0, 236, 0, 253, 0, 254, 0, 132, 1, 0, 1, 1, 1, 37, 1, 3, 1, 4, 1, 133, 1, 6, 1, 7, 1, 134, 1, 9, 1, 10, 1, 135, 1, 12, 1, 13, 1, 136, 1, 15, 1, 16, 1, 137, 1, 18, 1, 19, 1, 64, 1, 21, 1, 22, 1, 138, 1, 24, 1, 25, 1, 139, 1, 27, 1, 28, 1, 140, 1, 30, 1, 31, 1, 141, 1, 33, 1, 34, 1, 142, 1, 36, 1, 37, 1, 39, 1, 38, 1, 39, 1, 143, 1, 40, 1, 41, 1, 144, 1, 43, 1, 44, 1, 145, 1, 46, 1, 47, 1, 146, 1, 49, 1, 50, 1, 147, 1, 52, 1, 53, 1, 148, 1, 55, 1, 56, 1, 149, 1, 58, 1, 59, 1, 150, 1, 61, 1, 62, 1, 151, 1, 53, 1, 49, 1, 148, 1, 44, 1, 40, 1, 145, 1, 18, 1, 47, 1, 48, 1 ),
"blend_shape_data": [  ],
"format": 97559,
"index_count": 756,
"material": ExtResource( 1 ),
"name": "Material.017",
"primitive": 4,
"skeleton_aabb": [  ],
"vertex_count": 408
}

[node name="chicken broth" type="Spatial"]

[node name="Cylinder" type="MeshInstance" parent="."]
transform = Transform( 0.951569, 7.9025e-10, -0.307434, 8.37792e-16, 0.0588056, 4.37114e-08, 0.307434, -2.44598e-09, 0.951569, 0, 0, 0 )
mesh = SubResource( 1 )
material/0 = ExtResource( 1 )
