[gd_scene load_steps=5 format=2]

[ext_resource path="res://Assets/materials/Soup4UV.png" type="Texture" id=1]
[ext_resource path="res://Assets/meshes/Material_001.material" type="Material" id=2]

[sub_resource type="ArrayMesh" id=1]
resource_name = "Cylinder"
surfaces/0 = {
"aabb": AABB( -1.36355, -8.41054, -1.38458, 2.72709, 9.67159, 2.68566 ),
"array_data": PoolByteArray( 0, 0, 0, 0, 136, 105, 161, 63, 252, 57, 177, 191, 43, 0, 137, 0, 241, 125, 251, 127, 98, 59, 132, 49, 135, 214, 99, 63, 127, 105, 161, 191, 105, 195, 135, 191, 43, 0, 137, 0, 245, 126, 252, 127, 62, 58, 139, 46, 0, 0, 0, 0, 127, 105, 161, 191, 252, 57, 177, 191, 43, 0, 137, 0, 247, 126, 253, 127, 246, 58, 32, 50, 135, 214, 99, 63, 136, 105, 161, 63, 105, 195, 135, 191, 109, 0, 193, 0, 204, 70, 165, 127, 119, 58, 43, 43, 181, 136, 174, 63, 127, 105, 161, 191, 72, 51, 118, 190, 109, 0, 193, 0, 197, 46, 154, 127, 41, 57, 55, 46, 135, 214, 99, 63, 127, 105, 161, 191, 105, 195, 135, 191, 109, 0, 193, 0, 196, 35, 151, 127, 62, 58, 139, 46, 181, 136, 174, 63, 136, 105, 161, 63, 72, 51, 118, 190, 125, 0, 22, 0, 4, 132, 231, 127, 9, 57, 230, 40, 141, 123, 153, 63, 127, 105, 161, 191, 252, 57, 49, 63, 125, 0, 22, 0, 7, 136, 216, 127, 73, 56, 226, 48, 181, 136, 174, 63, 127, 105, 161, 191, 72, 51, 118, 190, 125, 0, 22, 0, 8, 139, 210, 127, 41, 57, 55, 46, 141, 123, 153, 63, 136, 105, 161, 63, 252, 57, 49, 63, 81, 0, 97, 0, 1, 130, 255, 127, 181, 55, 155, 47, 195, 117, 242, 62, 127, 105, 161, 191, 219, 137, 166, 63, 81, 0, 97, 0, 9, 130, 249, 127, 213, 55, 253, 51, 141, 123, 153, 63, 127, 105, 161, 191, 252, 57, 49, 63, 81, 0, 97, 0, 12, 131, 246, 127, 73, 56, 226, 48, 195, 117, 242, 62, 136, 105, 161, 63, 219, 137, 166, 63, 0, 0, 127, 0, 244, 130, 0, 127, 223, 54, 32, 52, 212, 117, 242, 190, 127, 105, 161, 191, 210, 137, 166, 63, 0, 0, 127, 0, 250, 130, 0, 127, 54, 56, 153, 53, 195, 117, 242, 62, 127, 105, 161, 191, 219, 137, 166, 63, 0, 0, 127, 0, 253, 130, 0, 127, 213, 55, 253, 51, 212, 117, 242, 190, 136, 105, 161, 63, 210, 137, 166, 63, 175, 0, 97, 0, 230, 134, 235, 127, 231, 55, 68, 54, 141, 123, 153, 191, 127, 105, 161, 191, 248, 57, 49, 63, 175, 0, 97, 0, 231, 134, 235, 127, 20, 57, 138, 54, 212, 117, 242, 190, 127, 105, 161, 191, 210, 137, 166, 63, 175, 0, 97, 0, 231, 134, 235, 127, 54, 56, 153, 53, 141, 123, 153, 191, 136, 105, 161, 63, 248, 57, 49, 63, 131, 0, 22, 0, 244, 105, 187, 127, 39, 57, 94, 55, 181, 136, 174, 191, 127, 105, 161, 191, 79, 51, 118, 190, 131, 0, 22, 0, 240, 83, 162, 127, 37, 58, 82, 54, 141, 123, 153, 191, 127, 105, 161, 191, 248, 57, 49, 63, 131, 0, 22, 0, 238, 73, 154, 127, 20, 57, 138, 54, 181, 136, 174, 191, 127, 105, 161, 191, 79, 51, 118, 190, 147, 251, 193, 0, 20, 116, 210, 127, 37, 58, 82, 54, 28, 29, 75, 191, 57, 97, 139, 192, 181, 15, 114, 191, 147, 251, 193, 0, 61, 21, 148, 127, 52, 57, 14, 52, 24, 152, 155, 191, 57, 97, 139, 192, 195, 123, 91, 190, 147, 251, 193, 0, 63, 250, 147, 127, 39, 57, 6, 52, 181, 136, 174, 191, 136, 105, 161, 63, 79, 51, 118, 190, 147, 0, 193, 0, 4, 126, 249, 127, 128, 58, 237, 54, 137, 214, 99, 191, 127, 105, 161, 191, 105, 195, 135, 191, 147, 0, 193, 0, 8, 125, 242, 127, 232, 58, 245, 52, 181, 136, 174, 191, 127, 105, 161, 191, 79, 51, 118, 190, 147, 0, 193, 0, 10, 125, 238, 127, 37, 58, 82, 54, 137, 214, 99, 191, 136, 105, 161, 63, 105, 195, 135, 191, 213, 0, 137, 0, 253, 126, 1, 127, 98, 59, 33, 53, 0, 0, 0, 0, 127, 105, 161, 191, 252, 57, 177, 191, 213, 0, 137, 0, 1, 126, 0, 127, 246, 58, 32, 50, 137, 214, 99, 191, 127, 105, 161, 191, 105, 195, 135, 191, 213, 0, 137, 0, 4, 126, 255, 127, 232, 58, 245, 52, 50, 38, 216, 190, 57, 97, 139, 192, 87, 119, 148, 63, 0, 240, 125, 0, 179, 99, 12, 129, 32, 57, 206, 51, 89, 213, 144, 62, 152, 207, 233, 192, 155, 246, 70, 63, 0, 240, 125, 0, 135, 221, 252, 129, 249, 56, 239, 51, 33, 38, 216, 62, 57, 97, 139, 192, 87, 119, 148, 63, 0, 240, 125, 0, 194, 109, 14, 129, 38, 57, 177, 51, 149, 202, 79, 63, 38, 50, 136, 190, 210, 162, 119, 191, 0, 127, 0, 0, 0, 0, 127, 127, 220, 52, 226, 56, 0, 0, 0, 0, 38, 50, 136, 190, 5, 162, 161, 191, 0, 127, 0, 0, 0, 0, 127, 127, 238, 51, 236, 57, 0, 0, 0, 0, 38, 50, 136, 190, 0, 0, 0, 128, 0, 127, 0, 0, 0, 0, 127, 127, 205, 55, 236, 57, 151, 202, 79, 191, 38, 50, 136, 190, 207, 162, 119, 191, 0, 127, 0, 0, 0, 0, 127, 127, 220, 52, 245, 58, 102, 45, 159, 191, 38, 50, 136, 190, 194, 137, 96, 190, 0, 127, 0, 0, 0, 0, 127, 127, 34, 55, 130, 59, 110, 250, 139, 191, 38, 50, 136, 190, 5, 162, 33, 63, 0, 127, 0, 0, 0, 0, 127, 127, 220, 56, 81, 59, 132, 32, 221, 190, 38, 50, 136, 190, 164, 226, 151, 63, 0, 127, 0, 0, 0, 0, 127, 127, 179, 57, 121, 58, 119, 32, 221, 62, 38, 50, 136, 190, 164, 226, 151, 63, 0, 127, 0, 0, 0, 0, 127, 127, 179, 57, 95, 57, 110, 250, 139, 63, 38, 50, 136, 190, 9, 162, 33, 63, 0, 127, 0, 0, 0, 0, 127, 127, 220, 56, 134, 56, 102, 45, 159, 63, 38, 50, 136, 190, 187, 137, 96, 190, 0, 127, 0, 0, 0, 0, 127, 127, 34, 55, 85, 56, 0, 0, 0, 0, 127, 105, 161, 191, 252, 57, 177, 191, 213, 251, 137, 0, 119, 246, 214, 129, 246, 58, 32, 50, 28, 29, 75, 191, 57, 97, 139, 192, 181, 15, 114, 191, 213, 251, 137, 0, 119, 246, 214, 129, 52, 57, 14, 52, 137, 214, 99, 191, 127, 105, 161, 191, 105, 195, 135, 191, 213, 251, 137, 0, 13, 125, 246, 127, 232, 58, 245, 52, 181, 136, 174, 63, 127, 105, 161, 191, 72, 51, 118, 190, 109, 251, 193, 0, 194, 15, 147, 127, 41, 57, 55, 46, 26, 29, 75, 63, 57, 97, 139, 192, 187, 15, 114, 191, 109, 251, 193, 0, 194, 17, 147, 127, 75, 57, 230, 51, 135, 214, 99, 63, 127, 105, 161, 191, 105, 195, 135, 191, 109, 251, 193, 0, 194, 14, 147, 127, 62, 58, 139, 46, 141, 123, 153, 63, 127, 105, 161, 191, 252, 57, 49, 63, 124, 251, 22, 0, 12, 169, 165, 127, 73, 56, 226, 48, 24, 152, 155, 63, 57, 97, 139, 192, 195, 123, 91, 190, 124, 251, 22, 0, 21, 246, 132, 127, 64, 57, 182, 51, 181, 136, 174, 63, 127, 105, 161, 191, 72, 51, 118, 190, 124, 251, 22, 0, 9, 156, 179, 127, 41, 57, 55, 46, 135, 214, 99, 63, 127, 105, 161, 191, 105, 195, 135, 191, 43, 251, 137, 0, 212, 116, 235, 127, 62, 58, 139, 46, 0, 0, 0, 0, 57, 97, 139, 192, 143, 254, 157, 191, 43, 251, 137, 0, 144, 41, 214, 127, 66, 57, 9, 52, 0, 0, 0, 0, 127, 105, 161, 191, 252, 57, 177, 191, 43, 251, 137, 0, 232, 123, 242, 127, 246, 58, 32, 50, 195, 117, 242, 62, 127, 105, 161, 191, 219, 137, 166, 63, 81, 251, 97, 0, 2, 130, 247, 127, 213, 55, 253, 51, 191, 211, 136, 63, 57, 97, 139, 192, 145, 254, 29, 63, 81, 251, 97, 0, 182, 172, 57, 127, 49, 57, 166, 51, 141, 123, 153, 63, 127, 105, 161, 191, 252, 57, 49, 63, 81, 251, 97, 0, 20, 134, 232, 127, 73, 56, 226, 48, 195, 117, 242, 62, 127, 105, 161, 191, 219, 137, 166, 63, 0, 251, 126, 0, 212, 138, 251, 127, 213, 55, 253, 51, 50, 38, 216, 190, 57, 97, 139, 192, 87, 119, 148, 63, 0, 251, 126, 0, 188, 150, 252, 127, 32, 57, 206, 51, 33, 38, 216, 62, 57, 97, 139, 192, 87, 119, 148, 63, 0, 251, 126, 0, 181, 154, 252, 127, 38, 57, 177, 51, 141, 123, 153, 191, 127, 105, 161, 191, 248, 57, 49, 63, 175, 251, 97, 0, 199, 157, 203, 127, 20, 57, 138, 54, 50, 38, 216, 190, 57, 97, 139, 192, 87, 119, 148, 63, 175, 251, 97, 0, 163, 224, 176, 127, 32, 57, 206, 51, 212, 117, 242, 190, 127, 105, 161, 191, 210, 137, 166, 63, 175, 251, 97, 0, 212, 146, 212, 127, 54, 56, 153, 53, 181, 136, 174, 191, 127, 105, 161, 191, 79, 51, 118, 190, 132, 251, 22, 0, 234, 26, 134, 127, 37, 58, 82, 54, 191, 211, 136, 191, 57, 97, 139, 192, 141, 254, 29, 63, 132, 251, 22, 0, 235, 253, 131, 127, 32, 57, 240, 51, 141, 123, 153, 191, 127, 105, 161, 191, 248, 57, 49, 63, 132, 251, 22, 0, 234, 34, 136, 127, 20, 57, 138, 54, 28, 29, 75, 191, 57, 97, 139, 192, 181, 15, 114, 191, 147, 240, 194, 0, 201, 88, 72, 129, 52, 57, 14, 52, 255, 131, 80, 191, 152, 207, 233, 192, 85, 17, 19, 190, 147, 240, 194, 0, 191, 31, 104, 129, 252, 56, 225, 51, 24, 152, 155, 191, 57, 97, 139, 192, 195, 123, 91, 190, 147, 240, 194, 0, 204, 95, 65, 129, 39, 57, 6, 52, 26, 29, 75, 63, 57, 97, 139, 192, 187, 15, 114, 191, 43, 240, 138, 0, 43, 119, 0, 129, 75, 57, 230, 51, 0, 0, 0, 0, 152, 207, 233, 192, 122, 187, 83, 191, 43, 240, 138, 0, 43, 119, 0, 129, 239, 56, 241, 51, 0, 0, 0, 0, 57, 97, 139, 192, 143, 254, 157, 191, 43, 240, 138, 0, 25, 124, 249, 127, 66, 57, 9, 52, 33, 38, 216, 62, 57, 97, 139, 192, 87, 119, 148, 63, 80, 240, 96, 0, 162, 19, 82, 129, 38, 57, 177, 51, 151, 93, 55, 63, 152, 207, 233, 192, 122, 187, 211, 62, 80, 240, 96, 0, 162, 19, 82, 129, 243, 56, 237, 51, 191, 211, 136, 63, 57, 97, 139, 192, 145, 254, 29, 63, 80, 240, 96, 0, 78, 192, 180, 127, 49, 57, 166, 51, 24, 152, 155, 191, 57, 97, 139, 192, 195, 123, 91, 190, 132, 240, 21, 0, 229, 65, 151, 127, 39, 57, 6, 52, 149, 93, 55, 191, 152, 207, 233, 192, 115, 187, 211, 62, 132, 240, 21, 0, 229, 65, 151, 127, 254, 56, 230, 51, 191, 211, 136, 191, 57, 97, 139, 192, 141, 254, 29, 63, 132, 240, 21, 0, 244, 124, 19, 129, 32, 57, 240, 51, 191, 211, 136, 63, 57, 97, 139, 192, 145, 254, 29, 63, 124, 240, 21, 0, 237, 19, 124, 129, 49, 57, 166, 51, 1, 132, 80, 63, 152, 207, 233, 192, 78, 17, 19, 190, 124, 240, 21, 0, 237, 19, 124, 129, 238, 56, 235, 51, 24, 152, 155, 63, 57, 97, 139, 192, 195, 123, 91, 190, 124, 240, 21, 0, 26, 92, 173, 127, 64, 57, 182, 51, 191, 211, 136, 191, 57, 97, 139, 192, 141, 254, 29, 63, 176, 240, 96, 0, 215, 119, 242, 127, 32, 57, 240, 51, 99, 213, 144, 190, 152, 207, 233, 192, 153, 246, 70, 63, 176, 240, 96, 0, 215, 119, 242, 127, 253, 56, 236, 51, 50, 38, 216, 190, 57, 97, 139, 192, 87, 119, 148, 63, 176, 240, 96, 0, 226, 123, 252, 129, 32, 57, 206, 51, 28, 29, 75, 191, 57, 97, 139, 192, 181, 15, 114, 191, 213, 240, 138, 0, 75, 94, 216, 127, 52, 57, 14, 52, 0, 0, 0, 0, 152, 207, 233, 192, 122, 187, 83, 191, 213, 240, 138, 0, 75, 94, 216, 127, 239, 56, 241, 51, 84, 25, 8, 191, 152, 207, 233, 192, 66, 50, 34, 191, 213, 240, 138, 0, 176, 97, 15, 129, 246, 56, 226, 51, 24, 152, 155, 63, 57, 97, 139, 192, 195, 123, 91, 190, 109, 240, 194, 0, 255, 122, 223, 127, 64, 57, 182, 51, 83, 25, 8, 63, 152, 207, 233, 192, 70, 50, 34, 191, 109, 240, 194, 0, 251, 119, 215, 127, 235, 56, 2, 52, 26, 29, 75, 63, 57, 97, 139, 192, 187, 15, 114, 191, 109, 240, 194, 0, 0, 122, 224, 127, 75, 57, 230, 51, 89, 213, 144, 62, 152, 207, 233, 192, 155, 246, 70, 63, 81, 0, 97, 0, 53, 105, 211, 127, 249, 56, 239, 51, 151, 93, 55, 63, 148, 145, 6, 193, 122, 187, 211, 62, 81, 0, 97, 0, 53, 105, 211, 127, 213, 56, 9, 52, 151, 93, 55, 63, 152, 207, 233, 192, 122, 187, 211, 62, 81, 0, 97, 0, 160, 12, 81, 129, 243, 56, 237, 51, 255, 131, 80, 191, 152, 207, 233, 192, 85, 17, 19, 190, 131, 0, 22, 0, 1, 126, 10, 127, 252, 56, 225, 51, 149, 93, 55, 191, 148, 145, 6, 193, 115, 187, 211, 62, 131, 0, 22, 0, 255, 126, 248, 127, 229, 56, 232, 51, 149, 93, 55, 191, 152, 207, 233, 192, 115, 187, 211, 62, 131, 0, 22, 0, 4, 124, 25, 127, 254, 56, 230, 51, 151, 93, 55, 63, 152, 207, 233, 192, 122, 187, 211, 62, 125, 0, 22, 0, 235, 247, 124, 129, 243, 56, 237, 51, 1, 132, 80, 63, 148, 145, 6, 193, 78, 17, 19, 190, 125, 0, 22, 0, 235, 221, 120, 129, 188, 56, 14, 52, 1, 132, 80, 63, 152, 207, 233, 192, 78, 17, 19, 190, 125, 0, 22, 0, 235, 10, 124, 129, 238, 56, 235, 51, 149, 93, 55, 191, 152, 207, 233, 192, 115, 187, 211, 62, 175, 0, 97, 0, 44, 113, 37, 127, 254, 56, 230, 51, 99, 213, 144, 190, 148, 145, 6, 193, 153, 246, 70, 63, 175, 0, 97, 0, 24, 123, 20, 127, 229, 56, 245, 51, 99, 213, 144, 190, 152, 207, 233, 192, 153, 246, 70, 63, 175, 0, 97, 0, 57, 102, 48, 127, 253, 56, 236, 51, 0, 0, 0, 0, 152, 207, 233, 192, 122, 187, 83, 191, 213, 0, 137, 0, 173, 90, 30, 129, 239, 56, 241, 51, 84, 25, 8, 191, 148, 145, 6, 193, 66, 50, 34, 191, 213, 0, 137, 0, 146, 46, 40, 129, 212, 56, 211, 51, 84, 25, 8, 191, 152, 207, 233, 192, 66, 50, 34, 191, 213, 0, 137, 0, 200, 111, 20, 129, 246, 56, 226, 51, 1, 132, 80, 63, 152, 207, 233, 192, 78, 17, 19, 190, 109, 0, 193, 0, 43, 92, 75, 129, 238, 56, 235, 51, 83, 25, 8, 63, 148, 145, 6, 193, 70, 50, 34, 191, 109, 0, 193, 0, 43, 92, 75, 129, 140, 56, 0, 52, 83, 25, 8, 63, 152, 207, 233, 192, 70, 50, 34, 191, 109, 0, 193, 0, 4, 126, 7, 127, 235, 56, 2, 52, 99, 213, 144, 190, 152, 207, 233, 192, 153, 246, 70, 63, 0, 0, 127, 0, 37, 121, 0, 127, 253, 56, 236, 51, 89, 213, 144, 62, 148, 145, 6, 193, 155, 246, 70, 63, 0, 0, 127, 0, 37, 121, 0, 127, 224, 56, 1, 52, 89, 213, 144, 62, 152, 207, 233, 192, 155, 246, 70, 63, 0, 0, 127, 0, 135, 221, 0, 129, 249, 56, 239, 51, 84, 25, 8, 191, 152, 207, 233, 192, 66, 50, 34, 191, 147, 0, 193, 0, 40, 98, 187, 127, 246, 56, 226, 51, 255, 131, 80, 191, 148, 145, 6, 193, 85, 17, 19, 190, 147, 0, 193, 0, 40, 98, 187, 127, 224, 56, 220, 51, 255, 131, 80, 191, 152, 207, 233, 192, 85, 17, 19, 190, 147, 0, 193, 0, 205, 72, 90, 129, 252, 56, 225, 51, 83, 25, 8, 63, 152, 207, 233, 192, 70, 50, 34, 191, 43, 0, 137, 0, 205, 114, 238, 129, 235, 56, 2, 52, 0, 0, 0, 0, 148, 145, 6, 193, 122, 187, 83, 191, 43, 0, 137, 0, 231, 124, 247, 129, 187, 56, 212, 51, 0, 0, 0, 0, 152, 207, 233, 192, 122, 187, 83, 191, 43, 0, 137, 0, 187, 103, 231, 129, 239, 56, 241, 51, 0, 0, 0, 0, 148, 145, 6, 193, 122, 187, 83, 191, 0, 129, 0, 0, 163, 0, 85, 127, 187, 56, 212, 51, 83, 25, 8, 63, 148, 145, 6, 193, 70, 50, 34, 191, 0, 129, 0, 0, 200, 0, 113, 127, 140, 56, 0, 52, 0, 0, 0, 0, 148, 145, 6, 193, 0, 0, 0, 128, 0, 129, 0, 0, 198, 0, 112, 127, 205, 56, 244, 51, 1, 132, 80, 63, 148, 145, 6, 193, 78, 17, 19, 190, 0, 129, 0, 0, 240, 0, 125, 127, 188, 56, 14, 52, 151, 93, 55, 63, 148, 145, 6, 193, 122, 187, 211, 62, 0, 129, 0, 0, 2, 0, 126, 127, 213, 56, 9, 52, 89, 213, 144, 62, 148, 145, 6, 193, 155, 246, 70, 63, 0, 129, 0, 0, 224, 0, 122, 127, 224, 56, 1, 52, 99, 213, 144, 190, 148, 145, 6, 193, 153, 246, 70, 63, 0, 129, 0, 0, 208, 0, 117, 127, 229, 56, 245, 51, 149, 93, 55, 191, 148, 145, 6, 193, 115, 187, 211, 62, 0, 129, 0, 0, 198, 0, 112, 127, 229, 56, 232, 51, 255, 131, 80, 191, 148, 145, 6, 193, 85, 17, 19, 190, 0, 129, 0, 0, 169, 0, 92, 127, 224, 56, 220, 51, 84, 25, 8, 191, 148, 145, 6, 193, 66, 50, 34, 191, 0, 129, 0, 0, 146, 0, 62, 127, 212, 56, 211, 51, 72, 149, 85, 63, 136, 105, 161, 63, 214, 137, 126, 191, 0, 127, 0, 0, 109, 0, 193, 127, 142, 53, 199, 47, 0, 0, 0, 0, 136, 105, 161, 63, 252, 57, 177, 191, 0, 127, 0, 0, 108, 0, 191, 127, 127, 52, 104, 41, 0, 0, 0, 0, 136, 105, 161, 63, 91, 35, 166, 191, 0, 127, 0, 0, 108, 0, 191, 127, 107, 52, 97, 42, 61, 157, 163, 63, 136, 105, 161, 63, 238, 203, 102, 190, 0, 127, 0, 0, 111, 0, 196, 127, 142, 53, 225, 50, 135, 214, 99, 63, 136, 105, 161, 63, 105, 195, 135, 191, 0, 127, 0, 0, 109, 0, 193, 127, 182, 53, 148, 47, 67, 225, 143, 63, 136, 105, 161, 63, 95, 35, 38, 63, 0, 127, 0, 0, 111, 0, 195, 127, 105, 52, 149, 52, 181, 136, 174, 63, 136, 105, 161, 63, 72, 51, 118, 190, 0, 127, 0, 0, 111, 0, 196, 127, 182, 53, 248, 50, 79, 74, 227, 62, 136, 105, 161, 63, 105, 30, 156, 63, 0, 127, 0, 0, 109, 0, 192, 127, 82, 49, 214, 52, 141, 123, 153, 63, 136, 105, 161, 63, 252, 57, 49, 63, 0, 127, 0, 0, 111, 0, 195, 127, 126, 52, 180, 52, 96, 74, 227, 190, 136, 105, 161, 63, 105, 30, 156, 63, 0, 127, 0, 0, 108, 0, 191, 127, 139, 44, 21, 52, 195, 117, 242, 62, 136, 105, 161, 63, 219, 137, 166, 63, 0, 127, 0, 0, 109, 0, 192, 127, 69, 49, 249, 52, 59, 225, 143, 191, 136, 105, 161, 63, 91, 35, 38, 63, 0, 127, 0, 0, 110, 0, 195, 127, 93, 40, 97, 49, 212, 117, 242, 190, 136, 105, 161, 63, 210, 137, 166, 63, 0, 127, 0, 0, 108, 0, 191, 127, 12, 44, 44, 52, 52, 157, 163, 191, 136, 105, 161, 63, 238, 203, 102, 190, 0, 127, 0, 0, 112, 0, 197, 127, 145, 44, 38, 45, 141, 123, 153, 191, 136, 105, 161, 63, 248, 57, 49, 63, 0, 127, 0, 0, 111, 0, 195, 127, 28, 38, 98, 49, 74, 149, 85, 191, 136, 105, 161, 63, 210, 137, 126, 191, 0, 127, 0, 0, 110, 0, 194, 127, 88, 49, 76, 40, 181, 136, 174, 191, 136, 105, 161, 63, 79, 51, 118, 190, 0, 127, 0, 0, 112, 0, 197, 127, 13, 44, 205, 44, 137, 214, 99, 191, 136, 105, 161, 63, 105, 195, 135, 191, 0, 127, 0, 0, 110, 0, 194, 127, 71, 49, 106, 38, 0, 0, 0, 0, 38, 50, 136, 190, 5, 162, 161, 191, 213, 2, 119, 0, 84, 90, 28, 127, 189, 50, 108, 48, 72, 149, 85, 63, 136, 105, 161, 63, 214, 137, 126, 191, 213, 2, 119, 0, 77, 97, 25, 127, 142, 53, 199, 47, 0, 0, 0, 0, 136, 105, 161, 63, 91, 35, 166, 191, 213, 2, 119, 0, 69, 103, 23, 127, 107, 52, 97, 42, 102, 45, 159, 63, 38, 50, 136, 190, 187, 137, 96, 190, 147, 2, 63, 0, 26, 117, 40, 127, 104, 51, 166, 49, 72, 149, 85, 63, 136, 105, 161, 63, 214, 137, 126, 191, 147, 2, 63, 0, 6, 126, 5, 127, 142, 53, 199, 47, 149, 202, 79, 63, 38, 50, 136, 190, 210, 162, 119, 191, 147, 2, 63, 0, 42, 98, 68, 127, 85, 51, 239, 48, 102, 45, 159, 63, 38, 50, 136, 190, 187, 137, 96, 190, 131, 2, 234, 0, 19, 75, 156, 127, 104, 51, 166, 49, 67, 225, 143, 63, 136, 105, 161, 63, 95, 35, 38, 63, 131, 2, 234, 0, 14, 104, 186, 127, 105, 52, 149, 52, 61, 157, 163, 63, 136, 105, 161, 63, 238, 203, 102, 190, 131, 2, 234, 0, 9, 120, 219, 127, 142, 53, 225, 50, 119, 32, 221, 62, 38, 50, 136, 190, 164, 226, 151, 63, 175, 2, 159, 0, 96, 20, 176, 127, 34, 50, 109, 50, 67, 225, 143, 63, 136, 105, 161, 63, 95, 35, 38, 63, 175, 2, 159, 0, 95, 26, 177, 127, 105, 52, 149, 52, 110, 250, 139, 63, 38, 50, 136, 190, 9, 162, 33, 63, 175, 2, 159, 0, 96, 14, 176, 127, 238, 50, 61, 50, 132, 32, 221, 190, 38, 50, 136, 190, 164, 226, 151, 63, 0, 2, 130, 0, 116, 207, 255, 127, 101, 49, 33, 50, 79, 74, 227, 62, 136, 105, 161, 63, 105, 30, 156, 63, 0, 2, 130, 0, 99, 178, 255, 127, 82, 49, 214, 52, 119, 32, 221, 62, 38, 50, 136, 190, 164, 226, 151, 63, 0, 2, 130, 0, 125, 236, 0, 127, 34, 50, 109, 50, 110, 250, 139, 191, 38, 50, 136, 190, 5, 162, 33, 63, 81, 2, 159, 0, 64, 160, 51, 127, 24, 49, 117, 49, 96, 74, 227, 190, 136, 105, 161, 63, 105, 30, 156, 63, 81, 2, 159, 0, 32, 136, 23, 127, 139, 44, 21, 52, 132, 32, 221, 190, 38, 50, 136, 190, 164, 226, 151, 63, 81, 2, 159, 0, 84, 192, 69, 127, 101, 49, 33, 50, 102, 45, 159, 191, 38, 50, 136, 190, 194, 137, 96, 190, 125, 2, 234, 0, 255, 132, 233, 127, 64, 49, 194, 48, 59, 225, 143, 191, 136, 105, 161, 63, 91, 35, 38, 63, 125, 2, 234, 0, 252, 135, 218, 127, 93, 40, 97, 49, 110, 250, 139, 191, 38, 50, 136, 190, 5, 162, 33, 63, 125, 2, 234, 0, 1, 130, 247, 127, 24, 49, 117, 49, 151, 202, 79, 191, 38, 50, 136, 190, 207, 162, 119, 191, 109, 2, 63, 0, 58, 203, 157, 127, 234, 49, 91, 48, 52, 157, 163, 191, 136, 105, 161, 63, 238, 203, 102, 190, 109, 2, 63, 0, 55, 190, 164, 127, 145, 44, 38, 45, 102, 45, 159, 191, 38, 50, 136, 190, 194, 137, 96, 190, 109, 2, 63, 0, 61, 217, 152, 127, 64, 49, 194, 48, 0, 0, 0, 0, 38, 50, 136, 190, 5, 162, 161, 191, 43, 2, 119, 0, 118, 16, 213, 127, 189, 50, 108, 48, 74, 149, 85, 191, 136, 105, 161, 63, 210, 137, 126, 191, 43, 2, 119, 0, 116, 27, 214, 127, 88, 49, 76, 40, 151, 202, 79, 191, 38, 50, 136, 190, 207, 162, 119, 191, 43, 2, 119, 0, 119, 4, 213, 127, 234, 49, 91, 48, 135, 214, 99, 63, 136, 105, 161, 63, 105, 195, 135, 191, 43, 0, 137, 0, 239, 125, 250, 127, 119, 58, 43, 43, 181, 136, 174, 63, 136, 105, 161, 63, 72, 51, 118, 190, 109, 0, 193, 0, 207, 79, 171, 127, 9, 57, 230, 40, 141, 123, 153, 63, 136, 105, 161, 63, 252, 57, 49, 63, 125, 0, 22, 0, 3, 131, 237, 127, 181, 55, 155, 47, 195, 117, 242, 62, 136, 105, 161, 63, 219, 137, 166, 63, 81, 0, 97, 0, 254, 130, 1, 127, 223, 54, 32, 52, 212, 117, 242, 190, 136, 105, 161, 63, 210, 137, 166, 63, 0, 0, 127, 0, 242, 130, 0, 127, 231, 55, 68, 54, 141, 123, 153, 191, 136, 105, 161, 63, 248, 57, 49, 63, 175, 0, 97, 0, 230, 134, 234, 127, 39, 57, 94, 55, 181, 136, 174, 191, 136, 105, 161, 63, 79, 51, 118, 190, 131, 0, 22, 0, 246, 112, 199, 127, 128, 58, 237, 54, 137, 214, 99, 191, 127, 105, 161, 191, 105, 195, 135, 191, 147, 251, 193, 0, 8, 123, 230, 127, 232, 58, 245, 52, 137, 214, 99, 191, 136, 105, 161, 63, 105, 195, 135, 191, 147, 0, 193, 0, 2, 126, 253, 127, 98, 59, 33, 53, 0, 0, 0, 0, 136, 105, 161, 63, 252, 57, 177, 191, 213, 0, 137, 0, 251, 126, 2, 127, 98, 59, 132, 49, 99, 213, 144, 190, 152, 207, 233, 192, 153, 246, 70, 63, 0, 240, 125, 0, 145, 197, 249, 129, 253, 56, 236, 51, 0, 0, 0, 0, 57, 97, 139, 192, 143, 254, 157, 191, 213, 251, 137, 0, 119, 246, 214, 129, 66, 57, 9, 52, 24, 152, 155, 63, 57, 97, 139, 192, 195, 123, 91, 190, 109, 251, 193, 0, 194, 18, 147, 127, 64, 57, 182, 51, 191, 211, 136, 63, 57, 97, 139, 192, 145, 254, 29, 63, 124, 251, 22, 0, 22, 11, 132, 127, 49, 57, 166, 51, 26, 29, 75, 63, 57, 97, 139, 192, 187, 15, 114, 191, 43, 251, 137, 0, 139, 17, 213, 127, 75, 57, 230, 51, 33, 38, 216, 62, 57, 97, 139, 192, 87, 119, 148, 63, 81, 251, 97, 0, 170, 193, 68, 127, 38, 57, 177, 51, 212, 117, 242, 190, 127, 105, 161, 191, 210, 137, 166, 63, 0, 251, 126, 0, 219, 135, 251, 127, 54, 56, 153, 53, 191, 211, 136, 191, 57, 97, 139, 192, 141, 254, 29, 63, 175, 251, 97, 0, 160, 245, 175, 127, 32, 57, 240, 51, 24, 152, 155, 191, 57, 97, 139, 192, 195, 123, 91, 190, 132, 251, 22, 0, 235, 245, 132, 127, 39, 57, 6, 52, 84, 25, 8, 191, 152, 207, 233, 192, 66, 50, 34, 191, 147, 240, 194, 0, 192, 16, 107, 129, 246, 56, 226, 51, 83, 25, 8, 63, 152, 207, 233, 192, 70, 50, 34, 191, 43, 240, 138, 0, 43, 119, 0, 129, 235, 56, 2, 52, 89, 213, 144, 62, 152, 207, 233, 192, 155, 246, 70, 63, 80, 240, 96, 0, 162, 19, 82, 129, 249, 56, 239, 51, 255, 131, 80, 191, 152, 207, 233, 192, 85, 17, 19, 190, 132, 240, 21, 0, 229, 65, 151, 127, 252, 56, 225, 51, 151, 93, 55, 63, 152, 207, 233, 192, 122, 187, 211, 62, 124, 240, 21, 0, 237, 19, 124, 129, 243, 56, 237, 51, 149, 93, 55, 191, 152, 207, 233, 192, 115, 187, 211, 62, 176, 240, 96, 0, 215, 119, 242, 127, 254, 56, 230, 51, 0, 0, 0, 0, 57, 97, 139, 192, 143, 254, 157, 191, 213, 240, 138, 0, 75, 94, 216, 127, 66, 57, 9, 52, 1, 132, 80, 63, 152, 207, 233, 192, 78, 17, 19, 190, 109, 240, 194, 0, 249, 119, 213, 127, 238, 56, 235, 51, 89, 213, 144, 62, 148, 145, 6, 193, 155, 246, 70, 63, 81, 0, 97, 0, 53, 105, 211, 127, 224, 56, 1, 52, 255, 131, 80, 191, 148, 145, 6, 193, 85, 17, 19, 190, 131, 0, 22, 0, 253, 124, 234, 127, 224, 56, 220, 51, 151, 93, 55, 63, 148, 145, 6, 193, 122, 187, 211, 62, 125, 0, 22, 0, 237, 202, 113, 129, 213, 56, 9, 52, 149, 93, 55, 191, 148, 145, 6, 193, 115, 187, 211, 62, 175, 0, 97, 0, 8, 126, 7, 127, 229, 56, 232, 51, 0, 0, 0, 0, 148, 145, 6, 193, 122, 187, 83, 191, 213, 0, 137, 0, 138, 11, 43, 129, 187, 56, 212, 51, 1, 132, 80, 63, 148, 145, 6, 193, 78, 17, 19, 190, 109, 0, 193, 0, 43, 92, 75, 129, 188, 56, 14, 52, 99, 213, 144, 190, 148, 145, 6, 193, 153, 246, 70, 63, 0, 0, 127, 0, 37, 121, 0, 127, 229, 56, 245, 51, 84, 25, 8, 191, 148, 145, 6, 193, 66, 50, 34, 191, 147, 0, 193, 0, 40, 98, 187, 127, 212, 56, 211, 51, 83, 25, 8, 63, 148, 145, 6, 193, 70, 50, 34, 191, 43, 0, 137, 0, 252, 126, 255, 129, 140, 56, 0, 52, 149, 202, 79, 63, 38, 50, 136, 190, 210, 162, 119, 191, 213, 2, 119, 0, 91, 82, 31, 127, 85, 51, 239, 48, 61, 157, 163, 63, 136, 105, 161, 63, 238, 203, 102, 190, 147, 2, 63, 0, 245, 123, 230, 127, 142, 53, 225, 50, 110, 250, 139, 63, 38, 50, 136, 190, 9, 162, 33, 63, 131, 2, 234, 0, 21, 42, 139, 127, 238, 50, 61, 50, 79, 74, 227, 62, 136, 105, 161, 63, 105, 30, 156, 63, 175, 2, 159, 0, 94, 32, 178, 127, 82, 49, 214, 52, 96, 74, 227, 190, 136, 105, 161, 63, 105, 30, 156, 63, 0, 2, 130, 0, 78, 157, 254, 127, 139, 44, 21, 52, 59, 225, 143, 191, 136, 105, 161, 63, 91, 35, 38, 63, 81, 2, 159, 0, 0, 130, 254, 127, 93, 40, 97, 49, 52, 157, 163, 191, 136, 105, 161, 63, 238, 203, 102, 190, 125, 2, 234, 0, 250, 141, 205, 127, 145, 44, 38, 45, 74, 149, 85, 191, 136, 105, 161, 63, 210, 137, 126, 191, 109, 2, 63, 0, 51, 178, 171, 127, 88, 49, 76, 40, 0, 0, 0, 0, 136, 105, 161, 63, 91, 35, 166, 191, 43, 2, 119, 0, 113, 38, 214, 127, 107, 52, 97, 42 ),
"array_index_data": PoolByteArray( 0, 0, 2, 0, 1, 0, 3, 0, 5, 0, 4, 0, 6, 0, 8, 0, 7, 0, 9, 0, 11, 0, 10, 0, 12, 0, 14, 0, 13, 0, 15, 0, 17, 0, 16, 0, 18, 0, 20, 0, 19, 0, 21, 0, 23, 0, 22, 0, 24, 0, 26, 0, 25, 0, 27, 0, 29, 0, 28, 0, 30, 0, 32, 0, 31, 0, 33, 0, 35, 0, 34, 0, 34, 0, 35, 0, 36, 0, 36, 0, 35, 0, 37, 0, 37, 0, 35, 0, 38, 0, 38, 0, 35, 0, 39, 0, 39, 0, 35, 0, 40, 0, 40, 0, 35, 0, 41, 0, 41, 0, 35, 0, 42, 0, 42, 0, 35, 0, 33, 0, 43, 0, 45, 0, 44, 0, 46, 0, 48, 0, 47, 0, 49, 0, 51, 0, 50, 0, 52, 0, 54, 0, 53, 0, 55, 0, 57, 0, 56, 0, 58, 0, 60, 0, 59, 0, 61, 0, 63, 0, 62, 0, 64, 0, 66, 0, 65, 0, 67, 0, 69, 0, 68, 0, 70, 0, 72, 0, 71, 0, 73, 0, 75, 0, 74, 0, 76, 0, 78, 0, 77, 0, 79, 0, 81, 0, 80, 0, 82, 0, 84, 0, 83, 0, 85, 0, 87, 0, 86, 0, 88, 0, 90, 0, 89, 0, 91, 0, 93, 0, 92, 0, 94, 0, 96, 0, 95, 0, 97, 0, 99, 0, 98, 0, 100, 0, 102, 0, 101, 0, 103, 0, 105, 0, 104, 0, 106, 0, 108, 0, 107, 0, 109, 0, 111, 0, 110, 0, 112, 0, 114, 0, 113, 0, 115, 0, 117, 0, 116, 0, 118, 0, 120, 0, 119, 0, 119, 0, 120, 0, 121, 0, 121, 0, 120, 0, 122, 0, 122, 0, 120, 0, 123, 0, 123, 0, 120, 0, 124, 0, 124, 0, 120, 0, 125, 0, 125, 0, 120, 0, 126, 0, 126, 0, 120, 0, 127, 0, 127, 0, 120, 0, 118, 0, 128, 0, 130, 0, 129, 0, 131, 0, 128, 0, 132, 0, 133, 0, 131, 0, 134, 0, 135, 0, 133, 0, 136, 0, 137, 0, 135, 0, 138, 0, 139, 0, 137, 0, 140, 0, 141, 0, 139, 0, 142, 0, 143, 0, 141, 0, 144, 0, 130, 0, 143, 0, 145, 0, 146, 0, 148, 0, 147, 0, 149, 0, 151, 0, 150, 0, 152, 0, 154, 0, 153, 0, 155, 0, 157, 0, 156, 0, 158, 0, 160, 0, 159, 0, 161, 0, 163, 0, 162, 0, 164, 0, 166, 0, 165, 0, 167, 0, 169, 0, 168, 0, 170, 0, 172, 0, 171, 0, 0, 0, 1, 0, 173, 0, 3, 0, 4, 0, 174, 0, 6, 0, 7, 0, 175, 0, 9, 0, 10, 0, 176, 0, 12, 0, 13, 0, 177, 0, 15, 0, 16, 0, 178, 0, 18, 0, 19, 0, 179, 0, 21, 0, 22, 0, 180, 0, 24, 0, 25, 0, 181, 0, 27, 0, 28, 0, 182, 0, 30, 0, 31, 0, 183, 0, 43, 0, 44, 0, 184, 0, 46, 0, 47, 0, 185, 0, 49, 0, 50, 0, 186, 0, 52, 0, 53, 0, 187, 0, 55, 0, 56, 0, 188, 0, 58, 0, 59, 0, 189, 0, 61, 0, 62, 0, 190, 0, 64, 0, 65, 0, 191, 0, 67, 0, 68, 0, 192, 0, 70, 0, 71, 0, 193, 0, 73, 0, 74, 0, 194, 0, 76, 0, 77, 0, 195, 0, 79, 0, 80, 0, 196, 0, 82, 0, 83, 0, 197, 0, 85, 0, 86, 0, 198, 0, 88, 0, 89, 0, 199, 0, 91, 0, 92, 0, 200, 0, 94, 0, 95, 0, 201, 0, 97, 0, 98, 0, 202, 0, 100, 0, 101, 0, 203, 0, 103, 0, 104, 0, 204, 0, 106, 0, 107, 0, 205, 0, 109, 0, 110, 0, 206, 0, 112, 0, 113, 0, 207, 0, 115, 0, 116, 0, 208, 0, 128, 0, 129, 0, 132, 0, 131, 0, 132, 0, 134, 0, 133, 0, 134, 0, 136, 0, 135, 0, 136, 0, 138, 0, 137, 0, 138, 0, 140, 0, 139, 0, 140, 0, 142, 0, 141, 0, 142, 0, 144, 0, 143, 0, 144, 0, 145, 0, 130, 0, 145, 0, 129, 0, 146, 0, 147, 0, 209, 0, 149, 0, 150, 0, 210, 0, 152, 0, 153, 0, 211, 0, 155, 0, 156, 0, 212, 0, 158, 0, 159, 0, 213, 0, 161, 0, 162, 0, 214, 0, 164, 0, 165, 0, 215, 0, 167, 0, 168, 0, 216, 0, 170, 0, 171, 0, 217, 0 ),
"blend_shape_data": [  ],
"format": 97559,
"index_count": 378,
"material": ExtResource( 2 ),
"name": "Material.001",
"primitive": 4,
"skeleton_aabb": [  ],
"vertex_count": 218
}

[sub_resource type="SpatialMaterial" id=2]
albedo_texture = ExtResource( 1 )

[node name="queso" type="Spatial"]

[node name="Cylinder" type="MeshInstance" parent="."]
transform = Transform( 1, 0, 0, 0, 0.115128, 1.62921e-07, 0, -1.87568e-08, 1, 0, 1.50188, 0 )
mesh = SubResource( 1 )
material/0 = SubResource( 2 )
