[gd_scene load_steps=5 format=2]

[ext_resource path="res://Assets/meshes/Material_008.material" type="Material" id=1]
[ext_resource path="res://Assets/materials/LowGreenAppleUV.png" type="Texture" id=2]

[sub_resource type="ArrayMesh" id=1]
resource_name = "Sphere.001"
surfaces/0 = {
"aabb": AABB( -1.0283, -1.12709, -1.083, 2.05995, 2.55771, 2.16596 ),
"array_data": PoolByteArray( 253, 171, 219, 58, 157, 133, 41, 191, 250, 26, 112, 191, 30, 175, 164, 0, 171, 174, 44, 127, 102, 52, 26, 57, 80, 209, 163, 62, 151, 201, 142, 191, 71, 78, 224, 190, 30, 175, 164, 0, 167, 176, 41, 127, 169, 52, 198, 57, 253, 171, 219, 58, 151, 201, 142, 191, 148, 160, 10, 191, 30, 175, 164, 0, 158, 183, 32, 127, 11, 53, 139, 57, 253, 171, 219, 58, 115, 138, 19, 63, 248, 26, 112, 191, 38, 27, 139, 0, 177, 169, 210, 127, 97, 55, 91, 53, 121, 99, 35, 63, 79, 217, 47, 189, 215, 76, 96, 191, 38, 27, 139, 0, 178, 168, 210, 127, 12, 55, 160, 55, 249, 169, 219, 58, 79, 217, 47, 189, 216, 159, 138, 191, 38, 27, 139, 0, 199, 152, 213, 127, 100, 56, 38, 54, 249, 169, 219, 58, 118, 204, 102, 63, 148, 160, 10, 191, 253, 126, 10, 0, 184, 6, 152, 127, 133, 54, 211, 52, 249, 169, 219, 58, 72, 78, 91, 63, 86, 179, 182, 183, 253, 126, 10, 0, 184, 6, 152, 127, 165, 53, 54, 52, 80, 209, 163, 62, 118, 204, 102, 63, 71, 78, 224, 190, 253, 126, 10, 0, 184, 6, 152, 127, 254, 53, 58, 53, 192, 205, 196, 188, 149, 68, 144, 191, 222, 111, 153, 60, 1, 130, 254, 0, 149, 254, 67, 127, 158, 53, 245, 57, 253, 171, 219, 58, 151, 201, 142, 191, 148, 160, 10, 191, 0, 130, 254, 0, 149, 254, 67, 127, 11, 53, 139, 57, 80, 209, 163, 62, 151, 201, 142, 191, 71, 78, 224, 190, 1, 130, 254, 0, 149, 254, 67, 127, 169, 52, 198, 57, 253, 171, 219, 58, 157, 133, 41, 191, 250, 26, 112, 191, 38, 229, 139, 0, 190, 148, 3, 127, 102, 52, 26, 57, 121, 99, 35, 63, 79, 217, 47, 189, 215, 76, 96, 191, 38, 229, 139, 0, 190, 148, 3, 127, 39, 48, 99, 57, 96, 142, 13, 63, 157, 133, 41, 191, 24, 64, 66, 191, 38, 229, 139, 0, 198, 144, 7, 127, 61, 51, 155, 57, 253, 171, 219, 58, 115, 138, 19, 63, 248, 26, 112, 191, 25, 96, 178, 0, 186, 201, 166, 127, 97, 55, 91, 53, 80, 209, 163, 62, 118, 204, 102, 63, 71, 78, 224, 190, 25, 96, 178, 0, 186, 201, 166, 127, 254, 53, 58, 53, 96, 142, 13, 63, 115, 138, 19, 63, 26, 64, 66, 191, 25, 96, 178, 0, 187, 201, 166, 127, 96, 54, 40, 54, 29, 68, 4, 63, 151, 201, 142, 191, 76, 94, 43, 190, 2, 130, 255, 0, 149, 254, 67, 127, 158, 52, 19, 58, 96, 142, 13, 63, 157, 133, 41, 191, 24, 64, 66, 191, 100, 229, 184, 0, 240, 133, 24, 127, 61, 51, 155, 57, 53, 13, 132, 63, 63, 217, 47, 189, 99, 91, 171, 190, 100, 229, 184, 0, 240, 133, 24, 127, 39, 48, 133, 58, 8, 199, 100, 63, 157, 133, 41, 191, 168, 102, 148, 190, 100, 229, 184, 0, 1, 139, 47, 127, 42, 51, 62, 58, 80, 209, 163, 62, 118, 204, 102, 63, 71, 78, 224, 190, 67, 96, 208, 0, 185, 253, 152, 127, 254, 53, 58, 53, 8, 199, 100, 63, 115, 138, 19, 63, 171, 102, 148, 190, 67, 96, 208, 0, 185, 253, 152, 127, 23, 53, 55, 54, 96, 142, 13, 63, 115, 138, 19, 63, 26, 64, 66, 191, 67, 96, 208, 0, 186, 252, 151, 127, 96, 54, 40, 54, 96, 142, 13, 63, 157, 133, 41, 191, 24, 64, 66, 191, 78, 175, 199, 0, 191, 159, 47, 127, 61, 51, 155, 57, 29, 68, 4, 63, 151, 201, 142, 191, 76, 94, 43, 190, 78, 175, 199, 0, 189, 159, 44, 127, 158, 52, 19, 58, 80, 209, 163, 62, 151, 201, 142, 191, 71, 78, 224, 190, 78, 175, 199, 0, 183, 159, 36, 127, 169, 52, 198, 57, 96, 142, 13, 63, 115, 138, 19, 63, 26, 64, 66, 191, 100, 27, 184, 0, 184, 247, 153, 127, 96, 54, 40, 54, 53, 13, 132, 63, 63, 217, 47, 189, 99, 91, 171, 190, 100, 27, 184, 0, 184, 247, 153, 127, 198, 52, 205, 55, 121, 99, 35, 63, 79, 217, 47, 189, 215, 76, 96, 191, 100, 27, 184, 0, 185, 243, 153, 127, 12, 55, 160, 55, 80, 209, 163, 62, 118, 204, 102, 63, 71, 78, 224, 190, 248, 126, 6, 0, 184, 0, 152, 127, 254, 53, 58, 53, 249, 169, 219, 58, 72, 78, 91, 63, 86, 179, 182, 183, 248, 126, 6, 0, 184, 0, 152, 127, 165, 53, 54, 52, 29, 68, 4, 63, 118, 204, 102, 63, 62, 94, 43, 190, 248, 126, 6, 0, 184, 0, 152, 127, 85, 53, 61, 53, 192, 205, 196, 188, 149, 68, 144, 191, 222, 111, 153, 60, 2, 130, 0, 0, 149, 255, 67, 127, 158, 53, 245, 57, 29, 68, 4, 63, 151, 201, 142, 191, 76, 94, 43, 190, 2, 130, 0, 0, 149, 254, 67, 127, 158, 52, 19, 58, 29, 68, 4, 63, 151, 201, 142, 191, 195, 82, 43, 62, 2, 130, 1, 0, 149, 255, 67, 127, 240, 52, 84, 58, 53, 13, 132, 63, 63, 217, 47, 189, 99, 91, 171, 190, 123, 229, 0, 0, 233, 151, 67, 127, 39, 48, 133, 58, 8, 199, 100, 63, 157, 133, 41, 191, 234, 96, 148, 62, 123, 229, 0, 0, 233, 151, 67, 127, 77, 52, 197, 58, 8, 199, 100, 63, 157, 133, 41, 191, 168, 102, 148, 190, 123, 229, 0, 0, 232, 148, 61, 127, 42, 51, 62, 58, 29, 68, 4, 63, 118, 204, 102, 63, 62, 94, 43, 190, 82, 96, 0, 0, 200, 48, 154, 127, 85, 53, 61, 53, 8, 199, 100, 63, 115, 138, 19, 63, 234, 96, 148, 62, 82, 96, 0, 0, 200, 48, 154, 127, 5, 52, 130, 53, 8, 199, 100, 63, 115, 138, 19, 63, 171, 102, 148, 190, 82, 96, 0, 0, 200, 49, 154, 127, 23, 53, 55, 54, 8, 199, 100, 63, 157, 133, 41, 191, 168, 102, 148, 190, 97, 175, 0, 0, 187, 173, 66, 127, 42, 51, 62, 58, 29, 68, 4, 63, 151, 201, 142, 191, 195, 82, 43, 62, 97, 175, 0, 0, 187, 173, 65, 127, 240, 52, 84, 58, 29, 68, 4, 63, 151, 201, 142, 191, 76, 94, 43, 190, 97, 175, 0, 0, 187, 172, 64, 127, 158, 52, 19, 58, 8, 199, 100, 63, 115, 138, 19, 63, 171, 102, 148, 190, 123, 27, 0, 0, 240, 72, 153, 127, 23, 53, 55, 54, 53, 13, 132, 63, 63, 217, 47, 189, 165, 85, 171, 62, 123, 27, 0, 0, 240, 72, 153, 127, 170, 49, 155, 54, 53, 13, 132, 63, 63, 217, 47, 189, 99, 91, 171, 190, 123, 27, 0, 0, 240, 74, 155, 127, 198, 52, 205, 55, 29, 68, 4, 63, 118, 204, 102, 63, 62, 94, 43, 190, 245, 126, 0, 0, 184, 250, 152, 127, 85, 53, 61, 53, 249, 169, 219, 58, 72, 78, 91, 63, 86, 179, 182, 183, 245, 126, 0, 0, 184, 250, 152, 127, 165, 53, 54, 52, 29, 68, 4, 63, 118, 204, 102, 63, 195, 82, 43, 62, 245, 126, 0, 0, 184, 250, 152, 127, 202, 52, 220, 52, 80, 209, 163, 62, 151, 201, 142, 191, 134, 72, 224, 62, 2, 130, 1, 0, 149, 255, 67, 127, 127, 53, 112, 58, 53, 13, 132, 63, 63, 217, 47, 189, 165, 85, 171, 62, 100, 229, 72, 0, 179, 212, 89, 127, 208, 50, 112, 59, 94, 142, 13, 63, 157, 133, 41, 191, 59, 61, 66, 63, 100, 229, 72, 0, 179, 212, 89, 127, 128, 53, 252, 58, 8, 199, 100, 63, 157, 133, 41, 191, 234, 96, 148, 62, 100, 229, 72, 0, 179, 216, 91, 127, 77, 52, 197, 58, 8, 199, 100, 63, 115, 138, 19, 63, 234, 96, 148, 62, 67, 96, 48, 0, 209, 77, 168, 127, 5, 52, 130, 53, 80, 209, 163, 62, 118, 204, 102, 63, 134, 72, 224, 62, 67, 96, 48, 0, 210, 77, 167, 127, 146, 52, 60, 52, 96, 142, 13, 63, 116, 138, 19, 63, 57, 61, 66, 63, 67, 96, 48, 0, 205, 79, 172, 127, 35, 51, 78, 52, 8, 199, 100, 63, 157, 133, 41, 191, 234, 96, 148, 62, 78, 175, 57, 0, 162, 218, 75, 127, 77, 52, 197, 58, 80, 209, 163, 62, 151, 201, 142, 191, 134, 72, 224, 62, 78, 175, 57, 0, 162, 219, 76, 127, 127, 53, 112, 58, 29, 68, 4, 63, 151, 201, 142, 191, 195, 82, 43, 62, 78, 175, 57, 0, 163, 220, 77, 127, 240, 52, 84, 58, 53, 13, 132, 63, 63, 217, 47, 189, 165, 85, 171, 62, 100, 27, 72, 0, 7, 114, 202, 127, 170, 49, 155, 54, 96, 142, 13, 63, 116, 138, 19, 63, 57, 61, 66, 63, 100, 27, 72, 0, 8, 114, 202, 127, 35, 51, 78, 52, 121, 99, 35, 63, 63, 217, 47, 189, 250, 73, 96, 63, 100, 27, 72, 0, 247, 122, 224, 127, 219, 47, 127, 52, 29, 68, 4, 63, 118, 204, 102, 63, 195, 82, 43, 62, 248, 126, 250, 0, 184, 246, 153, 127, 202, 52, 220, 52, 249, 169, 219, 58, 72, 78, 91, 63, 86, 179, 182, 183, 248, 126, 250, 0, 184, 246, 153, 127, 165, 53, 54, 52, 80, 209, 163, 62, 118, 204, 102, 63, 134, 72, 224, 62, 248, 126, 250, 0, 184, 246, 153, 127, 146, 52, 60, 52, 121, 99, 35, 63, 63, 217, 47, 189, 250, 73, 96, 63, 38, 229, 117, 0, 147, 43, 46, 127, 144, 53, 202, 59, 249, 169, 219, 58, 157, 133, 41, 191, 27, 24, 112, 63, 38, 229, 117, 0, 146, 43, 45, 127, 186, 54, 206, 58, 94, 142, 13, 63, 157, 133, 41, 191, 59, 61, 66, 63, 38, 229, 117, 0, 141, 29, 44, 127, 128, 53, 252, 58, 96, 142, 13, 63, 116, 138, 19, 63, 57, 61, 66, 63, 25, 96, 78, 0, 201, 80, 176, 127, 35, 51, 78, 52, 0, 174, 219, 58, 118, 204, 102, 63, 181, 157, 10, 63, 25, 96, 78, 0, 202, 81, 175, 127, 196, 52, 52, 51, 0, 174, 219, 58, 116, 138, 19, 63, 25, 24, 112, 63, 25, 96, 78, 0, 198, 80, 178, 127, 210, 51, 35, 50, 94, 142, 13, 63, 157, 133, 41, 191, 59, 61, 66, 63, 30, 175, 92, 0, 150, 31, 61, 127, 128, 53, 252, 58, 0, 174, 219, 58, 151, 201, 142, 191, 181, 157, 10, 63, 30, 175, 92, 0, 149, 29, 60, 127, 20, 54, 93, 58, 80, 209, 163, 62, 151, 201, 142, 191, 134, 72, 224, 62, 30, 175, 92, 0, 145, 23, 56, 127, 127, 53, 112, 58, 121, 99, 35, 63, 63, 217, 47, 189, 250, 73, 96, 63, 38, 27, 117, 0, 233, 122, 235, 127, 219, 47, 127, 52, 0, 174, 219, 58, 116, 138, 19, 63, 25, 24, 112, 63, 38, 27, 117, 0, 234, 123, 235, 127, 210, 51, 35, 50, 253, 171, 219, 58, 63, 217, 47, 189, 111, 158, 138, 63, 38, 27, 117, 0, 213, 118, 243, 127, 1, 49, 143, 48, 80, 209, 163, 62, 118, 204, 102, 63, 134, 72, 224, 62, 253, 126, 246, 0, 184, 246, 153, 127, 146, 52, 60, 52, 249, 169, 219, 58, 72, 78, 91, 63, 86, 179, 182, 183, 253, 126, 246, 0, 184, 246, 153, 127, 165, 53, 54, 52, 0, 174, 219, 58, 118, 204, 102, 63, 181, 157, 10, 63, 253, 126, 246, 0, 184, 246, 153, 127, 196, 52, 52, 51, 192, 205, 196, 188, 149, 68, 144, 191, 222, 111, 153, 60, 0, 130, 2, 0, 149, 1, 67, 127, 158, 53, 245, 57, 80, 209, 163, 62, 151, 201, 142, 191, 134, 72, 224, 62, 0, 130, 2, 0, 149, 0, 67, 127, 127, 53, 112, 58, 0, 174, 219, 58, 151, 201, 142, 191, 181, 157, 10, 63, 0, 130, 2, 0, 149, 2, 67, 127, 20, 54, 93, 58, 0, 174, 219, 58, 118, 204, 102, 63, 181, 157, 10, 63, 231, 96, 78, 0, 185, 54, 167, 127, 196, 52, 52, 51, 177, 178, 12, 191, 116, 138, 19, 63, 57, 61, 66, 63, 231, 96, 78, 0, 186, 55, 166, 127, 234, 52, 137, 48, 0, 174, 219, 58, 116, 138, 19, 63, 25, 24, 112, 63, 231, 96, 78, 0, 191, 58, 164, 127, 210, 51, 35, 50, 249, 169, 219, 58, 157, 133, 41, 191, 27, 24, 112, 63, 226, 175, 92, 0, 171, 82, 44, 127, 186, 54, 206, 58, 242, 25, 162, 190, 151, 201, 142, 191, 137, 72, 224, 62, 226, 175, 92, 0, 167, 80, 41, 127, 119, 54, 34, 58, 0, 174, 219, 58, 151, 201, 142, 191, 181, 157, 10, 63, 226, 175, 92, 0, 158, 73, 32, 127, 20, 54, 93, 58, 253, 171, 219, 58, 63, 217, 47, 189, 111, 158, 138, 63, 218, 27, 117, 0, 178, 88, 210, 127, 1, 49, 143, 48, 177, 178, 12, 191, 116, 138, 19, 63, 57, 61, 66, 63, 218, 27, 117, 0, 178, 88, 210, 127, 234, 52, 137, 48, 204, 135, 34, 191, 63, 217, 47, 189, 252, 73, 96, 63, 218, 27, 117, 0, 178, 88, 210, 127, 61, 52, 105, 42, 0, 174, 219, 58, 118, 204, 102, 63, 181, 157, 10, 63, 3, 126, 246, 0, 184, 250, 152, 127, 196, 52, 52, 51, 249, 169, 219, 58, 72, 78, 91, 63, 86, 179, 182, 183, 3, 126, 246, 0, 184, 250, 152, 127, 165, 53, 54, 52, 242, 25, 162, 190, 118, 204, 102, 63, 134, 72, 224, 62, 3, 126, 246, 0, 184, 250, 152, 127, 75, 53, 103, 50, 242, 25, 162, 190, 151, 201, 142, 191, 137, 72, 224, 62, 0, 130, 2, 0, 149, 2, 67, 127, 119, 54, 34, 58, 249, 169, 219, 58, 157, 133, 41, 191, 27, 24, 112, 63, 218, 229, 117, 0, 190, 108, 3, 127, 186, 54, 206, 58, 204, 135, 34, 191, 63, 217, 47, 189, 252, 73, 96, 63, 218, 229, 117, 0, 190, 107, 3, 127, 134, 56, 133, 58, 178, 178, 12, 191, 157, 133, 41, 191, 57, 61, 66, 63, 218, 229, 117, 0, 198, 112, 7, 127, 129, 55, 77, 58, 178, 178, 12, 191, 157, 133, 41, 191, 57, 61, 66, 63, 178, 175, 57, 0, 191, 97, 47, 127, 129, 55, 77, 58, 111, 104, 3, 191, 151, 201, 142, 191, 202, 82, 43, 62, 178, 175, 57, 0, 189, 97, 44, 127, 129, 54, 214, 57, 242, 25, 162, 190, 151, 201, 142, 191, 137, 72, 224, 62, 178, 175, 57, 0, 183, 97, 36, 127, 119, 54, 34, 58, 177, 178, 12, 191, 116, 138, 19, 63, 57, 61, 66, 63, 156, 27, 72, 0, 184, 9, 153, 127, 234, 52, 137, 48, 94, 159, 131, 191, 63, 217, 47, 189, 169, 85, 171, 62, 156, 27, 72, 0, 184, 9, 153, 127, 131, 54, 4, 41, 204, 135, 34, 191, 63, 217, 47, 189, 252, 73, 96, 63, 156, 27, 72, 0, 185, 13, 153, 127, 61, 52, 105, 42, 242, 25, 162, 190, 118, 204, 102, 63, 134, 72, 224, 62, 8, 126, 250, 0, 184, 0, 152, 127, 75, 53, 103, 50, 249, 169, 219, 58, 72, 78, 91, 63, 86, 179, 182, 183, 8, 126, 250, 0, 184, 0, 152, 127, 165, 53, 54, 52, 110, 104, 3, 191, 118, 204, 102, 63, 202, 82, 43, 62, 8, 126, 250, 0, 184, 0, 152, 127, 244, 53, 97, 50, 192, 205, 196, 188, 149, 68, 144, 191, 222, 111, 153, 60, 254, 130, 0, 0, 149, 2, 67, 127, 158, 53, 245, 57, 242, 25, 162, 190, 151, 201, 142, 191, 137, 72, 224, 62, 254, 130, 1, 0, 149, 3, 67, 127, 119, 54, 34, 58, 111, 104, 3, 191, 151, 201, 142, 191, 202, 82, 43, 62, 254, 130, 0, 0, 149, 2, 67, 127, 129, 54, 214, 57, 178, 178, 12, 191, 157, 133, 41, 191, 57, 61, 66, 63, 156, 229, 72, 0, 240, 123, 24, 127, 129, 55, 77, 58, 94, 159, 131, 191, 63, 217, 47, 189, 169, 85, 171, 62, 156, 229, 72, 0, 240, 123, 24, 127, 134, 56, 99, 57, 89, 235, 99, 191, 157, 133, 41, 191, 231, 96, 148, 62, 156, 229, 72, 0, 1, 117, 47, 127, 139, 55, 170, 57, 177, 178, 12, 191, 116, 138, 19, 63, 57, 61, 66, 63, 189, 96, 48, 0, 185, 3, 152, 127, 234, 52, 137, 48, 110, 104, 3, 191, 118, 204, 102, 63, 202, 82, 43, 62, 189, 96, 48, 0, 185, 3, 152, 127, 244, 53, 97, 50, 89, 235, 99, 191, 115, 138, 19, 63, 234, 96, 148, 62, 189, 96, 48, 0, 186, 4, 151, 127, 50, 54, 108, 48, 89, 235, 99, 191, 157, 133, 41, 191, 231, 96, 148, 62, 159, 175, 0, 0, 187, 83, 66, 127, 139, 55, 170, 57, 111, 104, 3, 191, 151, 201, 142, 191, 62, 94, 43, 190, 159, 175, 0, 0, 187, 83, 65, 127, 47, 54, 149, 57, 111, 104, 3, 191, 151, 201, 142, 191, 202, 82, 43, 62, 159, 175, 0, 0, 187, 84, 64, 127, 129, 54, 214, 57, 89, 235, 99, 191, 115, 138, 19, 63, 234, 96, 148, 62, 133, 27, 0, 0, 240, 184, 153, 127, 50, 54, 108, 48, 94, 159, 131, 191, 63, 217, 47, 189, 99, 91, 171, 190, 133, 27, 0, 0, 240, 184, 153, 127, 58, 56, 75, 47, 94, 159, 131, 191, 63, 217, 47, 189, 169, 85, 171, 62, 133, 27, 0, 0, 240, 182, 155, 127, 131, 54, 4, 41, 110, 104, 3, 191, 118, 204, 102, 63, 202, 82, 43, 62, 11, 126, 0, 0, 184, 6, 152, 127, 244, 53, 97, 50, 249, 169, 219, 58, 72, 78, 91, 63, 86, 179, 182, 183, 11, 126, 0, 0, 184, 6, 152, 127, 165, 53, 54, 52, 111, 104, 3, 191, 118, 204, 102, 63, 62, 94, 43, 190, 11, 126, 0, 0, 184, 6, 152, 127, 127, 54, 35, 51, 111, 104, 3, 191, 151, 201, 142, 191, 62, 94, 43, 190, 253, 130, 0, 0, 149, 2, 67, 127, 47, 54, 149, 57, 89, 235, 99, 191, 157, 133, 41, 191, 231, 96, 148, 62, 133, 229, 0, 0, 234, 102, 70, 127, 139, 55, 170, 57, 94, 159, 131, 191, 63, 217, 47, 189, 99, 91, 171, 190, 133, 229, 0, 0, 233, 103, 70, 127, 184, 55, 120, 56, 89, 235, 99, 191, 157, 133, 41, 191, 171, 102, 148, 190, 133, 229, 0, 0, 238, 83, 93, 127, 211, 54, 35, 57, 89, 235, 99, 191, 115, 138, 19, 63, 234, 96, 148, 62, 174, 96, 0, 0, 200, 208, 154, 127, 50, 54, 108, 48, 111, 104, 3, 191, 118, 204, 102, 63, 62, 94, 43, 190, 174, 96, 0, 0, 200, 208, 153, 127, 127, 54, 35, 51, 89, 235, 99, 191, 115, 138, 19, 63, 168, 102, 148, 190, 174, 96, 0, 0, 198, 206, 155, 127, 68, 55, 214, 49, 89, 235, 99, 191, 157, 133, 41, 191, 171, 102, 148, 190, 178, 175, 199, 0, 162, 38, 75, 127, 211, 54, 35, 57, 249, 25, 162, 190, 151, 201, 142, 191, 71, 78, 224, 190, 178, 175, 199, 0, 162, 37, 76, 127, 160, 53, 120, 57, 111, 104, 3, 191, 151, 201, 142, 191, 62, 94, 43, 190, 178, 175, 199, 0, 163, 36, 77, 127, 47, 54, 149, 57, 89, 235, 99, 191, 115, 138, 19, 63, 168, 102, 148, 190, 156, 27, 184, 0, 3, 139, 208, 127, 68, 55, 214, 49, 204, 135, 34, 191, 79, 217, 47, 189, 214, 76, 96, 191, 156, 27, 184, 0, 3, 139, 207, 127, 169, 56, 221, 51, 94, 159, 131, 191, 63, 217, 47, 189, 99, 91, 171, 190, 156, 27, 184, 0, 11, 145, 198, 127, 58, 56, 75, 47, 111, 104, 3, 191, 118, 204, 102, 63, 62, 94, 43, 190, 8, 126, 6, 0, 184, 10, 153, 127, 127, 54, 35, 51, 249, 169, 219, 58, 72, 78, 91, 63, 86, 179, 182, 183, 8, 126, 6, 0, 184, 10, 153, 127, 165, 53, 54, 52, 245, 25, 162, 190, 118, 204, 102, 63, 67, 78, 224, 190, 8, 126, 6, 0, 184, 10, 153, 127, 183, 54, 49, 52, 192, 205, 196, 188, 149, 68, 144, 191, 222, 111, 153, 60, 255, 130, 254, 0, 149, 0, 67, 127, 158, 53, 245, 57, 111, 104, 3, 191, 151, 201, 142, 191, 62, 94, 43, 190, 254, 130, 255, 0, 149, 1, 67, 127, 47, 54, 149, 57, 249, 25, 162, 190, 151, 201, 142, 191, 71, 78, 224, 190, 254, 130, 255, 0, 149, 0, 67, 127, 160, 53, 120, 57, 89, 235, 99, 191, 157, 133, 41, 191, 171, 102, 148, 190, 156, 229, 184, 0, 179, 45, 89, 127, 211, 54, 35, 57, 204, 135, 34, 191, 79, 217, 47, 189, 214, 76, 96, 191, 156, 229, 184, 0, 179, 45, 89, 127, 144, 53, 31, 56, 177, 178, 12, 191, 157, 133, 41, 191, 26, 64, 66, 191, 156, 229, 184, 0, 179, 35, 93, 127, 159, 53, 236, 56, 89, 235, 99, 191, 115, 138, 19, 63, 168, 102, 148, 190, 189, 96, 208, 0, 209, 179, 168, 127, 68, 55, 214, 49, 245, 25, 162, 190, 118, 204, 102, 63, 67, 78, 224, 190, 189, 96, 208, 0, 210, 179, 167, 127, 183, 54, 49, 52, 177, 178, 12, 191, 115, 138, 19, 63, 24, 64, 66, 191, 189, 96, 208, 0, 205, 177, 172, 127, 184, 55, 31, 52, 177, 178, 12, 191, 157, 133, 41, 191, 26, 64, 66, 191, 226, 175, 164, 0, 150, 225, 61, 127, 159, 53, 236, 56, 253, 171, 219, 58, 151, 201, 142, 191, 148, 160, 10, 191, 226, 175, 164, 0, 149, 227, 60, 127, 11, 53, 139, 57, 249, 25, 162, 190, 151, 201, 142, 191, 71, 78, 224, 190, 226, 175, 164, 0, 145, 233, 56, 127, 160, 53, 120, 57, 177, 178, 12, 191, 115, 138, 19, 63, 24, 64, 66, 191, 218, 27, 139, 0, 222, 136, 239, 127, 184, 55, 31, 52, 249, 169, 219, 58, 79, 217, 47, 189, 216, 159, 138, 191, 218, 27, 139, 0, 223, 135, 239, 127, 100, 56, 38, 54, 204, 135, 34, 191, 79, 217, 47, 189, 214, 76, 96, 191, 218, 27, 139, 0, 250, 133, 229, 127, 169, 56, 221, 51, 245, 25, 162, 190, 118, 204, 102, 63, 67, 78, 224, 190, 3, 126, 10, 0, 184, 10, 153, 127, 183, 54, 49, 52, 249, 169, 219, 58, 72, 78, 91, 63, 86, 179, 182, 183, 3, 126, 10, 0, 184, 10, 153, 127, 165, 53, 54, 52, 249, 169, 219, 58, 118, 204, 102, 63, 148, 160, 10, 191, 3, 126, 10, 0, 184, 10, 153, 127, 133, 54, 211, 52, 253, 171, 219, 58, 151, 201, 142, 191, 148, 160, 10, 191, 0, 130, 254, 0, 149, 0, 67, 127, 11, 53, 139, 57, 177, 178, 12, 191, 157, 133, 41, 191, 26, 64, 66, 191, 218, 229, 139, 0, 146, 214, 45, 127, 159, 53, 236, 56, 249, 169, 219, 58, 79, 217, 47, 189, 216, 159, 138, 191, 218, 229, 139, 0, 146, 214, 45, 127, 209, 50, 120, 56, 253, 171, 219, 58, 157, 133, 41, 191, 250, 26, 112, 191, 218, 229, 139, 0, 143, 220, 45, 127, 102, 52, 26, 57, 177, 178, 12, 191, 115, 138, 19, 63, 24, 64, 66, 191, 231, 96, 178, 0, 201, 176, 176, 127, 184, 55, 31, 52, 249, 169, 219, 58, 118, 204, 102, 63, 148, 160, 10, 191, 231, 96, 178, 0, 202, 175, 175, 127, 133, 54, 211, 52, 253, 171, 219, 58, 115, 138, 19, 63, 248, 26, 112, 191, 231, 96, 178, 0, 198, 176, 178, 127, 97, 55, 91, 53, 127, 54, 77, 190, 27, 186, 179, 63, 111, 36, 140, 189, 61, 13, 146, 0, 156, 209, 195, 127, 149, 59, 178, 56, 158, 233, 201, 60, 117, 20, 85, 63, 253, 226, 107, 188, 61, 13, 146, 0, 156, 209, 195, 127, 79, 59, 134, 57, 253, 91, 156, 58, 119, 58, 82, 63, 123, 181, 235, 188, 61, 13, 146, 0, 156, 209, 195, 127, 149, 59, 134, 57, 154, 17, 20, 190, 142, 30, 183, 63, 207, 47, 12, 189, 122, 34, 0, 0, 0, 0, 129, 127, 79, 59, 178, 56, 158, 233, 201, 60, 117, 20, 85, 63, 191, 44, 107, 60, 122, 34, 0, 0, 0, 0, 129, 127, 8, 59, 134, 57, 158, 233, 201, 60, 117, 20, 85, 63, 253, 226, 107, 188, 122, 34, 0, 0, 0, 0, 129, 127, 79, 59, 134, 57, 158, 233, 201, 60, 117, 20, 85, 63, 191, 44, 107, 60, 61, 13, 110, 0, 100, 47, 195, 127, 8, 59, 134, 57, 127, 54, 77, 190, 27, 186, 179, 63, 168, 13, 140, 61, 61, 13, 110, 0, 100, 47, 195, 127, 193, 58, 178, 56, 253, 91, 156, 58, 119, 58, 82, 63, 60, 90, 235, 60, 61, 13, 110, 0, 100, 47, 195, 127, 193, 58, 134, 57, 253, 91, 156, 58, 119, 58, 82, 63, 60, 90, 235, 60, 201, 230, 111, 0, 100, 47, 61, 127, 193, 58, 134, 57, 178, 45, 131, 190, 176, 85, 176, 63, 63, 2, 12, 61, 201, 230, 111, 0, 100, 47, 61, 127, 122, 58, 178, 56, 219, 93, 182, 188, 116, 96, 79, 63, 127, 44, 107, 60, 201, 230, 111, 0, 100, 47, 61, 127, 122, 58, 134, 57, 178, 45, 131, 190, 176, 85, 176, 63, 63, 2, 12, 61, 139, 208, 0, 0, 0, 0, 126, 127, 122, 58, 178, 56, 219, 93, 182, 188, 116, 96, 79, 63, 253, 226, 107, 188, 139, 208, 0, 0, 0, 0, 126, 127, 51, 58, 134, 57, 219, 93, 182, 188, 116, 96, 79, 63, 127, 44, 107, 60, 139, 208, 0, 0, 0, 0, 127, 127, 122, 58, 134, 57, 178, 45, 131, 190, 176, 85, 176, 63, 207, 47, 12, 189, 201, 230, 145, 0, 156, 209, 61, 127, 51, 58, 178, 56, 253, 91, 156, 58, 119, 58, 82, 63, 123, 181, 235, 188, 201, 230, 145, 0, 156, 209, 61, 127, 236, 57, 134, 57, 219, 93, 182, 188, 116, 96, 79, 63, 253, 226, 107, 188, 201, 230, 145, 0, 156, 209, 61, 127, 51, 58, 134, 57, 154, 17, 20, 190, 142, 30, 183, 63, 207, 47, 12, 189, 202, 114, 0, 0, 114, 54, 0, 127, 170, 59, 247, 57, 127, 54, 77, 190, 27, 186, 179, 63, 111, 36, 140, 189, 202, 114, 0, 0, 114, 54, 0, 127, 28, 59, 165, 57, 127, 54, 77, 190, 27, 186, 179, 63, 70, 85, 182, 183, 202, 114, 0, 0, 114, 54, 0, 127, 28, 59, 73, 58, 178, 45, 131, 190, 176, 85, 176, 63, 207, 47, 12, 189, 202, 114, 0, 0, 114, 54, 0, 127, 142, 58, 247, 57, 178, 45, 131, 190, 176, 85, 176, 63, 63, 2, 12, 61, 202, 114, 0, 0, 114, 54, 0, 127, 142, 58, 156, 58, 127, 54, 77, 190, 27, 186, 179, 63, 168, 13, 140, 61, 202, 114, 0, 0, 114, 54, 0, 127, 28, 59, 238, 58, 154, 17, 20, 190, 142, 30, 183, 63, 63, 2, 12, 61, 202, 114, 0, 0, 114, 54, 0, 127, 170, 59, 156, 58, 253, 91, 156, 58, 119, 58, 82, 63, 123, 181, 235, 188, 54, 142, 0, 0, 114, 54, 0, 129, 113, 58, 202, 58, 158, 233, 201, 60, 117, 20, 85, 63, 253, 226, 107, 188, 54, 142, 0, 0, 114, 54, 0, 129, 219, 58, 7, 59, 253, 91, 156, 58, 119, 58, 82, 63, 68, 114, 182, 183, 54, 142, 0, 0, 114, 54, 0, 129, 113, 58, 68, 59, 158, 233, 201, 60, 117, 20, 85, 63, 191, 44, 107, 60, 54, 142, 0, 0, 114, 54, 0, 129, 219, 58, 129, 59, 253, 91, 156, 58, 119, 58, 82, 63, 60, 90, 235, 60, 54, 142, 0, 0, 114, 54, 0, 129, 113, 58, 190, 59, 219, 93, 182, 188, 116, 96, 79, 63, 127, 44, 107, 60, 54, 142, 0, 0, 114, 54, 0, 129, 8, 58, 129, 59, 219, 93, 182, 188, 116, 96, 79, 63, 253, 226, 107, 188, 54, 142, 0, 0, 114, 54, 0, 129, 8, 58, 7, 59, 96, 142, 13, 63, 157, 133, 41, 191, 24, 64, 66, 191, 30, 175, 164, 0, 178, 170, 49, 127, 61, 51, 155, 57, 96, 142, 13, 63, 115, 138, 19, 63, 26, 64, 66, 191, 38, 27, 139, 0, 159, 191, 209, 127, 96, 54, 40, 54, 249, 169, 219, 58, 79, 217, 47, 189, 216, 159, 138, 191, 38, 229, 139, 0, 183, 153, 0, 127, 209, 50, 120, 56, 249, 169, 219, 58, 118, 204, 102, 63, 148, 160, 10, 191, 25, 96, 178, 0, 185, 202, 167, 127, 133, 54, 211, 52, 121, 99, 35, 63, 79, 217, 47, 189, 215, 76, 96, 191, 100, 229, 184, 0, 224, 134, 2, 127, 39, 48, 99, 57, 29, 68, 4, 63, 118, 204, 102, 63, 62, 94, 43, 190, 67, 96, 208, 0, 183, 255, 153, 127, 85, 53, 61, 53, 8, 199, 100, 63, 157, 133, 41, 191, 168, 102, 148, 190, 78, 175, 199, 0, 195, 159, 53, 127, 42, 51, 62, 58, 8, 199, 100, 63, 115, 138, 19, 63, 171, 102, 148, 190, 100, 27, 184, 0, 183, 252, 153, 127, 23, 53, 55, 54, 53, 13, 132, 63, 63, 217, 47, 189, 165, 85, 171, 62, 123, 229, 0, 0, 234, 155, 72, 127, 208, 50, 112, 59, 29, 68, 4, 63, 118, 204, 102, 63, 195, 82, 43, 62, 82, 96, 0, 0, 201, 48, 153, 127, 202, 52, 220, 52, 8, 199, 100, 63, 157, 133, 41, 191, 234, 96, 148, 62, 97, 175, 0, 0, 187, 174, 66, 127, 77, 52, 197, 58, 8, 199, 100, 63, 115, 138, 19, 63, 234, 96, 148, 62, 123, 27, 0, 0, 241, 69, 151, 127, 5, 52, 130, 53, 121, 99, 35, 63, 63, 217, 47, 189, 250, 73, 96, 63, 100, 229, 72, 0, 179, 208, 88, 127, 144, 53, 202, 59, 29, 68, 4, 63, 118, 204, 102, 63, 195, 82, 43, 62, 67, 96, 48, 0, 216, 75, 163, 127, 202, 52, 220, 52, 94, 142, 13, 63, 157, 133, 41, 191, 59, 61, 66, 63, 78, 175, 57, 0, 162, 217, 75, 127, 128, 53, 252, 58, 8, 199, 100, 63, 115, 138, 19, 63, 234, 96, 148, 62, 100, 27, 72, 0, 27, 98, 181, 127, 5, 52, 130, 53, 253, 171, 219, 58, 63, 217, 47, 189, 111, 158, 138, 63, 38, 229, 117, 0, 153, 55, 46, 127, 183, 55, 112, 59, 80, 209, 163, 62, 118, 204, 102, 63, 134, 72, 224, 62, 25, 96, 78, 0, 207, 81, 173, 127, 146, 52, 60, 52, 249, 169, 219, 58, 157, 133, 41, 191, 27, 24, 112, 63, 30, 175, 92, 0, 153, 34, 64, 127, 186, 54, 206, 58, 96, 142, 13, 63, 116, 138, 19, 63, 57, 61, 66, 63, 38, 27, 117, 0, 0, 123, 228, 127, 35, 51, 78, 52, 242, 25, 162, 190, 118, 204, 102, 63, 134, 72, 224, 62, 231, 96, 78, 0, 178, 49, 170, 127, 75, 53, 103, 50, 178, 178, 12, 191, 157, 133, 41, 191, 57, 61, 66, 63, 226, 175, 92, 0, 178, 86, 49, 127, 129, 55, 77, 58, 0, 174, 219, 58, 116, 138, 19, 63, 25, 24, 112, 63, 218, 27, 117, 0, 178, 88, 210, 127, 210, 51, 35, 50, 253, 171, 219, 58, 63, 217, 47, 189, 111, 158, 138, 63, 218, 229, 117, 0, 183, 103, 0, 127, 183, 55, 112, 59, 89, 235, 99, 191, 157, 133, 41, 191, 231, 96, 148, 62, 178, 175, 57, 0, 195, 97, 53, 127, 139, 55, 170, 57, 89, 235, 99, 191, 115, 138, 19, 63, 234, 96, 148, 62, 156, 27, 72, 0, 183, 4, 153, 127, 50, 54, 108, 48, 204, 135, 34, 191, 63, 217, 47, 189, 252, 73, 96, 63, 156, 229, 72, 0, 224, 122, 2, 127, 134, 56, 133, 58, 242, 25, 162, 190, 118, 204, 102, 63, 134, 72, 224, 62, 189, 96, 48, 0, 183, 1, 153, 127, 75, 53, 103, 50, 89, 235, 99, 191, 157, 133, 41, 191, 171, 102, 148, 190, 159, 175, 0, 0, 187, 82, 66, 127, 211, 54, 35, 57, 89, 235, 99, 191, 115, 138, 19, 63, 168, 102, 148, 190, 133, 27, 0, 0, 241, 187, 151, 127, 68, 55, 214, 49, 94, 159, 131, 191, 63, 217, 47, 189, 169, 85, 171, 62, 133, 229, 0, 0, 231, 115, 46, 127, 134, 56, 99, 57, 110, 104, 3, 191, 118, 204, 102, 63, 202, 82, 43, 62, 174, 96, 0, 0, 203, 210, 151, 127, 244, 53, 97, 50, 177, 178, 12, 191, 157, 133, 41, 191, 26, 64, 66, 191, 178, 175, 199, 0, 162, 39, 75, 127, 159, 53, 236, 56, 177, 178, 12, 191, 115, 138, 19, 63, 24, 64, 66, 191, 156, 27, 184, 0, 250, 135, 219, 127, 184, 55, 31, 52, 94, 159, 131, 191, 63, 217, 47, 189, 99, 91, 171, 190, 156, 229, 184, 0, 180, 53, 85, 127, 184, 55, 120, 56, 111, 104, 3, 191, 118, 204, 102, 63, 62, 94, 43, 190, 189, 96, 208, 0, 216, 181, 163, 127, 127, 54, 35, 51, 253, 171, 219, 58, 157, 133, 41, 191, 250, 26, 112, 191, 226, 175, 164, 0, 153, 222, 64, 127, 102, 52, 26, 57, 253, 171, 219, 58, 115, 138, 19, 63, 248, 26, 112, 191, 218, 27, 139, 0, 194, 146, 251, 127, 97, 55, 91, 53, 204, 135, 34, 191, 79, 217, 47, 189, 214, 76, 96, 191, 218, 229, 139, 0, 149, 208, 46, 127, 144, 53, 31, 56, 245, 25, 162, 190, 118, 204, 102, 63, 67, 78, 224, 190, 231, 96, 178, 0, 207, 175, 173, 127, 183, 54, 49, 52, 154, 17, 20, 190, 142, 30, 183, 63, 207, 47, 12, 189, 61, 13, 146, 0, 156, 209, 195, 127, 79, 59, 178, 56, 154, 17, 20, 190, 142, 30, 183, 63, 63, 2, 12, 61, 122, 34, 0, 0, 0, 0, 129, 127, 8, 59, 178, 56, 154, 17, 20, 190, 142, 30, 183, 63, 63, 2, 12, 61, 61, 13, 110, 0, 100, 47, 195, 127, 8, 59, 178, 56, 127, 54, 77, 190, 27, 186, 179, 63, 168, 13, 140, 61, 201, 230, 111, 0, 100, 47, 61, 127, 193, 58, 178, 56, 178, 45, 131, 190, 176, 85, 176, 63, 207, 47, 12, 189, 139, 208, 0, 0, 0, 0, 127, 127, 51, 58, 178, 56, 127, 54, 77, 190, 27, 186, 179, 63, 111, 36, 140, 189, 201, 230, 145, 0, 156, 209, 61, 127, 236, 57, 178, 56 ),
"array_index_data": PoolByteArray( 0, 0, 2, 0, 1, 0, 3, 0, 5, 0, 4, 0, 6, 0, 8, 0, 7, 0, 9, 0, 11, 0, 10, 0, 12, 0, 14, 0, 13, 0, 15, 0, 17, 0, 16, 0, 9, 0, 18, 0, 11, 0, 19, 0, 21, 0, 20, 0, 22, 0, 24, 0, 23, 0, 25, 0, 27, 0, 26, 0, 28, 0, 30, 0, 29, 0, 31, 0, 33, 0, 32, 0, 34, 0, 36, 0, 35, 0, 37, 0, 39, 0, 38, 0, 40, 0, 42, 0, 41, 0, 43, 0, 45, 0, 44, 0, 46, 0, 48, 0, 47, 0, 49, 0, 51, 0, 50, 0, 34, 0, 52, 0, 36, 0, 53, 0, 55, 0, 54, 0, 56, 0, 58, 0, 57, 0, 59, 0, 61, 0, 60, 0, 62, 0, 64, 0, 63, 0, 65, 0, 67, 0, 66, 0, 68, 0, 70, 0, 69, 0, 71, 0, 73, 0, 72, 0, 74, 0, 76, 0, 75, 0, 77, 0, 79, 0, 78, 0, 80, 0, 82, 0, 81, 0, 83, 0, 85, 0, 84, 0, 86, 0, 88, 0, 87, 0, 89, 0, 91, 0, 90, 0, 92, 0, 94, 0, 93, 0, 95, 0, 97, 0, 96, 0, 83, 0, 98, 0, 85, 0, 99, 0, 101, 0, 100, 0, 102, 0, 104, 0, 103, 0, 105, 0, 107, 0, 106, 0, 108, 0, 110, 0, 109, 0, 111, 0, 113, 0, 112, 0, 114, 0, 116, 0, 115, 0, 117, 0, 119, 0, 118, 0, 120, 0, 122, 0, 121, 0, 123, 0, 125, 0, 124, 0, 126, 0, 128, 0, 127, 0, 111, 0, 129, 0, 113, 0, 130, 0, 132, 0, 131, 0, 133, 0, 135, 0, 134, 0, 136, 0, 138, 0, 137, 0, 139, 0, 141, 0, 140, 0, 142, 0, 144, 0, 143, 0, 145, 0, 147, 0, 146, 0, 148, 0, 150, 0, 149, 0, 151, 0, 153, 0, 152, 0, 154, 0, 156, 0, 155, 0, 157, 0, 159, 0, 158, 0, 160, 0, 162, 0, 161, 0, 145, 0, 163, 0, 147, 0, 164, 0, 166, 0, 165, 0, 167, 0, 169, 0, 168, 0, 170, 0, 172, 0, 171, 0, 173, 0, 175, 0, 174, 0, 176, 0, 178, 0, 177, 0, 179, 0, 181, 0, 180, 0, 182, 0, 184, 0, 183, 0, 185, 0, 187, 0, 186, 0, 188, 0, 190, 0, 189, 0, 189, 0, 190, 0, 191, 0, 191, 0, 190, 0, 192, 0, 192, 0, 190, 0, 193, 0, 193, 0, 190, 0, 194, 0, 194, 0, 190, 0, 188, 0, 195, 0, 197, 0, 196, 0, 196, 0, 197, 0, 198, 0, 198, 0, 197, 0, 199, 0, 199, 0, 197, 0, 200, 0, 200, 0, 197, 0, 201, 0, 201, 0, 197, 0, 195, 0, 0, 0, 1, 0, 202, 0, 3, 0, 4, 0, 203, 0, 12, 0, 13, 0, 204, 0, 15, 0, 16, 0, 205, 0, 19, 0, 20, 0, 206, 0, 22, 0, 23, 0, 207, 0, 25, 0, 26, 0, 208, 0, 28, 0, 29, 0, 209, 0, 37, 0, 38, 0, 210, 0, 40, 0, 41, 0, 211, 0, 43, 0, 44, 0, 212, 0, 46, 0, 47, 0, 213, 0, 53, 0, 54, 0, 214, 0, 56, 0, 57, 0, 215, 0, 59, 0, 60, 0, 216, 0, 62, 0, 63, 0, 217, 0, 68, 0, 69, 0, 218, 0, 71, 0, 72, 0, 219, 0, 74, 0, 75, 0, 220, 0, 77, 0, 78, 0, 221, 0, 86, 0, 87, 0, 222, 0, 89, 0, 90, 0, 223, 0, 92, 0, 93, 0, 224, 0, 99, 0, 100, 0, 225, 0, 102, 0, 103, 0, 226, 0, 105, 0, 106, 0, 227, 0, 114, 0, 115, 0, 228, 0, 117, 0, 118, 0, 229, 0, 120, 0, 121, 0, 230, 0, 123, 0, 124, 0, 231, 0, 130, 0, 131, 0, 232, 0, 133, 0, 134, 0, 233, 0, 136, 0, 137, 0, 234, 0, 139, 0, 140, 0, 235, 0, 148, 0, 149, 0, 236, 0, 151, 0, 152, 0, 237, 0, 154, 0, 155, 0, 238, 0, 157, 0, 158, 0, 239, 0, 164, 0, 165, 0, 240, 0, 167, 0, 168, 0, 241, 0, 170, 0, 171, 0, 242, 0, 173, 0, 174, 0, 243, 0, 176, 0, 177, 0, 244, 0, 179, 0, 180, 0, 245, 0, 182, 0, 183, 0, 246, 0, 185, 0, 186, 0, 247, 0 ),
"blend_shape_data": [  ],
"format": 97559,
"index_count": 372,
"material": ExtResource( 1 ),
"name": "Material.008",
"primitive": 4,
"skeleton_aabb": [  ],
"vertex_count": 248
}

[sub_resource type="SpatialMaterial" id=2]
albedo_texture = ExtResource( 2 )

[node name="apple" type="Spatial"]
transform = Transform( 2, 0, 0, 0, 2, 0, 0, 0, 2, 0, 0, 0 )

[node name="Sphere" type="MeshInstance" parent="."]
transform = Transform( 1.10664, 0, 0, 0, 1.08, 1.78183e-07, 0, -1.75954e-07, 1.09368, 0, 0.755726, 0 )
mesh = SubResource( 1 )
material/0 = SubResource( 2 )
