368, -112, 15700, -446, -362, 80; 
248, -232, 15768, -474, -390, 33; 
320, -264, 15624, -478, -408, 27; 
440, -112, 15720, -469, -378, 11; 
412, -292, 15744, -459, -380, 44; 
400, -188, 15564, -464, -375, 82; 
392, -196, 15628, -483, -385, 48; 
280, -428, 15712, -472, -381, 36; 
344, -284, 15748, -464, -387, 29; 
328, -212, 15832, -452, -360, 49; 
384, -256, 15648, -454, -376, 23; 
384, -332, 15740, -457, -410, 47; 
332, -184, 15584, -483, -403, 29; 
324, -208, 15760, -457, -389, 18; 
436, -204, 15752, -470, -395, 19; 
440, -160, 15640, -448, -347, 71; 
132, -376, 15752, -450, -368, 49; 
316, -208, 15712, -464, -423, -8; 
560, -184, 15796, -481, -388, 17; 
336, -152, 15676, -440, -379, 55; 
328, -352, 15780, -487, -348, 34; 
452, -304, 15740, -475, -400, -12; 
432, -200, 15712, -471, -366, 39; 
440, -236, 15720, -481, -363, 55; 
336, -284, 15724, -462, -383, 25; 
416, -264, 15920, -450, -387, 26; 
520, -252, 15724, -449, -368, 47; 
344, -284, 15680, -472, -354, 51; 
324, -284, 15704, -471, -401, 57; 
392, -268, 15744, -462, -389, 31; 
452, -184, 15772, -454, -425, 36; 
324, -184, 15776, -461, -324, 36; 
376, -260, 15828, -450, -409, 26; 
352, -212, 15612, -464, -405, 22; 
332, -100, 15696, -469, -394, 37; 
416, -216, 15712, -454, -395, 52; 
284, -240, 15700, -452, -381, 17; 
444, -284, 15608, -451, -374, 22; 
324, -184, 15728, -465, -363, 45; 
392, -144, 15800, -481, -367, 20; 
416, -308, 15668, -463, -395, 23; 
540, -248, 15732, -479, -361, 45; 
448, -100, 15720, -441, -379, 53; 
376, -168, 15712, -477, -404, 36; 
448, -256, 15788, -477, -364, 26; 
400, -156, 15704, -486, -393, 37; 
372, -236, 15616, -483, -355, 33; 
352, -192, 15680, -470, -430, 58; 
396, -232, 15768, -464, -352, 41; 
404, -212, 15732, -474, -382, 30; 
316, -264, 15732, -469, -362, 33; 
412, -272, 15784, -466, -396, 12; 
320, -220, 15788, -467, -403, 27; 
400, -252, 15752, -480, -378, 64; 
284, -236, 15756, -465, -376, 37; 
412, -248, 15704, -460, -376, 50; 
344, -256, 15704, -467, -409, 14; 
380, -260, 15792, -457, -404, 34; 
368, -248, 15620, -484, -401, 52; 
380, -240, 15644, -483, -381, 51; 
388, -204, 15744, -477, -405, 43; 
380, -220, 15728, -470, -388, 33; 
424, -160, 15608, -466, -421, 37; 
352, -128, 15744, -464, -369, 44; 
348, -128, 15740, -454, -382, 36; 
292, -216, 15660, -447, -385, 44; 
356, -292, 15648, -470, -366, 20; 
348, -220, 15712, -471, -418, 34; 
340, -300, 15792, -485, -386, 39; 
448, -272, 15740, -459, -389, 23; 
268, -292, 15712, -436, -360, 40; 
384, -272, 15696, -464, -406, 40; 
360, -212, 15628, -450, -357, 10; 
384, -180, 15704, -472, -385, 34; 
308, -160, 15680, -478, -371, 44; 
280, -208, 15688, -463, -422, 23; 
316, -204, 15664, -485, -391, 39; 
328, -204, 15884, -467, -387, 26; 
308, -228, 15736, -464, -358, 34; 
296, -264, 15760, -457, -396, 27; 
396, -184, 15864, -479, -374, 43; 
300, -392, 15796, -493, -408, 38; 
336, -256, 15780, -459, -397, 42; 
436, -256, 15660, -441, -389, 47; 
416, -188, 15720, -480, -349, 35; 
320, -212, 15808, -460, -365, 33; 
376, -160, 15744, -446, -393, 35; 
376, -224, 15640, -459, -341, 29; 
352, -272, 15680, -455, -391, 50; 
328, -236, 15704, -452, -371, 60; 
360, -248, 15860, -453, -404, 38; 
348, -248, 15684, -463, -371, 39; 
336, -256, 15724, -443, -392, 26; 
272, -296, 15872, -476, -371, 21; 
276, -172, 15640, -440, -387, 31; 
340, -364, 15748, -454, -366, 56; 
352, -200, 15716, -453, -372, 36; 
388, -144, 15736, -480, -386, 48; 
464, -236, 15628, -443, -397, 20; 
396, -260, 15820, -438, -389, 41; 
580.00, 132.00 ; -100.00, -428.00; 15920.00, 15564.00; 
-436.00, -493.00 ; -324.00, -430.00; 82.00, -12.00; 