@startuml

title __JSON's Class Diagram__\n

  namespace fr.cnam.foad.nfa035.badges.wallet.dao {
    namespace impl {
      namespace json {
        interface fr.cnam.foad.nfa035.badges.wallet.dao.impl.json.JSONBadgeWalletDAO {
            {abstract} + addBadge()
            {abstract} + getBadgeFromMetadata()
            {abstract} + getWalletMetadataMap()
        }
      }
    }
  }
  

  namespace fr.cnam.foad.nfa035.badges.wallet.dao {
    namespace impl {
      namespace json {
        class fr.cnam.foad.nfa035.badges.wallet.dao.impl.json.JSONBadgeWalletDAOImpl {
            {static} - LOG : Logger
            - walletDatabase : File
            + JSONBadgeWalletDAOImpl()
            + addBadge()
            + addBadge()
            + addBadge()
            + getBadge()
            + getBadgeFromMetadata()
            + getBadgeFromMetadata()
            + getWalletMetadata()
            + getWalletMetadataMap()
            - getWalletMetadata()
        }
      }
    }
  }
  

  fr.cnam.foad.nfa035.badges.wallet.dao.impl.json.JSONBadgeWalletDAOImpl .up.|> fr.cnam.foad.nfa035.badges.wallet.dao.impl.json.JSONBadgeWalletDAO


right footer


PlantUML diagram generated by SketchIt! (https://bitbucket.org/pmesmeur/sketch.it)
For more information about this tool, please contact philippe.mesmeur@gmail.com
endfooter

@enduml
