@startuml

title __BADGES-SERVICE's Class Diagram__\n

  namespace fr.cnam.foad.nfa035.badges {
    class fr.cnam.foad.nfa035.badges.BadgesServiceApplication {
    }
  }
  

  namespace fr.cnam.foad.nfa035.badges {
    namespace service {
      interface fr.cnam.foad.nfa035.badges.service.BadgesWalletRestService {
      }
    }
  }
  

  namespace fr.cnam.foad.nfa035.badges {
    namespace service {
      namespace impl {
        class fr.cnam.foad.nfa035.badges.service.impl.BadgesWalletRestServiceImpl {
        }
      }
    }
  }
  

  fr.cnam.foad.nfa035.badges.service.impl.BadgesWalletRestServiceImpl .up.|> fr.cnam.foad.nfa035.badges.service.BadgesWalletRestService
  fr.cnam.foad.nfa035.badges.service.impl.BadgesWalletRestServiceImpl o-- fr.cnam.foad.nfa035.badges.wallet.dao.impl.json.JSONBadgeWalletDAO : jsonBadgeDao


right footer


PlantUML diagram generated by SketchIt! (https://bitbucket.org/pmesmeur/sketch.it)
For more information about this tool, please contact philippe.mesmeur@gmail.com
endfooter

@enduml
