@startuml

title __GUI's Class Diagram__\n

  namespace fr.cnam.foad.nfa035.badges.gui {
    class fr.cnam.foad.nfa035.badges.gui.BadgeWalletApp {
        {static} + main()
    }
  }
  



right footer


PlantUML diagram generated by SketchIt! (https://bitbucket.org/pmesmeur/sketch.it)
For more information about this tool, please contact philippe.mesmeur@gmail.com
endfooter

@enduml
