@startuml

title __BADGES-GUI's Class Diagram__\n

  namespace fr.cnam.foad.nfa035.badges.gui {
    class fr.cnam.foad.nfa035.badges.gui.renderer.BadgeSizeCellRenderer {
    }
  }
  

  namespace fr.cnam.foad.nfa035.badges.gui {
    class fr.cnam.foad.nfa035.badges.gui.BadgeWalletGUI {
    }
  }
  

  namespace fr.cnam.foad.nfa035.badges.gui {
    class fr.cnam.foad.nfa035.badges.gui.model.BadgesModel {
    }
  }
  

  namespace fr.cnam.foad.nfa035.badges.gui {
    class fr.cnam.foad.nfa035.badges.gui.renderer.DefaultBadgeCellRenderer {
    }
  }
  

  namespace fr.cnam.foad.nfa035.badges.gui {
    class fr.cnam.foad.nfa035.badges.gui.TableModelCreator {
    }
  }
  

  fr.cnam.foad.nfa035.badges.gui.renderer.BadgeSizeCellRenderer -up-|> javax.swing.table.DefaultTableCellRenderer
  fr.cnam.foad.nfa035.badges.gui.model.BadgesModel -up-|> javax.swing.table.AbstractTableModel
  fr.cnam.foad.nfa035.badges.gui.renderer.DefaultBadgeCellRenderer -up-|> javax.swing.table.DefaultTableCellRenderer


right footer


PlantUML diagram generated by SketchIt! (https://bitbucket.org/pmesmeur/sketch.it)
For more information about this tool, please contact philippe.mesmeur@gmail.com
endfooter

@enduml
