@startuml

title __DB's Class Diagram__\n

  namespace fr.cnam.foad.nfa035.badges.fileutils.streaming.serializer {
    namespace impl {
      namespace db {
        class fr.cnam.foad.nfa035.badges.fileutils.streaming.serializer.impl.db.MetadataDeserializerDatabaseImpl {
            {static} - LOG : Logger
            - sourceOutputStream : OutputStream
            + deserialize()
            {static} + readLastLine()
        }
      }
    }
  }
  

  namespace fr.cnam.foad.nfa035.badges.fileutils.streaming.serializer {
    namespace impl {
      namespace db {
        class fr.cnam.foad.nfa035.badges.fileutils.streaming.serializer.impl.db.WalletDeserializerDirectAccessImpl {
            ~ metas : List<DigitalBadgeMetadata>
            {static} - LOG : Logger
            - sourceOutputStream : OutputStream
            + WalletDeserializerDirectAccessImpl()
            + deserialize()
            + deserialize()
            + getDeserializingStream()
            + getSourceOutputStream()
            + setSourceOutputStream()
        }
      }
    }
  }
  

  namespace fr.cnam.foad.nfa035.badges.fileutils.streaming.serializer {
    namespace impl {
      namespace db {
        class fr.cnam.foad.nfa035.badges.fileutils.streaming.serializer.impl.db.WalletSerializerDirectAccessImpl {
            + getSerializingStream()
            + getSourceInputStream()
            + serialize()
        }
      }
    }
  }
  

  fr.cnam.foad.nfa035.badges.fileutils.streaming.serializer.impl.db.MetadataDeserializerDatabaseImpl .up.|> fr.cnam.foad.nfa035.badges.fileutils.streaming.serializer.MetadataDeserializer
  fr.cnam.foad.nfa035.badges.fileutils.streaming.serializer.impl.db.WalletDeserializerDirectAccessImpl .up.|> fr.cnam.foad.nfa035.badges.fileutils.streaming.serializer.DirectAccessDatabaseDeserializer
  fr.cnam.foad.nfa035.badges.fileutils.streaming.serializer.impl.db.WalletSerializerDirectAccessImpl -up-|> fr.cnam.foad.nfa035.badges.fileutils.streaming.serializer.AbstractStreamingImageSerializer


right footer


PlantUML diagram generated by SketchIt! (https://bitbucket.org/pmesmeur/sketch.it)
For more information about this tool, please contact philippe.mesmeur@gmail.com
endfooter

@enduml
