@startuml

title __DB General Class Diagram Design__\n

 namespace fr.cnam.foad.nfa035.badges.wallet {
    namespace dao {
      namespace impl {
        class fr.cnam.foad.nfa035.badges.wallet.dao.impl.DirectAccessBadgeWalletDAOImpl {
            {static} - LOG : Logger
            - walletDatabase : File
            + DirectAccessBadgeWalletDAOImpl()
            + addBadge()
            + getBadge()
            + getBadgeFromMetadata()
            + getWalletMetadata()
        }
      }
    }
  }



  namespace fr.cnam.foad.nfa035.badges.wallet {
    namespace dao {
      interface fr.cnam.foad.nfa035.badges.wallet.dao.DirectAccessBadgeWalletDAO {
          {abstract} + getBadgeFromMetadata()
          {abstract} + getWalletMetadata()
      }
    }
  }

  fr.cnam.foad.nfa035.badges.wallet.dao.impl.DirectAccessBadgeWalletDAOImpl .up.|> fr.cnam.foad.nfa035.badges.wallet.dao.DirectAccessBadgeWalletDAO


  namespace fr.cnam.foad.nfa035.badges.wallet.model {
    class fr.cnam.foad.nfa035.badges.wallet.model.DigitalBadge {
        - badge : File
        + DigitalBadge()
        + equals()
        + getBadge()
        + getMetadata()
        + hashCode()
        + setBadge()
        + setMetadata()
        + toString()
    }
  }


  namespace fr.cnam.foad.nfa035.badges.wallet.model {
    class fr.cnam.foad.nfa035.badges.wallet.model.DigitalBadgeMetadata {
        - badgeId : int
        - imageSize : long
        - walletPosition : long
        + DigitalBadgeMetadata()
        + equals()
        + getBadgeId()
        + getImageSize()
        + getWalletPosition()
        + hashCode()
        + setBadgeId()
        + setImageSize()
        + setWalletPosition()
        + toString()
    }
  }


  fr.cnam.foad.nfa035.badges.wallet.model.DigitalBadge o-left- fr.cnam.foad.nfa035.badges.wallet.model.DigitalBadgeMetadata : metadata

  namespace fr.cnam.foad.nfa035.badges.fileutils.streaming {
    namespace media {
      namespace impl {
        class fr.cnam.foad.nfa035.badges.fileutils.streaming.media.impl.WalletFrame {
            ~ numberOfLines : long
            {static} - LOG : Logger
            - fileOutputStream : FileOutputStream
            - reader : BufferedReader
            + WalletFrame()
            + getEncodedImageInput()
            + getEncodedImageOutput()
            + getEncodedImageReader()
            + getNumberOfLines()
            + incrementLines()
        }
      }
    }
  }

  fr.cnam.foad.nfa035.badges.fileutils.streaming.media.impl.WalletFrame .up.|> fr.cnam.foad.nfa035.badges.fileutils.streaming.media.WalletFrameMedia
  fr.cnam.foad.nfa035.badges.fileutils.streaming.media.impl.WalletFrame .up.|> java.lang.AutoCloseable

  namespace fr.cnam.foad.nfa035.badges.fileutils.streaming {
    namespace media {
      interface fr.cnam.foad.nfa035.badges.fileutils.streaming.media.WalletFrameMedia {
          {abstract} + getNumberOfLines()
          {abstract} + incrementLines()
      }
    }
  }

  namespace fr.cnam.foad.nfa035.badges.fileutils.streaming {
    namespace serializer {
      namespace impl.db {
        class fr.cnam.foad.nfa035.badges.fileutils.streaming.serializer.impl.db.MetadataDeserializerDatabaseImpl {
            {static} - LOG : Logger
            - sourceOutputStream : OutputStream
            + deserialize()
            {static} + readLastLine()
        }
      }
    }
  }


  namespace fr.cnam.foad.nfa035.badges.fileutils.streaming {
    namespace serializer {
      namespace impl.db {
        class fr.cnam.foad.nfa035.badges.fileutils.streaming.serializer.impl.db.WalletDeserializerDirectAccessImpl {
            ~ metas : List<DigitalBadgeMetadata>
            {static} - LOG : Logger
            - sourceOutputStream : OutputStream
            + WalletDeserializerDirectAccessImpl()
            + deserialize()
            + deserialize()
            + getDeserializingStream()
            + getSourceOutputStream()
            + setSourceOutputStream()
        }
      }
    }
  }


  namespace fr.cnam.foad.nfa035.badges.fileutils.streaming {
    namespace serializer {
      namespace impl.db {
        class fr.cnam.foad.nfa035.badges.fileutils.streaming.serializer.impl.db.WalletSerializerDirectAccessImpl {
            + getSerializingStream()
            + getSourceInputStream()
            + serialize()
        }
      }
    }
  }


  fr.cnam.foad.nfa035.badges.fileutils.streaming.serializer.impl.db.MetadataDeserializerDatabaseImpl .up.|> fr.cnam.foad.nfa035.badges.fileutils.streaming.serializer.MetadataDeserializer
  fr.cnam.foad.nfa035.badges.fileutils.streaming.serializer.impl.db.WalletDeserializerDirectAccessImpl .up.|> fr.cnam.foad.nfa035.badges.fileutils.streaming.serializer.DirectAccessDatabaseDeserializer
  fr.cnam.foad.nfa035.badges.fileutils.streaming.serializer.DirectAccessDatabaseDeserializer -left-|> fr.cnam.foad.nfa035.badges.fileutils.streaming.serializer.DatabaseDeserializer
  fr.cnam.foad.nfa035.badges.fileutils.streaming.serializer.DatabaseDeserializer -up-|> fr.cnam.foad.nfa035.badges.fileutils.streaming.serializer.BadgeDeserializer
  fr.cnam.foad.nfa035.badges.fileutils.streaming.serializer.impl.db.WalletSerializerDirectAccessImpl -up-|> fr.cnam.foad.nfa035.badges.fileutils.streaming.serializer.AbstractStreamingImageSerializer

  namespace fr.cnam.foad.nfa035.badges.fileutils.streaming {
    namespace serializer {
      abstract class fr.cnam.foad.nfa035.badges.fileutils.streaming.serializer.AbstractStreamingImageSerializer {
          + serialize()
      }
    }
  }


  namespace fr.cnam.foad.nfa035.badges.fileutils.streaming {
    namespace serializer {
      interface fr.cnam.foad.nfa035.badges.fileutils.streaming.serializer.BadgeDeserializer {
          {abstract} + deserialize()
          {abstract} + getSourceOutputStream()
          {abstract} + setSourceOutputStream()
      }
    }
  }


  namespace fr.cnam.foad.nfa035.badges.fileutils.streaming {
    namespace serializer {
      interface fr.cnam.foad.nfa035.badges.fileutils.streaming.serializer.DatabaseDeserializer {
          {abstract} + getDeserializingStream()
      }
    }
  }


  namespace fr.cnam.foad.nfa035.badges.fileutils.streaming {
    namespace serializer {
      interface fr.cnam.foad.nfa035.badges.fileutils.streaming.serializer.DirectAccessDatabaseDeserializer {
          {abstract} + deserialize()
          {abstract} + getSourceOutputStream()
          {abstract} + setSourceOutputStream()
      }
    }
  }

  namespace fr.cnam.foad.nfa035.badges.fileutils.streaming {
    namespace serializer {
      interface fr.cnam.foad.nfa035.badges.fileutils.streaming.serializer.ImageStreamingSerializer {
          {abstract} + getSerializingStream()
          {abstract} + getSourceInputStream()
          {abstract} + serialize()
      }
    }
  }


  namespace fr.cnam.foad.nfa035.badges.fileutils.streaming {
    namespace serializer {
      interface fr.cnam.foad.nfa035.badges.fileutils.streaming.serializer.MetadataDeserializer {
          {abstract} + deserialize()
      }
    }
  }


  fr.cnam.foad.nfa035.badges.fileutils.streaming.serializer.AbstractStreamingImageSerializer .up.|> fr.cnam.foad.nfa035.badges.fileutils.streaming.serializer.ImageStreamingSerializer

  fr.cnam.foad.nfa035.badges.fileutils.streaming.serializer.impl.db.WalletDeserializerDirectAccessImpl o-- fr.cnam.foad.nfa035.badges.wallet.model.DigitalBadgeMetadata : metadata
  fr.cnam.foad.nfa035.badges.wallet.dao.impl.DirectAccessBadgeWalletDAOImpl .up.> fr.cnam.foad.nfa035.badges.fileutils.streaming.media.impl.WalletFrame


right footer


PlantUML diagram generated by SketchIt! (https://bitbucket.org/pmesmeur/sketch.it)
For more information about this tool, please contact philippe.mesmeur@gmail.com
endfooter

@enduml
