// Jest Snapshot v1, https://goo.gl/fbAQLP

exports[`Test PrivateRoutes Debe redirigir si no esta autenticado 1`] = `
<Fragment>
  <Navigate
    to="/"
  />
</Fragment>
`;

exports[`Test PublicRoutes Debe redirigir si no esta autenticado 1`] = `
<Fragment>
  <Navigate
    to="/"
  />
</Fragment>
`;
