Buchungsdatum;Partnername;Partner IBAN;Partner BIC;Partner Kontonummer;Partner Bank-Code (BLZ);Betrag;Währung;Kategorie;Buchungs-Info;Buchungsreferenz;Notiz;Highlight;Valutadatum;Virtuelle Kartennummer;Bezahlt mit;App;Zahlungsreferenz;Mandats ID;Creditor ID
31.12.2018;;;;40005190700;20111;-83,62;EUR;Privat.Leben.Nahrung;Dahoam;201111812292ALV-230859089555;;0;29.12.2018;;;;;;
31.12.2018;;;;40005190700;20111;-7,99;EUR;Privat.Medien;PLAYSTATIONNETWORK;201111812282ALV-000838287880;;0;28.12.2018;;;;;;
21.12.2018;;;;40005190700;20111;206;EUR;Business.Unterkunft;Hotel Bliss;201111812202ALV-232654564455;;0;20.12.2018;;;;;;
19.12.2018;;;;40005190700;20111;-206;EUR;Business.Unterkunft;Hotel Bliss;201111812182ALV-232618102746;;0;18.12.2018;;;;;;
19.12.2018;;;;40005190700;20111;-3,99;EUR;Privat.Medien;Prime Video*M267A7EO4;201111812182ALV-232617075435;;0;18.12.2018;;;;;;
18.12.2018;;;;40005190700;20111;-5,49;EUR;Business.Infrastruktur.Cloud;ITUNES.COM/BILL;201111812172ALV-235859121453;;0;17.12.2018;;;;;;
17.12.2018;;;;40005190700;20111;-3,99;EUR;Privat.Medien;Prime Video*M261244C4;201111812142ALV-234520091009;;0;14.12.2018;;;;;;
14.12.2018;;;;40005190700;20111;-69,65;EUR;Business.Mobilität.Zug;DB BAHN A-NR VSDGMF;201111812132ALV-232111216275;;0;13.12.2018;;;;;;
13.12.2018;;;;40005190700;20111;-9,99;EUR;Privat.Medien;DAZN.com;201111812122ALV-232456566392;;0;12.12.2018;;;;;;
12.12.2018;;;;40005190700;20111;-59,83;EUR;;SHEETMUSICPLUS.COM inkl. Fremdwährungsentgelt 0,88 Kurs 1,1348600;201111812112ALV-232228986367;;0;11.12.2018;;;;;;
12.12.2018;;;;40005190700;20111;-4,5;EUR;Business.Mobilität.Zug;DB BAHN A-NR 1OHUMG;201111812112ALV-232228957310;;0;11.12.2018;;;;;;
12.12.2018;;;;40005190700;20111;-206;EUR;Business.Unterkunft;Hotel Bliss;201111812112ALV-232212767500;;0;11.12.2018;;;;;;
11.12.2018;;;;40005190700;20111;-309;EUR;;Allgemeine Sparkasse OO B inkl. Bearbeitungsentgelt 9,00;201111812102ALV-234101610366;;0;10.12.2018;;;;;;
11.12.2018;;;;40005190700;20111;-110,28;EUR;Privat.Leben.Nahrung;EUROSPAR DANKT 3331;201111812102ALV-234100383320;;0;10.12.2018;;;;;;
11.12.2018;;;;40005190700;20111;-69,65;EUR;Business.Mobilität.Zug;DB BAHN A-NR 1RED3G;201111812102ALV-234058777889;;0;10.12.2018;;;;;;
11.12.2018;;;;40005190700;20111;-37,47;EUR;;PMR*PLATI inkl. Fremdwährungsentgelt 0,55 Kurs 74,9249729;201111812102ALV-234058350371;;0;10.12.2018;;;;;;
10.12.2018;;;;40005190700;20111;-15,6;EUR;Privat.Haus.Geräte;WEYLAND DIE NR. 1;201111812082ALV-231621484775;;0;08.12.2018;;;;;;
10.12.2018;;;;40005190700;20111;-115,77;EUR;Privat.Leben.Nahrung;Innviertler Natur-Markt;201111812082ALV-231615109330;;0;08.12.2018;;;;;;
10.12.2018;;;;40005190700;20111;-22,2;EUR;Privat.Leben.Rauchen;TABAK TRAFIK HAGER;201111812082ALV-231606189598;;0;08.12.2018;;;;;;
10.12.2018;;;;40005190700;20111;-60,61;EUR;Privat.Leben.Nahrung;Dahoam;201111812082ALV-231604815506;;0;08.12.2018;;;;;;
10.12.2018;;;;40005190700;20111;-0,99;EUR;Business.Infrastruktur.Cloud;ITUNES.COM/BILL;201111812072ALV-233211549902;;0;07.12.2018;;;;;;
10.12.2018;;;;40005190700;20111;-73,8;EUR;Privat.Haus.Geräte;WEYLAND STEINER HANDWE;201111812072ALV-233145492767;;0;07.12.2018;;;;;;
10.12.2018;;;;40005190700;20111;-112,03;EUR;Privat.Leben.Nahrung;EUROSPAR DANKT 3331;201111812072ALV-233141800831;;0;07.12.2018;;;;;;
07.12.2018;;;;40005190700;20111;-412;EUR;;Raiba Region Scharding eG inkl. Bearbeitungsentgelt 12,00;201111812062ALV-231857140837;;0;06.12.2018;;;;;;
07.12.2018;;;;40005190700;20111;-29,4;EUR;Business.Mobilität.Zug;DB BAHN A-NR WVX17R;201111812062ALV-231854589880;;0;06.12.2018;;;;;;
07.12.2018;;;;40005190700;20111;-26,06;EUR;Privat.Leben.Nahrung;BILLA 4458;201111812062ALV-231850302453;;0;06.12.2018;;;;;;
07.12.2018;;;;40005190700;20111;-22,2;EUR;Privat.Leben.Rauchen;TABAK TRAFIK HAGER;201111812062ALV-231848411227;;0;06.12.2018;;;;;;
07.12.2018;;;;40005190700;20111;-13,6;EUR;Business.Mobilität.Zug;DB ZUGVERKAUF;201111812062ALV-231840334098;;0;06.12.2018;;;;;;
06.12.2018;;;;40005191900;20111;2326,38;EUR;;Ihre Zahlung Vormonat;201111812052ALV-000718255966;;0;05.12.2018;;;;;;
06.12.2018;;;;40005190700;20111;-4;EUR;Business.Infrastruktur.Cloud;GOOGLE *GSUITE_blauwei;201111812052ALV-000057454155;;0;05.12.2018;;;;;;
05.12.2018;;;;40005190700;20111;-124,26;EUR;Business.Infrastruktur.Cloud;AWS EMEA inkl. Fremdwährungsentgelt 1,84 Kurs 1,1314327;201111812042ALV-231144077574;;0;04.12.2018;;;;;;
04.12.2018;;;;40005190700;20111;-110,34;EUR;Privat.Leben.Nahrung;EUROSPAR DANKT 3331;201111812032ALV-233407150330;;0;03.12.2018;;;;;;
04.12.2018;;;;40005190700;20111;-61,3;EUR;Privat.Leben.Nahrung;TEEROSE;201111812032ALV-233357895518;;0;03.12.2018;;;;;;
04.12.2018;;;;40005190700;20111;-240,48;EUR;Business.Infrastruktur.Cloud;GOOGLE*CLOUD 0000FF-2E;201111812032ALV-233348529598;;0;03.12.2018;;;;;;
03.12.2018;;;;40005190700;20111;-5,55;EUR;Business.Mobilität.Nahverkehr;www.rmv.de Mobiles Ticket;201111812022ALV-230020488220;;0;02.12.2018;;;;;;
03.12.2018;;;;40005190700;20111;-20,96;EUR;Business.Infrastruktur.Cloud;MSFT * E0700723IT;201111812022ALV-230017892016;;0;02.12.2018;;;;;;
03.12.2018;;;;40005190700;20111;-33,65;EUR;Business.Mobilität.Zug;DB BAHN A-NR DHDMW3;201111811302ALV-232116211518;;0;30.11.2018;;;;;;
03.12.2018;;;;40005190700;20111;-36,35;EUR;Business.Mobilität.Zug;DB BAHN A-NR N1PK1P;201111811302ALV-232106929458;;0;30.11.2018;;;;;;
03.12.2018;;;;40005190700;20111;-16,95;EUR;Business.Mobilität.Zug;DB BAHN A-NR 3WYHRM;201111811302ALV-232105015246;;0;30.11.2018;;;;;;
03.12.2018;;;;40005190700;20111;-39,6;EUR;Business.Mobilität.Zug;DB BAHN A-NR ERNHU4;201111811302ALV-232039360137;;0;30.11.2018;;;;;;
03.12.2018;;;;40005190700;20111;-35,55;EUR;Business.Mobilität.Zug;DB BAHN A-NR B7CTE4;201111811302ALV-232039349413;;0;30.11.2018;;;;;;
29.11.2018;;;;40005190700;20111;-78,6;EUR;Business.Mobilität.Zug;DB BAHN A-NR UMFK42;201111811282ALV-231952851023;;0;28.11.2018;;;;;;
26.11.2018;;;;40005190700;20111;-51,8;EUR;Privat.Leben.Nahrung;BILLA 4458;201111811252ALV-230550741976;;0;25.11.2018;;;;;;
26.11.2018;;;;40005190700;20111;-44,14;EUR;Privat.Leben.Nahrung;Dahoam;201111811252ALV-230544221762;;0;25.11.2018;;;;;;
26.11.2018;;;;40005190700;20111;-107,1;EUR;Privat.Gesundheit.Heilbehelfe;Stadtapotheke;201111811252ALV-230411452585;;0;25.11.2018;;;;;;
23.11.2018;;;;40005190700;20111;-304;EUR;Business.Unterkunft;Hotel Bliss;201111811222ALV-230854661772;;0;22.11.2018;;;;;;
23.11.2018;;;;40005190700;20111;-62,15;EUR;Business.Mobilität.Zug;DB BAHN A-NR M8A62F;201111811222ALV-230849412902;;0;22.11.2018;;;;;;
20.11.2018;;;;40005190700;20111;-71,2;EUR;Privat.Leben.Rauchen;TABAK TRAFIK HAGER;201111811192ALV-235334152827;;0;19.11.2018;;;;;;
19.11.2018;;;;40005190700;20111;-51,66;EUR;Privat.Leben.Nahrung;Innviertler Natur-Markt;201111811182ALV-230305723819;;0;18.11.2018;;;;;;
19.11.2018;;;;40005190700;20111;-3,99;EUR;Privat.Medien;Prime Video*M86KB4GF4;201111811182ALV-230243131773;;0;18.11.2018;;;;;;
19.11.2018;;;;40005190700;20111;-39,6;EUR;Business.Mobilität.Zug;DB BAHN A-NR EHMQ23;201111811162ALV-231748142710;;0;16.11.2018;;;;;;
19.11.2018;;;;40005190700;20111;-33,65;EUR;Business.Mobilität.Zug;DB BAHN A-NR 2MD8Q3;201111811162ALV-231745103465;;0;16.11.2018;;;;;;
15.11.2018;;;;40005190700;20111;-3,99;EUR;Privat.Medien;Prime Video*M88EE93C4;201111811142ALV-232133416751;;0;14.11.2018;;;;;;
14.11.2018;;;;40005190700;20111;-62,15;EUR;Business.Mobilität.Zug;DB BAHN A-NR O8NRB3;201111811132ALV-231207213217;;0;13.11.2018;;;;;;
13.11.2018;;;;40005190700;20111;-62,15;EUR;Business.Mobilität.Zug;Privat.Medien;201111811122ALV-234126304305;;0;12.11.2018;;;;;;
13.11.2018;;;;40005190700;20111;-9,99;EUR;Privat.Medien;DAZN.com;201111811122ALV-234006910837;;0;12.11.2018;;;;;;
13.11.2018;;;;40005190700;20111;-250;EUR;Business.Unterkunft;HOTEL MUENCHNER HOF;201111811122ALV-233543084581;;0;12.11.2018;;;;;;
12.11.2018;;;;40005190700;20111;-81,06;EUR;Privat.Leben.Nahrung;Innviertler Natur-Markt;201111811112ALV-230323707056;;0;11.11.2018;;;;;;
12.11.2018;;;;40005190700;20111;-43,68;EUR;Privat.Leben.Nahrung;BILLA 4458;201111811112ALV-230323704841;;0;11.11.2018;;;;;;
12.11.2018;;;;40005190700;20111;-28,21;EUR;Privat.Leben.Nahrung;Dahoam;201111811112ALV-230321579900;;0;11.11.2018;;;;;;
12.11.2018;;;;40005190700;20111;-102,59;EUR;Business.Infrastruktur.Cloud;GOOGLE *CLOUD_0000FF-2;201111811112ALV-230304633148;;0;11.11.2018;;;;;;
12.11.2018;;;;40005190700;20111;-35,28;EUR;Privat.Leben.Nahrung;BILLA 4458;201111811102ALV-230806062108;;0;10.11.2018;;;;;;
12.11.2018;;;;40005190700;20111;-0,99;EUR;Business.Infrastruktur.Cloud;ITUNES.COM/BILL;201111811102ALV-230758557007;;0;10.11.2018;;;;;;
12.11.2018;;;;40005190700;20111;-9,99;EUR;Privat.Medien;Prime Video*M86Z33FO4;201111811102ALV-230725997520;;0;10.11.2018;;;;;;
12.11.2018;;;;40005190700;20111;-33,65;EUR;Business.Mobilität.Zug;DB BAHN A-NR 63VW1O;201111811092ALV-232548475437;;0;09.11.2018;;;;;;
12.11.2018;;;;40005190700;20111;-6;EUR;Business.Mobilität.Zug;DB BAHN A-NR U2GN4L;201111811092ALV-232545500315;;0;09.11.2018;;;;;;
12.11.2018;;;;40005190700;20111;-36,35;EUR;Business.Mobilität.Zug;DB BAHN A-NR RSKTGS;201111811092ALV-232544346538;;0;09.11.2018;;;;;;
08.11.2018;;;;40005190700;20111;-120,74;EUR;Business.Infrastruktur.Cloud;AWS EMEA inkl. Fremdwährungsentgelt 1,78 Kurs 1,1389542;201111811072ALV-231409076110;;0;07.11.2018;;;;;;
08.11.2018;;;;40005190700;20111;-69,65;EUR;Business.Mobilität.Zug;DB BAHN A-NR CAFN8Z;201111811072ALV-231320952554;;0;07.11.2018;;;;;;
07.11.2018;;;;40005190700;20111;-288;EUR;Business.Unterkunft;Hotel Bliss;201111811062ALV-230524481867;;0;06.11.2018;;;;;;
06.11.2018;;;;40005191900;20111;2866,22;EUR;;Ihre Zahlung Vormonat;201111811052ALV-235903906730;;0;05.11.2018;;;;;;
05.11.2018;;;;40005190700;20111;-20,18;EUR;Business.Infrastruktur.Cloud;MSFT *<E07006V6M7>;201111811042ALV-230213926819;;0;04.11.2018;;;;;;
05.11.2018;;;;40005190700;20111;-4;EUR;Business.Infrastruktur.Cloud;GOOGLE*GSUITE BLAUWEIS;201111811022ALV-230705662424;;0;02.11.2018;;;;;;
05.11.2018;;;;40005190700;20111;-9,25;EUR;Business.Mobilität.Nahverkehr;www.rmv.de Mobiles Ticket;201111811022ALV-230555330950;;0;02.11.2018;;;;;;
31.10.2018;;;;40005190700;20111;-37,4;EUR;;AMZN Mktp DE*MT23W3BW4;201111810302ALV-231248897129;;0;30.10.2018;;;;;;
31.10.2018;;;;40005190700;20111;-14,99;EUR;Privat.Medien;Prime Video*MT19Q4HX4;201111810302ALV-231146980556;;0;30.10.2018;;;;;;
29.10.2018;;;;40005190700;20111;-226,8;EUR;Business.Unterkunft;SAVFRA HOTELBESITZ GMB;201111810262ALV-232124582439;;0;26.10.2018;;;;;;
23.10.2018;;;;40005190700;20111;-2,99;EUR;Privat.Medien;Prime Video*MT4C10A54;201111810222ALV-000025604411;;0;22.10.2018;;;;;;
23.10.2018;;;;40005190700;20111;-7,99;EUR;Privat.Medien;Prime Video*MT8HA2J04;201111810222ALV-235458153635;;0;22.10.2018;;;;;;
23.10.2018;;;;40005190700;20111;-9,99;EUR;Privat.Medien;Prime Video*MT7OA4AA4;201111810222ALV-235427256071;;0;22.10.2018;;;;;;
22.10.2018;;;;40005190700;20111;-134,49;EUR;Privat.Leben.Nahrung;Innviertler Natur-Markt;201111810212ALV-230315099815;;0;21.10.2018;;;;;;
22.10.2018;;;;40005190700;20111;-3,99;EUR;Privat.Medien;Prime Video*MT7S81TT4;201111810212ALV-230308613001;;0;21.10.2018;;;;;;
22.10.2018;;;;40005190700;20111;-58,4;EUR;Business.Mobilität.Zug;DB BAHN A-NR L9Q3WN;201111810202ALV-231247606306;;0;20.10.2018;;;;;;
22.10.2018;;;;40005190700;20111;-62,15;EUR;Business.Mobilität.Zug;DB BAHN A-NR M1NDGP;201111810202ALV-231246108615;;0;20.10.2018;;;;;;
22.10.2018;;;;40005190700;20111;-33,65;EUR;Business.Mobilität.Zug;DB BAHN A-NR HFG272;201111810192ALV-230500885086;;0;19.10.2018;;;;;;
22.10.2018;;;;40005190700;20111;-39,6;EUR;Business.Mobilität.Zug;DB BAHN A-NR 9A3MRD;201111810192ALV-230500878887;;0;19.10.2018;;;;;;
19.10.2018;;;;40005190700;20111;-78,6;EUR;Business.Mobilität.Zug;DB BAHN A-NR 9B7K4O;201111810182ALV-231050538404;;0;18.10.2018;;;;;;
19.10.2018;;;;40005190700;20111;-3,99;EUR;Privat.Medien;Prime Video;201111810182ALV-230951393091;;0;18.10.2018;;;;;;
17.10.2018;;;;40005190700;20111;-4,99;EUR;Privat.Medien;PAYPAL *EUROSPORTSA;201111810162ALV-020149686021;;0;16.10.2018;;;;;;
17.10.2018;;;;40005190700;20111;-74,1;EUR;Business.Mobilität.Zug;DB BAHN A-NR DZS694;201111810162ALV-015417104659;;0;16.10.2018;;;;;;
16.10.2018;;;;40005190700;20111;-3,99;EUR;Privat.Medien;Prime Video;201111810152ALV-232040739473;;0;15.10.2018;;;;;;
15.10.2018;;;;40005190700;20111;-3,99;EUR;Privat.Medien;Prime Video;201111810142ALV-230202758800;;0;14.10.2018;;;;;;
15.10.2018;;;;40005190700;20111;-78,6;EUR;Privat.Leben.Nahrung;Innviertler Natur-Markt;201111810142ALV-230142231863;;0;14.10.2018;;;;;;
15.10.2018;;;;40005190700;20111;-35,27;EUR;Privat.Leben.Nahrung;BILLA 4458;201111810132ALV-230616719981;;0;13.10.2018;;;;;;
15.10.2018;;;;40005190700;20111;-60,66;EUR;Privat.Leben.Nahrung;Dahoam;201111810132ALV-230609969382;;0;13.10.2018;;;;;;
15.10.2018;;;;40005190700;20111;-9,99;EUR;Privat.Medien;DAZN.com;201111810122ALV-231107140268;;0;12.10.2018;;;;;;
12.10.2018;;;;40005190700;20111;-412;EUR;;Allgemeine Sparkasse OO B inkl. Bearbeitungsentgelt 12,00;201111810112ALV-235454741213;;0;11.10.2018;;;;;;
12.10.2018;;;;40005190700;20111;-31,28;EUR;Privat.Leben.Nahrung;BILLA 4458;201111810112ALV-235453944943;;0;11.10.2018;;;;;;
12.10.2018;;;;40005190700;20111;-3,99;EUR;Privat.Medien;Prime Video;201111810112ALV-235331379191;;0;11.10.2018;;;;;;
12.10.2018;;;;40005190700;20111;-26,43;EUR;Privat.Leben.Hygiene;Rossmann 2987;201111810112ALV-234942866052;;0;11.10.2018;;;;;;
11.10.2018;;;;40005190700;20111;-30,61;EUR;Privat.Leben.Nahrung;BILLA 4458;201111810102ALV-230438845918;;0;10.10.2018;;;;;;
10.10.2018;;;;40005190700;20111;-22,09;EUR;Privat.Leben.Nahrung;Dahoam;201111810092ALV-230944754108;;0;09.10.2018;;;;;;
09.10.2018;;;;40005190700;20111;-84,12;EUR;Privat.Leben.Nahrung;EUROSPAR DANKT 3331;201111810082ALV-231457860488;;0;08.10.2018;;;;;;
08.10.2018;;;;40005190700;20111;-108,99;EUR;Privat.Leben.Nahrung;Dahoam;201111810072ALV-230048950447;;0;07.10.2018;;;;;;
08.10.2018;;;;40005190700;20111;-100,11;EUR;Privat.Leben.Nahrung;Innviertler Natur-Markt;201111810072ALV-230035137229;;0;07.10.2018;;;;;;
08.10.2018;;;;40005190700;20111;-0,99;EUR;Business.Infrastruktur.Cloud;ITUNES.COM/BILL;201111810072ALV-230034219496;;0;07.10.2018;;;;;;
08.10.2018;;;;40005190700;20111;-412;EUR;;Allgemeine Sparkasse OO B inkl. Bearbeitungsentgelt 12,00;201111810062ALV-230421231902;;0;06.10.2018;;;;;;
08.10.2018;;;;40005190700;20111;-48,13;EUR;Privat.Leben.Nahrung;BILLA 4458;201111810062ALV-230843731036;;0;06.10.2018;;;;;;
08.10.2018;;;;40005190700;20111;-42,76;EUR;Privat.Leben.Nahrung;BILLA 4458;201111810062ALV-230840213796;;0;06.10.2018;;;;;;
08.10.2018;;;;40005190700;20111;-12,99;EUR;Privat.Medien;Prime Video;201111810062ALV-230510847355;;0;06.10.2018;;;;;;
08.10.2018;;;;40005191900;20111;2467,6;EUR;;Ihre Zahlung Vormonat;201111810052ALV-234519903498;;0;05.10.2018;;;;;;
08.10.2018;;;;40005190700;20111;-19,99;EUR;Privat.Medien;Prime Video;201111810052ALV-233849082272;;0;05.10.2018;;;;;;
05.10.2018;;;;40005190700;20111;-103,63;EUR;;Allgemeine Sparkasse OO B inkl. Bearbeitungsentgelt 3,63;201111810042ALV-230536761114;;0;04.10.2018;;;;;;
05.10.2018;;;;40005190700;20111;-79,06;EUR;Business.Infrastruktur.Cloud;AWS EMEA inkl. Fremdwährungsentgelt 1,17 Kurs 1,1463602;201111810042ALV-231040376169;;0;04.10.2018;;;;;;
05.10.2018;;;;40005190700;20111;-29,9;EUR;;HGV Krautergarten;201111810042ALV-230514851611;;0;04.10.2018;;;;;;
05.10.2018;;;;40005190700;20111;-8,99;EUR;Privat.Medien;Prime Video;201111810042ALV-230447106292;;0;04.10.2018;;;;;;
05.10.2018;;;;40005190700;20111;-58,8;EUR;Business.Mobilität.Zug;DB BAHN A-NR YLNQM3;201111810042ALV-230433216639;;0;04.10.2018;;;;;;
04.10.2018;;;;40005190700;20111;-88,97;EUR;Business.Infrastruktur.Cloud;GOOGLE *CLOUD_0000FF-2;201111810032ALV-230938496290;;0;03.10.2018;;;;;;
03.10.2018;;;;40005190700;20111;-20,92;EUR;Business.Infrastruktur.Cloud;MSFT *<E07006NY5U>;201111810022ALV-230929243428;;0;02.10.2018;;;;;;
03.10.2018;;;;40005190700;20111;-4;EUR;Business.Infrastruktur.Cloud;GOOGLE *GSUITE_blauwei;201111810022ALV-230926706122;;0;02.10.2018;;;;;;
03.10.2018;;;;40005190700;20111;-7,4;EUR;Business.Mobilität.Nahverkehr;www.rmv.de Mobiles Ticket;201111810022ALV-230328064900;;0;02.10.2018;;;;;;
02.10.2018;;;;40005190700;20111;-11;EUR;Business.Mobilität.Zug;DB ZUGVERKAUF;201111810012ALV-231126460971;;0;01.10.2018;;;;;;
02.10.2018;;;;40005190700;20111;-144;EUR;Business.Unterkunft;Hotel Bliss;201111810012ALV-231120859656;;0;01.10.2018;;;;;;
01.10.2018;;;;40005190700;20111;-62,15;EUR;Business.Mobilität.Zug;DB BAHN A-NR 17O3AD;201111809302ALV-230229344930;;0;30.09.2018;;;;;;
01.10.2018;;;;40005190700;20111;-78,6;EUR;Business.Mobilität.Zug;DB BAHN A-NR 7CY1DK;201111809302ALV-230228893150;;0;30.09.2018;;;;;;
01.10.2018;;;;40005190700;20111;-33,65;EUR;Business.Mobilität.Zug;DB BAHN A-NR YTQSLH;201111809282ALV-230345519260;;0;28.09.2018;;;;;;
01.10.2018;;;;40005190700;20111;-33,65;EUR;Business.Mobilität.Zug;DB BAHN A-NR OMLB8H;201111809282ALV-230342961119;;0;28.09.2018;;;;;;
01.10.2018;;;;40005190700;20111;-11,99;EUR;Privat.Medien;Prime Video;201111809282ALV-230304796902;;0;28.09.2018;;;;;;
28.09.2018;;;;40005190700;20111;-25,6;EUR;Privat.Leben.Wirtshaus;SEVEN;201111809272ALV-231002239810;;0;27.09.2018;;;;;;
26.09.2018;;;;40005190700;20111;-29,45;EUR;;AMZN MKTP DE AMAZON.DE;201111809252ALV-230831567165;;0;25.09.2018;;;;;;
26.09.2018;;;;40005190700;20111;-39,85;EUR;Privat.Leben.Nahrung;EUROSPAR DANKT 3331;201111809252ALV-230457586326;;0;25.09.2018;;;;;;
26.09.2018;;;;40005190700;20111;-39,9;EUR;;AMZN Mktp DE;201111809252ALV-230348665740;;0;25.09.2018;;;;;;
24.09.2018;;;;40005190700;20111;-13,8;EUR;Business.Mobilität.Zug;OEBB TICKET;201111809222ALV-230652831149;;0;22.09.2018;;;;;;
24.09.2018;;;;40005190700;20111;-50,6;EUR;Business.Mobilität.Zug;DB BAHN A-NR YD23Z1;201111809222ALV-230332392809;;0;22.09.2018;;;;;;
24.09.2018;;;;40005190700;20111;-6;EUR;Business.Mobilität.Zug;DB BAHN A-NR RPKRX9;201111809222ALV-230332089682;;0;22.09.2018;;;;;;
24.09.2018;;;;40005190700;20111;-13,99;EUR;Privat.Medien;Prime Video;201111809212ALV-231021022945;;0;21.09.2018;;;;;;
21.09.2018;;;;40005190700;20111;-78,6;EUR;Business.Mobilität.Zug;DB BAHN A-NR 1M6PH6;201111809202ALV-232752826282;;0;20.09.2018;;;;;;
19.09.2018;;;;40005190700;20111;-69;EUR;Privat.Medien;AMZNPRIME DE AMZN.DE/INFO;201111809182ALV-230950163420;;0;18.09.2018;;;;;;
19.09.2018;;;;40005190700;20111;-3,99;EUR;Privat.Medien;Prime Video;201111809182ALV-230500942350;;0;18.09.2018;;;;;;
18.09.2018;;;;40005190700;20111;-80,65;EUR;Business.Mobilität.Zug;DB BAHN A-NR HM4ZH4;201111809172ALV-230744806226;;0;17.09.2018;;;;;;
17.09.2018;;;;40005190700;20111;-268,92;EUR;Business.Unterkunft;LEONARDO FRANKF. C.C.;201111809142ALV-231103697175;;0;14.09.2018;;;;;;
17.09.2018;;;;40005190700;20111;-41,4;EUR;Business.Mobilität.Zug;DB BAHN A-NR Y33TB8;201111809142ALV-231033310138;;0;14.09.2018;;;;;;
17.09.2018;;;;40005190700;20111;-39,6;EUR;Business.Mobilität.Zug;DB BAHN A-NR HQQGBH;201111809142ALV-231033298230;;0;14.09.2018;;;;;;
17.09.2018;;;;40005190700;20111;-3,99;EUR;Privat.Medien;Prime Video;201111809142ALV-230415202785;;0;14.09.2018;;;;;;
14.09.2018;;;;40005190700;20111;-78,6;EUR;Business.Mobilität.Zug;DB BAHN A-NR AWLVES;201111809132ALV-231223466058;;0;13.09.2018;;;;;;
13.09.2018;;;;40005190700;20111;-441;EUR;Business.Unterkunft;SAVFRA HOTELBESITZ GMB;201111809122ALV-231121823155;;0;12.09.2018;;;;;;
13.09.2018;;;;40005190700;20111;-9,99;EUR;Privat.Medien;DAZN.com;201111809122ALV-230922888952;;0;12.09.2018;;;;;;
12.09.2018;;;;40005190700;20111;-9,96;EUR;Privat.Medien;Prime Video;201111809112ALV-231045908505;;0;11.09.2018;;;;;;
12.09.2018;;;;40005190700;20111;-14,98;EUR;Privat.Medien;Prime Video;201111809112ALV-231045604089;;0;11.09.2018;;;;;;
12.09.2018;;;;40005190700;20111;-78,6;EUR;Business.Mobilität.Zug;DB BAHN A-NR HM4934;201111809112ALV-231041647631;;0;11.09.2018;;;;;;
10.09.2018;;;;40005190700;20111;-78,8;EUR;Business.Mobilität.Zug;DB BAHN A-NR VGP77T;201111809082ALV-230657289238;;0;08.09.2018;;;;;;
07.09.2018;;;;40005190700;20111;-78,8;EUR;Business.Mobilität.Zug;DB BAHN A-NR WTZ669;201111809062ALV-230852302445;;0;06.09.2018;;;;;;
05.09.2018;;;;40005191900;20111;2342,16;EUR;;Ihre Zahlung Vormonat;201111809042ALV-231705363703;;0;04.09.2018;;;;;;
05.09.2018;;;;40005190700;20111;-80,27;EUR;Business.Infrastruktur.Cloud;AWS EMEA inkl. Fremdwährungsentgelt 1,19 Kurs 1,1583206;201111809042ALV-231147761801;;0;04.09.2018;;;;;;
05.09.2018;;;;40005190700;20111;-216;EUR;Business.Unterkunft;Hotel Bliss;201111809042ALV-231118442637;;0;04.09.2018;;;;;;
05.09.2018;;;;40005190700;20111;-23,99;EUR;Privat.Medien;Prime Video;201111809042ALV-230512130853;;0;04.09.2018;;;;;;
04.09.2018;;;;40005190700;20111;-20,88;EUR;Business.Infrastruktur.Cloud;MSFT *<E07006H876>;201111809032ALV-231015191688;;0;03.09.2018;;;;;;
04.09.2018;;;;40005190700;20111;-78,6;EUR;Business.Mobilität.Zug;DB BAHN A-NR YB8MY1;201111809032ALV-230529478041;;0;03.09.2018;;;;;;
04.09.2018;;;;40005190700;20111;-60,15;EUR;Business.Infrastruktur.Cloud;GOOGLE *CLOUD_0000FF-2;201111809032ALV-230528745506;;0;03.09.2018;;;;;;
03.09.2018;;;;40005190700;20111;-4,6;EUR;Business.Mobilität.Nahverkehr;www.rmv.de Mobiles Ticket;201111809022ALV-112642723611;;0;02.09.2018;;;;;;
03.09.2018;;;;40005190700;20111;-4;EUR;Business.Infrastruktur.Cloud;GOOGLE *GSUITE_blauwei;201111809022ALV-112638678672;;0;02.09.2018;;;;;;
03.09.2018;;;;40005190700;20111;-49,95;EUR;;Hartlauer Fil.86;201111808312ALV-094607618724;;0;31.08.2018;;;;;;
31.08.2018;;;;40005190700;20111;-78,6;EUR;Business.Mobilität.Zug;DB BAHN A-NR 4L3HRN;201111808302ALV-230949278397;;0;30.08.2018;;;;;;
29.08.2018;;;;40005190700;20111;-180;EUR;Business.Unterkunft;Hotel Bliss;201111808282ALV-231031413407;;0;28.08.2018;;;;;;
29.08.2018;;;;40005190700;20111;-74,1;EUR;Business.Mobilität.Zug;DB BAHN A-NR SL9ESU;201111808282ALV-230958922494;;0;28.08.2018;;;;;;
29.08.2018;;;;40005190700;20111;-25,99;EUR;Privat.Medien;Prime Video;201111808282ALV-230500847674;;0;28.08.2018;;;;;;
22.08.2018;;;;40005190700;20111;-2,99;EUR;Privat.Medien;Amazon Digital Video;201111808212ALV-135758638858;;0;21.08.2018;;;;;;
22.08.2018;;;;40005190700;20111;-153;EUR;Business.Unterkunft;Hotel Bliss;201111808212ALV-135441636045;;0;21.08.2018;;;;;;
20.08.2018;;;;40005190700;20111;-412;EUR;;Allgemeine Sparkasse OO B inkl. Bearbeitungsentgelt 12,00;201111808192ALV-230134933612;;0;19.08.2018;;;;;;
20.08.2018;;;;40005190700;20111;-78,6;EUR;Business.Mobilität.Zug;DB BAHN A-NR TC7GAN;201111808192ALV-230143820858;;0;19.08.2018;;;;;;
20.08.2018;;;;40005190700;20111;-44,05;EUR;Privat.Leben.Nahrung;Dahoam;201111808192ALV-230128651841;;0;19.08.2018;;;;;;
20.08.2018;;;;40005190700;20111;-65,44;EUR;Privat.Leben.Nahrung;Innviertler Natur-Markt;201111808192ALV-230123118170;;0;19.08.2018;;;;;;
20.08.2018;;;;40005190700;20111;-63,1;EUR;Privat.Leben.Nahrung;Dahoam;201111808182ALV-230309204706;;0;18.08.2018;;;;;;
20.08.2018;;;;40005190700;20111;-3,99;EUR;Privat.Medien;Amazon Digital Svcs;201111808182ALV-230300135686;;0;18.08.2018;;;;;;
20.08.2018;;;;40005190700;20111;-38,15;EUR;Business.Mobilität.Zug;DB BAHN A-NR TSOVBX;201111808172ALV-231006776030;;0;17.08.2018;;;;;;
20.08.2018;;;;40005190700;20111;-33,65;EUR;Business.Mobilität.Zug;DB BAHN A-NR G72UR6;201111808172ALV-230525403525;;0;17.08.2018;;;;;;
17.08.2018;;;;40005190700;20111;-78,6;EUR;Business.Mobilität.Zug;DB BAHN A-NR 7TZFK9;201111808162ALV-230353337654;;0;16.08.2018;;;;;;
16.08.2018;;;;40005190700;20111;-170;EUR;Business.Unterkunft;Hotel Bliss;201111808142ALV-231028623065;;0;14.08.2018;;;;;;
16.08.2018;;;;40005190700;20111;-3,99;EUR;Privat.Medien;Amazon Digital Svcs;201111808142ALV-230520463335;;0;14.08.2018;;;;;;
13.08.2018;;;;40005190700;20111;-72,4;EUR;Business.Mobilität.Zug;DB BAHN A-NR XUYC2E;201111808122ALV-230152505712;;0;12.08.2018;;;;;;
13.08.2018;;;;40005190700;20111;-9,99;EUR;Privat.Medien;DAZN.com;201111808122ALV-230146334902;;0;12.08.2018;;;;;;
13.08.2018;;;;40005190700;20111;-116,8;EUR;;Hartlauer Fil.86;201111808112ALV-230220451957;;0;11.08.2018;;;;;;
13.08.2018;;;;40005190700;20111;-14,92;EUR;Privat.Medien;Amazon Digital Video;201111808112ALV-230153869105;;0;11.08.2018;;;;;;
13.08.2018;;;;40005190700;20111;-108,9;EUR;Privat.Leben.Wirtshaus;Baumgartner Stadtwirt;201111808102ALV-230537722734;;0;10.08.2018;;;;;;
10.08.2018;;;;40005190700;20111;-86,92;EUR;Privat.Leben.Nahrung;Dahoam;201111808092ALV-231021838841;;0;09.08.2018;;;;;;
10.08.2018;;;;40005190700;20111;-28,9;EUR;Privat.Leben.Nahrung;TEEROSE;201111808092ALV-230512083847;;0;09.08.2018;;;;;;
10.08.2018;;;;40005190700;20111;-71,2;EUR;Privat.Leben.Rauchen;TABAK TRAFIK HAGER;201111808092ALV-230457758960;;0;09.08.2018;;;;;;
09.08.2018;;;;40005190700;20111;-8,25;EUR;Business.Mobilität.Nahverkehr;VGN TICKET NUERNBERG;201111808082ALV-230809480895;;0;08.08.2018;;;;;;
08.08.2018;;;;40005190700;20111;-107,6;EUR;Business.Mobilität.Zug;DB BAHN A-NR KFSMUK;201111808072ALV-231209593783;;0;07.08.2018;;;;;;
08.08.2018;;;;40005190700;20111;-68,63;EUR;Business.Infrastruktur.Cloud;AWS EMEA inkl. Fremdwährungsentgelt 1,01 Kurs 1,1527654;201111808072ALV-230729326013;;0;07.08.2018;;;;;;
07.08.2018;;;;40005191900;20111;2749,59;EUR;;Ihre Zahlung Vormonat;201111808062ALV-233309443532;;0;06.08.2018;;;;;;
06.08.2018;;;;40005190700;20111;-48,3;EUR;Business.Infrastruktur.Cloud;GOOGLE *CLOUD_0000FF-2;201111808032ALV-230521603040;;0;03.08.2018;;;;;;
03.08.2018;;;;40005190700;20111;-20,31;EUR;Business.Infrastruktur.Cloud;MSFT *<E07006A6C5>;201111808022ALV-230432666656;;0;02.08.2018;;;;;;
03.08.2018;;;;40005190700;20111;-4;EUR;Business.Infrastruktur.Cloud;GOOGLE *GSUITE_blauwei;201111808022ALV-230342916774;;0;02.08.2018;;;;;;
03.08.2018;;;;40005190700;20111;-18,45;EUR;Business.Mobilität.Nahverkehr;www.rmv.de Mobiles Ticket;201111808022ALV-230241604453;;0;02.08.2018;;;;;;
30.07.2018;;;;40005190700;20111;-393,03;EUR;Privat.Leben.Urlaub;BETRI BANKI P/F inkl. Fremdwähr./Bearb.entgelt5,64/11,45 Kurs 7,4479970;201111807282ALV-230945321072;;0;28.07.2018;;;;;;
30.07.2018;;;;40005190700;20111;-16;EUR;Privat.Leben.Urlaub;TELENORMARITIME.COM;201111807272ALV-230752190726;;0;27.07.2018;;;;;;
23.07.2018;;;;40005190700;20111;-227,06;EUR;Privat.Leben.Urlaub;AIRBNB;201111807222ALV-230025017542;;0;22.07.2018;;;;;;
23.07.2018;;;;40005190700;20111;-127,03;EUR;Privat.Leben.Urlaub;Vinbudin Austurstrati inkl. Fremdwährungsentgelt 1,88 Kurs 123,9872153;201111807222ALV-230023246893;;0;22.07.2018;;;;;;
23.07.2018;;;;40005190700;20111;-163,57;EUR;Privat.Leben.Urlaub;Blue Lagoon ISK - VEB inkl. Fremdwährungsentgelt 2,42 Kurs 123,9838659;201111807212ALV-230916140479;;0;21.07.2018;;;;;;
19.07.2018;;;;40005190700;20111;-6,15;EUR;Privat.Leben.Urlaub;Tjodgardurinn a Tingvollu inkl. Fremdwährungsentgelt 0,09 Kurs 123,7623762;201111807182ALV-230834408835;;0;18.07.2018;;;;;;
19.07.2018;;;;40005190700;20111;-1184,08;EUR;Privat.Leben.Urlaub;Bilal.Akureyrar Europcar inkl. Fremdwährungsentgelt 17,50 Kurs 123,8191979;201111807182ALV-230832239334;;0;18.07.2018;;;;;;
19.07.2018;;;;40005190700;20111;-3,99;EUR;Privat.Medien;Amazon Digital Svcs;201111807182ALV-230454817851;;0;18.07.2018;;;;;;
18.07.2018;;;;40005190700;20111;-79;EUR;Business.Unterkunft;Hotel Bliss;201111807172ALV-230723734404;;0;17.07.2018;;;;;;
17.07.2018;;;;40005190700;20111;-206;EUR;;Allgemeine Sparkasse OO B inkl. Bearbeitungsentgelt 6,00;201111807162ALV-001905800116;;0;16.07.2018;;;;;;
17.07.2018;;;;40005190700;20111;-52;EUR;Privat.Leben.Rauchen;TABAK TRAFIK HAGER;201111807162ALV-001912339946;;0;16.07.2018;;;;;;
16.07.2018;;;;40005190700;20111;-57,5;EUR;Privat.Leben.Nahrung;Innviertler Natur-Markt;201111807152ALV-230141626809;;0;15.07.2018;;;;;;
16.07.2018;;;;40005190700;20111;-37,2;EUR;Privat.Gesundheit.Heilbehelfe;Stadtapotheke;201111807152ALV-230132351814;;0;15.07.2018;;;;;;
16.07.2018;;;;40005190700;20111;-3,99;EUR;Privat.Medien;Amazon Digital Svcs;201111807142ALV-230311643639;;0;14.07.2018;;;;;;
13.07.2018;;;;40005190700;20111;-9,99;EUR;Privat.Medien;DAZN.com;201111807122ALV-230542734044;;0;12.07.2018;;;;;;
09.07.2018;;;;40005190700;20111;-66,14;EUR;Business.Infrastruktur.Cloud;Amazon web services inkl. Fremdwährungsentgelt 0,98 Kurs 1,1677409;201111807072ALV-230621864776;;0;07.07.2018;;;;;;
09.07.2018;;;;40005190700;20111;-33,65;EUR;Business.Mobilität.Zug;DB BAHN A-NR 3P2L6X;201111807062ALV-230719980521;;0;06.07.2018;;;;;;
09.07.2018;;;;40005190700;20111;-41,4;EUR;Business.Mobilität.Zug;DB BAHN A-NR 82YH16;201111807062ALV-230718476716;;0;06.07.2018;;;;;;
06.07.2018;;;;40005191900;20111;2790,6;EUR;;Ihre Zahlung Vormonat;201111807052ALV-232548501341;;0;05.07.2018;;;;;;
05.07.2018;;;;40005190700;20111;-96,4;EUR;Business.Mobilität.Zug;DB BAHN A-NR CPYY2C;201111807042ALV-230747426497;;0;04.07.2018;;;;;;
05.07.2018;;;;40005190700;20111;-61,25;EUR;Business.Infrastruktur.Cloud;GOOGLE *CLOUD_0000FF-2;201111807042ALV-230451812833;;0;04.07.2018;;;;;;
04.07.2018;;;;40005190700;20111;-135;EUR;Business.Unterkunft;Hotel Bliss;201111807032ALV-230810145253;;0;03.07.2018;;;;;;
03.07.2018;;;;40005190700;20111;-20,53;EUR;Business.Infrastruktur.Cloud;MSFT *<E070063G91>;201111807022ALV-231107614411;;0;02.07.2018;;;;;;
03.07.2018;;;;40005190700;20111;-78,6;EUR;Business.Mobilität.Zug;DB BAHN A-NR SM98YS;201111807022ALV-231049521334;;0;02.07.2018;;;;;;
03.07.2018;;;;40005190700;20111;-4;EUR;Business.Infrastruktur.Cloud;GOOGLE *SVCSAPPS_blauw;201111807022ALV-230911521712;;0;02.07.2018;;;;;;
03.07.2018;;;;40005190700;20111;-2,75;EUR;Business.Mobilität.Nahverkehr;www.rmv.de Mobiles Ticket;201111807022ALV-230821175711;;0;02.07.2018;;;;;;
02.07.2018;;;;40005190700;20111;-52,31;EUR;;HAUPTSHOP DEUTSCH;201111807012ALV-230108719279;;0;01.07.2018;;;;;;
26.06.2018;;;;40005190700;20111;-35,46;EUR;;PMR*DIGISELLER inkl. Fremdwährungsentgelt 0,52 Kurs 72,7358328;201111806252ALV-231011493240;;0;25.06.2018;;;;;;
26.06.2018;;;;40005190700;20111;-199,95;EUR;Privat.Leben.Nahrung;TEEROSE;201111806252ALV-230910297382;;0;25.06.2018;;;;;;
25.06.2018;;;;40005190700;20111;-84,3;EUR;Privat.Gesundheit.Heilbehelfe;Stadtapotheke;201111806242ALV-230301217053;;0;24.06.2018;;;;;;
19.06.2018;;;;40005190700;20111;-3,99;EUR;Privat.Medien;Amazon Digital Svcs;201111806182ALV-230900703208;;0;18.06.2018;;;;;;
18.06.2018;;;;40005190700;20111;-77,88;EUR;Privat.Leben.Nahrung;Innviertler Natur-Markt;201111806172ALV-230129153173;;0;17.06.2018;;;;;;
15.06.2018;;;;40005190700;20111;-206;EUR;;Allgemeine Sparkasse OO B inkl. Bearbeitungsentgelt 6,00;201111806142ALV-230822949786;;0;14.06.2018;;;;;;
15.06.2018;;;;40005190700;20111;-3,99;EUR;Privat.Medien;Amazon Digital Svcs;201111806142ALV-230534057151;;0;14.06.2018;;;;;;
14.06.2018;;;;40005190700;20111;138;EUR;Business.Unterkunft;Hotel on Booking.com;201111806132ALV-230756101378;;0;13.06.2018;;;;;;
13.06.2018;;;;40005190700;20111;-206;EUR;;Allgemeine Sparkasse OO B inkl. Bearbeitungsentgelt 6,00;201111806122ALV-230919741425;;0;12.06.2018;;;;;;
13.06.2018;;;;40005190700;20111;-14,84;EUR;Privat.Leben.Hygiene;Rossmann 2987;201111806122ALV-231033431065;;0;12.06.2018;;;;;;
13.06.2018;;;;40005190700;20111;-207;EUR;Business.Unterkunft;Hotel on Booking.com;201111806122ALV-230655231208;;0;12.06.2018;;;;;;
13.06.2018;;;;40005190700;20111;-9,99;EUR;Privat.Medien;DAZN.com;201111806122ALV-230650303135;;0;12.06.2018;;;;;;
12.06.2018;;;;40005190700;20111;-14,99;EUR;Privat.Medien;Amazon Digital Video;201111806112ALV-230835515811;;0;11.06.2018;;;;;;
12.06.2018;;;;40005190700;20111;-83,69;EUR;Privat.Leben.Nahrung;EUROSPAR DANKT 3331;201111806112ALV-230819267120;;0;11.06.2018;;;;;;
11.06.2018;;;;40005190700;20111;-412;EUR;;Allgemeine Sparkasse OO B inkl. Bearbeitungsentgelt 12,00;201111806102ALV-230137058150;;0;10.06.2018;;;;;;
11.06.2018;;;;40005190700;20111;-73,8;EUR;Privat.Leben.Nahrung;Innviertler Natur-Markt;201111806102ALV-230148313226;;0;10.06.2018;;;;;;
11.06.2018;;;;40005190700;20111;-79,82;EUR;Privat.Leben.Nahrung;Dahoam;201111806102ALV-230135231367;;0;10.06.2018;;;;;;
11.06.2018;;;;40005190700;20111;-412;EUR;;Allgemeine Sparkasse OO B inkl. Bearbeitungsentgelt 12,00;201111806092ALV-230510955957;;0;09.06.2018;;;;;;
11.06.2018;;;;40005190700;20111;-39,6;EUR;Business.Mobilität.Zug;DB BAHN A-NR F2MHKE;201111806092ALV-230602404346;;0;09.06.2018;;;;;;
11.06.2018;;;;40005190700;20111;-39,6;EUR;Business.Mobilität.Zug;DB BAHN A-NR VLY1FM;201111806092ALV-230602208193;;0;09.06.2018;;;;;;
11.06.2018;;;;40005190700;20111;-33,65;EUR;Business.Mobilität.Zug;DB BAHN A-NR 7K7R7R;201111806082ALV-230746147404;;0;08.06.2018;;;;;;
08.06.2018;;;;40005190700;20111;-7,81;EUR;Business.Infrastruktur.Cloud;Amazon web services inkl. Fremdwährungsentgelt 0,12 Kurs 1,1703511;201111806072ALV-231055283019;;0;07.06.2018;;;;;;
08.06.2018;;;;40005190700;20111;-29,4;EUR;Business.Mobilität.Zug;DB BAHN A-NR ZREL2D;201111806072ALV-230818703090;;0;07.06.2018;;;;;;
08.06.2018;;;;40005190700;20111;-33,65;EUR;Business.Mobilität.Zug;DB BAHN A-NR 7S3PYC;201111806072ALV-230816438440;;0;07.06.2018;;;;;;
07.06.2018;;;;40005190700;20111;-78,6;EUR;Business.Mobilität.Zug;DB BAHN A-NR Z2K2V8;201111806062ALV-230729548917;;0;06.06.2018;;;;;;
05.06.2018;;;;40005191900;20111;2698,29;EUR;;Ihre Zahlung Vormonat;201111806042ALV-231715543342;;0;04.06.2018;;;;;;
05.06.2018;;;;40005190700;20111;-26,85;EUR;Business.Infrastruktur.Cloud;Amazon web services inkl. Fremdwährungsentgelt 0,40 Kurs 1,1618147;201111806042ALV-231114573175;;0;04.06.2018;;;;;;
05.06.2018;;;;40005190700;20111;-78,6;EUR;Business.Mobilität.Zug;DB BAHN A-NR SKS3SW;201111806042ALV-230929024973;;0;04.06.2018;;;;;;
04.06.2018;;;;40005190700;20111;-126;EUR;Business.Unterkunft;HOTEL RHEINSBERG AM SE;201111806022ALV-231134665114;;0;02.06.2018;;;;;;
04.06.2018;;;;40005190700;20111;-4;EUR;Business.Infrastruktur.Cloud;GOOGLE *SVCSAPPS_blauw;201111806022ALV-231117165164;;0;02.06.2018;;;;;;
04.06.2018;;;;40005190700;20111;-2,8;EUR;Business.Mobilität.Nahverkehr;BVG APP ONLINESHOP;201111806022ALV-231103088543;;0;02.06.2018;;;;;;
04.06.2018;;;;40005190700;20111;-3,7;EUR;Business.Mobilität.Nahverkehr;www.rmv.de Mobiles Ticket;201111806022ALV-230631477504;;0;02.06.2018;;;;;;
04.06.2018;;;;40005190700;20111;-2,8;EUR;Business.Mobilität.Nahverkehr;BVG APP ONLINESHOP;201111806012ALV-230412717039;;0;01.06.2018;;;;;;
29.05.2018;;;;40005190700;20111;-106,1;EUR;Business.Mobilität.Zug;DB BAHN A-NR 2PNB9U;201111805282ALV-231017860902;;0;28.05.2018;;;;;;
29.05.2018;;;;40005190700;20111;-100,15;EUR;Business.Mobilität.Zug;DB BAHN A-NR BUBHQO;201111805282ALV-231015380599;;0;28.05.2018;;;;;;
29.05.2018;;;;40005190700;20111;-78,6;EUR;Business.Mobilität.Zug;DB BAHN A-NR 3M6W7G;201111805282ALV-231015002772;;0;28.05.2018;;;;;;
28.05.2018;;;;40005190700;20111;-10,99;EUR;Business.Infrastruktur.Cloud;ITUNES.COM/BILL;201111805262ALV-230853976924;;0;26.05.2018;;;;;;
22.05.2018;;;;40005190700;20111;-6,21;EUR;Business.Mobilität.Nahverkehr;MEIN HVV LOGPAY;201111805182ALV-230750396990;;0;18.05.2018;;;;;;
22.05.2018;;;;40005190700;20111;-3,99;EUR;Privat.Medien;Amazon Digital Svcs;201111805182ALV-230637018266;;0;18.05.2018;;;;;;
17.05.2018;;;;40005190700;20111;-91,9;EUR;Business.Mobilität.Zug;DB REISEZENTRUM;201111805162ALV-230835551780;;0;16.05.2018;;;;;;
15.05.2018;;;;40005190700;20111;-76,4;EUR;Business.Mobilität.Zug;DB BAHN A-NR BAW6AY;201111805142ALV-231008104815;;0;14.05.2018;;;;;;
15.05.2018;;;;40005190700;20111;-78,6;EUR;Business.Mobilität.Zug;DB BAHN A-NR LDGO39;201111805142ALV-230951145985;;0;14.05.2018;;;;;;
15.05.2018;;;;40005190700;20111;-3,99;EUR;Privat.Medien;Amazon Digital Svcs;201111805142ALV-230841328814;;0;14.05.2018;;;;;;
14.05.2018;;;;40005190700;20111;-228;EUR;Privat.Haus.Garten;Floristik Helmhart;201111805132ALV-230159692946;;0;13.05.2018;;;;;;
14.05.2018;;;;40005190700;20111;-665;EUR;Privat.Leben.Urlaub;WWWSMYRILLINEFO;201111805122ALV-230604084822;;0;12.05.2018;;;;;;
14.05.2018;;;;40005190700;20111;-793,95;EUR;Privat.Leben.Urlaub;OPODO;201111805122ALV-230557787689;;0;12.05.2018;;;;;;
14.05.2018;;;;40005190700;20111;-128,64;EUR;Privat.Haus.Geräte;OBI Markt AT0087;201111805122ALV-230410133741;;0;12.05.2018;;;;;;
14.05.2018;;;;40005190700;20111;-9,99;EUR;Privat.Medien;DAZN.com;201111805122ALV-230307784065;;0;12.05.2018;;;;;;
11.05.2018;;;;40005190700;20111;-111,9;EUR;Business.Mobilität.Zug;DB BAHN A-NR RXQ97E;201111805102ALV-230857201156;;0;10.05.2018;;;;;;
11.05.2018;;;;40005190700;20111;-9,99;EUR;Privat.Medien;Amazon Digital Video;201111805102ALV-230635488219;;0;10.05.2018;;;;;;
11.05.2018;;;;40005190700;20111;-43,72;EUR;Privat.Leben.Hygiene;Rossmann 2812;201111805092ALV-230857620886;;0;09.05.2018;;;;;;
08.05.2018;;;;40005191900;20111;2363,87;EUR;;Ihre Zahlung Vormonat;201111805072ALV-232417363438;;0;07.05.2018;;;;;;
08.05.2018;;;;40005190700;20111;-80,65;EUR;Business.Mobilität.Zug;DB BAHN A-NR SHQ6BK;201111805072ALV-231756806599;;0;07.05.2018;;;;;;
07.05.2018;;;;40005190700;20111;10,3;EUR;Business.Unterkunft;HOTEL RHEINSBERG AM SE;201111805052ALV-230810931523;;0;05.05.2018;;;;;;
07.05.2018;;;;40005190700;20111;-2,75;EUR;Business.Mobilität.Nahverkehr;VGN TICKET NUERNBERG;201111805052ALV-230738697312;;0;05.05.2018;;;;;;
07.05.2018;;;;40005190700;20111;-47,1;EUR;Business.Mobilität.Zug;DB BAHN A-NR W4Z42M;201111805052ALV-230636048937;;0;05.05.2018;;;;;;
07.05.2018;;;;40005190700;20111;-7,07;EUR;Business.Infrastruktur.Cloud;Amazon web services inkl. Fremdwährungsentgelt 0,10 Kurs 1,1951219;201111805042ALV-231024701242;;0;04.05.2018;;;;;;
07.05.2018;;;;40005190700;20111;-13,99;EUR;Privat.Medien;Amazon Digital Video;201111805042ALV-230543821957;;0;04.05.2018;;;;;;
04.05.2018;;;;40005190700;20111;-2,8;EUR;Business.Mobilität.Nahverkehr;BVG APP ONLINESHOP;201111805032ALV-230721745362;;0;03.05.2018;;;;;;
04.05.2018;;;;40005190700;20111;-5,5;EUR;Business.Mobilität.Nahverkehr;www.rmv.de Mobiles Ticket;201111805032ALV-230419239975;;0;03.05.2018;;;;;;
03.05.2018;;;;40005190700;20111;-1,86;EUR;Business.Infrastruktur.Cloud;GOOGLE *SVCSAPPS_blauw;201111805022ALV-230627735497;;0;02.05.2018;;;;;;
03.05.2018;;;;40005190700;20111;-2,75;EUR;Business.Mobilität.Nahverkehr;VGN TICKET NUERNBERG;201111805022ALV-230559217557;;0;02.05.2018;;;;;;
02.05.2018;;;;40005190700;20111;-47,1;EUR;Business.Mobilität.Zug;DB BAHN A-NR ECVAY8;201111805012ALV-231102379259;;0;01.05.2018;;;;;;
02.05.2018;;;;40005190700;20111;-216,3;EUR;Business.Unterkunft;HOTEL RHEINSBERG AM SE;201111804302ALV-232404304363;;0;30.04.2018;;;;;;
27.04.2018;;;;40005190700;20111;-28,44;EUR;;Amazon DE Marketplace;201111804262ALV-230458898469;;0;26.04.2018;;;;;;
26.04.2018;;;;40005190700;20111;-96,4;EUR;Business.Mobilität.Zug;DB BAHN A-NR B2QXBO;201111804252ALV-231338982052;;0;25.04.2018;;;;;;
25.04.2018;;;;40005190700;20111;61,65;EUR;Business.Mobilität.Zug;DB BAHN A-NR E24EFD;201111804242ALV-230537427063;;0;24.04.2018;;;;;;
25.04.2018;;;;40005190700;20111;-111,9;EUR;Business.Mobilität.Zug;DB BAHN A-NR RY3RGL;201111804242ALV-230537345104;;0;24.04.2018;;;;;;
25.04.2018;;;;40005190700;20111;-80,65;EUR;Business.Mobilität.Zug;DB BAHN A-NR E24EFD;201111804242ALV-230535682972;;0;24.04.2018;;;;;;
23.04.2018;;;;40005190700;20111;-261,29;EUR;Privat.Haus.Geräte;OBI Markt AT0087;201111804212ALV-230615816685;;0;21.04.2018;;;;;;
20.04.2018;;;;40005190700;20111;-29,4;EUR;Business.Mobilität.Zug;DB BAHN A-NR QGYFGY;201111804192ALV-230639023158;;0;19.04.2018;;;;;;
20.04.2018;;;;40005190700;20111;-25,15;EUR;Business.Mobilität.Zug;DB BAHN A-NR 2PL8FE;201111804192ALV-230636612888;;0;19.04.2018;;;;;;
19.04.2018;;;;40005190700;20111;-3,99;EUR;Privat.Medien;Amazon Digital Svcs;201111804182ALV-230621340626;;0;18.04.2018;;;;;;
16.04.2018;;;;40005190700;20111;-309;EUR;;Allgemeine Sparkasse OO B inkl. Bearbeitungsentgelt 9,00;201111804152ALV-230117757329;;0;15.04.2018;;;;;;
16.04.2018;;;;40005190700;20111;-27,2;EUR;Privat.Leben.Nahrung;BILLA 4458;201111804152ALV-230136014315;;0;15.04.2018;;;;;;
16.04.2018;;;;40005190700;20111;-101,3;EUR;Privat.Leben.Nahrung;Innviertler Natur-Markt;201111804152ALV-230129009781;;0;15.04.2018;;;;;;
16.04.2018;;;;40005190700;20111;-60,84;EUR;Privat.Leben.Nahrung;Dahoam;201111804152ALV-230115149137;;0;15.04.2018;;;;;;
16.04.2018;;;;40005190700;20111;-96,4;EUR;Business.Mobilität.Zug;DB BAHN A-NR F2AAUA;201111804132ALV-230656177105;;0;13.04.2018;;;;;;
13.04.2018;;;;40005190700;20111;-9,99;EUR;Privat.Medien;DAZN.com;201111804122ALV-230607953584;;0;12.04.2018;;;;;;
12.04.2018;;;;40005190700;20111;-39,9;EUR;Privat.Leben.Hygiene;Rossmann 2812;201111804112ALV-230943894388;;0;11.04.2018;;;;;;
11.04.2018;;;;40005190700;20111;-99,99;EUR;Privat.Leben.Kleidung;PEEK & CLOPPENBURG;201111804102ALV-230234194750;;0;10.04.2018;;;;;;
10.04.2018;;;;40005190700;20111;-309;EUR;;Allgemeine Sparkasse OO B inkl. Bearbeitungsentgelt 9,00;201111804092ALV-230908254096;;0;09.04.2018;;;;;;
10.04.2018;;;;40005190700;20111;-82,55;EUR;Business.Mobilität.Zug;DB BAHN A-NR VYBMDN;201111804092ALV-230819273190;;0;09.04.2018;;;;;;
10.04.2018;;;;40005190700;20111;-64,65;EUR;Business.Mobilität.Zug;DB BAHN A-NR 2MCPBK;201111804092ALV-230818871943;;0;09.04.2018;;;;;;
10.04.2018;;;;40005190700;20111;-31,5;EUR;Privat.Leben.Hygiene;FRISEUR MARFIEWICZ;201111804092ALV-230816402430;;0;09.04.2018;;;;;;
10.04.2018;;;;40005190700;20111;-31,2;EUR;Privat.Leben.Wirtshaus;SEVEN;201111804092ALV-230816390879;;0;09.04.2018;;;;;;
09.04.2018;;;;40005190700;20111;-95,5;EUR;Privat.Gesundheit.Heilbehelfe;Optiker Aigner;201111804072ALV-230608424925;;0;07.04.2018;;;;;;
09.04.2018;;;;40005190700;20111;-412;EUR;;Allgemeine Sparkasse OO B inkl. Bearbeitungsentgelt 12,00;201111804062ALV-230955706956;;0;06.04.2018;;;;;;
05.04.2018;;;;40005191900;20111;1711,9;EUR;;Ihre Zahlung Vormonat;201111804042ALV-231626055687;;0;04.04.2018;;;;;;
05.04.2018;;;;40005190700;20111;-4,28;EUR;Business.Infrastruktur.Cloud;Amazon web services inkl. Fremdwährungsentgelt 0,06 Kurs 1,2251184;201111804042ALV-231223453440;;0;04.04.2018;;;;;;
03.04.2018;;;;40005190700;20111;-9,25;EUR;Business.Mobilität.Nahverkehr;www.rmv.de Mobiles Ticket;201111804022ALV-230813990086;;0;02.04.2018;;;;;;
03.04.2018;;;;40005190700;20111;-4,99;EUR;Privat.Medien;Amazon Digital Video;201111803302ALV-230449824629;;0;30.03.2018;;;;;;
30.03.2018;;;;40005190700;20111;-27,2;EUR;Business.Mobilität.Zug;OBB*536000000018332234 OE;201111803292ALV-230856917369;;0;29.03.2018;;;;;;
26.03.2018;;;;40005190700;20111;-66,87;EUR;Privat.Leben.Nahrung;EUROSPAR DANKT 3331;201111803242ALV-230347733031;;0;24.03.2018;;;;;;
26.03.2018;;;;40005190700;20111;-79,5;EUR;Business.Mobilität.Zug;OBB*536000000018127900 OE;201111803232ALV-231033070899;;0;23.03.2018;;;;;;
23.03.2018;;;;40005190700;20111;-96,4;EUR;Business.Mobilität.Zug;DB BAHN A-NR V8YFH6;201111803222ALV-230750979864;;0;22.03.2018;;;;;;
20.03.2018;;;;40005190700;20111;-18,35;EUR;Business.Mobilität.Zug;DB BAHN ZUGVERKAUF;201111803192ALV-230829467972;;0;19.03.2018;;;;;;
20.03.2018;;;;40005190700;20111;-64,65;EUR;Business.Mobilität.Zug;DB BAHN A-NR S1LXAL;201111803192ALV-230827410473;;0;19.03.2018;;;;;;
20.03.2018;;;;40005190700;20111;-3,99;EUR;Privat.Medien;Amazon Digital Video;201111803192ALV-230759207047;;0;19.03.2018;;;;;;
19.03.2018;;;;40005190700;20111;-3,99;EUR;Privat.Medien;Amazon Digital Svcs;201111803182ALV-230059295216;;0;18.03.2018;;;;;;
19.03.2018;;;;40005190700;20111;-29,4;EUR;Business.Mobilität.Zug;DB BAHN A-NR VEFGOC;201111803162ALV-230732183350;;0;16.03.2018;;;;;;
19.03.2018;;;;40005190700;20111;-8,1;EUR;Business.Mobilität.Nahverkehr;VGN TICKET NUERNBERG;201111803162ALV-230725002754;;0;16.03.2018;;;;;;
19.03.2018;;;;40005190700;20111;-42,6;EUR;Business.Mobilität.Zug;DB BAHN A-NR DFNKU2;201111803162ALV-230716195316;;0;16.03.2018;;;;;;
16.03.2018;;;;40005190700;20111;-96,4;EUR;Business.Mobilität.Zug;DB BAHN A-NR HZGBL9;201111803152ALV-110506646078;;0;15.03.2018;;;;;;
13.03.2018;;;;40005190700;20111;-206;EUR;;Allgemeine Sparkasse OO B inkl. Bearbeitungsentgelt 6,00;201111803122ALV-230854482040;;0;12.03.2018;;;;;;
13.03.2018;;;;40005190700;20111;-4,99;EUR;Privat.Medien;Amazon Digital Video;201111803122ALV-230819881992;;0;12.03.2018;;;;;;
13.03.2018;;;;40005190700;20111;-9,99;EUR;Privat.Medien;DAZN.com;201111803122ALV-230715238801;;0;12.03.2018;;;;;;
12.03.2018;;;;40005190700;20111;-57,15;EUR;Business.Mobilität.Zug;DB BAHN A-NR TFE6ED;201111803112ALV-230150923227;;0;11.03.2018;;;;;;
12.03.2018;;;;40005190700;20111;-59,08;EUR;Privat.Leben.Nahrung;Innviertler Natur-Markt;201111803112ALV-230110465147;;0;11.03.2018;;;;;;
12.03.2018;;;;40005190700;20111;-38,31;EUR;Privat.Leben.Nahrung;BILLA 4458;201111803112ALV-230109814656;;0;11.03.2018;;;;;;
12.03.2018;;;;40005190700;20111;-5,98;EUR;Privat.Medien;Amazon Digital Video;201111803112ALV-230052711029;;0;11.03.2018;;;;;;
12.03.2018;;;;40005190700;20111;-8,1;EUR;Business.Mobilität.Nahverkehr;VGN TICKET NUERNBERG;201111803102ALV-230655294158;;0;10.03.2018;;;;;;
12.03.2018;;;;40005190700;20111;-40,05;EUR;Business.Mobilität.Zug;DB BAHN A-NR 4B274N;201111803102ALV-230646593388;;0;10.03.2018;;;;;;
12.03.2018;;;;40005190700;20111;-5,1;EUR;Business.Mobilität.Zug;DB BAHN A-NR FXPHZC;201111803102ALV-230646538330;;0;10.03.2018;;;;;;
12.03.2018;;;;40005190700;20111;-42,6;EUR;Business.Mobilität.Zug;DB BAHN A-NR QRYPYO;201111803102ALV-230638409653;;0;10.03.2018;;;;;;
12.03.2018;;;;40005190700;20111;-98,7;EUR;Privat.Gesundheit.Heilbehelfe;Stadtapotheke;201111803102ALV-230626194013;;0;10.03.2018;;;;;;
12.03.2018;;;;40005190700;20111;-150,74;EUR;Privat.Leben.Nahrung;Innviertler Natur-Markt;201111803102ALV-230619587325;;0;10.03.2018;;;;;;
12.03.2018;;;;40005190700;20111;-6,98;EUR;Privat.Medien;Amazon Digital Video;201111803102ALV-230521170845;;0;10.03.2018;;;;;;
12.03.2018;;;;40005190700;20111;-8,1;EUR;Business.Mobilität.Nahverkehr;VGN TICKET NUERNBERG;201111803092ALV-230802860629;;0;09.03.2018;;;;;;
12.03.2018;;;;40005190700;20111;-42,6;EUR;Business.Mobilität.Zug;DB BAHN A-NR KAC6MU;201111803092ALV-230754800951;;0;09.03.2018;;;;;;
09.03.2018;;;;40005190700;20111;-80,65;EUR;Business.Mobilität.Zug;DB BAHN A-NR H9KP2G;201111803082ALV-130447608671;;0;08.03.2018;;;;;;
09.03.2018;;;;40005190700;20111;-29,4;EUR;Business.Mobilität.Zug;DB BAHN A-NR EDDARE;201111803082ALV-130446140896;;0;08.03.2018;;;;;;
08.03.2018;;;;40005191900;20111;1873,52;EUR;;Ihre Zahlung Vormonat;201111803072ALV-231714150737;;0;07.03.2018;;;;;;
06.03.2018;;;;40005190700;20111;-50,15;EUR;Business.Mobilität.Zug;DB BAHN A-NR COEY4E;201111803052ALV-230858910151;;0;05.03.2018;;;;;;
05.03.2018;;;;40005190700;20111;-42,6;EUR;Business.Mobilität.Zug;DB BAHN A-NR MR2MF1;201111803022ALV-231038839881;;0;02.03.2018;;;;;;
05.03.2018;;;;40005190700;20111;-9,25;EUR;Business.Mobilität.Nahverkehr;www.rmv.de Mobiles Ticket;201111803022ALV-231034917026;;0;02.03.2018;;;;;;
05.03.2018;;;;40005190700;20111;-5,99;EUR;Privat.Medien;Amazon Digital Video;201111803022ALV-230921945689;;0;02.03.2018;;;;;;
02.03.2018;;;;40005190700;20111;-8,1;EUR;Business.Mobilität.Nahverkehr;VGN TICKET NUERNBERG;201111803012ALV-231002529419;;0;01.03.2018;;;;;;
02.03.2018;;;;40005190700;20111;-46,4;EUR;Business.Mobilität.Zug;DB BAHN A-NR SX6OAZ;201111803012ALV-230954458663;;0;01.03.2018;;;;;;
02.03.2018;;;;40005190700;20111;-9,99;EUR;Privat.Medien;Amazon Digital Video;201111803012ALV-230854200933;;0;01.03.2018;;;;;;
28.02.2018;;;;40005190700;20111;-38,9;EUR;Business.Mobilität.Zug;DB BAHN A-NR R1XK1H;201111802272ALV-231058286515;;0;27.02.2018;;;;;;
28.02.2018;;;;40005190700;20111;-21,01;EUR;Privat.Leben.Hygiene;Rossmann 2812;201111802272ALV-231023398302;;0;27.02.2018;;;;;;
28.02.2018;;;;40005190700;20111;-23,35;EUR;;Amazon DE Marketplace;201111802272ALV-230729087944;;0;27.02.2018;;;;;;
27.02.2018;;;;40005190700;20111;-41,4;EUR;Business.Mobilität.Zug;DB BAHN A-NR UNTBYZ;201111802262ALV-230835512946;;0;26.02.2018;;;;;;
27.02.2018;;;;40005190700;20111;-9,99;EUR;Privat.Medien;Amazon Digital Video;201111802262ALV-230742082731;;0;26.02.2018;;;;;;
26.02.2018;;;;40005190700;20111;-42,6;EUR;Business.Mobilität.Zug;DB BAHN A-NR FVQNSA;201111802242ALV-230430624287;;0;24.02.2018;;;;;;
26.02.2018;;;;40005190700;20111;-42,6;EUR;Business.Mobilität.Zug;DB BAHN A-NR D2MV2X;201111802232ALV-230739744892;;0;23.02.2018;;;;;;
26.02.2018;;;;40005190700;20111;-41,4;EUR;Business.Mobilität.Zug;DB BAHN A-NR 4FTPKA;201111802232ALV-230736468419;;0;23.02.2018;;;;;;
26.02.2018;;;;40005190700;20111;-8,1;EUR;Business.Mobilität.Nahverkehr;VGN TICKET NUERNBERG;201111802232ALV-230728522749;;0;23.02.2018;;;;;;
23.02.2018;;;;40005190700;20111;-8,1;EUR;Business.Mobilität.Nahverkehr;VGN TICKET NUERNBERG;201111802222ALV-230808912256;;0;22.02.2018;;;;;;
23.02.2018;;;;40005190700;20111;-41,4;EUR;Business.Mobilität.Zug;DB BAHN A-NR ZES3XX;201111802222ALV-230802207322;;0;22.02.2018;;;;;;
19.02.2018;;;;40005190700;20111;-3,99;EUR;Privat.Medien;Amazon Digital Svcs;201111802182ALV-230238224762;;0;18.02.2018;;;;;;
19.02.2018;;;;40005190700;20111;-8,1;EUR;Business.Mobilität.Nahverkehr;VGN TICKET NUERNBERG;201111802172ALV-230619363010;;0;17.02.2018;;;;;;
19.02.2018;;;;40005190700;20111;-42,6;EUR;Business.Mobilität.Zug;DB BAHN A-NR 49CXZ8;201111802172ALV-230617948080;;0;17.02.2018;;;;;;
19.02.2018;;;;40005190700;20111;-209;EUR;Business.Unterkunft;HOTEL IBIS NUERNBERG;201111802162ALV-230437445452;;0;16.02.2018;;;;;;
19.02.2018;;;;40005190700;20111;-8,1;EUR;Business.Mobilität.Nahverkehr;VGN TICKET NUERNBERG;201111802162ALV-230402305070;;0;16.02.2018;;;;;;
19.02.2018;;;;40005190700;20111;-15,75;EUR;;162747823;201111802162ALV-230359582205;;0;16.02.2018;;;;;;
16.02.2018;;;;40005190700;20111;-206;EUR;;Allgemeine Sparkasse OO B inkl. Bearbeitungsentgelt 6,00;201111802152ALV-230534745232;;0;15.02.2018;;;;;;
16.02.2018;;;;40005190700;20111;-287,87;EUR;Business.Infrastruktur.Geräte;FIRMA HEINDL DANKT;201111802152ALV-230514860517;;0;15.02.2018;;;;;;
16.02.2018;;;;40005190700;20111;-78,2;EUR;Business.Infrastruktur.Geräte;Hartlauer Fil.86;201111802152ALV-230514587590;;0;15.02.2018;;;;;;
16.02.2018;;;;40005190700;20111;-41,4;EUR;Business.Mobilität.Zug;DB BAHN A-NR 99BD9A;201111802152ALV-230512744247;;0;15.02.2018;;;;;;
15.02.2018;;;;40005190700;20111;-10,99;EUR;Business.Infrastruktur.Cloud;ITUNES.COM/BILL;201111802142ALV-230631016351;;0;14.02.2018;;;;;;
13.02.2018;;;;40005190700;20111;-412;EUR;;Allgemeine Sparkasse OO B inkl. Bearbeitungsentgelt 12,00;201111802122ALV-231127969776;;0;12.02.2018;;;;;;
13.02.2018;;;;40005190700;20111;-9,99;EUR;Privat.Medien;DAZN.com;201111802122ALV-230814946819;;0;12.02.2018;;;;;;
06.02.2018;;;;40005191900;20111;2595,77;EUR;;Ihre Zahlung Vormonat;201111802052ALV-231441694095;;0;05.02.2018;;;;;;
06.02.2018;;;;40005190700;20111;-1,98;EUR;Privat.Medien;Amazon Digital Video;201111802052ALV-230940113841;;0;05.02.2018;;;;;;
05.02.2018;;;;40005190700;20111;-3,99;EUR;Privat.Medien;Amazon Digital Video;201111802042ALV-230121342937;;0;04.02.2018;;;;;;
05.02.2018;;;;40005190700;20111;-96,4;EUR;Business.Mobilität.Zug;DB BAHN A-NR D2YFRE;201111802022ALV-230948822134;;0;02.02.2018;;;;;;
05.02.2018;;;;40005190700;20111;-14,8;EUR;Business.Mobilität.Nahverkehr;www.rmv.de Mobiles Ticket;201111802022ALV-230914173506;;0;02.02.2018;;;;;;
02.02.2018;;;;40005190700;20111;-3,99;EUR;Priat.Medien;Amazon Digital Video;201111802012ALV-230638036374;;0;01.02.2018;;;;;;
30.01.2018;;;;40005190700;20111;-57,15;EUR;Business.Mobilität.Zug;DB BAHN A-NR 8QLZUS;201111801292ALV-230726752102;;0;29.01.2018;;;;;;
29.01.2018;;;;40005190700;20111;-7,99;EUR;Business.Infrastruktur.Cloud;ITUNES.COM/BILL;201111801282ALV-230210237287;;0;28.01.2018;;;;;;
29.01.2018;;;;40005190700;20111;-17,98;EUR;Business.Infrastruktur.Cloud;ITUNES.COM/BILL;201111801282ALV-230210234057;;0;28.01.2018;;;;;;
29.01.2018;;;;40005190700;20111;-42,6;EUR;Business.Mobilität.Zug;DB BAHN A-NR DDBNSP;201111801272ALV-230444077426;;0;27.01.2018;;;;;;
29.01.2018;;;;40005190700;20111;-8,1;EUR;Business.Mobilität.Nahverkehr;VGN TICKET NUERNBERG;201111801272ALV-230439096958;;0;27.01.2018;;;;;;
29.01.2018;;;;40005190700;20111;-49,65;EUR;Business.Mobilität.Zug;DB BAHN A-NR GTUOAK;201111801272ALV-230438201729;;0;27.01.2018;;;;;;
29.01.2018;;;;40005190700;20111;-42,6;EUR;Business.Mobilität.Zug;DB BAHN A-NR 2M2XMM;201111801262ALV-230644793580;;0;26.01.2018;;;;;;
29.01.2018;;;;40005190700;20111;-8,1;EUR;Business.Mobilität.Nahverkehr;VGN TICKET NUERNBERG;201111801262ALV-230640162623;;0;26.01.2018;;;;;;
26.01.2018;;;;40005190700;20111;-2,75;EUR;Business.Mobilität.Nahverkehr;VGN TICKET NUERNBERG;201111801252ALV-230811395152;;0;25.01.2018;;;;;;
26.01.2018;;;;40005190700;20111;-42,6;EUR;Business.Mobilität.Zug;DB BAHN A-NR 7BZYM3;201111801252ALV-230805679608;;0;25.01.2018;;;;;;
26.01.2018;;;;40005190700;20111;-41,4;EUR;Business.Mobilität.Zug;DB BAHN A-NR YGZ84E;201111801252ALV-230805636038;;0;25.01.2018;;;;;;
24.01.2018;;;;40005190700;20111;-80,65;EUR;Business.Mobilität.Zug;DB BAHN A-NR 4L83D6;201111801232ALV-230806537237;;0;23.01.2018;;;;;;
24.01.2018;;;;40005190700;20111;-37,4;EUR;Business.Mobilität.Zug;DB BAHN A-NR WNN67F;201111801232ALV-230804487529;;0;23.01.2018;;;;;;
22.01.2018;;;;40005190700;20111;-1508,69;EUR;Business.Unterkunft;PAYPAL *AIRBNB HMM8MJ;201111801202ALV-230449506304;;0;20.01.2018;;;;;;
22.01.2018;;;;40005190700;20111;-54,99;EUR;Business.Infrastruktur.Cloud;ITUNES.COM/BILL;201111801192ALV-230751036398;;0;19.01.2018;;;;;;
19.01.2018;;;;40005190700;20111;-57,15;EUR;Business.Mobilität.Zug;DB BAHN A-NR 9GWHFO;201111801182ALV-230856990005;;0;18.01.2018;;;;;;
19.01.2018;;;;40005190700;20111;-8,1;EUR;Business.Mobilität.Nahverkehr;VGN TICKET NUERNBERG;201111801182ALV-230851964609;;0;18.01.2018;;;;;;
19.01.2018;;;;40005190700;20111;-10,99;EUR;Business.Infrastruktur.Cloud;ITUNES.COM/BILL;201111801182ALV-230845823146;;0;18.01.2018;;;;;;
18.01.2018;;;;40005190700;20111;-31;EUR;Business.Mobilität.Zug;DB BAHN A-NR S4UKPR;201111801172ALV-230847480477;;0;17.01.2018;;;;;;
18.01.2018;;;;40005190700;20111;-29,4;EUR;Business.Mobilität.Zug;DB BAHN A-NR MMTN9X;201111801172ALV-230847222457;;0;17.01.2018;;;;;;
18.01.2018;;;;40005190700;20111;-49,65;EUR;Business.Mobilität.Zug;DB BAHN A-NR SYWPS3;201111801172ALV-230844615853;;0;17.01.2018;;;;;;
18.01.2018;;;;40005190700;20111;-42,6;EUR;Business.Mobilität.Zug;DB BAHN A-NR GS4A4D;201111801172ALV-230843185425;;0;17.01.2018;;;;;;
18.01.2018;;;;40005190700;20111;-2,75;EUR;Business.Mobilität.Nahverkehr;VGN TICKET NUERNBERG;201111801172ALV-230837049428;;0;17.01.2018;;;;;;
18.01.2018;;;;40005190700;20111;-12,3;EUR;Business.Mobilität.Nahverkehr;VGN TICKET NUERNBERG;201111801172ALV-230837039508;;0;17.01.2018;;;;;;
16.01.2018;;;;40005190700;20111;-49,95;EUR;;NOWMUSIK.COM;201111801152ALV-231435903588;;0;15.01.2018;;;;;;
15.01.2018;;;;40005190700;20111;-412;EUR;;Allgemeine Sparkasse OO B inkl. Bearbeitungsentgelt 12,00;201111801132ALV-230825432048;;0;13.01.2018;;;;;;
15.01.2018;;;;40005190700;20111;-33,6;EUR;Privat.Leben.Wirtshaus;SEVEN;201111801132ALV-230702473576;;0;13.01.2018;;;;;;
15.01.2018;;;;40005190700;20111;-30,73;EUR;Privat.Leben.Nahrung;BILLA 4458;201111801122ALV-230755555993;;0;12.01.2018;;;;;;
15.01.2018;;;;40005190700;20111;-9,99;EUR;Privat.Medien;DAZN.com;201111801122ALV-230657815218;;0;12.01.2018;;;;;;
12.01.2018;;;;40005190700;20111;-80,65;EUR;Business.Mobilität.Zug;DB BAHN A-NR Q2ML83;201111801112ALV-230828861358;;0;11.01.2018;;;;;;
10.01.2018;;;;40005190700;20111;738;EUR;Business.Infrastruktur.Geräte;APPLE ONLINE STORE EUR;201111801092ALV-230951023697;;0;09.01.2018;;;;;;
10.01.2018;;;;40005190700;20111;-96,4;EUR;Business.Mobilität.Zug;DB BAHN A-NR 872OBQ;201111801092ALV-230939081961;;0;09.01.2018;;;;;;
08.01.2018;;;;40005190700;20111;-412;EUR;;Allgemeine Sparkasse OO B inkl. Bearbeitungsentgelt 12,00;201111801072ALV-230131313609;;0;07.01.2018;;;;;;
08.01.2018;;;;40005190700;20111;-157,3;EUR;Privat.Gesundheit.Heilbehelfe;Stadtapotheke;201111801062ALV-230559872800;;0;06.01.2018;;;;;;
05.01.2018;;;;40005191900;20111;2811,69;EUR;;Ihre Zahlung Vormonat;201111801042ALV-231156497725;;0;04.01.2018;;;;;;
04.01.2018;;;;40005190700;20111;-1,85;EUR;Business.Mobilität.Nahverkehr;www.rmv.de Mobiles Ticket;201111801032ALV-230445952084;;0;03.01.2018;;;;;;
02.01.2018;;;;40005190700;20111;-6,99;EUR;Business.Infrastruktur.Cloud;ITUNES.COM/BILL;201111712302ALV-230459629419;;0;30.12.2017;;;;;;
02.01.2018;;;;40005190700;20111;-25,9;EUR;Privat.Leben.Wirtshaus;SEVEN;201111712292ALV-230637511033;;0;29.12.2017;;;;;;
