"05.02.2020";"";"";"";"";"";"-1,73";"EUR";"Kostenersatz Freigabespesen zu Umsatz über EUR 113,64";"1200020013008125892787590044";"";"0";"03.02.2020";"";"";"";"";"";""
"05.02.2020";"Porsche-Bank Aktiengesellschaft";"AT491100009959808800";"BKAUATWWXXX";"";"11000";"-113,64";"EUR";"1917724 SD354DL 113,64";"1200020013008125892787590044";"";"0";"03.02.2020";"";"";"";"";"1917724";"AT56ZZZ00000001547"
"04.02.2020";"Erste Bank Oesterreich";"AT052011140005191900";"GIBAATWWXXX";"40005191900";"20111";"-2.298,40";"EUR";"s Kreditkartenrechnung Jan. 2020 s Visa Card Business Gold Kartenendnummer 6011";"201112001312ALV-200131267875";"";"0";"04.02.2020";"";"";"";"";"170602ALV-270/72107807142";"AT68ZZZ00000004435"
"31.01.2020";"Wolfram Laube";"AT632032032102152059";"ASPKAT2LXXX";"";"20320";"-4.830,76";"EUR";"George-Überweisung";"203202001312AIP-00A3PKLL0HJ4";"";"0";"31.01.2020";"";"";"";"";"";""
"31.01.2020";"Porsche-Bank Aktiengesellschaft";"AT491100009959808800";"BKAUATWWXXX";"";"11000";"-190,33";"EUR";"1917724 SD354DL 190,33";"1200020012822502177089562539";"";"0";"31.01.2020";"";"";"";"";"1917724";"AT56ZZZ00000001547"
"30.01.2020";"AMAZON PAYMENTS EUROPE S.C.A.";"DE87300308801908262006";"TUBDDEDDXXX";"";"";"-15,45";"EUR";"028-7944278-1512301 AMZN Mktp DE 4B 7CNRPOFHNX9015";"201002001282AEI-03X7BT004577";"";"0";"30.01.2020";"";"";"";"";"o:13VsmeZ1r0TL8N7lxm-JQ(vO,.yC";"DE94ZZZ00000561653"
"29.01.2020";"Wolfram Laube";"AT632032032102152059";"ASPKAT2LXXX";"";"20320";"-400,00";"EUR";"George-Überweisung";"203202001282AIP-00IQET7O4MS8";"";"0";"29.01.2020";"";"";"";"";"";""
"28.01.2020";"";"";"";"";"";"-50,00";"EUR";"SB-Auszahlung *K2 S72692 28.01/10:52";"203202001282ALH-72692K520002";"";"0";"28.01.2020";"";"";"";"";"";""
"28.01.2020";"DB Vertrieb GmbH";"DE98700111100000405507";"";"";"";"-84,40";"EUR";"DB Vertrieb A-Nr. DK4428 Ihre Buchu ng auf bahn.de 71069-154104-5E2F9E8 E-5D20";"203202001282CDC-003D93AXE1LS";"";"0";"28.01.2020";"";"";"";"";"";""
"28.01.2020";"DB Vertrieb GmbH";"DE98700111100000405507";"";"";"";"-84,40";"EUR";"DB Vertrieb A-Nr. E4M7XU Ihre Buchu ng auf bahn.de 71069-154104-5E2F9D9 B-946C";"203202001282CDC-003AT3F4SL34";"";"0";"28.01.2020";"";"";"";"";"";""
"27.01.2020";"";"";"";"";"";"-1.400,00";"EUR";"SB-Auszahlung *K3 S72692 25.01/11:28";"203202001252ALH-72692L280501";"";"0";"25.01.2020";"";"";"";"";"";""
"23.01.2020";"Wolfram Laube";"AT632032032102152059";"ASPKAT2LXXX";"";"20320";"-400,00";"EUR";"George-Überweisung";"203202001232AIP-00GRU3EY4YT4";"";"0";"23.01.2020";"";"";"";"";"";""
"23.01.2020";"";"";"";"";"";"-100,00";"EUR";"SB-Auszahlung *K2 S72692 22.01/18:55";"203202001222ALH-72692S550001";"";"0";"22.01.2020";"";"";"";"";"";""
"22.01.2020";"Hays AG";"DE53670400310604042200";"COBADEFFXXX";"";"";"7.555,10";"EUR";"/GSV/1660264486/60C20790701/2019";"201002001222AEI-57XN6L004767";"";"0";"22.01.2020";"";"";"";"";"";""
"21.01.2020";"Google Ireland Limited";"IE64CITI99005124417026";"CITIIE2XXXX";"";"";"0,24";"EUR";"GG1022966O";"201002001212AEI-50XJ0O015941";"";"0";"21.01.2020";"";"";"";"";"";""
"20.01.2020";"Wolfram Laube";"AT632032032102152059";"ASPKAT2LXXX";"32102152059";"20320";"2.311,79";"EUR";"SEPA-Gutschrift Wolfram Laube";"203202001202AIP-00H84ZB9OR3C";"";"0";"20.01.2020";"";"";"";"";"";""
"17.01.2020";"";"";"";"";"";"0,00";"EUR";"Guthaben auf Girokonten und Spareinlagen sind gemäß Einlagensicherungs- und Anlegerentschädigungsgesetz erstattungsfähig. Nähere Informationen dazu entnehmen Sie bitte dem 'Informationsbogen für den Einleger' - abholbereit in jeder Filiale bzw. abrufbar unter: www.erstebank.at/einlagensicherung und www.sparkasse.at/einlagensicherung.";"203202001172AAU-005Z9593XYTS";"";"0";"17.01.2020";"";"";"";"";"";""
"15.01.2020";"";"";"";"";"";"-6,91";"EUR";"Information über Nicht-Durchführung Der Dauerauftrag mit der Nr. 003 wurde per 15.01.2020 nicht durchgeführt Grund: fehlende Kontodeckung Empfänger: SVA der gew. Wirtschaft";"203202001152AB3-DD1003016809";"";"0";"15.01.2020";"";"";"";"";"";""
"15.01.2020";"";"";"";"";"";"-6,91";"EUR";"Information über Nicht-Durchführung Der Dauerauftrag mit der Nr. 002 wurde per 15.01.2020 nicht durchgeführt Grund: fehlende Kontodeckung Empfänger: SVA der gew. Wirtschaft";"203202001152AB3-DD1002016808";"";"0";"15.01.2020";"";"";"";"";"";""
"14.01.2020";"";"";"";"";"";"-1,73";"EUR";"Kostenersatz Freigabespesen zu Umsatz über EUR 38,34";"201002001092AEI-10XO2F004690";"";"0";"10.01.2020";"";"";"";"";"";""
"14.01.2020";"AMAZON PAYMENTS EUROPE S.C.A.";"DE87300308801908262006";"TUBDDEDDXXX";"";"";"-38,34";"EUR";"305-6502837-9870706 AMZN Mktp DE LJ 0T5KR81HTFKG1H";"201002001092AEI-10XO2F004690";"";"0";"10.01.2020";"";"";"";"";"o:13VsmeZ1r0TL8N7lxm-JQ(vO,.yC";"DE94ZZZ00000561653"
"07.01.2020";"Erste Bank Oesterreich";"AT052011140005191900";"GIBAATWWXXX";"40005191900";"20111";"-2.257,90";"EUR";"s Kreditkartenrechnung Dez. 2019 s Visa Card Business Gold Kartenendnummer 6011";"201111912312ALV-191231273051";"";"0";"07.01.2020";"";"";"";"";"170602ALV-270/72107807142";"AT68ZZZ00000004435"
"03.01.2020";"Wolfram Laube";"AT632032032102152059";"ASPKAT2LXXX";"";"20320";"-17.518,91";"EUR";"George-Überweisung";"203202001032AIP-00D28FM6DDPS";"";"0";"03.01.2020";"";"";"";"";"";""
"03.01.2020";"Krongaard AG";"DE91200505501280393156";"HASPDEHHXXX";"";"";"12.210,80";"EUR";"DIVERSE BELEGE SIEHE AVIS";"201002001032AEI-50X7V9004398";"";"0";"03.01.2020";"";"";"";"";"";""
"02.01.2020";"Porsche-Bank Aktiengesellschaft";"AT491100009959808800";"BKAUATWWXXX";"";"11000";"-113,64";"EUR";"1917724 SD354DL 113,64";"1200019122408274452087154590";"";"0";"02.01.2020";"";"";"";"";"1917724";"AT56ZZZ00000001547"
