<?xml version="1.0" ?><!DOCTYPE svg  PUBLIC '-//W3C//DTD SVG 1.1//EN'
  'http://www.w3.org/Graphics/SVG/1.1/DTD/svg11.dtd'>
<svg height="6.82666in"
     style="shape-rendering:geometricPrecision; text-rendering:geometricPrecision; image-rendering:optimizeQuality; fill-rule:evenodd; clip-rule:evenodd"
     viewBox="0 0 6.82666 6.82666" width="6.82666in" xml:space="preserve" xmlns="http://www.w3.org/2000/svg"
     xmlns:xlink="http://www.w3.org/1999/xlink"><defs><style type="text/css">
   <![CDATA[
    .str0 {stroke:#0099cc;stroke-width:0.16;stroke-linecap:round;stroke-linejoin:round}
    .fil0 {fill:none}
    .fil2 {fill:#0099cc}
    .fil1 {fill:#0099cc;fill-rule:nonzero}
   ]]>
  </style></defs>
  <g id="Layer_x0020_1"><path class="fil0 str0" d="M3.41333 5.51835c-1.26612,0 -2.29251,-1.02639 -2.29251,-2.29251 0,-1.26612 1.02639,-2.29251 2.29251,-2.29251 1.26612,0 2.29251,1.02639 2.29251,2.29251"/>
    <polygon class="fil1" points="3.23143,5.15131 3.5331,5.45298 3.60287,5.52276 3.5331,5.59254 3.23143,5.89422 "/>
    <path class="fil2"
          d="M2.28426 4.49996c-0.250291,-0.221374 -0.428559,-0.510646 -0.515087,-0.833571 -0.0567205,-0.211685 -0.0723701,-0.433433 -0.0453819,-0.650941 0.0280512,-0.226071 0.101559,-0.443449 0.215437,-0.640689 0.0659961,-0.114307 0.145004,-0.220776 0.23548,-0.31689l0.031374 -0.0333346 0.0288228 0.0355669c0.0199646,0.0246378 0.0417874,0.0477953 0.0647283,0.0696772 0.0541772,0.0516772 0.115118,0.0970394 0.178378,0.136965 0.0529252,0.0334055 0.0958307,0.079752 0.12824,0.133071 0.0500709,0.082374 0.0749685,0.180665 0.0760197,0.276724 0.00104331,0.0950197 -0.0212992,0.192567 -0.0723425,0.273441 -0.0312087,0.0494488 -0.0723465,0.0910591 -0.122386,0.12148 -0.092689,0.0563465 -0.184528,0.11435 -0.272965,0.177209 -0.0589921,0.0419331 -0.117705,0.0863465 -0.169768,0.136752 -0.0444764,0.0430591 -0.107394,0.111917 -0.0943543,0.179378 0.00287008,0.0148386 0.00901181,0.028748 0.0168346,0.0416181 0.0282677,0.0465 0.0875079,0.0837677 0.132051,0.113622 0.131583,0.088189 0.238594,0.174402 0.272618,0.33785 0.0205945,0.0989409 0.0224252,0.201134 0.00622835,0.300858 -0.00677559,0.0417087 -0.0166142,0.0829252 -0.0292756,0.123236l-0.0184724 0.0588228 -0.0461811 -0.0408465z"/>
    <path class="fil2"
          d="M3.66609 2.07423l-0.00325591 -0.0110472c-0.00131496,-0.00414961 -0.00402756,-0.00916929 -0.00584252,-0.0132283 -0.00635827,-0.0142008 -0.0130945,-0.0282283 -0.0200591,-0.0421417 -0.0249252,-0.0497992 -0.0528425,-0.098126 -0.0829449,-0.144969 -0.0625354,-0.0972992 -0.135142,-0.188673 -0.217126,-0.270335l-0.0657913 -0.0655315 0.092815 -0.00278346c0.0867598,-0.0026063 0.173697,0.00142126 0.259839,0.0121102 0.226067,0.0280551 0.443445,0.101563 0.640681,0.215437 0.107429,0.0620236 0.207961,0.135551 0.299469,0.219303l0.0232717 0.0212953 -0.0152913 0.0275945c-0.0216614,0.0390945 -0.0399803,0.0800276 -0.0547441,0.122213 -0.0272362,0.077815 -0.0420276,0.159236 -0.0453622,0.241563 -0.00491732,0.121362 -0.0440551,0.237807 -0.138839,0.318327 -0.0268071,0.0227756 -0.0571417,0.0417559 -0.0894803,0.055622 -0.0133465,0.00572441 -0.0264685,0.00965748 -0.0402913,0.0138583l-0.0088937 0.00270472c-0.0098189,0.00298819 -0.0189331,0.00614961 -0.0290787,0.00821654 -0.024748,0.00503937 -0.0504213,0.00615354 -0.0755276,0.00348819 -0.0888937,-0.00943701 -0.158654,-0.0639134 -0.209709,-0.13437 -0.0365157,-0.0504016 -0.0659134,-0.106228 -0.0910197,-0.163071 -0.0399016,-0.0903465 -0.0699843,-0.185496 -0.0940079,-0.281213 -0.00804724,-0.0320512 -0.0154016,-0.0642835 -0.021937,-0.0966772 -0.0018622,-0.00921654 -0.00365354,-0.0184449 -0.00534646,-0.0276929 -0.000527559,-0.00288189 -0.000992126,-0.00579134 -0.00152756,-0.00867323z"/>
    <path class="fil2"
          d="M4.15743 4.757c-0.0973386,0.047189 -0.199067,0.0850039 -0.303551,0.113 -0.211685,0.0567205 -0.433429,0.0723701 -0.650937,0.0453819 -0.226071,-0.0280512 -0.443445,-0.101563 -0.640685,-0.215437 -0.0513701,-0.0296575 -0.101205,-0.0619646 -0.149228,-0.0967795l-0.0247598 -0.0179449 0.0108268 -0.0285984c0.0227717,-0.0601417 0.039685,-0.122602 0.0499921,-0.186083 0.0176339,-0.108587 0.0154488,-0.219654 -0.00697638,-0.327374 -0.0192126,-0.0922913 -0.0599488,-0.171461 -0.124154,-0.240504 -0.0524646,-0.0564213 -0.114941,-0.099752 -0.178583,-0.142409 -0.0333504,-0.0223543 -0.0905079,-0.0577559 -0.110909,-0.0913031 -0.00402756,-0.00661811 -0.00325984,-0.00462992 -0.006,-0.012874 -0.0127638,-0.038378 0.0171575,-0.0763583 0.0418898,-0.102437 0.0159055,-0.0167717 0.0332402,-0.0321181 0.0510118,-0.0468701 0.0496929,-0.0412559 0.102969,-0.0781654 0.156594,-0.114083 0.0829409,-0.0555472 0.167772,-0.108213 0.253063,-0.160059 0.0595315,-0.036185 0.108488,-0.0855 0.145626,-0.144343 0.058374,-0.0924921 0.0847598,-0.203669 0.0835669,-0.312445 -0.00119685,-0.108906 -0.0300709,-0.220173 -0.0867992,-0.3135 -0.0381654,-0.0627874 -0.0888071,-0.117004 -0.151102,-0.156319 -0.0592835,-0.0374173 -0.116429,-0.0798071 -0.167205,-0.128232 -0.0242126,-0.0230906 -0.0471417,-0.0477323 -0.0674921,-0.074315l-0.0226654 -0.0296063 0.0279488 -0.024685c0.197126,-0.174079 0.431815,-0.299421 0.685882,-0.3675 0.0595197,-0.0159488 0.119898,-0.0286772 0.180791,-0.0381102l0.0175394 -0.00271654 0.0137835 0.0111772c0.1125,0.091248 0.209953,0.201425 0.290638,0.321551 0.0444213,0.066126 0.086252,0.137311 0.118008,0.210445l0.00185433 0.00427559 0.000822835 0.00459055c0.00985433,0.0549055 0.0227047,0.109339 0.0371496,0.163209 0.0257205,0.0959016 0.0575433,0.191142 0.0991772,0.281374 0.0250866,0.054374 0.0541063,0.107665 0.0892835,0.156217 0.0963346,0.132969 0.238,0.198374 0.399142,0.147551 0.0636969,-0.0200906 0.120858,-0.0515591 0.170476,-0.0964449 0.103154,-0.093315 0.146394,-0.221638 0.151913,-0.357969 0.00304724,-0.0752441 0.016622,-0.149638 0.0415079,-0.220756 0.00823622,-0.0235276 0.017689,-0.046626 0.028311,-0.0691732l0.0256417 -0.0544331 0.0402598 0.0447126c0.179693,0.199555 0.308886,0.438669 0.378406,0.69811 0.0410472,0.153181 0.0606732,0.312043 0.0580236,0.470614l-0.000822835 0.0490787 -0.0479016 -0.0107165c-0.106476,-0.0238228 -0.214138,-0.0248701 -0.320618,0.000153543 -0.140732,0.0330709 -0.268646,0.109807 -0.371795,0.21013 -0.0119961,0.0116693 -0.0236102,0.023748 -0.0345827,0.0363898l-0.0209961 0.0241772 -0.028185 -0.0151969c-0.0046378,-0.0025 -0.00930709,-0.00494488 -0.0140039,-0.00733071 -0.181374,-0.0921772 -0.418575,-0.107303 -0.614335,-0.0575039 -0.0979567,0.0249213 -0.195657,0.0683898 -0.272114,0.135508 -0.0757362,0.0664843 -0.124858,0.150772 -0.137232,0.251453 -0.0176535,0.143657 0.0442913,0.28687 0.121417,0.404591 0.00892126,0.0136181 0.0176378,0.0273661 0.0262323,0.0411929 0.0141339,0.0227362 0.0297283,0.052315 0.0551929,0.0638819 0.0337992,0.0153543 0.0634803,-0.00250394 0.094626,-0.0162008l0.0176024 -0.00774016c0.146909,-0.0645984 0.286063,-0.0399213 0.406094,0.0652362 0.0856457,0.0750276 0.151764,0.178689 0.20178,0.280346l0.0177559 0.0360984 -0.0361969 0.0175472z"/>
    <path class="fil2"
          d="M4.23767 4.66637c-0.053874,-0.108374 -0.12489,-0.217618 -0.216362,-0.297756 -0.143315,-0.125551 -0.306457,-0.152531 -0.481799,-0.0767362 -0.00604331,0.00261024 -0.0120827,0.00522441 -0.0181142,0.00786614 -0.000724409,0.000318898 -0.00144882,0.000661417 -0.0021378,0.00105118l-0.0355866 0.0201417 -0.0193504 -0.0360197c-0.00092126,-0.0017126 -0.00188583,-0.0033937 -0.00291339,-0.00504331 -0.00887008,-0.0142756 -0.0177402,-0.0285591 -0.0269528,-0.0426181 -0.0673543,-0.102776 -0.125614,-0.230835 -0.110165,-0.356551 0.0101299,-0.0824409 0.051437,-0.151713 0.113335,-0.206051 0.0679094,-0.0596142 0.155276,-0.0977835 0.242232,-0.119906 0.179937,-0.0457795 0.397134,-0.0329606 0.563953,0.0517795 0.0136417,0.00692913 0.0270118,0.0143583 0.0402008,0.0221142 0.0209882,0.0123425 0.031878,0.0216929 0.0559843,0.0140197 0.0172953,-0.00550394 0.0232362,-0.0150197 0.0339803,-0.0292126 0.0155472,-0.0205433 0.032252,-0.0395315 0.0507244,-0.0574961 0.0937913,-0.0912362 0.209953,-0.161484 0.337976,-0.191571 0.103953,-0.0244252 0.210142,-0.0206929 0.313169,0.00609843l0.0334843 0.00870866 -0.00379528 0.0343898c-0.000834646,0.00755906 -0.00172441,0.0151102 -0.00265748,0.0226535 -0.0280354,0.226075 -0.101559,0.443449 -0.215437,0.640689 -0.143748,0.248984 -0.347244,0.457354 -0.593283,0.605886l-0.0371614 0.022437 -0.0193228 -0.038874z"/></g>
  <rect class="fil0" height="6.82666" width="6.82666"/></svg>
