%YAML 1.1
%TAG !u! tag:unity3d.com,2011:
--- !u!1045 &1
EditorBuildSettings:
  m_ObjectHideFlags: 0
  serializedVersion: 2
  m_Scenes:
  - enabled: 1
    path: Assets/Scenes/Menu.unity
    guid: 13f56cdc48146294795de10aef9bcfe7
  - enabled: 1
    path: Assets/Scenes/SinglePlayerScene.unity
    guid: 2cda990e2423bbf4892e6590ba056729
  - enabled: 1
    path: Assets/Scenes/MultiPlayerMenu.unity
    guid: de560ebd6dc832746a417503778d7b25
  - enabled: 1
    path: Assets/Scenes/MatchMaking.unity
    guid: ba4e9634974ca9b439a39380ee6829e9
  - enabled: 1
    path: Assets/Scenes/RaceModeScene.unity
    guid: 69dd230c216ed3d44a6133812cb250d1
  - enabled: 1
    path: Assets/Scenes/SurvivalModeScene.unity
    guid: 4620ec5e25026594cb9c1c39c0c169c9
  - enabled: 1
    path: Assets/Scenes/TimeTrialModeScene.unity
    guid: f9ae4752ed5b51349a72f308f71ad184
  - enabled: 1
    path: Assets/Scenes/PreferencesMenu.unity
    guid: 3161cbf5f1dcdef4fbd6e1f1d147bb35
  m_configObjects: {}
