%!PS-Adobe-3.0 EPSF-3.0
%%Creator: cairo 1.15.10 (http://cairographics.org)
%%CreationDate: Sat Jul  4 12:50:09 2020
%%Pages: 1
%%DocumentData: Clean7Bit
%%LanguageLevel: 2
%%BoundingBox: 64 35 1261 790
%%EndComments
%%BeginProlog
50 dict begin
/q { gsave } bind def
/Q { grestore } bind def
/cm { 6 array astore concat } bind def
/w { setlinewidth } bind def
/J { setlinecap } bind def
/j { setlinejoin } bind def
/M { setmiterlimit } bind def
/d { setdash } bind def
/m { moveto } bind def
/l { lineto } bind def
/c { curveto } bind def
/h { closepath } bind def
/re { exch dup neg 3 1 roll 5 3 roll moveto 0 rlineto
      0 exch rlineto 0 rlineto closepath } bind def
/S { stroke } bind def
/f { fill } bind def
/f* { eofill } bind def
/n { newpath } bind def
/W { clip } bind def
/W* { eoclip } bind def
/BT { } bind def
/ET { } bind def
/BDC { mark 3 1 roll /BDC pdfmark } bind def
/EMC { mark /EMC pdfmark } bind def
/cairo_store_point { /cairo_point_y exch def /cairo_point_x exch def } def
/Tj { show currentpoint cairo_store_point } bind def
/TJ {
  {
    dup
    type /stringtype eq
    { show } { -0.001 mul 0 cairo_font_matrix dtransform rmoveto } ifelse
  } forall
  currentpoint cairo_store_point
} bind def
/cairo_selectfont { cairo_font_matrix aload pop pop pop 0 0 6 array astore
    cairo_font exch selectfont cairo_point_x cairo_point_y moveto } bind def
/Tf { pop /cairo_font exch def /cairo_font_matrix where
      { pop cairo_selectfont } if } bind def
/Td { matrix translate cairo_font_matrix matrix concatmatrix dup
      /cairo_font_matrix exch def dup 4 get exch 5 get cairo_store_point
      /cairo_font where { pop cairo_selectfont } if } bind def
/Tm { 2 copy 8 2 roll 6 array astore /cairo_font_matrix exch def
      cairo_store_point /cairo_font where { pop cairo_selectfont } if } bind def
/g { setgray } bind def
/rg { setrgbcolor } bind def
/d1 { setcachedevice } bind def
/cairo_data_source {
  CairoDataIndex CairoData length lt
    { CairoData CairoDataIndex get /CairoDataIndex CairoDataIndex 1 add def }
    { () } ifelse
} def
/cairo_flush_ascii85_file { cairo_ascii85_file status { cairo_ascii85_file flushfile } if } def
/cairo_image { image cairo_flush_ascii85_file } def
/cairo_imagemask { imagemask cairo_flush_ascii85_file } def
%%EndProlog
%%BeginSetup
%%EndSetup
%%Page: 1 1
%%BeginPageSetup
%%PageBoundingBox: 64 35 1261 790
%%EndPageSetup
q 64 35 1197 755 rectclip
1 0 0 -1 0 845 cm q
0 g
382.395 748.5 m 390.695 739.836 l 382.031 731.535 l 444.297 666.551 l 435.629
 658.246 l 373.367 723.234 l 364.703 714.93 l 356.398 723.594 l 365.062 
731.898 l 356.762 740.562 l 353.668 737.605 349.23 736.52 345.117 737.715
 c 299.449 693.961 l 300.469 689.801 299.195 685.414 296.109 682.449 c 278.781
 665.844 l 278.59 665.66 278.387 665.496 278.188 665.332 c 386.609 535.938
 l 386.605 535.938 l 386.773 535.738 386.93 535.527 387.074 535.305 c 409.734
 499.691 l 417.172 487.969 417.773 473.164 411.316 460.879 c 410.711 459.73
 409.75 458.809 408.578 458.254 c 396.023 452.328 381.262 453.562 369.867
 461.496 c 335.254 485.656 l 335.039 485.809 334.836 485.973 334.645 486.148
 c 210 600 l 209.824 599.809 209.652 599.613 209.461 599.43 c 192.133 582.824
 l 189.035 579.867 184.602 578.781 180.488 579.98 c 134.82 536.223 l 135.84
 532.062 134.566 527.676 131.48 524.711 c 139.781 516.047 l 148.445 524.348
 l 156.75 515.684 l 148.082 507.383 l 210.348 442.395 l 201.684 434.094 
l 139.418 499.078 l 130.754 490.777 l 122.453 499.441 l 131.117 507.742 
l 122.816 516.41 l 118.027 511.832 110.438 511.992 105.848 516.77 c 68.488
 555.762 l 66.195 558.156 66.277 561.953 68.672 564.246 c 73.004 568.398
 l 64.703 577.062 l 73.367 585.363 l 81.668 576.699 l 86 580.852 l 88.395
 583.141 92.191 583.062 94.484 580.668 c 95.453 579.656 l 111.082 636.938
 l 111.543 638.625 112.719 640.031 114.305 640.781 c 123.926 645.336 l 117.234
 652.324 l 114.941 654.715 115.023 658.516 117.414 660.809 c 121.746 664.957
 l 113.445 673.621 l 122.109 681.926 l 130.41 673.262 l 134.746 677.41 l
 137.137 679.703 140.934 679.621 143.227 677.23 c 162.262 657.363 l 162.859
 685.297 l 162.895 686.887 163.559 688.398 164.707 689.5 c 190.703 714.406
 l 191.852 715.508 193.391 716.109 194.98 716.074 c 222.914 715.477 l 203.879
 735.344 l 201.586 737.734 201.668 741.535 204.062 743.828 c 208.395 747.977
 l 200.094 756.641 l 208.758 764.945 l 217.059 756.281 l 221.391 760.43 
l 223.785 762.723 227.582 762.641 229.875 760.25 c 236.566 753.262 l 241.531
 762.684 l 242.348 764.234 243.801 765.348 245.512 765.738 c 303.406 778.902
 l 302.438 779.918 l 300.145 782.309 300.227 786.105 302.617 788.398 c 306.949
 792.551 l 298.648 801.215 l 307.312 809.516 l 315.613 800.852 l 319.945
 805.004 l 322.34 807.297 326.137 807.215 328.43 804.82 c 365.789 765.832
 l 370.367 761.043 370.203 753.453 365.426 748.863 c 373.73 740.199 l h
357.129 757.523 m 348.824 766.195 l 340.156 757.891 l 348.461 749.227 l
 h
254.598 725.773 m 237.27 709.168 l 253.875 691.84 l 271.203 708.441 l h
216.34 687.484 m 217.875 685.07 217.492 681.91 215.426 679.93 c 198.098
 663.324 l 196.031 661.348 192.855 661.102 190.512 662.738 c 174.617 673.832
 l 174.184 653.59 l 209.684 616.539 l 338.59 498.793 l 347.531 507.359 l
 349.398 509.148 352.195 509.543 354.48 508.336 c 367.441 501.508 l 369.859
 503.824 l 363.59 517.066 l 362.484 519.398 362.996 522.18 364.863 523.965
 c 373.805 532.535 l 261.672 666.352 l 226.172 703.402 l 205.934 703.836
 l h
193.719 700.68 m 178.293 685.898 l 193.348 675.395 l 203.574 685.191 l 
h
150.621 626.148 m 167.227 608.82 l 184.555 625.422 l 167.953 642.754 l 
h
287.812 691.109 m 279.504 699.777 l 262.176 683.176 l 270.477 674.508 l
 h
376.738 471.336 m 384.004 466.273 393.305 465.141 401.578 468.301 c 405.09
 476.43 404.352 485.77 399.609 493.246 c 380.875 522.691 l 376.285 518.293
 l 382.559 505.055 l 383.664 502.719 383.148 499.938 381.285 498.152 c 372.621
 489.852 l 370.754 488.062 367.957 487.672 365.672 488.875 c 352.711 495.703
 l 348.121 491.309 l h
201.16 608.094 m 192.859 616.758 l 175.527 600.152 l 183.832 591.488 l 
h
123.18 533.375 m 114.875 542.039 l 106.211 533.738 l 114.512 525.074 l 
h
81.305 559.73 m 97.91 542.402 l 106.574 550.703 l 89.969 568.035 l h
121.934 631.117 m 105.137 569.551 l 127.691 546.008 l 149.352 566.766 l
 138.621 577.969 l 124.137 578.277 l 124.395 590.273 l 141.359 589.91 l 
142.953 589.879 144.465 589.211 145.566 588.062 c 158.02 575.066 l 171.016
 587.52 l 137.809 622.18 l 135.516 624.57 135.598 628.371 137.988 630.66
 c 132.68 636.203 l h
130.051 656.293 m 146.652 638.965 l 155.316 647.266 l 138.715 664.594 l
 h
216.695 739.312 m 233.301 721.984 l 241.965 730.285 l 225.359 747.613 l
 h
250.863 754.648 m 245.32 744.129 l 250.629 738.586 l 253.023 740.879 256.82
 740.801 259.113 738.406 c 292.32 703.746 l 305.316 716.199 l 292.863 729.199
 l 291.766 730.348 291.164 731.887 291.199 733.477 c 291.562 750.445 l 303.559
 750.188 l 303.25 735.707 l 313.984 724.504 l 335.645 745.258 l 313.09 768.797
 l h
315.254 783.887 m 331.855 766.555 l 340.52 774.859 l 323.918 792.188 l 
h
315.254 783.887 m f
306.387 567.652 m 299.203 560.785 287.82 561.027 280.938 568.195 c 239.426
 611.52 l 237.133 613.91 237.215 617.711 239.605 620.004 c 256.938 636.605
 l 259.328 638.898 263.129 638.816 265.418 636.426 c 306.93 593.102 l 313.797
 585.918 313.551 574.535 306.387 567.652 c h
289.602 576.496 m 291.895 574.105 295.691 574.023 298.082 576.316 c 300.477
 578.609 300.559 582.406 298.266 584.801 c 277.512 606.461 l 268.844 598.16
 l h
252.242 615.488 m 260.543 606.824 l 269.207 615.125 l 260.906 623.789 l
 h
252.242 615.488 m f
239.969 636.969 m 234.715 631.934 226.941 630.559 220.273 633.488 c 213.609
 636.418 209.367 643.07 209.52 650.352 c 209.676 657.629 214.203 664.098
 220.984 666.738 c 227.77 669.379 235.477 667.676 240.516 662.418 c 247.379
 655.238 247.137 643.852 239.969 636.969 c h
223.367 654.297 m 221.613 652.621 221.047 650.051 221.926 647.789 c 222.805
 645.527 224.961 644.02 227.387 643.969 c 229.816 643.914 232.035 645.332
 233.012 647.551 c 233.984 649.773 233.527 652.363 231.848 654.117 c 229.555
 656.508 225.762 656.586 223.367 654.297 c h
223.367 654.297 m f
343.562 520.176 m 352.227 528.48 l 319.02 563.137 l 310.355 554.836 l h
343.562 520.176 m f
389.223 472.52 m 397.891 480.824 l 389.586 489.488 l 380.922 481.188 l 
h
389.223 472.52 m f
578.406 142.184 m 569.465 151.129 564.035 162.578 563.125 174.422 c 562.188
 186.613 566.109 197.766 574.164 205.824 c 581.441 213.102 591.234 217 602.043
 217 c 603.207 217 604.383 216.953 605.566 216.863 c 617.414 215.953 628.863
 210.523 637.809 201.578 c 646.75 192.633 652.18 181.188 653.09 169.34 c
 654.027 157.148 650.109 145.996 642.051 137.941 c 625.676 121.566 597.125
 123.469 578.406 142.184 c h
641.125 168.422 m 640.434 177.414 636.242 186.176 629.32 193.098 c 622.398
 200.02 613.637 204.211 604.645 204.902 c 596.004 205.566 588.191 202.883
 582.648 197.34 c 577.109 191.801 574.422 183.988 575.09 175.344 c 575.777
 166.355 579.973 157.594 586.891 150.668 c 594.746 142.816 604.758 138.762
 614.105 138.762 c 621.461 138.762 628.41 141.273 633.562 146.426 c 639.105
 151.969 641.789 159.781 641.125 168.422 c h
641.125 168.422 m f
602.109 165.883 12 12 re f
830.816 191.555 m 830.152 188.879 827.75 187 824.992 187 c 793.312 187 
l 791.598 175 l 812.109 175 l 812.109 163 l 789.883 163 l 788.047 150.152
 l 787.809 148.461 786.855 146.953 785.438 146.008 c 774.926 139 l 794.109
 139 l 794.109 127 l 756.926 127 l 749.438 122.008 l 748.449 121.352 747.293
 121 746.109 121 c 722.109 121 l 722.109 109 l 752.109 109 l 752.109 97 
l 722.109 97 l 722.109 71.625 l 722.109 69.105 720.539 66.859 718.176 65.992
 c 635.957 35.938 544.027 69.25 500.148 145 c 500.109 145 l 500.109 145.07
 l 492.484 158.238 486.582 172.328 482.547 187 c 482.109 187 l 482.109 188.664
 l 478.113 203.785 476.098 219.359 476.109 235 c 476.035 266.57 484.316 
297.594 500.109 324.93 c 500.109 325 l 500.148 325 l 508.047 338.617 517.688
 351.148 528.828 362.273 c 585.508 418.938 672.809 431.32 743.008 392.652
 c 744.922 391.598 746.109 389.586 746.109 387.402 c 746.109 373 l 764.109
 373 l 764.109 361 l 746.109 361 l 746.109 349 l 800.109 349 l 800.109 337
 l 754.594 337 l 766.594 325 l 794.109 325 l 797.422 325 800.109 322.312
 800.109 319 c 800.109 307 l 824.109 307 l 824.109 295 l 800.109 295 l 800.109
 281.988 l 827.469 276.898 l 829.855 276.453 831.742 274.613 832.242 272.234
 c 837.84 245.578 837.352 218 830.816 191.555 c h
566.109 271 m 566.109 283 l 698.109 283 l 698.109 313 l 507.234 313 l 502.199
 303.422 498.113 293.375 495.039 283 c 530.109 283 l 530.109 271 l 491.961
 271 l 489.824 261.133 488.57 251.09 488.227 241 c 608.109 241 l 608.109
 271 l h
821.273 265.844 m 793.012 271.102 l 790.168 271.629 788.109 274.109 788.109
 277 c 788.109 313 l 764.109 313 l 762.516 313 760.992 313.633 759.867 314.758
 c 735.867 338.758 l 734.738 339.883 734.109 341.41 734.109 343 c 734.109
 383.824 l 675.438 414.539 604.203 407.953 552.156 367 c 584.109 367 l 584.109
 355 l 538.551 355 l 538.141 354.598 537.727 354.199 537.312 353.793 c 528.578
 345.066 520.82 335.41 514.184 325 c 650.109 325 l 650.109 355 l 620.109
 355 l 620.109 367 l 722.109 367 l 722.109 355 l 662.109 355 l 662.109 325
 l 734.109 325 l 734.109 313 l 710.109 313 l 710.109 283 l 776.109 283 l
 776.109 271 l 620.109 271 l 620.109 241 l 788.109 241 l 788.109 229 l 734.109
 229 l 734.109 199 l 770.109 199 l 770.109 187 l 662.109 187 l 662.109 199
 l 722.109 199 l 722.109 229 l 488.227 229 l 488.57 218.906 489.824 208.867
 491.961 199 c 554.109 199 l 554.109 187 l 495.039 187 l 498.113 176.625
 502.199 166.578 507.234 157 c 554.109 157 l 554.109 145 l 514.184 145 l
 520.82 134.586 528.578 124.934 537.312 116.207 c 537.723 115.797 538.141
 115.402 538.551 115 c 578.109 115 l 578.109 103 l 552.156 103 l 596.848
 67.863 656.254 57.66 710.109 75.867 c 710.109 127 l 710.109 130.312 712.793
 133 716.109 133 c 744.293 133 l 776.547 154.504 l 782.172 193.848 l 782.594
 196.805 785.125 198.996 788.109 199 c 820.23 199 l 825.023 220.988 825.375
 243.715 821.273 265.844 c h
821.273 265.844 m f
668.109 145 78 12 re f
590.109 103 12 12 re f
614.109 103 84 12 re f
596.109 355 12 12 re f
542.109 271 12 12 re f
800.109 229 12 12 re f
734.109 73 12 12 re f
806.109 139 12 12 re f
776.109 361 12 12 re f
1254.703 651.664 m 1254.703 791.289 l 1254.703 801.23 1246.645 809.289 
1236.703 809.289 c 1226.762 809.289 1218.703 801.23 1218.703 791.289 c 1218.703
 683.289 l 1206.703 683.289 l 1196.766 683.277 1188.715 675.227 1188.703
 665.289 c 1188.703 654.586 l 1140.715 658.02 l 1129.285 684.289 1103.367
 701.281 1074.719 701.289 c 1046.07 701.293 1020.145 684.312 1008.703 658.047
 c 1008.703 689.289 l 996.703 689.289 l 996.703 657.16 l 984.703 656.305
 l 984.703 671.289 l 972.703 671.289 l 972.703 655.445 l 960.703 654.586
 l 960.703 665.289 l 960.691 675.227 952.641 683.277 942.703 683.289 c 930.703
 683.289 l 930.703 791.289 l 930.703 801.23 922.645 809.289 912.703 809.289
 c 902.762 809.289 894.703 801.23 894.703 791.289 c 894.703 651.664 l 890.996
 649.523 888.707 645.57 888.703 641.289 c 888.703 617.289 l 888.707 613.008
 890.996 609.055 894.703 606.914 c 894.703 467.289 l 894.703 457.348 902.762
 449.289 912.703 449.289 c 922.645 449.289 930.703 457.348 930.703 467.289
 c 930.703 575.289 l 942.703 575.289 l 952.641 575.301 960.691 583.352 960.703
 593.289 c 960.703 603.988 l 1008.691 600.559 l 1011.496 594.141 1015.223
 588.168 1019.754 582.82 c 1010.461 573.531 l 1018.945 565.047 l 1028.238
 574.336 l 1034.074 569.391 1040.66 565.402 1047.75 562.527 c 1050.785 544.305
 l 1051.266 541.41 1053.77 539.289 1056.703 539.289 c 1092.703 539.289 l
 1095.637 539.289 1098.141 541.41 1098.621 544.305 c 1101.656 562.527 l 
1108.746 565.402 1115.332 569.391 1121.168 574.336 c 1130.461 565.047 l 
1138.945 573.531 l 1129.652 582.82 l 1134.184 588.168 1137.91 594.141 1140.715
 600.559 c 1188.703 603.988 l 1188.703 593.289 l 1188.715 583.352 1196.766
 575.301 1206.703 575.289 c 1218.703 575.289 l 1218.703 467.289 l 1218.703
 457.348 1226.762 449.289 1236.703 449.289 c 1246.645 449.289 1254.703 457.348
 1254.703 467.289 c 1254.703 606.914 l 1258.41 609.055 1260.699 613.008 
1260.703 617.289 c 1260.703 641.289 l 1260.699 645.57 1258.41 649.523 1254.703
 651.664 c h
1248.703 617.289 m 1224.703 617.289 l 1224.703 641.289 l 1248.703 641.289
 l 1248.711 617.289 l h
1236.703 797.289 m 1240.016 797.285 1242.699 794.602 1242.703 791.289 c
 1242.703 653.289 l 1230.703 653.289 l 1230.703 791.289 l 1230.707 794.602
 1233.391 797.285 1236.703 797.289 c h
900.703 617.289 m 900.703 641.289 l 924.703 641.289 l 924.703 617.289 l
 h
912.703 797.289 m 916.016 797.285 918.699 794.602 918.703 791.289 c 918.703
 653.289 l 906.703 653.289 l 906.703 791.289 l 906.707 794.602 909.391 797.285
 912.703 797.289 c h
912.703 461.289 m 909.391 461.293 906.707 463.977 906.703 467.289 c 906.703
 605.289 l 918.703 605.289 l 918.703 467.289 l 918.699 463.977 916.016 461.293
 912.703 461.289 c h
948.703 593.289 m 948.699 589.977 946.016 587.293 942.703 587.289 c 930.703
 587.289 l 930.703 605.289 l 932.293 605.289 933.82 605.922 934.945 607.047
 c 936.07 608.172 936.703 609.695 936.703 611.289 c 936.703 647.289 l 936.703
 648.879 936.07 650.406 934.945 651.531 c 933.82 652.656 932.293 653.289
 930.703 653.289 c 930.703 671.289 l 942.703 671.289 l 946.016 671.285 948.699
 668.602 948.703 665.289 c h
960.703 616.02 m 960.703 642.559 l 1004.59 645.695 l 1003.789 642.27 1003.246
 638.793 1002.957 635.289 c 984.703 635.289 l 984.703 623.289 l 1002.957
 623.289 l 1003.246 619.785 1003.789 616.305 1004.59 612.883 c h
1014.703 629.289 m 1014.691 652.469 1028.035 673.578 1048.98 683.508 c 
1069.926 693.438 1094.719 690.406 1112.652 675.723 c 1099.844 662.914 l 
1083.129 675.426 1059.762 673.758 1045 658.992 c 1030.234 644.23 1028.566
 620.863 1041.078 604.148 c 1028.27 591.34 l 1019.488 602.035 1014.691 615.449
 1014.703 629.289 c h
1074.703 622.07 m 1069.598 624.184 l 1067.484 629.289 l 1069.598 634.395
 l 1074.703 636.508 l 1079.809 634.395 l 1081.922 629.289 l 1079.809 624.184
 l h
1082.992 646.062 m 1080.703 647.012 l 1080.703 658.684 l 1084.461 657.918
 1088.039 656.43 1091.234 654.305 c h
1068.703 647.012 m 1066.414 646.062 l 1058.172 654.305 l 1061.367 656.43
 1064.945 657.918 1068.703 658.684 c h
1049.688 645.82 m 1057.93 637.578 l 1056.98 635.289 l 1045.309 635.289 
l 1046.074 639.047 1047.562 642.625 1049.688 645.82 c h
1056.98 623.289 m 1057.93 621 l 1049.688 612.758 l 1047.562 615.953 1046.074
 619.527 1045.309 623.289 c h
1066.414 612.516 m 1068.703 611.566 l 1068.703 599.887 l 1064.945 600.656
 1061.367 602.145 1058.172 604.27 c h
1080.703 611.566 m 1082.992 612.516 l 1091.234 604.273 l 1088.039 602.145
 1084.465 600.656 1080.703 599.887 c h
1091.477 621 m 1092.426 623.289 l 1104.102 623.289 l 1103.336 619.527 1101.848
 615.953 1099.723 612.758 c h
1092.426 635.289 m 1091.477 637.578 l 1099.719 645.82 l 1101.844 642.625
 1103.332 639.047 1104.102 635.289 c h
1087.621 551.289 m 1061.785 551.289 l 1060.555 558.688 l 1069.895 556.82
 1079.512 556.82 1088.852 558.688 c h
1074.703 569.289 m 1060.863 569.277 1047.449 574.07 1036.754 582.855 c 
1049.562 595.664 l 1064.461 584.496 1084.941 584.496 1099.84 595.664 c 1112.652
 582.855 l 1101.957 574.07 1088.543 569.277 1074.703 569.289 c h
1121.137 591.34 m 1108.328 604.148 l 1119.496 619.047 1119.496 639.527 
1108.328 654.426 c 1121.137 667.238 l 1139.227 645.168 1139.227 613.402 
1121.137 591.336 c h
1144.816 612.883 m 1145.617 616.305 1146.164 619.785 1146.453 623.289 c
 1164.703 623.289 l 1164.703 635.289 l 1146.453 635.289 l 1146.164 638.793
 1145.617 642.27 1144.816 645.695 c 1188.703 642.559 l 1188.703 616.02 l
 h
1206.703 587.289 m 1203.391 587.293 1200.707 589.977 1200.703 593.289 c
 1200.703 665.289 l 1200.707 668.602 1203.391 671.285 1206.703 671.289 c
 1218.703 671.289 l 1218.703 653.289 l 1215.391 653.289 1212.703 650.602
 1212.703 647.289 c 1212.703 611.289 l 1212.703 607.977 1215.391 605.289
 1218.703 605.289 c 1218.703 587.289 l h
1236.703 461.289 m 1233.391 461.293 1230.707 463.977 1230.703 467.289 c
 1230.703 605.289 l 1242.703 605.289 l 1242.703 467.289 l 1242.699 463.977
 1240.016 461.293 1236.703 461.289 c h
1236.703 461.289 m f
Q Q
showpage
%%Trailer
end
%%EOF
