%!PS-Adobe-3.0 EPSF-3.0
%%Creator: cairo 1.15.10 (http://cairographics.org)
%%CreationDate: Fri Oct  2 02:17:00 2020
%%Pages: 1
%%DocumentData: Clean7Bit
%%LanguageLevel: 2
%%BoundingBox: 0 0 115 100
%%EndComments
%%BeginProlog
50 dict begin
/q { gsave } bind def
/Q { grestore } bind def
/cm { 6 array astore concat } bind def
/w { setlinewidth } bind def
/J { setlinecap } bind def
/j { setlinejoin } bind def
/M { setmiterlimit } bind def
/d { setdash } bind def
/m { moveto } bind def
/l { lineto } bind def
/c { curveto } bind def
/h { closepath } bind def
/re { exch dup neg 3 1 roll 5 3 roll moveto 0 rlineto
      0 exch rlineto 0 rlineto closepath } bind def
/S { stroke } bind def
/f { fill } bind def
/f* { eofill } bind def
/n { newpath } bind def
/W { clip } bind def
/W* { eoclip } bind def
/BT { } bind def
/ET { } bind def
/BDC { mark 3 1 roll /BDC pdfmark } bind def
/EMC { mark /EMC pdfmark } bind def
/cairo_store_point { /cairo_point_y exch def /cairo_point_x exch def } def
/Tj { show currentpoint cairo_store_point } bind def
/TJ {
  {
    dup
    type /stringtype eq
    { show } { -0.001 mul 0 cairo_font_matrix dtransform rmoveto } ifelse
  } forall
  currentpoint cairo_store_point
} bind def
/cairo_selectfont { cairo_font_matrix aload pop pop pop 0 0 6 array astore
    cairo_font exch selectfont cairo_point_x cairo_point_y moveto } bind def
/Tf { pop /cairo_font exch def /cairo_font_matrix where
      { pop cairo_selectfont } if } bind def
/Td { matrix translate cairo_font_matrix matrix concatmatrix dup
      /cairo_font_matrix exch def dup 4 get exch 5 get cairo_store_point
      /cairo_font where { pop cairo_selectfont } if } bind def
/Tm { 2 copy 8 2 roll 6 array astore /cairo_font_matrix exch def
      cairo_store_point /cairo_font where { pop cairo_selectfont } if } bind def
/g { setgray } bind def
/rg { setrgbcolor } bind def
/d1 { setcachedevice } bind def
/cairo_data_source {
  CairoDataIndex CairoData length lt
    { CairoData CairoDataIndex get /CairoDataIndex CairoDataIndex 1 add def }
    { () } ifelse
} def
/cairo_flush_ascii85_file { cairo_ascii85_file status { cairo_ascii85_file flushfile } if } def
/cairo_image { image cairo_flush_ascii85_file } def
/cairo_imagemask { imagemask cairo_flush_ascii85_file } def
%%EndProlog
%%BeginSetup
%%EndSetup
%%Page: 1 1
%%BeginPageSetup
%%PageBoundingBox: 0 0 115 100
%%EndPageSetup
q 0 0 115 100 rectclip
1 0 0 -1 0 100 cm q
0.94902 g
0.074 51.254 114.289 48.273 re f*
0.074 0.074 114.035 48.859 re f*
1 g
0.074 92.781 36.82 6.746 re f*
0 g
0.152179 w
1 J
1 j
[] 0.0 d
4 M q 1 0 0 1 0 0 cm
0.074 92.781 36.82 6.746 re S Q
9.465 97.402 m 9.465 95.621 l 9.465 95.426 9.469 95.23 9.48 95.043 c 9.418
 95.273 9.359 95.449 9.309 95.574 c 8.621 97.402 l 8.371 97.402 l 7.668 
95.574 l 7.559 95.262 l 7.496 95.043 l 7.512 95.262 l 7.512 97.402 l 7.184
 97.402 l 7.184 94.73 l 7.668 94.73 l 8.387 96.574 l 8.406 96.66 8.426 96.742
 8.449 96.824 c 8.469 96.91 8.484 96.973 8.496 97.012 c 8.504 96.961 8.527
 96.883 8.559 96.777 c 8.59 96.676 8.609 96.605 8.621 96.574 c 9.324 94.73
 l 9.793 94.73 l 9.793 97.402 l h
9.465 97.402 m f
10.477 98.215 m 10.383 98.215 10.305 98.203 10.242 98.184 c 10.242 97.934
 l 10.293 97.941 10.344 97.949 10.398 97.949 c 10.617 97.949 10.789 97.793
 10.914 97.48 c 10.945 97.387 l 10.133 95.34 l 10.492 95.34 l 10.93 96.48
 l 10.93 96.504 10.934 96.527 10.945 96.559 c 10.953 96.582 10.98 96.664
 11.023 96.809 c 11.074 96.945 11.105 97.02 11.117 97.027 c 11.242 96.652
 l 11.695 95.34 l 12.055 95.34 l 11.258 97.402 l 11.172 97.621 11.094 97.781
 11.023 97.887 c 10.949 98 10.867 98.082 10.773 98.137 c 10.688 98.188 10.59
 98.215 10.477 98.215 c h
10.477 98.215 m f
14.645 94.98 m 14.352 94.98 14.121 95.082 13.957 95.277 c 13.789 95.465
 13.707 95.727 13.707 96.059 c 13.707 96.383 13.789 96.645 13.957 96.84 
c 14.133 97.039 14.367 97.137 14.66 97.137 c 15.035 97.137 15.316 96.957
 15.504 96.59 c 15.801 96.73 l 15.695 96.961 15.539 97.137 15.332 97.262
 c 15.133 97.379 14.902 97.434 14.645 97.434 c 14.371 97.434 14.137 97.383
 13.941 97.277 c 13.742 97.164 13.59 97.004 13.488 96.793 c 13.395 96.586
 13.348 96.34 13.348 96.059 c 13.348 95.633 13.461 95.301 13.691 95.059 
c 13.918 94.809 14.238 94.684 14.645 94.684 c 14.926 94.684 15.16 94.742
 15.348 94.855 c 15.543 94.973 15.691 95.137 15.785 95.355 c 15.441 95.465
 l 15.379 95.309 15.273 95.191 15.129 95.105 c 14.992 95.023 14.832 94.98
 14.645 94.98 c h
14.645 94.98 m f
17.961 96.371 m 17.961 96.738 17.883 97.008 17.727 97.184 c 17.57 97.352
 17.34 97.434 17.039 97.434 c 16.734 97.434 16.508 97.348 16.352 97.168 
c 16.195 96.98 16.117 96.715 16.117 96.371 c 16.117 95.664 16.422 95.309
 17.039 95.309 c 17.359 95.309 17.594 95.398 17.742 95.574 c 17.887 95.742
 17.961 96.008 17.961 96.371 c h
17.602 96.371 m 17.602 96.09 17.559 95.887 17.477 95.762 c 17.391 95.629
 17.25 95.559 17.055 95.559 c 16.855 95.559 16.711 95.629 16.617 95.762 
c 16.523 95.887 16.477 96.09 16.477 96.371 c 16.477 96.645 16.516 96.848
 16.602 96.98 c 16.695 97.117 16.836 97.184 17.023 97.184 c 17.23 97.184
 17.375 97.121 17.461 96.996 c 17.555 96.863 17.602 96.652 17.602 96.371
 c h
17.602 96.371 m f
19.582 97.402 m 19.582 96.105 l 19.582 95.91 19.555 95.773 19.504 95.699
 c 19.449 95.617 19.352 95.574 19.207 95.574 c 19.059 95.574 18.945 95.633
 18.863 95.746 c 18.777 95.852 18.738 96.008 18.738 96.215 c 18.738 97.402
 l 18.395 97.402 l 18.395 95.793 l 18.395 95.555 18.395 95.402 18.395 95.34
 c 18.707 95.34 l 18.707 95.352 18.707 95.371 18.707 95.402 c 18.715 95.426
 18.723 95.457 18.723 95.496 c 18.723 95.527 18.723 95.598 18.723 95.699
 c 18.738 95.699 l 18.809 95.555 18.895 95.457 18.988 95.402 c 19.082 95.34
 19.195 95.309 19.332 95.309 c 19.488 95.309 19.605 95.34 19.691 95.402 
c 19.785 95.465 19.852 95.566 19.895 95.699 c 19.965 95.566 20.051 95.465
 20.145 95.402 c 20.246 95.34 20.371 95.309 20.52 95.309 c 20.727 95.309
 20.879 95.367 20.973 95.48 c 21.066 95.598 21.113 95.777 21.113 96.027 
c 21.113 97.402 l 20.77 97.402 l 20.77 96.105 l 20.77 95.91 20.742 95.773
 20.691 95.699 c 20.637 95.617 20.539 95.574 20.395 95.574 c 20.246 95.574
 20.133 95.633 20.051 95.746 c 19.965 95.852 19.926 96.008 19.926 96.215
 c 19.926 97.402 l h
19.582 97.402 m f
23.375 96.371 m 23.375 97.082 23.125 97.434 22.625 97.434 c 22.301 97.434
 22.086 97.32 21.984 97.09 c 21.969 97.09 l 21.977 97.102 21.984 97.207 
21.984 97.402 c 21.984 98.215 l 21.641 98.215 l 21.641 95.762 l 21.641 95.555
 21.633 95.414 21.625 95.34 c 21.953 95.34 l 21.953 95.352 21.953 95.371
 21.953 95.402 c 21.961 95.434 21.969 95.48 21.969 95.543 c 21.969 95.605
 21.969 95.652 21.969 95.684 c 21.984 95.684 l 22.047 95.551 22.125 95.457
 22.219 95.402 c 22.32 95.34 22.457 95.309 22.625 95.309 c 22.875 95.309
 23.062 95.398 23.188 95.574 c 23.312 95.742 23.375 96.008 23.375 96.371
 c h
23.016 96.371 m 23.016 96.09 22.973 95.887 22.891 95.762 c 22.816 95.637
 22.695 95.574 22.531 95.574 c 22.395 95.574 22.285 95.605 22.203 95.668
 c 22.129 95.723 22.07 95.809 22.031 95.934 c 22 96.051 21.984 96.207 21.984
 96.402 c 21.984 96.676 22.023 96.871 22.109 96.996 c 22.191 97.121 22.332
 97.184 22.531 97.184 c 22.695 97.184 22.816 97.121 22.891 96.996 c 22.973
 96.871 23.016 96.664 23.016 96.371 c h
23.016 96.371 m f
24.137 95.34 m 24.137 96.652 l 24.137 96.789 24.145 96.895 24.168 96.965
 c 24.199 97.039 24.238 97.098 24.293 97.137 c 24.355 97.168 24.441 97.184
 24.559 97.184 c 24.723 97.184 24.855 97.129 24.949 97.012 c 25.043 96.898
 25.09 96.742 25.09 96.543 c 25.09 95.34 l 25.434 95.34 l 25.434 96.965 
l 25.434 97.207 25.438 97.352 25.449 97.402 c 25.121 97.402 l 25.121 97.395
 25.121 97.379 25.121 97.355 c 25.121 97.324 25.121 97.293 25.121 97.262
 c 25.121 97.223 25.113 97.152 25.105 97.059 c 25.02 97.195 24.926 97.293
 24.824 97.355 c 24.73 97.406 24.605 97.434 24.449 97.434 c 24.219 97.434
 24.051 97.383 23.949 97.277 c 23.844 97.164 23.793 96.977 23.793 96.715
 c 23.793 95.34 l h
24.137 95.34 m f
26.758 97.387 m 26.652 97.418 26.539 97.434 26.414 97.434 c 26.141 97.434
 26.008 97.277 26.008 96.965 c 26.008 95.59 l 25.773 95.59 l 25.773 95.34
 l 26.023 95.34 l 26.117 94.887 l 26.352 94.887 l 26.352 95.34 l 26.727 
95.34 l 26.727 95.59 l 26.352 95.59 l 26.352 96.887 l 26.352 96.992 26.367
 97.066 26.398 97.105 c 26.43 97.148 26.484 97.168 26.57 97.168 c 26.609
 97.168 26.672 97.16 26.758 97.137 c h
26.758 97.387 m f
27.324 96.449 m 27.324 96.68 27.371 96.863 27.465 96.996 c 27.559 97.121
 27.699 97.184 27.887 97.184 c 28.031 97.184 28.152 97.16 28.246 97.105 
c 28.34 97.043 28.402 96.965 28.434 96.871 c 28.73 96.949 l 28.605 97.273
 28.324 97.434 27.887 97.434 c 27.582 97.434 27.355 97.348 27.199 97.168
 c 27.043 96.992 26.965 96.723 26.965 96.355 c 26.965 96.023 27.043 95.77
 27.199 95.59 c 27.355 95.402 27.578 95.309 27.871 95.309 c 28.473 95.309
 28.777 95.676 28.777 96.402 c 28.777 96.449 l h
28.434 96.184 m 28.41 95.965 28.355 95.809 28.262 95.715 c 28.168 95.613
 28.035 95.559 27.871 95.559 c 27.703 95.559 27.574 95.617 27.48 95.73 c
 27.387 95.836 27.332 95.988 27.324 96.184 c h
28.434 96.184 m f
29.227 97.402 m 29.227 95.824 l 29.227 95.68 29.227 95.52 29.227 95.34 
c 29.539 95.34 l 29.547 95.582 29.555 95.723 29.555 95.762 c 29.57 95.762
 l 29.621 95.586 29.684 95.465 29.758 95.402 c 29.828 95.34 29.93 95.309
 30.055 95.309 c 30.094 95.309 30.141 95.316 30.195 95.324 c 30.195 95.637
 l 30.141 95.629 30.078 95.621 30.008 95.621 c 29.859 95.621 29.75 95.684
 29.68 95.809 c 29.605 95.934 29.57 96.105 29.57 96.324 c 29.57 97.402 l
 h
29.227 97.402 m f
1 g
0.074 0.074 39.699 6.75 re f*
0 g
q 1 0 0 1 0 0 cm
0.074 0.074 39.699 6.75 re S Q
3.66 2.82 m 3.66 3.082 3.574 3.285 3.41 3.43 c 3.242 3.578 3.02 3.648 2.738
 3.648 c 1.957 3.648 l 1.957 4.695 l 1.582 4.695 l 1.582 2.023 l 2.723 2.023
 l 3.012 2.023 3.242 2.098 3.41 2.242 c 3.574 2.379 3.66 2.57 3.66 2.82 
c h
3.301 2.82 m 3.301 2.477 3.09 2.305 2.676 2.305 c 1.957 2.305 l 1.957 3.367
 l 2.691 3.367 l 3.098 3.367 3.301 3.188 3.301 2.82 c h
3.301 2.82 m f
6.293 3.961 m 6.293 4.203 6.191 4.391 5.996 4.523 c 5.809 4.66 5.535 4.727
 5.184 4.727 c 4.527 4.727 4.145 4.504 4.043 4.055 c 4.402 3.977 l 4.441
 4.145 4.527 4.266 4.652 4.336 c 4.785 4.41 4.969 4.445 5.199 4.445 c 5.426
 4.445 5.605 4.41 5.73 4.336 c 5.863 4.254 5.934 4.133 5.934 3.977 c 5.934
 3.895 5.91 3.828 5.871 3.773 c 5.828 3.711 5.77 3.664 5.699 3.633 c 5.625
 3.594 5.535 3.562 5.434 3.539 c 5.34 3.52 5.23 3.492 5.105 3.461 c 4.895
 3.41 4.734 3.363 4.621 3.32 c 4.516 3.27 4.434 3.219 4.371 3.164 c 4.309
 3.102 4.254 3.035 4.215 2.961 c 4.184 2.891 4.168 2.801 4.168 2.695 c 4.168
 2.469 4.254 2.289 4.434 2.164 c 4.609 2.039 4.859 1.977 5.184 1.977 c 5.496
 1.977 5.73 2.023 5.887 2.117 c 6.043 2.211 6.156 2.375 6.23 2.602 c 5.871
 2.664 l 5.828 2.52 5.75 2.414 5.637 2.352 c 5.531 2.289 5.379 2.258 5.184
 2.258 c 4.973 2.258 4.812 2.297 4.699 2.367 c 4.582 2.43 4.527 2.535 4.527
 2.68 c 4.527 2.766 4.547 2.832 4.59 2.883 c 4.629 2.938 4.691 2.984 4.777
 3.023 c 4.859 3.055 5.027 3.098 5.277 3.148 c 5.359 3.172 5.438 3.191 5.512
 3.211 c 5.594 3.234 5.672 3.258 5.746 3.289 c 5.828 3.312 5.902 3.344 5.965
 3.383 c 6.027 3.414 6.078 3.457 6.121 3.508 c 6.172 3.562 6.215 3.625 6.246
 3.695 c 6.277 3.77 6.293 3.859 6.293 3.961 c h
6.293 3.961 m f
6.832 3.039 m 6.832 2.633 l 7.191 2.633 l 7.191 3.039 l h
6.832 4.695 m 6.832 4.305 l 7.191 4.305 l 7.191 4.695 l h
6.832 4.695 m f
9.945 2.82 m 9.945 3.082 9.859 3.285 9.695 3.43 c 9.527 3.578 9.305 3.648
 9.023 3.648 c 8.242 3.648 l 8.242 4.695 l 7.867 4.695 l 7.867 2.023 l 9.008
 2.023 l 9.297 2.023 9.527 2.098 9.695 2.242 c 9.859 2.379 9.945 2.57 9.945
 2.82 c h
9.586 2.82 m 9.586 2.477 9.375 2.305 8.961 2.305 c 8.242 2.305 l 8.242 
3.367 l 8.977 3.367 l 9.383 3.367 9.586 3.188 9.586 2.82 c h
9.586 2.82 m f
10.422 4.695 m 10.422 3.117 l 10.422 2.973 10.422 2.812 10.422 2.633 c 
10.734 2.633 l 10.742 2.875 10.75 3.016 10.75 3.055 c 10.766 3.055 l 10.816
 2.879 10.879 2.758 10.953 2.695 c 11.023 2.633 11.125 2.602 11.25 2.602
 c 11.289 2.602 11.336 2.609 11.391 2.617 c 11.391 2.93 l 11.336 2.922 11.273
 2.914 11.203 2.914 c 11.055 2.914 10.945 2.977 10.875 3.102 c 10.801 3.227
 10.766 3.398 10.766 3.617 c 10.766 4.695 l h
10.422 4.695 m f
13.457 3.664 m 13.457 4.031 13.379 4.301 13.223 4.477 c 13.066 4.645 12.836
 4.727 12.535 4.727 c 12.23 4.727 12.004 4.641 11.848 4.461 c 11.691 4.273
 11.613 4.008 11.613 3.664 c 11.613 2.957 11.918 2.602 12.535 2.602 c 12.855
 2.602 13.09 2.691 13.238 2.867 c 13.383 3.035 13.457 3.301 13.457 3.664
 c h
13.098 3.664 m 13.098 3.383 13.055 3.18 12.973 3.055 c 12.887 2.922 12.746
 2.852 12.551 2.852 c 12.352 2.852 12.207 2.922 12.113 3.055 c 12.02 3.18
 11.973 3.383 11.973 3.664 c 11.973 3.938 12.012 4.141 12.098 4.273 c 12.191
 4.41 12.332 4.477 12.52 4.477 c 12.727 4.477 12.871 4.414 12.957 4.289 
c 13.051 4.156 13.098 3.945 13.098 3.664 c h
13.098 3.664 m f
15.188 4.367 m 15.125 4.492 15.039 4.586 14.938 4.648 c 14.832 4.699 14.703
 4.727 14.547 4.727 c 14.285 4.727 14.094 4.645 13.969 4.477 c 13.844 4.301
 13.781 4.035 13.781 3.68 c 13.781 2.961 14.035 2.602 14.547 2.602 c 14.703
 2.602 14.832 2.633 14.938 2.695 c 15.039 2.75 15.125 2.836 15.188 2.961
 c 15.188 1.883 l 15.531 1.883 l 15.531 4.273 l 15.531 4.484 15.531 4.625
 15.531 4.695 c 15.219 4.695 l 15.207 4.676 15.195 4.629 15.188 4.555 c 
15.188 4.484 15.188 4.422 15.188 4.367 c h
14.141 3.664 m 14.141 3.957 14.176 4.164 14.25 4.289 c 14.332 4.414 14.457
 4.477 14.625 4.477 c 14.82 4.477 14.961 4.41 15.047 4.273 c 15.141 4.141
 15.188 3.93 15.188 3.648 c 15.188 3.379 15.141 3.18 15.047 3.055 c 14.961
 2.922 14.828 2.852 14.641 2.852 c 14.461 2.852 14.332 2.922 14.25 3.055
 c 14.176 3.18 14.141 3.383 14.141 3.664 c h
14.141 3.664 m f
16.387 2.633 m 16.387 3.945 l 16.387 4.082 16.395 4.188 16.418 4.258 c 
16.449 4.332 16.488 4.391 16.543 4.43 c 16.605 4.461 16.691 4.477 16.809
 4.477 c 16.973 4.477 17.105 4.422 17.199 4.305 c 17.293 4.191 17.34 4.035
 17.34 3.836 c 17.34 2.633 l 17.684 2.633 l 17.684 4.258 l 17.684 4.5 17.688
 4.645 17.699 4.695 c 17.371 4.695 l 17.371 4.688 17.371 4.672 17.371 4.648
 c 17.371 4.617 17.371 4.586 17.371 4.555 c 17.371 4.516 17.363 4.445 17.355
 4.352 c 17.27 4.488 17.176 4.586 17.074 4.648 c 16.98 4.699 16.855 4.727
 16.699 4.727 c 16.469 4.727 16.301 4.676 16.199 4.57 c 16.094 4.457 16.043
 4.27 16.043 4.008 c 16.043 2.633 l h
16.387 2.633 m f
18.477 3.664 m 18.477 3.938 18.516 4.141 18.602 4.273 c 18.695 4.398 18.828
 4.461 19.008 4.461 c 19.121 4.461 19.219 4.43 19.305 4.367 c 19.387 4.305
 19.438 4.203 19.461 4.055 c 19.805 4.086 l 19.773 4.285 19.684 4.441 19.539
 4.555 c 19.402 4.672 19.227 4.727 19.008 4.727 c 18.727 4.727 18.508 4.641
 18.352 4.461 c 18.203 4.285 18.133 4.02 18.133 3.664 c 18.133 3.32 18.203
 3.062 18.352 2.883 c 18.508 2.695 18.727 2.602 19.008 2.602 c 19.215 2.602
 19.387 2.66 19.523 2.773 c 19.668 2.879 19.758 3.023 19.789 3.211 c 19.445
 3.242 l 19.422 3.129 19.375 3.039 19.305 2.977 c 19.23 2.906 19.125 2.867
 18.992 2.867 c 18.812 2.867 18.684 2.93 18.602 3.055 c 18.516 3.172 18.477
 3.375 18.477 3.664 c h
18.477 3.664 m f
20.953 4.68 m 20.848 4.711 20.734 4.727 20.609 4.727 c 20.336 4.727 20.203
 4.57 20.203 4.258 c 20.203 2.883 l 19.969 2.883 l 19.969 2.633 l 20.219
 2.633 l 20.312 2.18 l 20.547 2.18 l 20.547 2.633 l 20.922 2.633 l 20.922
 2.883 l 20.547 2.883 l 20.547 4.18 l 20.547 4.285 20.562 4.359 20.594 4.398
 c 20.625 4.441 20.68 4.461 20.766 4.461 c 20.805 4.461 20.867 4.453 20.953
 4.43 c h
20.953 4.68 m f
21.254 2.195 m 21.254 1.883 l 21.598 1.883 l 21.598 2.195 l h
21.254 4.695 m 21.254 2.633 l 21.598 2.633 l 21.598 4.695 l h
21.254 4.695 m f
23.855 3.664 m 23.855 4.031 23.777 4.301 23.621 4.477 c 23.465 4.645 23.234
 4.727 22.934 4.727 c 22.629 4.727 22.402 4.641 22.246 4.461 c 22.09 4.273
 22.012 4.008 22.012 3.664 c 22.012 2.957 22.316 2.602 22.934 2.602 c 23.254
 2.602 23.488 2.691 23.637 2.867 c 23.781 3.035 23.855 3.301 23.855 3.664
 c h
23.496 3.664 m 23.496 3.383 23.453 3.18 23.371 3.055 c 23.285 2.922 23.145
 2.852 22.949 2.852 c 22.75 2.852 22.605 2.922 22.512 3.055 c 22.418 3.18
 22.371 3.383 22.371 3.664 c 22.371 3.938 22.41 4.141 22.496 4.273 c 22.59
 4.41 22.73 4.477 22.918 4.477 c 23.125 4.477 23.27 4.414 23.355 4.289 c
 23.449 4.156 23.496 3.945 23.496 3.664 c h
23.496 3.664 m f
25.586 4.695 m 25.586 3.398 l 25.586 3.266 25.57 3.16 25.539 3.086 c 25.516
 3.004 25.477 2.945 25.414 2.914 c 25.359 2.883 25.277 2.867 25.164 2.867
 c 24.996 2.867 24.867 2.926 24.773 3.039 c 24.68 3.156 24.633 3.312 24.633
 3.508 c 24.633 4.695 l 24.289 4.695 l 24.289 3.086 l 24.289 2.848 24.289
 2.695 24.289 2.633 c 24.602 2.633 l 24.602 2.645 24.602 2.664 24.602 2.695
 c 24.609 2.719 24.617 2.75 24.617 2.789 c 24.617 2.82 24.617 2.891 24.617
 2.992 c 24.633 2.992 l 24.703 2.848 24.793 2.75 24.898 2.695 c 25 2.633
 25.133 2.602 25.289 2.602 c 25.508 2.602 25.668 2.66 25.773 2.773 c 25.875
 2.891 25.93 3.07 25.93 3.32 c 25.93 4.695 l h
25.586 4.695 m f
29.691 3.961 m 29.691 4.203 29.59 4.391 29.395 4.523 c 29.207 4.66 28.934
 4.727 28.582 4.727 c 27.926 4.727 27.543 4.504 27.441 4.055 c 27.801 3.977
 l 27.84 4.145 27.926 4.266 28.051 4.336 c 28.184 4.41 28.367 4.445 28.598
 4.445 c 28.824 4.445 29.004 4.41 29.129 4.336 c 29.262 4.254 29.332 4.133
 29.332 3.977 c 29.332 3.895 29.309 3.828 29.27 3.773 c 29.227 3.711 29.168
 3.664 29.098 3.633 c 29.023 3.594 28.934 3.562 28.832 3.539 c 28.738 3.52
 28.629 3.492 28.504 3.461 c 28.293 3.41 28.133 3.363 28.02 3.32 c 27.914
 3.27 27.832 3.219 27.77 3.164 c 27.707 3.102 27.652 3.035 27.613 2.961 
c 27.582 2.891 27.566 2.801 27.566 2.695 c 27.566 2.469 27.652 2.289 27.832
 2.164 c 28.008 2.039 28.258 1.977 28.582 1.977 c 28.895 1.977 29.129 2.023
 29.285 2.117 c 29.441 2.211 29.555 2.375 29.629 2.602 c 29.27 2.664 l 29.227
 2.52 29.148 2.414 29.035 2.352 c 28.93 2.289 28.777 2.258 28.582 2.258 
c 28.371 2.258 28.211 2.297 28.098 2.367 c 27.98 2.43 27.926 2.535 27.926
 2.68 c 27.926 2.766 27.945 2.832 27.988 2.883 c 28.027 2.938 28.09 2.984
 28.176 3.023 c 28.258 3.055 28.426 3.098 28.676 3.148 c 28.758 3.172 28.836
 3.191 28.91 3.211 c 28.992 3.234 29.07 3.258 29.145 3.289 c 29.227 3.312
 29.301 3.344 29.363 3.383 c 29.426 3.414 29.477 3.457 29.52 3.508 c 29.57
 3.562 29.613 3.625 29.645 3.695 c 29.676 3.77 29.691 3.859 29.691 3.961
 c h
29.691 3.961 m f
30.402 3.742 m 30.402 3.973 30.449 4.156 30.543 4.289 c 30.637 4.414 30.777
 4.477 30.965 4.477 c 31.109 4.477 31.23 4.453 31.324 4.398 c 31.418 4.336
 31.48 4.258 31.512 4.164 c 31.809 4.242 l 31.684 4.566 31.402 4.727 30.965
 4.727 c 30.66 4.727 30.434 4.641 30.277 4.461 c 30.121 4.285 30.043 4.016
 30.043 3.648 c 30.043 3.316 30.121 3.062 30.277 2.883 c 30.434 2.695 30.656
 2.602 30.949 2.602 c 31.551 2.602 31.855 2.969 31.855 3.695 c 31.855 3.742
 l h
31.512 3.477 m 31.488 3.258 31.434 3.102 31.34 3.008 c 31.246 2.906 31.113
 2.852 30.949 2.852 c 30.781 2.852 30.652 2.91 30.559 3.023 c 30.465 3.129
 30.41 3.281 30.402 3.477 c h
31.512 3.477 m f
32.305 4.695 m 32.305 3.117 l 32.305 2.973 32.305 2.812 32.305 2.633 c 
32.617 2.633 l 32.625 2.875 32.633 3.016 32.633 3.055 c 32.648 3.055 l 32.699
 2.879 32.762 2.758 32.836 2.695 c 32.906 2.633 33.008 2.602 33.133 2.602
 c 33.172 2.602 33.219 2.609 33.273 2.617 c 33.273 2.93 l 33.219 2.922 33.156
 2.914 33.086 2.914 c 32.938 2.914 32.828 2.977 32.758 3.102 c 32.684 3.227
 32.648 3.398 32.648 3.617 c 32.648 4.695 l h
32.305 4.695 m f
34.512 4.695 m 34.105 4.695 l 33.355 2.633 l 33.715 2.633 l 34.168 3.977
 l 34.188 4.031 34.234 4.18 34.309 4.43 c 34.371 4.211 l 34.449 3.977 l 
34.902 2.633 l 35.277 2.633 l h
34.512 4.695 m f
35.82 3.742 m 35.82 3.973 35.867 4.156 35.961 4.289 c 36.055 4.414 36.195
 4.477 36.383 4.477 c 36.527 4.477 36.648 4.453 36.742 4.398 c 36.836 4.336
 36.898 4.258 36.93 4.164 c 37.227 4.242 l 37.102 4.566 36.82 4.727 36.383
 4.727 c 36.078 4.727 35.852 4.641 35.695 4.461 c 35.539 4.285 35.461 4.016
 35.461 3.648 c 35.461 3.316 35.539 3.062 35.695 2.883 c 35.852 2.695 36.074
 2.602 36.367 2.602 c 36.969 2.602 37.273 2.969 37.273 3.695 c 37.273 3.742
 l h
36.93 3.477 m 36.906 3.258 36.852 3.102 36.758 3.008 c 36.664 2.906 36.531
 2.852 36.367 2.852 c 36.199 2.852 36.07 2.91 35.977 3.023 c 35.883 3.129
 35.828 3.281 35.82 3.477 c h
36.93 3.477 m f
37.723 4.695 m 37.723 3.117 l 37.723 2.973 37.723 2.812 37.723 2.633 c 
38.035 2.633 l 38.043 2.875 38.051 3.016 38.051 3.055 c 38.066 3.055 l 38.117
 2.879 38.18 2.758 38.254 2.695 c 38.324 2.633 38.426 2.602 38.551 2.602
 c 38.59 2.602 38.637 2.609 38.691 2.617 c 38.691 2.93 l 38.637 2.922 38.574
 2.914 38.504 2.914 c 38.355 2.914 38.246 2.977 38.176 3.102 c 38.102 3.227
 38.066 3.398 38.066 3.617 c 38.066 4.695 l h
37.723 4.695 m f
1 g
23.391 25.559 18.414 9.203 re f*
0 g
q 1 0 0 1 0 0 cm
23.391 25.559 18.414 9.203 re S Q
31.773 31.406 m 31.398 31.406 l 30.305 28.734 l 30.695 28.734 l 31.43 30.609
 l 31.586 31.094 l 31.742 30.609 l 32.492 28.734 l 32.867 28.734 l h
31.773 31.406 m f
33.094 31.406 m 33.094 31.172 l 33.156 31.016 33.234 30.887 33.328 30.781
 c 33.422 30.668 33.516 30.562 33.609 30.469 c 33.711 30.375 33.816 30.293
 33.922 30.219 c 34.023 30.137 34.113 30.059 34.188 29.984 c 34.27 29.902
 34.336 29.82 34.391 29.734 c 34.441 29.641 34.469 29.543 34.469 29.438 
c 34.469 29.293 34.422 29.18 34.328 29.094 c 34.242 29.012 34.129 28.969
 33.984 28.969 c 33.836 28.969 33.711 29.012 33.609 29.094 c 33.516 29.168
 33.461 29.277 33.453 29.422 c 33.094 29.391 l 33.125 29.172 33.219 29 33.375
 28.875 c 33.531 28.75 33.734 28.688 33.984 28.688 c 34.242 28.688 34.445
 28.758 34.594 28.891 c 34.738 29.016 34.812 29.195 34.812 29.422 c 34.812
 29.527 34.785 29.633 34.734 29.734 c 34.691 29.84 34.625 29.945 34.531 
30.047 c 34.438 30.141 34.258 30.297 34 30.516 c 33.852 30.641 33.734 30.75
 33.641 30.844 c 33.555 30.938 33.5 31.027 33.469 31.109 c 34.859 31.109
 l 34.859 31.406 l h
33.094 31.406 m f
1 g
1.305 25.559 18.414 9.203 re f*
0 g
q 1 0 0 1 0 0 cm
1.305 25.559 18.414 9.203 re S Q
9.688 31.406 m 9.312 31.406 l 8.219 28.734 l 8.609 28.734 l 9.344 30.609
 l 9.5 31.094 l 9.656 30.609 l 10.406 28.734 l 10.781 28.734 l h
9.688 31.406 m f
11.102 31.406 m 11.102 31.109 l 11.789 31.109 l 11.789 29.062 l 11.18 29.484
 l 11.18 29.172 l 11.805 28.734 l 12.133 28.734 l 12.133 31.109 l 12.773
 31.109 l 12.773 31.406 l h
11.102 31.406 m f
q 1 0 0 1 0 0 cm
23.391 30.469 m 21.645 30.469 l S Q
22.871 30.469 m 22.871 30.754 23.105 30.988 23.391 30.988 c 23.684 30.988
 23.918 30.754 23.918 30.469 c 23.918 30.176 23.684 29.941 23.391 29.941
 c 23.105 29.941 22.871 30.176 22.871 30.469 c h
22.871 30.469 m f*
21.816 31.172 m 19.719 30.469 l 21.816 29.77 l h
21.816 31.172 m f*
q 1 0 0 1 0 0 cm
45.477 30.469 m 43.73 30.469 l S Q
1 g
45.477 25.559 18.414 9.203 re f*
0 g
q 1 0 0 1 0 0 cm
45.477 25.559 18.414 9.203 re S Q
53.863 31.406 m 53.488 31.406 l 52.395 28.734 l 52.785 28.734 l 53.52 30.609
 l 53.676 31.094 l 53.832 30.609 l 54.582 28.734 l 54.957 28.734 l h
53.863 31.406 m f
56.98 30.672 m 56.98 30.914 56.895 31.102 56.73 31.234 c 56.574 31.371 
56.348 31.438 56.059 31.438 c 55.785 31.438 55.566 31.383 55.402 31.266 
c 55.246 31.141 55.152 30.961 55.121 30.719 c 55.48 30.688 l 55.52 31 55.715
 31.156 56.059 31.156 c 56.234 31.156 56.371 31.117 56.465 31.031 c 56.566
 30.949 56.621 30.824 56.621 30.656 c 56.621 30.512 56.562 30.398 56.449
 30.312 c 56.332 30.23 56.172 30.188 55.965 30.188 c 55.777 30.188 l 55.777
 29.891 l 55.949 29.891 l 56.137 29.891 56.281 29.855 56.387 29.781 c 56.488
 29.699 56.543 29.586 56.543 29.438 c 56.543 29.293 56.5 29.18 56.418 29.094
 c 56.332 29.012 56.207 28.969 56.043 28.969 c 55.895 28.969 55.777 29.012
 55.684 29.094 c 55.59 29.168 55.531 29.273 55.512 29.406 c 55.168 29.391
 l 55.199 29.172 55.293 29 55.449 28.875 c 55.605 28.75 55.801 28.688 56.043
 28.688 c 56.312 28.688 56.52 28.75 56.668 28.875 c 56.824 29 56.902 29.172
 56.902 29.391 c 56.902 29.57 56.848 29.711 56.746 29.812 c 56.652 29.918
 56.516 29.992 56.34 30.031 c 56.34 30.047 l 56.535 30.07 56.691 30.137 
56.809 30.25 c 56.922 30.355 56.98 30.496 56.98 30.672 c h
56.98 30.672 m f
44.957 30.469 m 44.957 30.754 45.191 30.988 45.477 30.988 c 45.77 30.988
 46.004 30.754 46.004 30.469 c 46.004 30.176 45.77 29.941 45.477 29.941 
c 45.191 29.941 44.957 30.176 44.957 30.469 c h
44.957 30.469 m f*
43.902 31.172 m 41.805 30.469 l 43.902 29.77 l h
43.902 31.172 m f*
1 g
23.391 64.746 18.414 9.203 re f*
0 g
q 1 0 0 1 0 0 cm
23.391 64.746 18.414 9.203 re S Q
31.773 70.594 m 31.398 70.594 l 30.305 67.922 l 30.695 67.922 l 31.43 69.797
 l 31.586 70.281 l 31.742 69.797 l 32.492 67.922 l 32.867 67.922 l h
31.773 70.594 m f
33.094 70.594 m 33.094 70.359 l 33.156 70.203 33.234 70.074 33.328 69.969
 c 33.422 69.855 33.516 69.75 33.609 69.656 c 33.711 69.562 33.816 69.48
 33.922 69.406 c 34.023 69.324 34.113 69.246 34.188 69.172 c 34.27 69.09
 34.336 69.008 34.391 68.922 c 34.441 68.828 34.469 68.73 34.469 68.625 
c 34.469 68.48 34.422 68.367 34.328 68.281 c 34.242 68.199 34.129 68.156
 33.984 68.156 c 33.836 68.156 33.711 68.199 33.609 68.281 c 33.516 68.355
 33.461 68.465 33.453 68.609 c 33.094 68.578 l 33.125 68.359 33.219 68.188
 33.375 68.062 c 33.531 67.938 33.734 67.875 33.984 67.875 c 34.242 67.875
 34.445 67.945 34.594 68.078 c 34.738 68.203 34.812 68.383 34.812 68.609
 c 34.812 68.715 34.785 68.82 34.734 68.922 c 34.691 69.027 34.625 69.133
 34.531 69.234 c 34.438 69.328 34.258 69.484 34 69.703 c 33.852 69.828 33.734
 69.938 33.641 70.031 c 33.555 70.125 33.5 70.215 33.469 70.297 c 34.859
 70.297 l 34.859 70.594 l h
33.094 70.594 m f
1 g
45.477 64.746 18.414 9.203 re f*
0 g
q 1 0 0 1 0 0 cm
45.477 64.746 18.414 9.203 re S Q
53.863 70.594 m 53.488 70.594 l 52.395 67.922 l 52.785 67.922 l 53.52 69.797
 l 53.676 70.281 l 53.832 69.797 l 54.582 67.922 l 54.957 67.922 l h
53.863 70.594 m f
56.98 69.859 m 56.98 70.102 56.895 70.289 56.73 70.422 c 56.574 70.559 
56.348 70.625 56.059 70.625 c 55.785 70.625 55.566 70.57 55.402 70.453 c
 55.246 70.328 55.152 70.148 55.121 69.906 c 55.48 69.875 l 55.52 70.188
 55.715 70.344 56.059 70.344 c 56.234 70.344 56.371 70.305 56.465 70.219
 c 56.566 70.137 56.621 70.012 56.621 69.844 c 56.621 69.699 56.562 69.586
 56.449 69.5 c 56.332 69.418 56.172 69.375 55.965 69.375 c 55.777 69.375
 l 55.777 69.078 l 55.949 69.078 l 56.137 69.078 56.281 69.043 56.387 68.969
 c 56.488 68.887 56.543 68.773 56.543 68.625 c 56.543 68.48 56.5 68.367 
56.418 68.281 c 56.332 68.199 56.207 68.156 56.043 68.156 c 55.895 68.156
 55.777 68.199 55.684 68.281 c 55.59 68.355 55.531 68.461 55.512 68.594 
c 55.168 68.578 l 55.199 68.359 55.293 68.188 55.449 68.062 c 55.605 67.938
 55.801 67.875 56.043 67.875 c 56.312 67.875 56.52 67.938 56.668 68.062 
c 56.824 68.188 56.902 68.359 56.902 68.578 c 56.902 68.758 56.848 68.898
 56.746 69 c 56.652 69.105 56.516 69.18 56.34 69.219 c 56.34 69.234 l 56.535
 69.258 56.691 69.324 56.809 69.438 c 56.922 69.543 56.98 69.684 56.98 69.859
 c h
56.98 69.859 m f
1 g
1.305 64.746 18.414 9.203 re f*
0 g
q 1 0 0 1 0 0 cm
1.305 64.746 18.414 9.203 re S Q
9.688 70.594 m 9.312 70.594 l 8.219 67.922 l 8.609 67.922 l 9.344 69.797
 l 9.5 70.281 l 9.656 69.797 l 10.406 67.922 l 10.781 67.922 l h
9.688 70.594 m f
11.102 70.594 m 11.102 70.297 l 11.789 70.297 l 11.789 68.25 l 11.18 68.672
 l 11.18 68.359 l 11.805 67.922 l 12.133 67.922 l 12.133 70.297 l 12.773
 70.297 l 12.773 70.594 l h
11.102 70.594 m f
q 1 0 0 1 0 0 cm
23.391 69.656 m 21.645 69.656 l S Q
22.871 69.656 m 22.871 69.949 23.105 70.184 23.391 70.184 c 23.684 70.184
 23.918 69.949 23.918 69.656 c 23.918 69.363 23.684 69.129 23.391 69.129
 c 23.105 69.129 22.871 69.363 22.871 69.656 c h
22.871 69.656 m f*
21.816 70.355 m 19.719 69.656 l 21.816 68.957 l h
21.816 70.355 m f*
q 1 0 0 1 0 0 cm
45.477 69.656 m 43.73 69.656 l S Q
44.957 69.656 m 44.957 69.949 45.191 70.184 45.477 70.184 c 45.77 70.184
 46.004 69.949 46.004 69.656 c 46.004 69.363 45.77 69.129 45.477 69.129 
c 45.191 69.129 44.957 69.363 44.957 69.656 c h
44.957 69.656 m f*
43.902 70.355 m 41.805 69.656 l 43.902 68.957 l h
43.902 70.355 m f*
q
0 0 115 100 re W n
[ 1 0 0 1 0 0 ] concat
  q
1 g
67.562 64.746 18.414 9.203 re f*
0 g
0.152179 w
1 J
1 j
[] 0.0 d
4 M q 1 0 0 1 0 0 cm
67.562 64.746 18.414 9.203 re S Q
75.949 70.594 m 75.574 70.594 l 74.48 67.922 l 74.871 67.922 l 75.605 69.797
 l 75.762 70.281 l 75.918 69.797 l 76.668 67.922 l 77.043 67.922 l h
75.949 70.594 m f
78.738 69.984 m 78.738 70.594 l 78.41 70.594 l 78.41 69.984 l 77.16 69.984
 l 77.16 69.719 l 78.379 67.922 l 78.738 67.922 l 78.738 69.719 l 79.113
 69.719 l 79.113 69.984 l h
78.41 68.297 m 78.41 68.309 78.395 68.344 78.363 68.406 c 78.332 68.469
 78.305 68.512 78.285 68.531 c 77.598 69.547 l 77.504 69.688 l 77.473 69.719
 l 78.41 69.719 l h
78.41 68.297 m f
q 1 0 0 1 0 0 cm
67.609 69.656 m 65.863 69.656 l S Q
67.094 69.656 m 67.094 69.949 67.324 70.184 67.609 70.184 c 67.902 70.184
 68.137 69.949 68.137 69.656 c 68.137 69.363 67.902 69.129 67.609 69.129
 c 67.324 69.129 67.094 69.363 67.094 69.656 c h
67.094 69.656 m f*
66.035 70.355 m 63.938 69.656 l 66.035 68.957 l h
66.035 70.355 m f*
  Q
Q
q
0 0 115 100 re W n
[ 1 0 0 1 0 0 ] concat
  q
1 g
67.562 25.559 18.414 9.203 re f*
  Q
Q
q
0 0 115 100 re W n
[ 1 0 0 1 0 0 ] concat
  q
0 g
0.152179 w
1 J
1 j
[] 0.0 d
4 M q 1 0 0 1 0 0 cm
67.562 25.559 18.414 9.203 re S Q
  Q
Q
q
0 0 115 100 re W n
[ 1 0 0 1 0 0 ] concat
  q
0 g
75.949 31.406 m 75.574 31.406 l 74.48 28.734 l 74.871 28.734 l 75.605 30.609
 l 75.762 31.094 l 75.918 30.609 l 76.668 28.734 l 77.043 28.734 l h
75.949 31.406 m f
79.066 30.531 m 79.066 30.812 78.98 31.039 78.816 31.203 c 78.648 31.359
 78.414 31.438 78.113 31.438 c 77.863 31.438 77.66 31.387 77.504 31.281 
c 77.355 31.18 77.262 31.023 77.223 30.812 c 77.566 30.766 l 77.637 31.039
 77.824 31.172 78.129 31.172 c 78.305 31.172 78.445 31.117 78.551 31 c 78.652
 30.887 78.707 30.734 78.707 30.547 c 78.707 30.383 78.652 30.246 78.551
 30.141 c 78.445 30.039 78.305 29.984 78.129 29.984 c 78.035 29.984 77.945
 30 77.863 30.031 c 77.789 30.055 77.711 30.102 77.629 30.172 c 77.301 30.172
 l 77.395 28.734 l 78.91 28.734 l 78.91 29.016 l 77.707 29.016 l 77.645 
29.875 l 77.801 29.762 77.988 29.703 78.207 29.703 c 78.465 29.703 78.676
 29.781 78.832 29.938 c 78.988 30.086 79.066 30.281 79.066 30.531 c h
79.066 30.531 m f
  Q
Q
q
0 0 115 100 re W n
[ 1 0 0 1 0 0 ] concat
  q
0 g
0.152179 w
1 J
1 j
[] 0.0 d
4 M q 1 0 0 1 0 0 cm
67.562 30.469 m 65.816 30.469 l S Q
  Q
Q
q
0 0 115 100 re W n
[ 1 0 0 1 0 0 ] concat
  q
0 g
67.047 30.469 m 67.047 30.754 67.277 30.988 67.562 30.988 c 67.855 30.988
 68.09 30.754 68.09 30.469 c 68.09 30.176 67.855 29.941 67.562 29.941 c 
67.277 29.941 67.047 30.176 67.047 30.469 c h
67.047 30.469 m f*
  Q
Q
q
0 0 115 100 re W n
[ 1 0 0 1 0 0 ] concat
  q
0 g
65.988 31.172 m 63.891 30.469 l 65.988 29.77 l h
65.988 31.172 m f*
  Q
Q
q
0 0 115 100 re W n
[ 1 0 0 1 0 0 ] concat
  q
1 g
67.562 64.746 18.414 9.203 re f*
0 g
0.152179 w
1 J
1 j
[] 0.0 d
4 M q 1 0 0 1 0 0 cm
67.562 64.746 18.414 9.203 re S Q
75.949 70.594 m 75.574 70.594 l 74.48 67.922 l 74.871 67.922 l 75.605 69.797
 l 75.762 70.281 l 75.918 69.797 l 76.668 67.922 l 77.043 67.922 l h
75.949 70.594 m f
78.738 69.984 m 78.738 70.594 l 78.41 70.594 l 78.41 69.984 l 77.16 69.984
 l 77.16 69.719 l 78.379 67.922 l 78.738 67.922 l 78.738 69.719 l 79.113
 69.719 l 79.113 69.984 l h
78.41 68.297 m 78.41 68.309 78.395 68.344 78.363 68.406 c 78.332 68.469
 78.305 68.512 78.285 68.531 c 77.598 69.547 l 77.504 69.688 l 77.473 69.719
 l 78.41 69.719 l h
78.41 68.297 m f
q 1 0 0 1 0 0 cm
67.609 69.656 m 65.863 69.656 l S Q
67.094 69.656 m 67.094 69.949 67.324 70.184 67.609 70.184 c 67.902 70.184
 68.137 69.949 68.137 69.656 c 68.137 69.363 67.902 69.129 67.609 69.129
 c 67.324 69.129 67.094 69.363 67.094 69.656 c h
67.094 69.656 m f*
66.035 70.355 m 63.938 69.656 l 66.035 68.957 l h
66.035 70.355 m f*
  Q
Q
q
0 0 115 100 re W n
[ 1 0 0 1 0 0 ] concat
  q
1 g
67.73 76.465 18.414 9.203 re f*
  Q
Q
q
0 0 115 100 re W n
[ 1 0 0 1 0 0 ] concat
  q
0 g
0.152179 w
1 J
1 j
[] 0.0 d
4 M q 1 0 0 1 0 0 cm
67.73 76.465 18.414 9.203 re S Q
  Q
Q
q
0 0 115 100 re W n
[ 1 0 0 1 0 0 ] concat
  q
0 g
76.113 82.316 m 75.738 82.316 l 74.645 79.645 l 75.035 79.645 l 75.77 81.52
 l 75.926 82.004 l 76.082 81.52 l 76.832 79.645 l 77.207 79.645 l h
76.113 82.316 m f
79.23 81.441 m 79.23 81.723 79.145 81.949 78.98 82.113 c 78.812 82.27 78.578
 82.348 78.277 82.348 c 78.027 82.348 77.824 82.297 77.668 82.191 c 77.52
 82.09 77.426 81.934 77.387 81.723 c 77.73 81.676 l 77.801 81.949 77.988
 82.082 78.293 82.082 c 78.469 82.082 78.609 82.027 78.715 81.91 c 78.816
 81.797 78.871 81.645 78.871 81.457 c 78.871 81.293 78.816 81.156 78.715
 81.051 c 78.609 80.949 78.469 80.895 78.293 80.895 c 78.199 80.895 78.109
 80.91 78.027 80.941 c 77.953 80.965 77.875 81.012 77.793 81.082 c 77.465
 81.082 l 77.559 79.645 l 79.074 79.645 l 79.074 79.926 l 77.871 79.926 
l 77.809 80.785 l 77.965 80.672 78.152 80.613 78.371 80.613 c 78.629 80.613
 78.84 80.691 78.996 80.848 c 79.152 80.996 79.23 81.191 79.23 81.441 c 
h
79.23 81.441 m f
  Q
Q
q
0 0 115 100 re W n
[ 1 0 0 1 0 0 ] concat
  q
0 g
0.153828 w
1 J
1 j
[] 0.0 d
4 M q 1 0 0 1 0 0 cm
67.117 81.172 m 54.602 81.172 l S Q
67.047 81.172 m 67.047 81.465 67.281 81.699 67.566 81.699 c 67.859 81.699
 68.094 81.465 68.094 81.172 c 68.094 80.875 67.859 80.641 67.566 80.641
 c 67.281 80.641 67.047 80.875 67.047 81.172 c h
67.047 81.172 m f*
53.848 75.973 m 54.547 73.871 l 55.25 75.973 l h
53.848 75.973 m f*
0.107851 w
q 1 0 0 1 0 0 cm
54.531 81.199 m 54.531 75.043 l S Q
  Q
Q
q
0 0 115 100 re W n
[ 1 0 0 1 0 0 ] concat
  q
1 g
89.562 64.773 18.414 9.203 re f*
0 g
0.152179 w
1 J
1 j
[] 0.0 d
4 M q 1 0 0 1 0 0 cm
89.562 64.773 18.414 9.203 re S Q
97.949 70.625 m 97.574 70.625 l 96.48 67.953 l 96.871 67.953 l 97.605 69.828
 l 97.762 70.312 l 97.918 69.828 l 98.668 67.953 l 99.043 67.953 l h
97.949 70.625 m f
101.066 69.75 m 101.066 70.031 100.988 70.258 100.832 70.422 c 100.676 
70.578 100.461 70.656 100.191 70.656 c 99.887 70.656 99.66 70.547 99.504
 70.328 c 99.348 70.102 99.27 69.773 99.27 69.344 c 99.27 68.887 99.348 
68.531 99.504 68.281 c 99.668 68.031 99.91 67.906 100.223 67.906 c 100.629
 67.906 100.883 68.09 100.988 68.453 c 100.66 68.516 l 100.586 68.297 100.441
 68.188 100.223 68.188 c 100.023 68.188 99.867 68.281 99.754 68.469 c 99.648
 68.648 99.598 68.906 99.598 69.25 c 99.66 69.137 99.746 69.047 99.863 68.984
 c 99.977 68.922 100.105 68.891 100.254 68.891 c 100.504 68.891 100.699 
68.969 100.848 69.125 c 100.992 69.281 101.066 69.492 101.066 69.75 c h
100.707 69.766 m 100.707 69.57 100.66 69.418 100.566 69.312 c 100.473 69.211
 100.34 69.156 100.176 69.156 c 100.008 69.156 99.879 69.203 99.785 69.297
 c 99.691 69.391 99.645 69.523 99.645 69.688 c 99.645 69.898 99.691 70.07
 99.785 70.203 c 99.887 70.328 100.02 70.391 100.176 70.391 c 100.34 70.391
 100.473 70.34 100.566 70.234 c 100.66 70.121 100.707 69.965 100.707 69.766
 c h
100.707 69.766 m f
  Q
Q
q
0 0 115 100 re W n
[ 1 0 0 1 0 0 ] concat
  q
0 g
0.152179 w
1 J
1 j
[] 0.0 d
4 M q 1 0 0 1 0 0 cm
89.469 69.656 m 87.727 69.656 l S Q
88.953 69.656 m 88.953 69.949 89.188 70.184 89.469 70.184 c 89.766 70.184
 89.996 69.949 89.996 69.656 c 89.996 69.363 89.766 69.129 89.469 69.129
 c 89.188 69.129 88.953 69.363 88.953 69.656 c h
88.953 69.656 m f*
87.898 70.355 m 85.797 69.656 l 87.898 68.957 l h
87.898 70.355 m f*
  Q
Q
q
0 0 115 100 re W n
[ 1 0 0 1 0 0 ] concat
  q
0 g
0.152179 w
1 J
1 j
[] 0.0 d
4 M q 1 0 0 1 0 0 cm
98.434 60.148 m 98.434 63.242 l S Q
97.57 63.031 m 98.434 64.746 l 99.285 63.031 l h
97.57 63.031 m f*
87.691 52.48 21.477 7.668 re f*
q 1 0 0 1 0 0 cm
87.691 52.48 21.477 7.668 re S Q
1 g
94.711 57.559 m 94.711 55.934 l 94.711 55.902 94.711 55.871 94.711 55.84
 c 94.711 55.801 94.715 55.637 94.727 55.355 c 94.633 55.699 94.562 55.934
 94.523 56.059 c 94.039 57.559 l 93.648 57.559 l 93.164 56.059 l 92.961 
55.355 l 92.98 55.648 92.992 55.84 92.992 55.934 c 92.992 57.559 l 92.492
 57.559 l 92.492 54.887 l 93.242 54.887 l 93.711 56.371 l 93.758 56.527 
l 93.852 56.887 l 93.961 56.449 l 94.461 54.887 l 95.211 54.887 l 95.211
 57.559 l h
94.711 57.559 m f
96.227 57.59 m 96.027 57.59 95.871 57.539 95.758 57.434 c 95.641 57.332
 95.586 57.18 95.586 56.98 c 95.586 56.762 95.652 56.602 95.789 56.496 c
 95.934 56.383 96.137 56.324 96.398 56.324 c 96.852 56.309 l 96.852 56.215
 l 96.852 56.082 96.824 55.98 96.773 55.918 c 96.73 55.848 96.652 55.809
 96.539 55.809 c 96.445 55.809 96.371 55.836 96.32 55.887 c 96.277 55.93
 96.25 56.004 96.242 56.105 c 95.68 56.074 l 95.719 55.879 95.812 55.727
 95.961 55.621 c 96.105 55.52 96.309 55.465 96.57 55.465 c 96.828 55.465
 97.027 55.535 97.164 55.668 c 97.309 55.793 97.383 55.973 97.383 56.199
 c 97.383 56.949 l 97.383 57.066 97.391 57.148 97.414 57.199 c 97.445 57.242
 97.492 57.262 97.555 57.262 c 97.586 57.262 97.621 57.258 97.664 57.246
 c 97.664 57.527 l 97.633 57.539 97.602 57.551 97.57 57.559 c 97.547 57.559
 97.523 57.559 97.492 57.559 c 97.469 57.566 97.445 57.574 97.414 57.574
 c 97.391 57.574 97.359 57.574 97.32 57.574 c 97.184 57.574 97.086 57.543
 97.023 57.48 c 96.961 57.418 96.922 57.324 96.914 57.199 c 96.898 57.199
 l 96.75 57.461 96.527 57.59 96.227 57.59 c h
96.852 56.605 m 96.57 56.605 l 96.445 56.617 96.355 56.633 96.305 56.652
 c 96.25 56.676 96.211 56.711 96.18 56.762 c 96.156 56.805 96.148 56.863
 96.148 56.934 c 96.148 57.027 96.168 57.102 96.211 57.152 c 96.262 57.207
 96.324 57.23 96.398 57.23 c 96.48 57.23 96.555 57.211 96.617 57.168 c 96.688
 57.117 96.746 57.051 96.789 56.965 c 96.828 56.883 96.852 56.801 96.852
 56.715 c h
96.852 56.605 m f
99.645 56.965 m 99.645 57.164 99.559 57.32 99.395 57.434 c 99.238 57.539
 99.012 57.59 98.723 57.59 c 98.441 57.59 98.223 57.551 98.066 57.465 c 
97.918 57.371 97.824 57.23 97.785 57.043 c 98.254 56.98 l 98.273 57.074 
98.316 57.145 98.379 57.184 c 98.449 57.227 98.566 57.246 98.723 57.246 
c 98.879 57.246 98.988 57.23 99.051 57.199 c 99.121 57.16 99.16 57.098 99.16
 57.012 c 99.16 56.941 99.129 56.887 99.066 56.855 c 99.012 56.816 98.926
 56.777 98.801 56.746 c 98.496 56.695 98.293 56.645 98.191 56.59 c 98.086
 56.539 98.004 56.473 97.941 56.387 c 97.887 56.305 97.863 56.207 97.863
 56.09 c 97.863 55.895 97.934 55.742 98.082 55.637 c 98.238 55.523 98.457
 55.465 98.738 55.465 c 98.977 55.465 99.168 55.512 99.316 55.605 c 99.473
 55.699 99.566 55.836 99.598 56.012 c 99.129 56.074 l 99.105 55.992 99.066
 55.93 99.004 55.887 c 98.949 55.848 98.863 55.824 98.738 55.824 c 98.613
 55.824 98.512 55.84 98.441 55.871 c 98.379 55.902 98.348 55.957 98.348 
56.027 c 98.348 56.09 98.371 56.145 98.426 56.184 c 98.477 56.215 98.559
 56.242 98.676 56.262 c 98.832 56.293 98.973 56.332 99.098 56.371 c 99.223
 56.402 99.32 56.445 99.395 56.496 c 99.477 56.539 99.539 56.598 99.582 
56.668 c 99.621 56.742 99.645 56.84 99.645 56.965 c h
99.645 56.965 m f
100.609 57.59 m 100.453 57.59 100.332 57.551 100.25 57.465 c 100.164 57.383
 100.125 57.254 100.125 57.074 c 100.125 55.871 l 99.859 55.871 l 99.859
 55.496 l 100.141 55.496 l 100.312 55.027 l 100.641 55.027 l 100.641 55.496
 l 101.031 55.496 l 101.031 55.871 l 100.641 55.871 l 100.641 56.934 l 100.641
 57.027 100.66 57.102 100.703 57.152 c 100.742 57.207 100.801 57.23 100.875
 57.23 c 100.914 57.23 100.977 57.223 101.062 57.199 c 101.062 57.527 l 
100.926 57.566 100.773 57.59 100.609 57.59 c h
100.609 57.59 m f
102.223 57.59 m 101.918 57.59 101.684 57.504 101.52 57.324 c 101.352 57.137
 101.27 56.871 101.27 56.527 c 101.27 56.184 101.352 55.926 101.52 55.746
 c 101.684 55.559 101.926 55.465 102.238 55.465 c 102.527 55.465 102.754
 55.566 102.91 55.762 c 103.066 55.961 103.145 56.246 103.145 56.621 c 103.145
 56.637 l 101.832 56.637 l 101.832 56.836 101.867 56.988 101.941 57.09 c
 102.012 57.195 102.117 57.246 102.254 57.246 c 102.441 57.246 102.559 57.164
 102.613 56.996 c 103.113 57.043 l 102.965 57.41 102.668 57.59 102.223 57.59
 c h
102.223 55.809 m 102.098 55.809 101.996 55.852 101.926 55.934 c 101.863
 56.02 101.832 56.137 101.832 56.293 c 102.629 56.293 l 102.617 56.129 102.574
 56.008 102.504 55.934 c 102.441 55.852 102.348 55.809 102.223 55.809 c 
h
102.223 55.809 m f
103.547 57.559 m 103.547 55.98 l 103.547 55.879 103.547 55.789 103.547 
55.715 c 103.547 55.633 103.539 55.559 103.531 55.496 c 104.047 55.496 l
 104.047 55.527 104.051 55.602 104.062 55.715 c 104.07 55.832 104.078 55.91
 104.078 55.949 c 104.129 55.805 104.176 55.699 104.219 55.637 c 104.258
 55.574 104.305 55.535 104.359 55.512 c 104.422 55.48 104.492 55.465 104.578
 55.465 c 104.641 55.465 104.691 55.477 104.734 55.496 c 104.734 55.934 
l 104.648 55.914 104.578 55.902 104.516 55.902 c 104.379 55.902 104.273 
55.961 104.203 56.074 c 104.129 56.18 104.094 56.336 104.094 56.543 c 104.094
 57.559 l h
103.547 57.559 m f
  Q
Q
q
0 0 115 100 re W n
[ 1 0 0 1 0 0 ] concat
  q
0 g
0.113171 w
1 J
1 j
[] 0.0 d
4 M q 1 0 0 1 0 0 cm
98.824 74.496 m 98.824 81.273 l S Q
88.262 81.891 m 86.16 81.191 l 88.262 80.492 l h
88.262 81.891 m f*
0.140877 w
q 1 0 0 1 0 0 cm
98.797 81.254 m 88.297 81.254 l S Q
98.809 74.535 m 99.105 74.535 99.336 74.301 99.336 74.016 c 99.336 73.723
 99.105 73.488 98.809 73.488 c 98.516 73.488 98.281 73.723 98.281 74.016
 c 98.281 74.301 98.516 74.535 98.809 74.535 c h
98.809 74.535 m f*
  Q
Q
q
0 0 115 100 re W n
[ 1 0 0 1 0 0 ] concat
  q
1 g
67.621 13.621 18.414 9.203 re f*
0 g
0.152179 w
1 J
1 j
[] 0.0 d
4 M q 1 0 0 1 0 0 cm
67.621 13.621 18.414 9.203 re S Q
76.008 19.473 m 75.633 19.473 l 74.539 16.801 l 74.93 16.801 l 75.664 18.676
 l 75.82 19.16 l 75.977 18.676 l 76.727 16.801 l 77.102 16.801 l h
76.008 19.473 m f
78.797 18.863 m 78.797 19.473 l 78.469 19.473 l 78.469 18.863 l 77.219 
18.863 l 77.219 18.598 l 78.438 16.801 l 78.797 16.801 l 78.797 18.598 l
 79.172 18.598 l 79.172 18.863 l h
78.469 17.176 m 78.469 17.188 78.453 17.223 78.422 17.285 c 78.391 17.348
 78.363 17.391 78.344 17.41 c 77.656 18.426 l 77.562 18.566 l 77.531 18.598
 l 78.469 18.598 l h
78.469 17.176 m f
  Q
Q
q
0 0 115 100 re W n
[ 1 0 0 1 0 0 ] concat
  q
1 g
89.773 25.586 18.414 9.203 re f*
  Q
Q
q
0 0 115 100 re W n
[ 1 0 0 1 0 0 ] concat
  q
0 g
0.152179 w
1 J
1 j
[] 0.0 d
4 M q 1 0 0 1 0 0 cm
89.773 25.586 18.414 9.203 re S Q
  Q
Q
q
0 0 115 100 re W n
[ 1 0 0 1 0 0 ] concat
  q
0 g
98.16 31.438 m 97.785 31.438 l 96.691 28.766 l 97.082 28.766 l 97.816 30.641
 l 97.973 31.125 l 98.129 30.641 l 98.879 28.766 l 99.254 28.766 l h
98.16 31.438 m f
101.277 30.562 m 101.277 30.844 101.199 31.07 101.043 31.234 c 100.887 
31.391 100.672 31.469 100.402 31.469 c 100.098 31.469 99.871 31.359 99.715
 31.141 c 99.559 30.914 99.48 30.586 99.48 30.156 c 99.48 29.699 99.559 
29.344 99.715 29.094 c 99.879 28.844 100.121 28.719 100.434 28.719 c 100.84
 28.719 101.094 28.902 101.199 29.266 c 100.871 29.328 l 100.797 29.109 
100.652 29 100.434 29 c 100.234 29 100.078 29.094 99.965 29.281 c 99.859
 29.461 99.809 29.719 99.809 30.062 c 99.871 29.949 99.957 29.859 100.074
 29.797 c 100.188 29.734 100.316 29.703 100.465 29.703 c 100.715 29.703 
100.91 29.781 101.059 29.938 c 101.203 30.094 101.277 30.305 101.277 30.562
 c h
100.918 30.578 m 100.918 30.383 100.871 30.23 100.777 30.125 c 100.684 
30.023 100.551 29.969 100.387 29.969 c 100.219 29.969 100.09 30.016 99.996
 30.109 c 99.902 30.203 99.855 30.336 99.855 30.5 c 99.855 30.711 99.902
 30.883 99.996 31.016 c 100.098 31.141 100.23 31.203 100.387 31.203 c 100.551
 31.203 100.684 31.152 100.777 31.047 c 100.871 30.934 100.918 30.777 100.918
 30.578 c h
100.918 30.578 m f
  Q
Q
q
0 0 115 100 re W n
[ 1 0 0 1 0 0 ] concat
  q
0 g
0.152179 w
1 J
1 j
[] 0.0 d
4 M q 1 0 0 1 0 0 cm
89.773 30.5 m 87.328 30.5 l S Q
  Q
Q
q
0 0 115 100 re W n
[ 1 0 0 1 0 0 ] concat
  q
0 g
89.258 30.5 m 89.258 30.793 89.492 31.027 89.773 31.027 c 90.07 31.027 
90.301 30.793 90.301 30.5 c 90.301 30.203 90.07 29.969 89.773 29.969 c 89.492
 29.969 89.258 30.203 89.258 30.5 c h
89.258 30.5 m f*
  Q
Q
q
0 0 115 100 re W n
[ 1 0 0 1 0 0 ] concat
  q
0 g
0.153828 w
1 J
1 j
[] 0.0 d
4 M q 1 0 0 -1 0 0 cm
67.168 -18.305 m 54.648 -18.305 l S Q
67.098 18.305 m 67.098 18.012 67.332 17.777 67.617 17.777 c 67.91 17.777
 68.145 18.012 68.145 18.305 c 68.145 18.602 67.91 18.832 67.617 18.832 
c 67.332 18.832 67.098 18.602 67.098 18.305 c h
67.098 18.305 m f*
53.898 23.504 m 54.598 25.602 l 55.297 23.504 l h
53.898 23.504 m f*
0.107851 w
q 1 0 0 -1 0 0 cm
54.582 -18.277 m 54.582 -24.43 l S Q
  Q
Q
q
0 0 115 100 re W n
[ 1 0 0 1 0 0 ] concat
  q
0 g
0.113171 w
1 J
1 j
[] 0.0 d
4 M q 1 0 0 -0.947198 0 0 cm
98.742 -26.554 m 98.742 -19.779 l S Q
88.176 18.148 m 86.074 18.812 l 88.176 19.477 l h
88.176 18.148 m f*
0.140877 w
q 1 0 0 -0.947198 0 0 cm
98.711 -19.799 m 88.215 -19.799 l S Q
98.727 25.117 m 99.02 25.117 99.254 25.34 99.254 25.609 c 99.254 25.887
 99.02 26.109 98.727 26.109 c 98.43 26.109 98.199 25.887 98.199 25.609 c
 98.199 25.34 98.43 25.117 98.727 25.117 c h
98.727 25.117 m f*
  Q
Q
q
0 0 115 100 re W n
[ 1 0 0 1 0 0 ] concat
  q
0 g
88.242 39.715 21.477 7.672 re f*
0.152179 w
1 J
1 j
[] 0.0 d
4 M q 1 0 0 1 0 0 cm
88.242 39.715 21.477 7.672 re S Q
1 g
95.082 44.793 m 95.082 43.168 l 95.082 43.137 95.082 43.105 95.082 43.074
 c 95.082 43.035 95.086 42.871 95.098 42.59 c 95.004 42.934 94.934 43.168
 94.895 43.293 c 94.41 44.793 l 94.02 44.793 l 93.535 43.293 l 93.332 42.59
 l 93.352 42.883 93.363 43.074 93.363 43.168 c 93.363 44.793 l 92.863 44.793
 l 92.863 42.121 l 93.613 42.121 l 94.082 43.605 l 94.129 43.762 l 94.223
 44.121 l 94.332 43.684 l 94.832 42.121 l 95.582 42.121 l 95.582 44.793 
l h
95.082 44.793 m f
96.594 44.824 m 96.395 44.824 96.238 44.773 96.125 44.668 c 96.008 44.566
 95.953 44.414 95.953 44.215 c 95.953 43.996 96.02 43.836 96.156 43.73 c
 96.301 43.617 96.504 43.559 96.766 43.559 c 97.219 43.543 l 97.219 43.449
 l 97.219 43.316 97.191 43.215 97.141 43.152 c 97.098 43.082 97.02 43.043
 96.906 43.043 c 96.812 43.043 96.738 43.07 96.688 43.121 c 96.645 43.164
 96.617 43.238 96.609 43.34 c 96.047 43.309 l 96.086 43.113 96.18 42.961
 96.328 42.855 c 96.473 42.754 96.676 42.699 96.938 42.699 c 97.195 42.699
 97.395 42.77 97.531 42.902 c 97.676 43.027 97.75 43.207 97.75 43.434 c 
97.75 44.184 l 97.75 44.301 97.758 44.383 97.781 44.434 c 97.812 44.477 
97.859 44.496 97.922 44.496 c 97.953 44.496 97.988 44.492 98.031 44.48 c
 98.031 44.762 l 98 44.773 97.969 44.785 97.938 44.793 c 97.914 44.793 97.891
 44.793 97.859 44.793 c 97.836 44.801 97.812 44.809 97.781 44.809 c 97.758
 44.809 97.727 44.809 97.688 44.809 c 97.551 44.809 97.453 44.777 97.391
 44.715 c 97.328 44.652 97.289 44.559 97.281 44.434 c 97.266 44.434 l 97.117
 44.695 96.895 44.824 96.594 44.824 c h
97.219 43.84 m 96.938 43.84 l 96.812 43.852 96.723 43.867 96.672 43.887
 c 96.617 43.91 96.578 43.945 96.547 43.996 c 96.523 44.039 96.516 44.098
 96.516 44.168 c 96.516 44.262 96.535 44.336 96.578 44.387 c 96.629 44.441
 96.691 44.465 96.766 44.465 c 96.848 44.465 96.922 44.445 96.984 44.402
 c 97.055 44.352 97.113 44.285 97.156 44.199 c 97.195 44.117 97.219 44.035
 97.219 43.949 c h
97.219 43.84 m f
100.012 44.199 m 100.012 44.398 99.926 44.555 99.762 44.668 c 99.605 44.773
 99.379 44.824 99.09 44.824 c 98.809 44.824 98.59 44.785 98.434 44.699 c
 98.285 44.605 98.191 44.465 98.152 44.277 c 98.621 44.215 l 98.641 44.309
 98.684 44.379 98.746 44.418 c 98.816 44.461 98.934 44.48 99.09 44.48 c 
99.246 44.48 99.355 44.465 99.418 44.434 c 99.488 44.395 99.527 44.332 99.527
 44.246 c 99.527 44.176 99.496 44.121 99.434 44.09 c 99.379 44.051 99.293
 44.012 99.168 43.98 c 98.863 43.93 98.66 43.879 98.559 43.824 c 98.453 
43.773 98.371 43.707 98.309 43.621 c 98.254 43.539 98.23 43.441 98.23 43.324
 c 98.23 43.129 98.301 42.977 98.449 42.871 c 98.605 42.758 98.824 42.699
 99.105 42.699 c 99.344 42.699 99.535 42.746 99.684 42.84 c 99.84 42.934
 99.934 43.07 99.965 43.246 c 99.496 43.309 l 99.473 43.227 99.434 43.164
 99.371 43.121 c 99.316 43.082 99.23 43.059 99.105 43.059 c 98.98 43.059
 98.879 43.074 98.809 43.105 c 98.746 43.137 98.715 43.191 98.715 43.262
 c 98.715 43.324 98.738 43.379 98.793 43.418 c 98.844 43.449 98.926 43.477
 99.043 43.496 c 99.199 43.527 99.34 43.566 99.465 43.605 c 99.59 43.637
 99.688 43.68 99.762 43.73 c 99.844 43.773 99.906 43.832 99.949 43.902 c
 99.988 43.977 100.012 44.074 100.012 44.199 c h
100.012 44.199 m f
100.977 44.824 m 100.82 44.824 100.699 44.785 100.617 44.699 c 100.531 
44.617 100.492 44.488 100.492 44.309 c 100.492 43.105 l 100.227 43.105 l
 100.227 42.73 l 100.508 42.73 l 100.68 42.262 l 101.008 42.262 l 101.008
 42.73 l 101.398 42.73 l 101.398 43.105 l 101.008 43.105 l 101.008 44.168
 l 101.008 44.262 101.027 44.336 101.07 44.387 c 101.109 44.441 101.168 
44.465 101.242 44.465 c 101.281 44.465 101.344 44.457 101.43 44.434 c 101.43
 44.762 l 101.293 44.801 101.141 44.824 100.977 44.824 c h
100.977 44.824 m f
102.59 44.824 m 102.285 44.824 102.051 44.738 101.887 44.559 c 101.719 
44.371 101.637 44.105 101.637 43.762 c 101.637 43.418 101.719 43.16 101.887
 42.98 c 102.051 42.793 102.293 42.699 102.605 42.699 c 102.895 42.699 103.121
 42.801 103.277 42.996 c 103.434 43.195 103.512 43.48 103.512 43.855 c 103.512
 43.871 l 102.199 43.871 l 102.199 44.07 102.234 44.223 102.309 44.324 c
 102.379 44.43 102.484 44.48 102.621 44.48 c 102.809 44.48 102.926 44.398
 102.98 44.23 c 103.48 44.277 l 103.332 44.645 103.035 44.824 102.59 44.824
 c h
102.59 43.043 m 102.465 43.043 102.363 43.086 102.293 43.168 c 102.23 43.254
 102.199 43.371 102.199 43.527 c 102.996 43.527 l 102.984 43.363 102.941
 43.242 102.871 43.168 c 102.809 43.086 102.715 43.043 102.59 43.043 c h
102.59 43.043 m f
103.914 44.793 m 103.914 43.215 l 103.914 43.113 103.914 43.023 103.914
 42.949 c 103.914 42.867 103.906 42.793 103.898 42.73 c 104.414 42.73 l 
104.414 42.762 104.418 42.836 104.43 42.949 c 104.438 43.066 104.445 43.145
 104.445 43.184 c 104.496 43.039 104.543 42.934 104.586 42.871 c 104.625
 42.809 104.672 42.77 104.727 42.746 c 104.789 42.715 104.859 42.699 104.945
 42.699 c 105.008 42.699 105.059 42.711 105.102 42.73 c 105.102 43.168 l
 105.016 43.148 104.945 43.137 104.883 43.137 c 104.746 43.137 104.641 43.195
 104.57 43.309 c 104.496 43.414 104.461 43.57 104.461 43.777 c 104.461 44.793
 l h
103.914 44.793 m f
0 g
q 1 0 0 1 0 0 cm
98.977 39.562 m 98.977 36.457 l S Q
98.125 36.672 m 98.977 34.957 l 99.84 36.672 l h
98.125 36.672 m f*
  Q
Q
q
0 0 115 100 re W n
[ 1 0 0 1 0 0 ] concat
  q
0 g
87.504 31.199 m 86.102 30.5 l 87.504 29.797 l h
87.504 31.199 m f*
  Q
Q
q
0 0 115 100 re W n
[ 1 0 0 1 0 0 ] concat
  q
0 g
89.781 81.852 21.477 7.668 re f*
  Q
Q
q
0 0 115 100 re W n
[ 1 0 0 1 0 0 ] concat
  q
0 g
0.152179 w
1 J
1 j
[] 0.0 d
4 M q 1 0 0 1 0 0 cm
89.781 81.852 21.477 7.668 re S Q
  Q
Q
q
0 0 115 100 re W n
[ 1 0 0 1 0 0 ] concat
  q
1 g
93.645 85.102 m 93.645 85.27 93.602 85.422 93.52 85.555 c 93.434 85.691
 93.32 85.801 93.176 85.883 c 93.027 85.957 92.855 85.992 92.66 85.992 c
 92.004 85.992 l 92.004 86.93 l 91.441 86.93 l 91.441 84.258 l 92.645 84.258
 l 92.957 84.258 93.199 84.332 93.379 84.477 c 93.555 84.625 93.645 84.832
 93.645 85.102 c h
93.066 85.117 m 93.066 84.836 92.902 84.695 92.582 84.695 c 92.004 84.695
 l 92.004 85.555 l 92.598 85.555 l 92.742 85.555 92.855 85.52 92.941 85.445
 c 93.023 85.363 93.066 85.254 93.066 85.117 c h
93.066 85.117 m f
96.215 86.164 m 96.215 86.426 96.113 86.625 95.918 86.758 c 95.73 86.895
 95.449 86.961 95.074 86.961 c 94.73 86.961 94.457 86.906 94.262 86.789 
c 94.074 86.664 93.949 86.477 93.887 86.227 c 94.434 86.148 l 94.465 86.285
 94.531 86.391 94.637 86.461 c 94.75 86.523 94.902 86.555 95.09 86.555 c
 95.473 86.555 95.668 86.438 95.668 86.195 c 95.668 86.113 95.645 86.051
 95.605 86.008 c 95.562 85.957 95.5 85.914 95.418 85.883 c 95.332 85.852
 95.176 85.812 94.949 85.758 c 94.75 85.719 94.609 85.68 94.527 85.648 c
 94.453 85.617 94.379 85.586 94.309 85.555 c 94.246 85.516 94.191 85.469
 94.152 85.414 c 94.109 85.352 94.074 85.285 94.043 85.211 c 94.02 85.141
 94.012 85.055 94.012 84.961 c 94.012 84.723 94.098 84.539 94.277 84.414
 c 94.465 84.281 94.73 84.211 95.074 84.211 c 95.406 84.211 95.656 84.266
 95.824 84.367 c 95.988 84.473 96.098 84.645 96.152 84.883 c 95.605 84.961
 l 95.574 84.848 95.516 84.766 95.434 84.711 c 95.348 84.648 95.23 84.617
 95.074 84.617 c 94.73 84.617 94.559 84.723 94.559 84.93 c 94.559 85.004
 94.574 85.062 94.605 85.102 c 94.645 85.145 94.703 85.18 94.777 85.211 
c 94.848 85.242 94.988 85.285 95.199 85.336 c 95.457 85.391 95.641 85.441
 95.746 85.492 c 95.859 85.535 95.949 85.586 96.012 85.648 c 96.082 85.711
 96.137 85.785 96.168 85.867 c 96.199 85.953 96.215 86.051 96.215 86.164
 c h
96.215 86.164 m f
96.41 87.008 m 96.973 84.117 l 97.426 84.117 l 96.879 87.008 l h
96.41 87.008 m f
99.941 86.93 m 99.941 85.305 l 99.941 85.273 99.941 85.242 99.941 85.211
 c 99.941 85.172 99.945 85.008 99.957 84.727 c 99.863 85.07 99.793 85.305
 99.754 85.43 c 99.27 86.93 l 98.879 86.93 l 98.395 85.43 l 98.191 84.727
 l 98.211 85.02 98.223 85.211 98.223 85.305 c 98.223 86.93 l 97.723 86.93
 l 97.723 84.258 l 98.473 84.258 l 98.941 85.742 l 98.988 85.898 l 99.082
 86.258 l 99.191 85.82 l 99.691 84.258 l 100.441 84.258 l 100.441 86.93 
l h
99.941 86.93 m f
101.457 86.961 m 101.258 86.961 101.102 86.91 100.988 86.805 c 100.871 
86.703 100.816 86.551 100.816 86.352 c 100.816 86.133 100.883 85.973 101.02
 85.867 c 101.164 85.754 101.367 85.695 101.629 85.695 c 102.082 85.68 l
 102.082 85.586 l 102.082 85.453 102.055 85.352 102.004 85.289 c 101.961
 85.219 101.883 85.18 101.77 85.18 c 101.676 85.18 101.602 85.207 101.551
 85.258 c 101.508 85.301 101.48 85.375 101.473 85.477 c 100.91 85.445 l 
100.949 85.25 101.043 85.098 101.191 84.992 c 101.336 84.891 101.539 84.836
 101.801 84.836 c 102.059 84.836 102.258 84.906 102.395 85.039 c 102.539
 85.164 102.613 85.344 102.613 85.57 c 102.613 86.32 l 102.613 86.438 102.621
 86.52 102.645 86.57 c 102.676 86.613 102.723 86.633 102.785 86.633 c 102.816
 86.633 102.852 86.629 102.895 86.617 c 102.895 86.898 l 102.863 86.91 102.832
 86.922 102.801 86.93 c 102.777 86.93 102.754 86.93 102.723 86.93 c 102.699
 86.938 102.676 86.945 102.645 86.945 c 102.621 86.945 102.59 86.945 102.551
 86.945 c 102.414 86.945 102.316 86.914 102.254 86.852 c 102.191 86.789 
102.152 86.695 102.145 86.57 c 102.129 86.57 l 101.98 86.832 101.758 86.961
 101.457 86.961 c h
102.082 85.977 m 101.801 85.977 l 101.676 85.988 101.586 86.004 101.535
 86.023 c 101.48 86.047 101.441 86.082 101.41 86.133 c 101.387 86.176 101.379
 86.234 101.379 86.305 c 101.379 86.398 101.398 86.473 101.441 86.523 c 
101.492 86.578 101.555 86.602 101.629 86.602 c 101.711 86.602 101.785 86.582
 101.848 86.539 c 101.918 86.488 101.977 86.422 102.02 86.336 c 102.059 
86.254 102.082 86.172 102.082 86.086 c h
102.082 85.977 m f
104.875 86.336 m 104.875 86.535 104.789 86.691 104.625 86.805 c 104.469
 86.91 104.242 86.961 103.953 86.961 c 103.672 86.961 103.453 86.922 103.297
 86.836 c 103.148 86.742 103.055 86.602 103.016 86.414 c 103.484 86.352 
l 103.504 86.445 103.547 86.516 103.609 86.555 c 103.68 86.598 103.797 86.617
 103.953 86.617 c 104.109 86.617 104.219 86.602 104.281 86.57 c 104.352 
86.531 104.391 86.469 104.391 86.383 c 104.391 86.312 104.359 86.258 104.297
 86.227 c 104.242 86.188 104.156 86.148 104.031 86.117 c 103.727 86.066 
103.523 86.016 103.422 85.961 c 103.316 85.91 103.234 85.844 103.172 85.758
 c 103.117 85.676 103.094 85.578 103.094 85.461 c 103.094 85.266 103.164
 85.113 103.312 85.008 c 103.469 84.895 103.688 84.836 103.969 84.836 c 
104.207 84.836 104.398 84.883 104.547 84.977 c 104.703 85.07 104.797 85.207
 104.828 85.383 c 104.359 85.445 l 104.336 85.363 104.297 85.301 104.234
 85.258 c 104.18 85.219 104.094 85.195 103.969 85.195 c 103.844 85.195 103.742
 85.211 103.672 85.242 c 103.609 85.273 103.578 85.328 103.578 85.398 c 
103.578 85.461 103.602 85.516 103.656 85.555 c 103.707 85.586 103.789 85.613
 103.906 85.633 c 104.062 85.664 104.203 85.703 104.328 85.742 c 104.453
 85.773 104.551 85.816 104.625 85.867 c 104.707 85.91 104.77 85.969 104.812
 86.039 c 104.852 86.113 104.875 86.211 104.875 86.336 c h
104.875 86.336 m f
105.84 86.961 m 105.684 86.961 105.562 86.922 105.48 86.836 c 105.395 86.754
 105.355 86.625 105.355 86.445 c 105.355 85.242 l 105.09 85.242 l 105.09
 84.867 l 105.371 84.867 l 105.543 84.398 l 105.871 84.398 l 105.871 84.867
 l 106.262 84.867 l 106.262 85.242 l 105.871 85.242 l 105.871 86.305 l 105.871
 86.398 105.891 86.473 105.934 86.523 c 105.973 86.578 106.031 86.602 106.105
 86.602 c 106.145 86.602 106.207 86.594 106.293 86.57 c 106.293 86.898 l
 106.156 86.938 106.004 86.961 105.84 86.961 c h
105.84 86.961 m f
107.453 86.961 m 107.148 86.961 106.914 86.875 106.75 86.695 c 106.582 
86.508 106.5 86.242 106.5 85.898 c 106.5 85.555 106.582 85.297 106.75 85.117
 c 106.914 84.93 107.156 84.836 107.469 84.836 c 107.758 84.836 107.984 
84.938 108.141 85.133 c 108.297 85.332 108.375 85.617 108.375 85.992 c 108.375
 86.008 l 107.062 86.008 l 107.062 86.207 107.098 86.359 107.172 86.461 
c 107.242 86.566 107.348 86.617 107.484 86.617 c 107.672 86.617 107.789 
86.535 107.844 86.367 c 108.344 86.414 l 108.195 86.781 107.898 86.961 107.453
 86.961 c h
107.453 85.18 m 107.328 85.18 107.227 85.223 107.156 85.305 c 107.094 85.391
 107.062 85.508 107.062 85.664 c 107.859 85.664 l 107.848 85.5 107.805 85.379
 107.734 85.305 c 107.672 85.223 107.578 85.18 107.453 85.18 c h
107.453 85.18 m f
108.777 86.93 m 108.777 85.352 l 108.777 85.25 108.777 85.16 108.777 85.086
 c 108.777 85.004 108.77 84.93 108.762 84.867 c 109.277 84.867 l 109.277
 84.898 109.281 84.973 109.293 85.086 c 109.301 85.203 109.309 85.281 109.309
 85.32 c 109.359 85.176 109.406 85.07 109.449 85.008 c 109.488 84.945 109.535
 84.906 109.59 84.883 c 109.652 84.852 109.723 84.836 109.809 84.836 c 109.871
 84.836 109.922 84.848 109.965 84.867 c 109.965 85.305 l 109.879 85.285 
109.809 85.273 109.746 85.273 c 109.609 85.273 109.504 85.332 109.434 85.445
 c 109.359 85.551 109.324 85.707 109.324 85.914 c 109.324 86.93 l h
108.777 86.93 m f
  Q
Q
q
0 0 115 100 re W n
[ 1 0 0 1 0 0 ] concat
  q
0 g
0.212388 w
1 J
1 j
[] 0.0 d
4 M q 1 0 0 1 0 0 cm
100.516 81.754 m 100.516 75.707 l S Q
  Q
Q
q
0 0 115 100 re W n
[ 1 0 0 1 0 0 ] concat
  q
0 g
99.66 75.809 m 100.516 74.094 l 101.375 75.809 l h
99.66 75.809 m f*
  Q
Q
Q Q
showpage
%%Trailer
end
%%EOF
