%!PS-Adobe-3.0 EPSF-3.0
%%Creator: cairo 1.15.10 (http://cairographics.org)
%%CreationDate: Sun Oct  4 23:40:11 2020
%%Pages: 1
%%DocumentData: Clean7Bit
%%LanguageLevel: 2
%%BoundingBox: 0 0 435 327
%%EndComments
%%BeginProlog
50 dict begin
/q { gsave } bind def
/Q { grestore } bind def
/cm { 6 array astore concat } bind def
/w { setlinewidth } bind def
/J { setlinecap } bind def
/j { setlinejoin } bind def
/M { setmiterlimit } bind def
/d { setdash } bind def
/m { moveto } bind def
/l { lineto } bind def
/c { curveto } bind def
/h { closepath } bind def
/re { exch dup neg 3 1 roll 5 3 roll moveto 0 rlineto
      0 exch rlineto 0 rlineto closepath } bind def
/S { stroke } bind def
/f { fill } bind def
/f* { eofill } bind def
/n { newpath } bind def
/W { clip } bind def
/W* { eoclip } bind def
/BT { } bind def
/ET { } bind def
/BDC { mark 3 1 roll /BDC pdfmark } bind def
/EMC { mark /EMC pdfmark } bind def
/cairo_store_point { /cairo_point_y exch def /cairo_point_x exch def } def
/Tj { show currentpoint cairo_store_point } bind def
/TJ {
  {
    dup
    type /stringtype eq
    { show } { -0.001 mul 0 cairo_font_matrix dtransform rmoveto } ifelse
  } forall
  currentpoint cairo_store_point
} bind def
/cairo_selectfont { cairo_font_matrix aload pop pop pop 0 0 6 array astore
    cairo_font exch selectfont cairo_point_x cairo_point_y moveto } bind def
/Tf { pop /cairo_font exch def /cairo_font_matrix where
      { pop cairo_selectfont } if } bind def
/Td { matrix translate cairo_font_matrix matrix concatmatrix dup
      /cairo_font_matrix exch def dup 4 get exch 5 get cairo_store_point
      /cairo_font where { pop cairo_selectfont } if } bind def
/Tm { 2 copy 8 2 roll 6 array astore /cairo_font_matrix exch def
      cairo_store_point /cairo_font where { pop cairo_selectfont } if } bind def
/g { setgray } bind def
/rg { setrgbcolor } bind def
/d1 { setcachedevice } bind def
/cairo_data_source {
  CairoDataIndex CairoData length lt
    { CairoData CairoDataIndex get /CairoDataIndex CairoDataIndex 1 add def }
    { () } ifelse
} def
/cairo_flush_ascii85_file { cairo_ascii85_file status { cairo_ascii85_file flushfile } if } def
/cairo_image { image cairo_flush_ascii85_file } def
/cairo_imagemask { imagemask cairo_flush_ascii85_file } def
%%EndProlog
%%BeginSetup
%%EndSetup
%%Page: 1 1
%%BeginPageSetup
%%PageBoundingBox: 0 0 435 327
%%EndPageSetup
q 0 0 435 327 rectclip
1 0 0 -1 0 327 cm q
1 g
0 0 435 327 rectfill
0.363 141.293 88.164 44.082 re f*
0 g
0.729035 w
1 J
1 j
[] 0.0 d
4 M q 1 0 0 1 0 0 cm
0.363 141.293 88.164 44.082 re S Q
40.504 169.289 m 38.691 169.289 l 33.457 156.461 l 35.285 156.461 l 38.848
 165.492 l 39.613 167.758 l 40.379 165.492 l 43.91 156.461 l 45.738 156.461
 l h
40.504 169.289 m f
47.262 169.289 m 47.262 167.898 l 50.527 167.898 l 50.527 158.023 l 47.637
 160.086 l 47.637 158.539 l 50.668 156.461 l 52.184 156.461 l 52.184 167.898
 l 55.309 167.898 l 55.309 169.289 l h
47.262 169.289 m f
1 g
110.547 141.293 88.164 44.082 re f*
0 g
q 1 0 0 1 0 0 cm
110.547 141.293 88.164 44.082 re S Q
150.723 169.289 m 148.91 169.289 l 143.676 156.461 l 145.504 156.461 l 
149.066 165.492 l 149.832 167.758 l 150.598 165.492 l 154.129 156.461 l 
155.957 156.461 l h
150.723 169.289 m f
156.996 169.289 m 156.996 168.133 l 157.309 167.426 157.684 166.801 158.121
 166.258 c 158.566 165.707 159.035 165.211 159.527 164.773 c 160.027 164.336
 160.516 163.93 160.996 163.555 c 161.484 163.18 161.922 162.805 162.309
 162.43 c 162.691 162.047 163.004 161.648 163.246 161.242 c 163.484 160.828
 163.605 160.359 163.605 159.836 c 163.605 159.129 163.395 158.582 162.98
 158.195 c 162.574 157.812 162 157.617 161.262 157.617 c 160.562 157.617
 159.988 157.805 159.543 158.18 c 159.094 158.555 158.828 159.086 158.746
 159.773 c 157.074 159.617 l 157.188 158.598 157.621 157.785 158.371 157.18
 c 159.121 156.566 160.082 156.258 161.262 156.258 c 162.562 156.258 163.559
 156.566 164.246 157.18 c 164.941 157.785 165.293 158.648 165.293 159.773
 c 165.293 160.273 165.176 160.773 164.949 161.273 c 164.719 161.766 164.379
 162.254 163.934 162.742 c 163.484 163.234 162.625 163.992 161.355 165.023
 c 160.656 165.598 160.098 166.113 159.684 166.57 c 159.277 167.031 158.98
 167.473 158.793 167.898 c 165.496 167.898 l 165.496 169.289 l h
156.996 169.289 m f
q 1 0 0 1 0 0 cm
110.547 163.309 m 94.41 163.309 l S Q
108.02 163.309 m 108.02 164.719 109.184 165.836 110.547 165.836 c 111.957
 165.836 113.074 164.719 113.074 163.309 c 113.074 161.949 111.957 160.781
 110.547 160.781 c 109.184 160.781 108.02 161.949 108.02 163.309 c h
108.02 163.309 m f*
95.238 166.66 m 88.527 163.309 l 95.238 159.953 l h
95.238 166.66 m f*
1 g
220.777 141.293 88.164 44.082 re f*
0 g
0.729037 w
q 1 0 0 1 0 0 cm
220.777 141.293 88.164 44.082 re S Q
260.938 169.289 m 259.125 169.289 l 253.891 156.461 l 255.719 156.461 l
 259.281 165.492 l 260.047 167.758 l 260.812 165.492 l 264.344 156.461 l
 266.172 156.461 l h
260.938 169.289 m f
275.836 165.742 m 275.836 166.93 275.453 167.852 274.695 168.508 c 273.945
 169.156 272.871 169.477 271.477 169.477 c 270.172 169.477 269.133 169.188
 268.352 168.602 c 267.578 168.008 267.121 167.141 266.977 165.992 c 268.68
 165.836 l 268.898 167.359 269.828 168.117 271.477 168.117 c 272.297 168.117
 272.945 167.914 273.414 167.508 c 273.891 167.102 274.133 166.5 274.133
 165.695 c 274.133 165 273.859 164.453 273.32 164.055 c 272.777 163.66 272
 163.461 270.992 163.461 c 270.07 163.461 l 270.07 162.055 l 270.961 162.055
 l 271.855 162.055 272.547 161.859 273.039 161.461 c 273.539 161.066 273.789
 160.523 273.789 159.836 c 273.789 159.148 273.586 158.609 273.18 158.211
 c 272.773 157.816 272.172 157.617 271.383 157.617 c 270.664 157.617 270.078
 157.805 269.633 158.18 c 269.184 158.547 268.922 159.062 268.852 159.727
 c 267.195 159.602 l 267.32 158.551 267.758 157.734 268.508 157.148 c 269.258
 156.555 270.219 156.258 271.398 156.258 c 272.688 156.258 273.688 156.562
 274.398 157.164 c 275.117 157.758 275.477 158.594 275.477 159.664 c 275.477
 160.477 275.246 161.145 274.789 161.664 c 274.328 162.176 273.664 162.52
 272.789 162.695 c 272.789 162.742 l 273.746 162.848 274.492 163.172 275.023
 163.711 c 275.562 164.254 275.836 164.93 275.836 165.742 c h
275.836 165.742 m f
q 1 0 0 1 0 0 cm
220.777 163.309 m 204.594 163.309 l S Q
218.25 163.309 m 218.25 164.719 219.367 165.836 220.777 165.836 c 222.188
 165.836 223.305 164.719 223.305 163.309 c 223.305 161.949 222.188 160.781
 220.777 160.781 c 219.367 160.781 218.25 161.949 218.25 163.309 c h
218.25 163.309 m f*
205.465 166.66 m 198.711 163.309 l 205.465 159.953 l h
205.465 166.66 m f*
q 1 0 0 1 0 0 cm
382.453 237.832 m 382.453 222.961 l S Q
378.32 223.98 m 382.453 215.766 l 386.535 223.98 l h
378.32 223.98 m f*
330.98 237.832 102.895 36.742 re f*
q 1 0 0 1 0 0 cm
330.98 237.832 102.895 36.742 re S Q
1 g
356.133 251.391 m 356.133 262.156 l 353.445 262.156 l 353.445 251.391 l
 349.289 251.391 l 349.289 249.328 l 360.289 249.328 l 360.289 251.391 l
 h
356.133 251.391 m f
362.684 262.344 m 361.734 262.344 360.988 262.086 360.449 261.562 c 359.918
 261.043 359.652 260.312 359.652 259.375 c 359.652 258.355 359.984 257.578
 360.652 257.047 c 361.316 256.508 362.281 256.23 363.543 256.219 c 365.668
 256.188 l 365.668 255.672 l 365.668 255.039 365.551 254.562 365.324 254.25
 c 365.105 253.938 364.738 253.781 364.23 253.781 c 363.75 253.781 363.402
 253.891 363.184 254.109 c 362.965 254.32 362.824 254.672 362.762 255.172
 c 360.105 255.047 l 360.262 254.09 360.691 253.367 361.402 252.875 c 362.121
 252.375 363.098 252.125 364.34 252.125 c 365.578 252.125 366.535 252.434
 367.215 253.047 c 367.891 253.652 368.23 254.523 368.23 255.656 c 368.23
 259.234 l 368.23 259.789 368.285 260.172 368.402 260.391 c 368.527 260.602
 368.734 260.703 369.027 260.703 c 369.223 260.703 369.418 260.684 369.605
 260.641 c 369.605 262.031 l 369.449 262.062 369.309 262.094 369.184 262.125
 c 369.066 262.156 368.949 262.18 368.824 262.203 c 368.699 262.223 368.566
 262.238 368.434 262.25 c 368.297 262.258 368.141 262.266 367.965 262.266
 c 367.316 262.266 366.84 262.109 366.527 261.797 c 366.223 261.477 366.043
 261.008 365.98 260.391 c 365.934 260.391 l 365.215 261.695 364.129 262.344
 362.684 262.344 c h
365.668 257.594 m 364.355 257.609 l 363.762 257.633 363.34 257.699 363.09
 257.812 c 362.84 257.918 362.645 258.078 362.512 258.297 c 362.387 258.516
 362.324 258.809 362.324 259.172 c 362.324 259.641 362.426 259.992 362.637
 260.219 c 362.855 260.438 363.145 260.547 363.512 260.547 c 363.906 260.547
 364.27 260.438 364.605 260.219 c 364.938 260 365.199 259.699 365.387 259.312
 c 365.574 258.93 365.668 258.523 365.668 258.094 c h
365.668 257.594 m f
370.785 262.156 m 370.785 254.609 l 370.785 254.07 370.773 253.621 370.754
 253.266 c 370.742 252.902 370.73 252.578 370.723 252.297 c 373.16 252.297
 l 373.18 252.414 373.207 252.746 373.238 253.297 c 373.27 253.852 373.285
 254.219 373.285 254.406 c 373.316 254.406 l 373.566 253.711 373.785 253.219
 373.973 252.938 c 374.168 252.656 374.398 252.449 374.66 252.312 c 374.93
 252.18 375.27 252.109 375.676 252.109 c 375.996 252.109 376.262 252.156
 376.473 252.25 c 376.473 254.391 l 376.055 254.297 375.691 254.25 375.379
 254.25 c 374.73 254.25 374.23 254.512 373.879 255.031 c 373.523 255.543
 373.348 256.305 373.348 257.312 c 373.348 262.156 l h
370.785 262.156 m f
382.086 262.344 m 380.594 262.344 379.453 261.906 378.664 261.031 c 377.871
 260.148 377.477 258.867 377.477 257.188 c 377.477 255.555 377.875 254.305
 378.68 253.438 c 379.492 252.562 380.637 252.125 382.117 252.125 c 383.531
 252.125 384.609 252.594 385.352 253.531 c 386.102 254.469 386.477 255.84
 386.477 257.641 c 386.477 257.719 l 380.164 257.719 l 380.164 258.68 380.34
 259.402 380.695 259.891 c 381.047 260.383 381.555 260.625 382.211 260.625
 c 383.117 260.625 383.684 260.234 383.914 259.453 c 386.336 259.656 l 385.637
 261.449 384.219 262.344 382.086 262.344 c h
382.086 253.734 m 381.48 253.734 381.016 253.945 380.695 254.359 c 380.371
 254.777 380.199 255.359 380.18 256.109 c 384.008 256.109 l 383.953 255.32
 383.762 254.727 383.43 254.328 c 383.094 253.934 382.648 253.734 382.086
 253.734 c h
382.086 253.734 m f
390.703 262.344 m 389.754 262.344 389.008 262.086 388.469 261.562 c 387.938
 261.043 387.672 260.312 387.672 259.375 c 387.672 258.355 388.004 257.578
 388.672 257.047 c 389.336 256.508 390.301 256.23 391.562 256.219 c 393.688
 256.188 l 393.688 255.672 l 393.688 255.039 393.57 254.562 393.344 254.25
 c 393.125 253.938 392.758 253.781 392.25 253.781 c 391.77 253.781 391.422
 253.891 391.203 254.109 c 390.984 254.32 390.844 254.672 390.781 255.172
 c 388.125 255.047 l 388.281 254.09 388.711 253.367 389.422 252.875 c 390.141
 252.375 391.117 252.125 392.359 252.125 c 393.598 252.125 394.555 252.434
 395.234 253.047 c 395.91 253.652 396.25 254.523 396.25 255.656 c 396.25
 259.234 l 396.25 259.789 396.305 260.172 396.422 260.391 c 396.547 260.602
 396.754 260.703 397.047 260.703 c 397.242 260.703 397.438 260.684 397.625
 260.641 c 397.625 262.031 l 397.469 262.062 397.328 262.094 397.203 262.125
 c 397.086 262.156 396.969 262.18 396.844 262.203 c 396.719 262.223 396.586
 262.238 396.453 262.25 c 396.316 262.258 396.16 262.266 395.984 262.266
 c 395.336 262.266 394.859 262.109 394.547 261.797 c 394.242 261.477 394.062
 261.008 394 260.391 c 393.953 260.391 l 393.234 261.695 392.148 262.344
 390.703 262.344 c h
393.688 257.594 m 392.375 257.609 l 391.781 257.633 391.359 257.699 391.109
 257.812 c 390.859 257.918 390.664 258.078 390.531 258.297 c 390.406 258.516
 390.344 258.809 390.344 259.172 c 390.344 259.641 390.445 259.992 390.656
 260.219 c 390.875 260.438 391.164 260.547 391.531 260.547 c 391.926 260.547
 392.289 260.438 392.625 260.219 c 392.957 260 393.219 259.699 393.406 259.312
 c 393.594 258.93 393.688 258.523 393.688 258.094 c h
393.688 257.594 m f
412.137 262.156 m 408.918 257.047 l 405.684 262.156 l 402.84 262.156 l 
407.293 255.406 l 403.215 249.328 l 406.059 249.328 l 408.918 253.859 l 
411.762 249.328 l 414.59 249.328 l 410.684 255.406 l 414.965 262.156 l h
412.137 262.156 m f
0 g
0.243012 w
q 1 0 0 1 0 0 cm
382.453 237.832 m 382.453 215.039 l S Q
1 g
338.344 170.648 88.168 44.129 re f*
0 g
0.729037 w
q 1 0 0 1 0 0 cm
338.344 192.715 m 313.656 174.195 l S Q
336.305 191.207 m 335.477 192.324 335.723 193.879 336.84 194.754 c 337.957
 195.582 339.512 195.336 340.34 194.219 c 341.164 193.102 340.969 191.547
 339.852 190.719 c 338.734 189.844 337.18 190.09 336.305 191.207 c h
336.305 191.207 m f*
312.293 177.402 m 308.941 170.648 l 316.328 172.008 l h
312.293 177.402 m f*
q 1 0 0 1 0 0 cm
338.344 170.648 88.168 44.129 re S Q
378.5 198.68 m 376.688 198.68 l 371.453 185.852 l 373.281 185.852 l 376.844
 194.883 l 377.609 197.148 l 378.375 194.883 l 381.906 185.852 l 383.734
 185.852 l h
378.5 198.68 m f
391.867 195.773 m 391.867 198.68 l 390.32 198.68 l 390.32 195.773 l 384.258
 195.773 l 384.258 194.492 l 390.133 185.852 l 391.867 185.852 l 391.867
 194.477 l 393.664 194.477 l 393.664 195.773 l h
390.32 187.695 m 390.297 187.727 390.211 187.891 390.055 188.18 c 389.898
 188.461 389.777 188.66 389.695 188.773 c 386.414 193.617 l 385.93 194.305
 l 385.773 194.477 l 390.32 194.477 l h
390.32 187.695 m f
1 g
331.008 274.91 102.84 36.742 re f*
0 g
365.293 314.395 m 365.293 308.895 l 359.699 308.895 l 359.699 314.395 l
 357.012 314.395 l 357.012 301.566 l 359.699 301.566 l 359.699 306.676 l
 365.293 306.676 l 365.293 301.566 l 367.98 301.566 l 367.98 314.395 l h
365.293 314.395 m f
370.492 314.395 m 370.492 301.566 l 380.586 301.566 l 380.586 303.629 l
 373.18 303.629 l 373.18 306.863 l 380.023 306.863 l 380.023 308.941 l 373.18
 308.941 l 373.18 312.316 l 380.961 312.316 l 380.961 314.395 l h
370.492 314.395 m f
392.031 314.395 m 390.891 311.113 l 386 311.113 l 384.859 314.395 l 382.172
 314.395 l 386.844 301.566 l 390.016 301.566 l 394.688 314.395 l h
388.438 303.535 m 388.375 303.738 l 388.32 303.957 388.25 304.207 388.156
 304.488 c 388.07 304.77 387.551 306.309 386.594 309.098 c 390.281 309.098
 l 389.016 305.41 l 388.625 304.16 l h
388.438 303.535 m f
407.875 307.879 m 407.875 309.203 407.613 310.359 407.094 311.348 c 406.57
 312.34 405.836 313.094 404.891 313.613 c 403.941 314.137 402.852 314.395
 401.625 314.395 c 396.438 314.395 l 396.438 301.566 l 401.078 301.566 l
 403.242 301.566 404.914 302.113 406.094 303.207 c 407.281 304.293 407.875
 305.848 407.875 307.879 c h
405.172 307.879 m 405.172 306.504 404.812 305.453 404.094 304.723 c 403.375
 303.996 402.352 303.629 401.031 303.629 c 399.125 303.629 l 399.125 312.316
 l 401.406 312.316 l 402.551 312.316 403.461 311.922 404.141 311.129 c 404.828
 310.328 405.172 309.246 405.172 307.879 c h
405.172 307.879 m f
q 1 0 0 1 0 0 cm
331.008 289.344 102.84 36.746 re S Q
q 1 0 0 -1 0 0 cm
382.43 -289.344 m 382.43 -281.812 l S Q
378.344 282.832 m 382.43 274.668 l 386.559 282.832 l h
378.344 282.832 m f*
0.243012 w
q 1 0 0 -1 0 0 cm
382.43 -289.344 m 382.43 -274.668 l S Q
1 g
338.344 111.887 88.168 44.082 re f*
0 g
0.729037 w
q 1 0 0 1 0 0 cm
338.344 111.887 88.168 44.082 re S Q
378.5 139.898 m 376.688 139.898 l 371.453 127.07 l 373.281 127.07 l 376.844
 136.102 l 377.609 138.367 l 378.375 136.102 l 381.906 127.07 l 383.734 
127.07 l h
378.5 139.898 m f
393.43 135.711 m 393.43 137.066 393.023 138.133 392.211 138.914 c 391.406
 139.695 390.293 140.086 388.867 140.086 c 387.68 140.086 386.715 139.828
 385.977 139.305 c 385.234 138.773 384.773 138.016 384.586 137.023 c 386.242
 136.836 l 386.586 138.109 387.477 138.742 388.914 138.742 c 389.789 138.742
 390.477 138.477 390.977 137.945 c 391.477 137.414 391.727 136.688 391.727
 135.758 c 391.727 134.945 391.477 134.297 390.977 133.805 c 390.477 133.305
 389.797 133.055 388.945 133.055 c 388.508 133.055 388.094 133.125 387.711
 133.258 c 387.324 133.395 386.938 133.629 386.555 133.961 c 384.961 133.961
 l 385.383 127.07 l 392.68 127.07 l 392.68 128.461 l 386.883 128.461 l 386.633
 132.523 l 387.34 131.984 388.227 131.711 389.289 131.711 c 390.547 131.711
 391.555 132.082 392.305 132.82 c 393.055 133.562 393.43 134.523 393.43 
135.711 c h
393.43 135.711 m f
q 1 0 0 1 0 0 cm
338.344 133.953 m 313.656 152.469 l S Q
336.305 135.461 m 337.18 136.578 338.734 136.773 339.852 135.945 c 340.969
 135.117 341.164 133.516 340.34 132.398 c 339.512 131.328 337.957 131.086
 336.84 131.91 c 335.723 132.738 335.477 134.34 336.305 135.461 c h
336.305 135.461 m f*
316.328 154.609 m 308.941 155.969 l 312.293 149.262 l h
316.328 154.609 m f*
330.859 53.422 102.844 36.746 re f*
q 1 0 0 1 0 0 cm
330.859 53.422 102.844 36.746 re S Q
1 g
364.473 77.773 m 364.473 69.992 l 364.473 69.816 364.473 69.641 364.473
 69.461 c 364.48 69.285 364.512 68.531 364.566 67.195 c 364.129 68.832 363.809
 69.973 363.613 70.617 c 361.301 77.773 l 359.379 77.773 l 357.066 70.617
 l 356.098 67.195 l 356.168 68.602 356.207 69.535 356.207 69.992 c 356.207
 77.773 l 353.816 77.773 l 353.816 64.945 l 357.41 64.945 l 359.707 72.117
 l 359.91 72.805 l 360.348 74.523 l 360.926 72.477 l 363.285 64.945 l 366.863
 64.945 l 366.863 77.773 l h
364.473 77.773 m f
371.703 77.961 m 370.754 77.961 370.008 77.703 369.469 77.18 c 368.938 
76.66 368.672 75.93 368.672 74.992 c 368.672 73.973 369.004 73.195 369.672
 72.664 c 370.336 72.125 371.301 71.848 372.562 71.836 c 374.688 71.805 
l 374.688 71.289 l 374.688 70.656 374.57 70.18 374.344 69.867 c 374.125 
69.555 373.758 69.398 373.25 69.398 c 372.77 69.398 372.422 69.508 372.203
 69.727 c 371.984 69.938 371.844 70.289 371.781 70.789 c 369.125 70.664 
l 369.281 69.707 369.711 68.984 370.422 68.492 c 371.141 67.992 372.117 
67.742 373.359 67.742 c 374.598 67.742 375.555 68.051 376.234 68.664 c 376.91
 69.27 377.25 70.141 377.25 71.273 c 377.25 74.852 l 377.25 75.406 377.305
 75.789 377.422 76.008 c 377.547 76.219 377.754 76.32 378.047 76.32 c 378.242
 76.32 378.438 76.301 378.625 76.258 c 378.625 77.648 l 378.469 77.68 378.328
 77.711 378.203 77.742 c 378.086 77.773 377.969 77.797 377.844 77.82 c 377.719
 77.84 377.586 77.855 377.453 77.867 c 377.316 77.875 377.16 77.883 376.984
 77.883 c 376.336 77.883 375.859 77.727 375.547 77.414 c 375.242 77.094 
375.062 76.625 375 76.008 c 374.953 76.008 l 374.234 77.312 373.148 77.961
 371.703 77.961 c h
374.688 73.211 m 373.375 73.227 l 372.781 73.25 372.359 73.316 372.109 
73.43 c 371.859 73.535 371.664 73.695 371.531 73.914 c 371.406 74.133 371.344
 74.426 371.344 74.789 c 371.344 75.258 371.445 75.609 371.656 75.836 c 
371.875 76.055 372.164 76.164 372.531 76.164 c 372.926 76.164 373.289 76.055
 373.625 75.836 c 373.957 75.617 374.219 75.316 374.406 74.93 c 374.594 
74.547 374.688 74.141 374.688 73.711 c h
374.688 73.211 m f
388.117 74.898 m 388.117 75.848 387.727 76.598 386.945 77.148 c 386.164
 77.691 385.086 77.961 383.711 77.961 c 382.355 77.961 381.32 77.75 380.602
 77.32 c 379.883 76.883 379.402 76.219 379.164 75.32 c 381.414 74.977 l 
381.539 75.445 381.758 75.781 382.07 75.977 c 382.383 76.164 382.93 76.258
 383.711 76.258 c 384.43 76.258 384.949 76.172 385.273 75.992 c 385.605 
75.805 385.773 75.52 385.773 75.133 c 385.773 74.82 385.637 74.57 385.367
 74.383 c 385.105 74.195 384.656 74.039 384.023 73.914 c 382.586 73.625 
381.609 73.359 381.102 73.117 c 380.602 72.867 380.215 72.551 379.945 72.164
 c 379.684 71.77 379.555 71.285 379.555 70.711 c 379.555 69.773 379.914 
69.047 380.633 68.523 c 381.359 67.992 382.391 67.727 383.727 67.727 c 384.902
 67.727 385.844 67.957 386.555 68.414 c 387.273 68.863 387.715 69.52 387.883
 70.383 c 385.617 70.617 l 385.543 70.223 385.367 69.926 385.086 69.727 
c 384.805 69.531 384.352 69.43 383.727 69.43 c 383.121 69.43 382.664 69.508
 382.352 69.664 c 382.047 69.82 381.898 70.082 381.898 70.445 c 381.898 
70.727 382.012 70.953 382.242 71.117 c 382.48 71.285 382.875 71.426 383.43
 71.539 c 384.199 71.695 384.883 71.859 385.477 72.023 c 386.078 72.191 
386.562 72.391 386.93 72.617 c 387.293 72.848 387.578 73.145 387.789 73.508
 c 388.008 73.875 388.117 74.336 388.117 74.898 c h
388.117 74.898 m f
392.723 77.93 m 391.973 77.93 391.387 77.727 390.973 77.32 c 390.566 76.914
 390.363 76.297 390.363 75.461 c 390.363 69.648 l 389.129 69.648 l 389.129
 67.914 l 390.504 67.914 l 391.301 65.602 l 392.91 65.602 l 392.91 67.914
 l 394.77 67.914 l 394.77 69.648 l 392.91 69.648 l 392.91 74.773 l 392.91
 75.254 392.996 75.609 393.176 75.836 c 393.363 76.055 393.645 76.164 394.02
 76.164 c 394.215 76.164 394.504 76.125 394.879 76.039 c 394.879 77.633 
l 394.242 77.828 393.523 77.93 392.723 77.93 c h
392.723 77.93 m f
400.469 77.961 m 398.977 77.961 397.836 77.523 397.047 76.648 c 396.254
 75.766 395.859 74.484 395.859 72.805 c 395.859 71.172 396.258 69.922 397.062
 69.055 c 397.875 68.18 399.02 67.742 400.5 67.742 c 401.914 67.742 402.992
 68.211 403.734 69.148 c 404.484 70.086 404.859 71.457 404.859 73.258 c 
404.859 73.336 l 398.547 73.336 l 398.547 74.297 398.723 75.02 399.078 75.508
 c 399.43 76 399.938 76.242 400.594 76.242 c 401.5 76.242 402.066 75.852
 402.297 75.07 c 404.719 75.273 l 404.02 77.066 402.602 77.961 400.469 77.961
 c h
400.469 69.352 m 399.863 69.352 399.398 69.562 399.078 69.977 c 398.754
 70.395 398.582 70.977 398.562 71.727 c 402.391 71.727 l 402.336 70.938 
402.145 70.344 401.812 69.945 c 401.477 69.551 401.031 69.352 400.469 69.352
 c h
400.469 69.352 m f
406.809 77.773 m 406.809 70.227 l 406.809 69.688 406.797 69.238 406.777
 68.883 c 406.766 68.52 406.754 68.195 406.746 67.914 c 409.184 67.914 l
 409.203 68.031 409.23 68.363 409.262 68.914 c 409.293 69.469 409.309 69.836
 409.309 70.023 c 409.34 70.023 l 409.59 69.328 409.809 68.836 409.996 68.555
 c 410.191 68.273 410.422 68.066 410.684 67.93 c 410.953 67.797 411.293 
67.727 411.699 67.727 c 412.02 67.727 412.285 67.773 412.496 67.867 c 412.496
 70.008 l 412.078 69.914 411.715 69.867 411.402 69.867 c 410.754 69.867 
410.254 70.129 409.902 70.648 c 409.547 71.16 409.371 71.922 409.371 72.93
 c 409.371 77.773 l h
406.809 77.773 m f
0 g
q 1 0 0 1 0 0 cm
382.281 90.168 m 382.281 105.039 l S Q
386.41 104.02 m 382.281 112.234 l 378.199 104.02 l h
386.41 104.02 m f*
q 1 0 0 1 0 0 cm
382.574 37.109 m 382.574 44.641 l S Q
378.492 43.621 m 382.574 51.785 l 386.707 43.621 l h
378.492 43.621 m f*
1 g
331.152 0.363 102.844 36.746 re f*
0 g
q 1 0 0 1 0 0 cm
331.152 0.363 102.844 36.746 re S Q
366.039 24.711 m 366.039 19.211 l 360.445 19.211 l 360.445 24.711 l 357.758
 24.711 l 357.758 11.883 l 360.445 11.883 l 360.445 16.992 l 366.039 16.992
 l 366.039 11.883 l 368.727 11.883 l 368.727 24.711 l h
366.039 24.711 m f
371.238 24.711 m 371.238 11.883 l 381.332 11.883 l 381.332 13.945 l 373.926
 13.945 l 373.926 17.18 l 380.77 17.18 l 380.77 19.258 l 373.926 19.258 
l 373.926 22.633 l 381.707 22.633 l 381.707 24.711 l h
371.238 24.711 m f
392.781 24.711 m 391.641 21.43 l 386.75 21.43 l 385.609 24.711 l 382.922
 24.711 l 387.594 11.883 l 390.766 11.883 l 395.438 24.711 l h
389.188 13.852 m 389.125 14.055 l 389.07 14.273 389 14.523 388.906 14.805
 c 388.82 15.086 388.301 16.625 387.344 19.414 c 391.031 19.414 l 389.766
 15.727 l 389.375 14.477 l h
389.188 13.852 m f
408.621 18.195 m 408.621 19.52 408.359 20.676 407.84 21.664 c 407.316 22.656
 406.582 23.41 405.637 23.93 c 404.688 24.453 403.598 24.711 402.371 24.711
 c 397.184 24.711 l 397.184 11.883 l 401.824 11.883 l 403.988 11.883 405.66
 12.43 406.84 13.523 c 408.027 14.609 408.621 16.164 408.621 18.195 c h
405.918 18.195 m 405.918 16.82 405.559 15.77 404.84 15.039 c 404.121 14.312
 403.098 13.945 401.777 13.945 c 399.871 13.945 l 399.871 22.633 l 402.152
 22.633 l 403.297 22.633 404.207 22.238 404.887 21.445 c 405.574 20.645 
405.918 19.562 405.918 18.195 c h
405.918 18.195 m f
0.243012 w
q 1 0 0 1 0 0 cm
382.574 37.109 m 382.574 51.785 l S Q
Q Q
showpage
%%Trailer
end
%%EOF
