%!PS-Adobe-3.0 EPSF-3.0
%%Creator: cairo 1.15.10 (http://cairographics.org)
%%CreationDate: Fri Oct  2 02:13:07 2020
%%Pages: 1
%%DocumentData: Clean7Bit
%%LanguageLevel: 2
%%BoundingBox: 0 0 115 100
%%EndComments
%%BeginProlog
50 dict begin
/q { gsave } bind def
/Q { grestore } bind def
/cm { 6 array astore concat } bind def
/w { setlinewidth } bind def
/J { setlinecap } bind def
/j { setlinejoin } bind def
/M { setmiterlimit } bind def
/d { setdash } bind def
/m { moveto } bind def
/l { lineto } bind def
/c { curveto } bind def
/h { closepath } bind def
/re { exch dup neg 3 1 roll 5 3 roll moveto 0 rlineto
      0 exch rlineto 0 rlineto closepath } bind def
/S { stroke } bind def
/f { fill } bind def
/f* { eofill } bind def
/n { newpath } bind def
/W { clip } bind def
/W* { eoclip } bind def
/BT { } bind def
/ET { } bind def
/BDC { mark 3 1 roll /BDC pdfmark } bind def
/EMC { mark /EMC pdfmark } bind def
/cairo_store_point { /cairo_point_y exch def /cairo_point_x exch def } def
/Tj { show currentpoint cairo_store_point } bind def
/TJ {
  {
    dup
    type /stringtype eq
    { show } { -0.001 mul 0 cairo_font_matrix dtransform rmoveto } ifelse
  } forall
  currentpoint cairo_store_point
} bind def
/cairo_selectfont { cairo_font_matrix aload pop pop pop 0 0 6 array astore
    cairo_font exch selectfont cairo_point_x cairo_point_y moveto } bind def
/Tf { pop /cairo_font exch def /cairo_font_matrix where
      { pop cairo_selectfont } if } bind def
/Td { matrix translate cairo_font_matrix matrix concatmatrix dup
      /cairo_font_matrix exch def dup 4 get exch 5 get cairo_store_point
      /cairo_font where { pop cairo_selectfont } if } bind def
/Tm { 2 copy 8 2 roll 6 array astore /cairo_font_matrix exch def
      cairo_store_point /cairo_font where { pop cairo_selectfont } if } bind def
/g { setgray } bind def
/rg { setrgbcolor } bind def
/d1 { setcachedevice } bind def
/cairo_data_source {
  CairoDataIndex CairoData length lt
    { CairoData CairoDataIndex get /CairoDataIndex CairoDataIndex 1 add def }
    { () } ifelse
} def
/cairo_flush_ascii85_file { cairo_ascii85_file status { cairo_ascii85_file flushfile } if } def
/cairo_image { image cairo_flush_ascii85_file } def
/cairo_imagemask { imagemask cairo_flush_ascii85_file } def
%%EndProlog
%%BeginSetup
%%EndSetup
%%Page: 1 1
%%BeginPageSetup
%%PageBoundingBox: 0 0 115 100
%%EndPageSetup
q 0 0 115 100 rectclip
1 0 0 -1 0 100 cm q
0.94902 g
0.074 51.254 114.289 48.273 re f*
0.074 0.074 114.035 48.859 re f*
1 g
0.074 92.781 36.82 6.746 re f*
0 g
0.152179 w
1 J
1 j
[] 0.0 d
4 M q 1 0 0 1 0 0 cm
0.074 92.781 36.82 6.746 re S Q
9.465 97.402 m 9.465 95.621 l 9.465 95.426 9.469 95.23 9.48 95.043 c 9.418
 95.273 9.359 95.449 9.309 95.574 c 8.621 97.402 l 8.371 97.402 l 7.668 
95.574 l 7.559 95.262 l 7.496 95.043 l 7.512 95.262 l 7.512 97.402 l 7.184
 97.402 l 7.184 94.73 l 7.668 94.73 l 8.387 96.574 l 8.406 96.66 8.426 96.742
 8.449 96.824 c 8.469 96.91 8.484 96.973 8.496 97.012 c 8.504 96.961 8.527
 96.883 8.559 96.777 c 8.59 96.676 8.609 96.605 8.621 96.574 c 9.324 94.73
 l 9.793 94.73 l 9.793 97.402 l h
9.465 97.402 m f
10.477 98.215 m 10.383 98.215 10.305 98.203 10.242 98.184 c 10.242 97.934
 l 10.293 97.941 10.344 97.949 10.398 97.949 c 10.617 97.949 10.789 97.793
 10.914 97.48 c 10.945 97.387 l 10.133 95.34 l 10.492 95.34 l 10.93 96.48
 l 10.93 96.504 10.934 96.527 10.945 96.559 c 10.953 96.582 10.98 96.664
 11.023 96.809 c 11.074 96.945 11.105 97.02 11.117 97.027 c 11.242 96.652
 l 11.695 95.34 l 12.055 95.34 l 11.258 97.402 l 11.172 97.621 11.094 97.781
 11.023 97.887 c 10.949 98 10.867 98.082 10.773 98.137 c 10.688 98.188 10.59
 98.215 10.477 98.215 c h
10.477 98.215 m f
14.645 94.98 m 14.352 94.98 14.121 95.082 13.957 95.277 c 13.789 95.465
 13.707 95.727 13.707 96.059 c 13.707 96.383 13.789 96.645 13.957 96.84 
c 14.133 97.039 14.367 97.137 14.66 97.137 c 15.035 97.137 15.316 96.957
 15.504 96.59 c 15.801 96.73 l 15.695 96.961 15.539 97.137 15.332 97.262
 c 15.133 97.379 14.902 97.434 14.645 97.434 c 14.371 97.434 14.137 97.383
 13.941 97.277 c 13.742 97.164 13.59 97.004 13.488 96.793 c 13.395 96.586
 13.348 96.34 13.348 96.059 c 13.348 95.633 13.461 95.301 13.691 95.059 
c 13.918 94.809 14.238 94.684 14.645 94.684 c 14.926 94.684 15.16 94.742
 15.348 94.855 c 15.543 94.973 15.691 95.137 15.785 95.355 c 15.441 95.465
 l 15.379 95.309 15.273 95.191 15.129 95.105 c 14.992 95.023 14.832 94.98
 14.645 94.98 c h
14.645 94.98 m f
17.961 96.371 m 17.961 96.738 17.883 97.008 17.727 97.184 c 17.57 97.352
 17.34 97.434 17.039 97.434 c 16.734 97.434 16.508 97.348 16.352 97.168 
c 16.195 96.98 16.117 96.715 16.117 96.371 c 16.117 95.664 16.422 95.309
 17.039 95.309 c 17.359 95.309 17.594 95.398 17.742 95.574 c 17.887 95.742
 17.961 96.008 17.961 96.371 c h
17.602 96.371 m 17.602 96.09 17.559 95.887 17.477 95.762 c 17.391 95.629
 17.25 95.559 17.055 95.559 c 16.855 95.559 16.711 95.629 16.617 95.762 
c 16.523 95.887 16.477 96.09 16.477 96.371 c 16.477 96.645 16.516 96.848
 16.602 96.98 c 16.695 97.117 16.836 97.184 17.023 97.184 c 17.23 97.184
 17.375 97.121 17.461 96.996 c 17.555 96.863 17.602 96.652 17.602 96.371
 c h
17.602 96.371 m f
19.582 97.402 m 19.582 96.105 l 19.582 95.91 19.555 95.773 19.504 95.699
 c 19.449 95.617 19.352 95.574 19.207 95.574 c 19.059 95.574 18.945 95.633
 18.863 95.746 c 18.777 95.852 18.738 96.008 18.738 96.215 c 18.738 97.402
 l 18.395 97.402 l 18.395 95.793 l 18.395 95.555 18.395 95.402 18.395 95.34
 c 18.707 95.34 l 18.707 95.352 18.707 95.371 18.707 95.402 c 18.715 95.426
 18.723 95.457 18.723 95.496 c 18.723 95.527 18.723 95.598 18.723 95.699
 c 18.738 95.699 l 18.809 95.555 18.895 95.457 18.988 95.402 c 19.082 95.34
 19.195 95.309 19.332 95.309 c 19.488 95.309 19.605 95.34 19.691 95.402 
c 19.785 95.465 19.852 95.566 19.895 95.699 c 19.965 95.566 20.051 95.465
 20.145 95.402 c 20.246 95.34 20.371 95.309 20.52 95.309 c 20.727 95.309
 20.879 95.367 20.973 95.48 c 21.066 95.598 21.113 95.777 21.113 96.027 
c 21.113 97.402 l 20.77 97.402 l 20.77 96.105 l 20.77 95.91 20.742 95.773
 20.691 95.699 c 20.637 95.617 20.539 95.574 20.395 95.574 c 20.246 95.574
 20.133 95.633 20.051 95.746 c 19.965 95.852 19.926 96.008 19.926 96.215
 c 19.926 97.402 l h
19.582 97.402 m f
23.375 96.371 m 23.375 97.082 23.125 97.434 22.625 97.434 c 22.301 97.434
 22.086 97.32 21.984 97.09 c 21.969 97.09 l 21.977 97.102 21.984 97.207 
21.984 97.402 c 21.984 98.215 l 21.641 98.215 l 21.641 95.762 l 21.641 95.555
 21.633 95.414 21.625 95.34 c 21.953 95.34 l 21.953 95.352 21.953 95.371
 21.953 95.402 c 21.961 95.434 21.969 95.48 21.969 95.543 c 21.969 95.605
 21.969 95.652 21.969 95.684 c 21.984 95.684 l 22.047 95.551 22.125 95.457
 22.219 95.402 c 22.32 95.34 22.457 95.309 22.625 95.309 c 22.875 95.309
 23.062 95.398 23.188 95.574 c 23.312 95.742 23.375 96.008 23.375 96.371
 c h
23.016 96.371 m 23.016 96.09 22.973 95.887 22.891 95.762 c 22.816 95.637
 22.695 95.574 22.531 95.574 c 22.395 95.574 22.285 95.605 22.203 95.668
 c 22.129 95.723 22.07 95.809 22.031 95.934 c 22 96.051 21.984 96.207 21.984
 96.402 c 21.984 96.676 22.023 96.871 22.109 96.996 c 22.191 97.121 22.332
 97.184 22.531 97.184 c 22.695 97.184 22.816 97.121 22.891 96.996 c 22.973
 96.871 23.016 96.664 23.016 96.371 c h
23.016 96.371 m f
24.137 95.34 m 24.137 96.652 l 24.137 96.789 24.145 96.895 24.168 96.965
 c 24.199 97.039 24.238 97.098 24.293 97.137 c 24.355 97.168 24.441 97.184
 24.559 97.184 c 24.723 97.184 24.855 97.129 24.949 97.012 c 25.043 96.898
 25.09 96.742 25.09 96.543 c 25.09 95.34 l 25.434 95.34 l 25.434 96.965 
l 25.434 97.207 25.438 97.352 25.449 97.402 c 25.121 97.402 l 25.121 97.395
 25.121 97.379 25.121 97.355 c 25.121 97.324 25.121 97.293 25.121 97.262
 c 25.121 97.223 25.113 97.152 25.105 97.059 c 25.02 97.195 24.926 97.293
 24.824 97.355 c 24.73 97.406 24.605 97.434 24.449 97.434 c 24.219 97.434
 24.051 97.383 23.949 97.277 c 23.844 97.164 23.793 96.977 23.793 96.715
 c 23.793 95.34 l h
24.137 95.34 m f
26.758 97.387 m 26.652 97.418 26.539 97.434 26.414 97.434 c 26.141 97.434
 26.008 97.277 26.008 96.965 c 26.008 95.59 l 25.773 95.59 l 25.773 95.34
 l 26.023 95.34 l 26.117 94.887 l 26.352 94.887 l 26.352 95.34 l 26.727 
95.34 l 26.727 95.59 l 26.352 95.59 l 26.352 96.887 l 26.352 96.992 26.367
 97.066 26.398 97.105 c 26.43 97.148 26.484 97.168 26.57 97.168 c 26.609
 97.168 26.672 97.16 26.758 97.137 c h
26.758 97.387 m f
27.324 96.449 m 27.324 96.68 27.371 96.863 27.465 96.996 c 27.559 97.121
 27.699 97.184 27.887 97.184 c 28.031 97.184 28.152 97.16 28.246 97.105 
c 28.34 97.043 28.402 96.965 28.434 96.871 c 28.73 96.949 l 28.605 97.273
 28.324 97.434 27.887 97.434 c 27.582 97.434 27.355 97.348 27.199 97.168
 c 27.043 96.992 26.965 96.723 26.965 96.355 c 26.965 96.023 27.043 95.77
 27.199 95.59 c 27.355 95.402 27.578 95.309 27.871 95.309 c 28.473 95.309
 28.777 95.676 28.777 96.402 c 28.777 96.449 l h
28.434 96.184 m 28.41 95.965 28.355 95.809 28.262 95.715 c 28.168 95.613
 28.035 95.559 27.871 95.559 c 27.703 95.559 27.574 95.617 27.48 95.73 c
 27.387 95.836 27.332 95.988 27.324 96.184 c h
28.434 96.184 m f
29.227 97.402 m 29.227 95.824 l 29.227 95.68 29.227 95.52 29.227 95.34 
c 29.539 95.34 l 29.547 95.582 29.555 95.723 29.555 95.762 c 29.57 95.762
 l 29.621 95.586 29.684 95.465 29.758 95.402 c 29.828 95.34 29.93 95.309
 30.055 95.309 c 30.094 95.309 30.141 95.316 30.195 95.324 c 30.195 95.637
 l 30.141 95.629 30.078 95.621 30.008 95.621 c 29.859 95.621 29.75 95.684
 29.68 95.809 c 29.605 95.934 29.57 96.105 29.57 96.324 c 29.57 97.402 l
 h
29.227 97.402 m f
1 g
0.074 0.074 39.699 6.75 re f*
0 g
q 1 0 0 1 0 0 cm
0.074 0.074 39.699 6.75 re S Q
3.66 2.82 m 3.66 3.082 3.574 3.285 3.41 3.43 c 3.242 3.578 3.02 3.648 2.738
 3.648 c 1.957 3.648 l 1.957 4.695 l 1.582 4.695 l 1.582 2.023 l 2.723 2.023
 l 3.012 2.023 3.242 2.098 3.41 2.242 c 3.574 2.379 3.66 2.57 3.66 2.82 
c h
3.301 2.82 m 3.301 2.477 3.09 2.305 2.676 2.305 c 1.957 2.305 l 1.957 3.367
 l 2.691 3.367 l 3.098 3.367 3.301 3.188 3.301 2.82 c h
3.301 2.82 m f
6.293 3.961 m 6.293 4.203 6.191 4.391 5.996 4.523 c 5.809 4.66 5.535 4.727
 5.184 4.727 c 4.527 4.727 4.145 4.504 4.043 4.055 c 4.402 3.977 l 4.441
 4.145 4.527 4.266 4.652 4.336 c 4.785 4.41 4.969 4.445 5.199 4.445 c 5.426
 4.445 5.605 4.41 5.73 4.336 c 5.863 4.254 5.934 4.133 5.934 3.977 c 5.934
 3.895 5.91 3.828 5.871 3.773 c 5.828 3.711 5.77 3.664 5.699 3.633 c 5.625
 3.594 5.535 3.562 5.434 3.539 c 5.34 3.52 5.23 3.492 5.105 3.461 c 4.895
 3.41 4.734 3.363 4.621 3.32 c 4.516 3.27 4.434 3.219 4.371 3.164 c 4.309
 3.102 4.254 3.035 4.215 2.961 c 4.184 2.891 4.168 2.801 4.168 2.695 c 4.168
 2.469 4.254 2.289 4.434 2.164 c 4.609 2.039 4.859 1.977 5.184 1.977 c 5.496
 1.977 5.73 2.023 5.887 2.117 c 6.043 2.211 6.156 2.375 6.23 2.602 c 5.871
 2.664 l 5.828 2.52 5.75 2.414 5.637 2.352 c 5.531 2.289 5.379 2.258 5.184
 2.258 c 4.973 2.258 4.812 2.297 4.699 2.367 c 4.582 2.43 4.527 2.535 4.527
 2.68 c 4.527 2.766 4.547 2.832 4.59 2.883 c 4.629 2.938 4.691 2.984 4.777
 3.023 c 4.859 3.055 5.027 3.098 5.277 3.148 c 5.359 3.172 5.438 3.191 5.512
 3.211 c 5.594 3.234 5.672 3.258 5.746 3.289 c 5.828 3.312 5.902 3.344 5.965
 3.383 c 6.027 3.414 6.078 3.457 6.121 3.508 c 6.172 3.562 6.215 3.625 6.246
 3.695 c 6.277 3.77 6.293 3.859 6.293 3.961 c h
6.293 3.961 m f
6.832 3.039 m 6.832 2.633 l 7.191 2.633 l 7.191 3.039 l h
6.832 4.695 m 6.832 4.305 l 7.191 4.305 l 7.191 4.695 l h
6.832 4.695 m f
9.945 2.82 m 9.945 3.082 9.859 3.285 9.695 3.43 c 9.527 3.578 9.305 3.648
 9.023 3.648 c 8.242 3.648 l 8.242 4.695 l 7.867 4.695 l 7.867 2.023 l 9.008
 2.023 l 9.297 2.023 9.527 2.098 9.695 2.242 c 9.859 2.379 9.945 2.57 9.945
 2.82 c h
9.586 2.82 m 9.586 2.477 9.375 2.305 8.961 2.305 c 8.242 2.305 l 8.242 
3.367 l 8.977 3.367 l 9.383 3.367 9.586 3.188 9.586 2.82 c h
9.586 2.82 m f
10.422 4.695 m 10.422 3.117 l 10.422 2.973 10.422 2.812 10.422 2.633 c 
10.734 2.633 l 10.742 2.875 10.75 3.016 10.75 3.055 c 10.766 3.055 l 10.816
 2.879 10.879 2.758 10.953 2.695 c 11.023 2.633 11.125 2.602 11.25 2.602
 c 11.289 2.602 11.336 2.609 11.391 2.617 c 11.391 2.93 l 11.336 2.922 11.273
 2.914 11.203 2.914 c 11.055 2.914 10.945 2.977 10.875 3.102 c 10.801 3.227
 10.766 3.398 10.766 3.617 c 10.766 4.695 l h
10.422 4.695 m f
13.457 3.664 m 13.457 4.031 13.379 4.301 13.223 4.477 c 13.066 4.645 12.836
 4.727 12.535 4.727 c 12.23 4.727 12.004 4.641 11.848 4.461 c 11.691 4.273
 11.613 4.008 11.613 3.664 c 11.613 2.957 11.918 2.602 12.535 2.602 c 12.855
 2.602 13.09 2.691 13.238 2.867 c 13.383 3.035 13.457 3.301 13.457 3.664
 c h
13.098 3.664 m 13.098 3.383 13.055 3.18 12.973 3.055 c 12.887 2.922 12.746
 2.852 12.551 2.852 c 12.352 2.852 12.207 2.922 12.113 3.055 c 12.02 3.18
 11.973 3.383 11.973 3.664 c 11.973 3.938 12.012 4.141 12.098 4.273 c 12.191
 4.41 12.332 4.477 12.52 4.477 c 12.727 4.477 12.871 4.414 12.957 4.289 
c 13.051 4.156 13.098 3.945 13.098 3.664 c h
13.098 3.664 m f
15.188 4.367 m 15.125 4.492 15.039 4.586 14.938 4.648 c 14.832 4.699 14.703
 4.727 14.547 4.727 c 14.285 4.727 14.094 4.645 13.969 4.477 c 13.844 4.301
 13.781 4.035 13.781 3.68 c 13.781 2.961 14.035 2.602 14.547 2.602 c 14.703
 2.602 14.832 2.633 14.938 2.695 c 15.039 2.75 15.125 2.836 15.188 2.961
 c 15.188 1.883 l 15.531 1.883 l 15.531 4.273 l 15.531 4.484 15.531 4.625
 15.531 4.695 c 15.219 4.695 l 15.207 4.676 15.195 4.629 15.188 4.555 c 
15.188 4.484 15.188 4.422 15.188 4.367 c h
14.141 3.664 m 14.141 3.957 14.176 4.164 14.25 4.289 c 14.332 4.414 14.457
 4.477 14.625 4.477 c 14.82 4.477 14.961 4.41 15.047 4.273 c 15.141 4.141
 15.188 3.93 15.188 3.648 c 15.188 3.379 15.141 3.18 15.047 3.055 c 14.961
 2.922 14.828 2.852 14.641 2.852 c 14.461 2.852 14.332 2.922 14.25 3.055
 c 14.176 3.18 14.141 3.383 14.141 3.664 c h
14.141 3.664 m f
16.387 2.633 m 16.387 3.945 l 16.387 4.082 16.395 4.188 16.418 4.258 c 
16.449 4.332 16.488 4.391 16.543 4.43 c 16.605 4.461 16.691 4.477 16.809
 4.477 c 16.973 4.477 17.105 4.422 17.199 4.305 c 17.293 4.191 17.34 4.035
 17.34 3.836 c 17.34 2.633 l 17.684 2.633 l 17.684 4.258 l 17.684 4.5 17.688
 4.645 17.699 4.695 c 17.371 4.695 l 17.371 4.688 17.371 4.672 17.371 4.648
 c 17.371 4.617 17.371 4.586 17.371 4.555 c 17.371 4.516 17.363 4.445 17.355
 4.352 c 17.27 4.488 17.176 4.586 17.074 4.648 c 16.98 4.699 16.855 4.727
 16.699 4.727 c 16.469 4.727 16.301 4.676 16.199 4.57 c 16.094 4.457 16.043
 4.27 16.043 4.008 c 16.043 2.633 l h
16.387 2.633 m f
18.477 3.664 m 18.477 3.938 18.516 4.141 18.602 4.273 c 18.695 4.398 18.828
 4.461 19.008 4.461 c 19.121 4.461 19.219 4.43 19.305 4.367 c 19.387 4.305
 19.438 4.203 19.461 4.055 c 19.805 4.086 l 19.773 4.285 19.684 4.441 19.539
 4.555 c 19.402 4.672 19.227 4.727 19.008 4.727 c 18.727 4.727 18.508 4.641
 18.352 4.461 c 18.203 4.285 18.133 4.02 18.133 3.664 c 18.133 3.32 18.203
 3.062 18.352 2.883 c 18.508 2.695 18.727 2.602 19.008 2.602 c 19.215 2.602
 19.387 2.66 19.523 2.773 c 19.668 2.879 19.758 3.023 19.789 3.211 c 19.445
 3.242 l 19.422 3.129 19.375 3.039 19.305 2.977 c 19.23 2.906 19.125 2.867
 18.992 2.867 c 18.812 2.867 18.684 2.93 18.602 3.055 c 18.516 3.172 18.477
 3.375 18.477 3.664 c h
18.477 3.664 m f
20.953 4.68 m 20.848 4.711 20.734 4.727 20.609 4.727 c 20.336 4.727 20.203
 4.57 20.203 4.258 c 20.203 2.883 l 19.969 2.883 l 19.969 2.633 l 20.219
 2.633 l 20.312 2.18 l 20.547 2.18 l 20.547 2.633 l 20.922 2.633 l 20.922
 2.883 l 20.547 2.883 l 20.547 4.18 l 20.547 4.285 20.562 4.359 20.594 4.398
 c 20.625 4.441 20.68 4.461 20.766 4.461 c 20.805 4.461 20.867 4.453 20.953
 4.43 c h
20.953 4.68 m f
21.254 2.195 m 21.254 1.883 l 21.598 1.883 l 21.598 2.195 l h
21.254 4.695 m 21.254 2.633 l 21.598 2.633 l 21.598 4.695 l h
21.254 4.695 m f
23.855 3.664 m 23.855 4.031 23.777 4.301 23.621 4.477 c 23.465 4.645 23.234
 4.727 22.934 4.727 c 22.629 4.727 22.402 4.641 22.246 4.461 c 22.09 4.273
 22.012 4.008 22.012 3.664 c 22.012 2.957 22.316 2.602 22.934 2.602 c 23.254
 2.602 23.488 2.691 23.637 2.867 c 23.781 3.035 23.855 3.301 23.855 3.664
 c h
23.496 3.664 m 23.496 3.383 23.453 3.18 23.371 3.055 c 23.285 2.922 23.145
 2.852 22.949 2.852 c 22.75 2.852 22.605 2.922 22.512 3.055 c 22.418 3.18
 22.371 3.383 22.371 3.664 c 22.371 3.938 22.41 4.141 22.496 4.273 c 22.59
 4.41 22.73 4.477 22.918 4.477 c 23.125 4.477 23.27 4.414 23.355 4.289 c
 23.449 4.156 23.496 3.945 23.496 3.664 c h
23.496 3.664 m f
25.586 4.695 m 25.586 3.398 l 25.586 3.266 25.57 3.16 25.539 3.086 c 25.516
 3.004 25.477 2.945 25.414 2.914 c 25.359 2.883 25.277 2.867 25.164 2.867
 c 24.996 2.867 24.867 2.926 24.773 3.039 c 24.68 3.156 24.633 3.312 24.633
 3.508 c 24.633 4.695 l 24.289 4.695 l 24.289 3.086 l 24.289 2.848 24.289
 2.695 24.289 2.633 c 24.602 2.633 l 24.602 2.645 24.602 2.664 24.602 2.695
 c 24.609 2.719 24.617 2.75 24.617 2.789 c 24.617 2.82 24.617 2.891 24.617
 2.992 c 24.633 2.992 l 24.703 2.848 24.793 2.75 24.898 2.695 c 25 2.633
 25.133 2.602 25.289 2.602 c 25.508 2.602 25.668 2.66 25.773 2.773 c 25.875
 2.891 25.93 3.07 25.93 3.32 c 25.93 4.695 l h
25.586 4.695 m f
29.691 3.961 m 29.691 4.203 29.59 4.391 29.395 4.523 c 29.207 4.66 28.934
 4.727 28.582 4.727 c 27.926 4.727 27.543 4.504 27.441 4.055 c 27.801 3.977
 l 27.84 4.145 27.926 4.266 28.051 4.336 c 28.184 4.41 28.367 4.445 28.598
 4.445 c 28.824 4.445 29.004 4.41 29.129 4.336 c 29.262 4.254 29.332 4.133
 29.332 3.977 c 29.332 3.895 29.309 3.828 29.27 3.773 c 29.227 3.711 29.168
 3.664 29.098 3.633 c 29.023 3.594 28.934 3.562 28.832 3.539 c 28.738 3.52
 28.629 3.492 28.504 3.461 c 28.293 3.41 28.133 3.363 28.02 3.32 c 27.914
 3.27 27.832 3.219 27.77 3.164 c 27.707 3.102 27.652 3.035 27.613 2.961 
c 27.582 2.891 27.566 2.801 27.566 2.695 c 27.566 2.469 27.652 2.289 27.832
 2.164 c 28.008 2.039 28.258 1.977 28.582 1.977 c 28.895 1.977 29.129 2.023
 29.285 2.117 c 29.441 2.211 29.555 2.375 29.629 2.602 c 29.27 2.664 l 29.227
 2.52 29.148 2.414 29.035 2.352 c 28.93 2.289 28.777 2.258 28.582 2.258 
c 28.371 2.258 28.211 2.297 28.098 2.367 c 27.98 2.43 27.926 2.535 27.926
 2.68 c 27.926 2.766 27.945 2.832 27.988 2.883 c 28.027 2.938 28.09 2.984
 28.176 3.023 c 28.258 3.055 28.426 3.098 28.676 3.148 c 28.758 3.172 28.836
 3.191 28.91 3.211 c 28.992 3.234 29.07 3.258 29.145 3.289 c 29.227 3.312
 29.301 3.344 29.363 3.383 c 29.426 3.414 29.477 3.457 29.52 3.508 c 29.57
 3.562 29.613 3.625 29.645 3.695 c 29.676 3.77 29.691 3.859 29.691 3.961
 c h
29.691 3.961 m f
30.402 3.742 m 30.402 3.973 30.449 4.156 30.543 4.289 c 30.637 4.414 30.777
 4.477 30.965 4.477 c 31.109 4.477 31.23 4.453 31.324 4.398 c 31.418 4.336
 31.48 4.258 31.512 4.164 c 31.809 4.242 l 31.684 4.566 31.402 4.727 30.965
 4.727 c 30.66 4.727 30.434 4.641 30.277 4.461 c 30.121 4.285 30.043 4.016
 30.043 3.648 c 30.043 3.316 30.121 3.062 30.277 2.883 c 30.434 2.695 30.656
 2.602 30.949 2.602 c 31.551 2.602 31.855 2.969 31.855 3.695 c 31.855 3.742
 l h
31.512 3.477 m 31.488 3.258 31.434 3.102 31.34 3.008 c 31.246 2.906 31.113
 2.852 30.949 2.852 c 30.781 2.852 30.652 2.91 30.559 3.023 c 30.465 3.129
 30.41 3.281 30.402 3.477 c h
31.512 3.477 m f
32.305 4.695 m 32.305 3.117 l 32.305 2.973 32.305 2.812 32.305 2.633 c 
32.617 2.633 l 32.625 2.875 32.633 3.016 32.633 3.055 c 32.648 3.055 l 32.699
 2.879 32.762 2.758 32.836 2.695 c 32.906 2.633 33.008 2.602 33.133 2.602
 c 33.172 2.602 33.219 2.609 33.273 2.617 c 33.273 2.93 l 33.219 2.922 33.156
 2.914 33.086 2.914 c 32.938 2.914 32.828 2.977 32.758 3.102 c 32.684 3.227
 32.648 3.398 32.648 3.617 c 32.648 4.695 l h
32.305 4.695 m f
34.512 4.695 m 34.105 4.695 l 33.355 2.633 l 33.715 2.633 l 34.168 3.977
 l 34.188 4.031 34.234 4.18 34.309 4.43 c 34.371 4.211 l 34.449 3.977 l 
34.902 2.633 l 35.277 2.633 l h
34.512 4.695 m f
35.82 3.742 m 35.82 3.973 35.867 4.156 35.961 4.289 c 36.055 4.414 36.195
 4.477 36.383 4.477 c 36.527 4.477 36.648 4.453 36.742 4.398 c 36.836 4.336
 36.898 4.258 36.93 4.164 c 37.227 4.242 l 37.102 4.566 36.82 4.727 36.383
 4.727 c 36.078 4.727 35.852 4.641 35.695 4.461 c 35.539 4.285 35.461 4.016
 35.461 3.648 c 35.461 3.316 35.539 3.062 35.695 2.883 c 35.852 2.695 36.074
 2.602 36.367 2.602 c 36.969 2.602 37.273 2.969 37.273 3.695 c 37.273 3.742
 l h
36.93 3.477 m 36.906 3.258 36.852 3.102 36.758 3.008 c 36.664 2.906 36.531
 2.852 36.367 2.852 c 36.199 2.852 36.07 2.91 35.977 3.023 c 35.883 3.129
 35.828 3.281 35.82 3.477 c h
36.93 3.477 m f
37.723 4.695 m 37.723 3.117 l 37.723 2.973 37.723 2.812 37.723 2.633 c 
38.035 2.633 l 38.043 2.875 38.051 3.016 38.051 3.055 c 38.066 3.055 l 38.117
 2.879 38.18 2.758 38.254 2.695 c 38.324 2.633 38.426 2.602 38.551 2.602
 c 38.59 2.602 38.637 2.609 38.691 2.617 c 38.691 2.93 l 38.637 2.922 38.574
 2.914 38.504 2.914 c 38.355 2.914 38.246 2.977 38.176 3.102 c 38.102 3.227
 38.066 3.398 38.066 3.617 c 38.066 4.695 l h
37.723 4.695 m f
1 g
23.391 25.559 18.414 9.203 re f*
0 g
q 1 0 0 1 0 0 cm
23.391 25.559 18.414 9.203 re S Q
31.773 31.406 m 31.398 31.406 l 30.305 28.734 l 30.695 28.734 l 31.43 30.609
 l 31.586 31.094 l 31.742 30.609 l 32.492 28.734 l 32.867 28.734 l h
31.773 31.406 m f
33.094 31.406 m 33.094 31.172 l 33.156 31.016 33.234 30.887 33.328 30.781
 c 33.422 30.668 33.516 30.562 33.609 30.469 c 33.711 30.375 33.816 30.293
 33.922 30.219 c 34.023 30.137 34.113 30.059 34.188 29.984 c 34.27 29.902
 34.336 29.82 34.391 29.734 c 34.441 29.641 34.469 29.543 34.469 29.438 
c 34.469 29.293 34.422 29.18 34.328 29.094 c 34.242 29.012 34.129 28.969
 33.984 28.969 c 33.836 28.969 33.711 29.012 33.609 29.094 c 33.516 29.168
 33.461 29.277 33.453 29.422 c 33.094 29.391 l 33.125 29.172 33.219 29 33.375
 28.875 c 33.531 28.75 33.734 28.688 33.984 28.688 c 34.242 28.688 34.445
 28.758 34.594 28.891 c 34.738 29.016 34.812 29.195 34.812 29.422 c 34.812
 29.527 34.785 29.633 34.734 29.734 c 34.691 29.84 34.625 29.945 34.531 
30.047 c 34.438 30.141 34.258 30.297 34 30.516 c 33.852 30.641 33.734 30.75
 33.641 30.844 c 33.555 30.938 33.5 31.027 33.469 31.109 c 34.859 31.109
 l 34.859 31.406 l h
33.094 31.406 m f
1 g
1.305 25.559 18.414 9.203 re f*
0 g
q 1 0 0 1 0 0 cm
1.305 25.559 18.414 9.203 re S Q
9.688 31.406 m 9.312 31.406 l 8.219 28.734 l 8.609 28.734 l 9.344 30.609
 l 9.5 31.094 l 9.656 30.609 l 10.406 28.734 l 10.781 28.734 l h
9.688 31.406 m f
11.102 31.406 m 11.102 31.109 l 11.789 31.109 l 11.789 29.062 l 11.18 29.484
 l 11.18 29.172 l 11.805 28.734 l 12.133 28.734 l 12.133 31.109 l 12.773
 31.109 l 12.773 31.406 l h
11.102 31.406 m f
q 1 0 0 1 0 0 cm
23.391 30.469 m 21.645 30.469 l S Q
22.871 30.469 m 22.871 30.754 23.105 30.988 23.391 30.988 c 23.684 30.988
 23.918 30.754 23.918 30.469 c 23.918 30.176 23.684 29.941 23.391 29.941
 c 23.105 29.941 22.871 30.176 22.871 30.469 c h
22.871 30.469 m f*
21.816 31.172 m 19.719 30.469 l 21.816 29.77 l h
21.816 31.172 m f*
q 1 0 0 1 0 0 cm
45.477 30.469 m 43.73 30.469 l S Q
1 g
45.477 25.559 18.414 9.203 re f*
0 g
q 1 0 0 1 0 0 cm
45.477 25.559 18.414 9.203 re S Q
53.863 31.406 m 53.488 31.406 l 52.395 28.734 l 52.785 28.734 l 53.52 30.609
 l 53.676 31.094 l 53.832 30.609 l 54.582 28.734 l 54.957 28.734 l h
53.863 31.406 m f
56.98 30.672 m 56.98 30.914 56.895 31.102 56.73 31.234 c 56.574 31.371 
56.348 31.438 56.059 31.438 c 55.785 31.438 55.566 31.383 55.402 31.266 
c 55.246 31.141 55.152 30.961 55.121 30.719 c 55.48 30.688 l 55.52 31 55.715
 31.156 56.059 31.156 c 56.234 31.156 56.371 31.117 56.465 31.031 c 56.566
 30.949 56.621 30.824 56.621 30.656 c 56.621 30.512 56.562 30.398 56.449
 30.312 c 56.332 30.23 56.172 30.188 55.965 30.188 c 55.777 30.188 l 55.777
 29.891 l 55.949 29.891 l 56.137 29.891 56.281 29.855 56.387 29.781 c 56.488
 29.699 56.543 29.586 56.543 29.438 c 56.543 29.293 56.5 29.18 56.418 29.094
 c 56.332 29.012 56.207 28.969 56.043 28.969 c 55.895 28.969 55.777 29.012
 55.684 29.094 c 55.59 29.168 55.531 29.273 55.512 29.406 c 55.168 29.391
 l 55.199 29.172 55.293 29 55.449 28.875 c 55.605 28.75 55.801 28.688 56.043
 28.688 c 56.312 28.688 56.52 28.75 56.668 28.875 c 56.824 29 56.902 29.172
 56.902 29.391 c 56.902 29.57 56.848 29.711 56.746 29.812 c 56.652 29.918
 56.516 29.992 56.34 30.031 c 56.34 30.047 l 56.535 30.07 56.691 30.137 
56.809 30.25 c 56.922 30.355 56.98 30.496 56.98 30.672 c h
56.98 30.672 m f
44.957 30.469 m 44.957 30.754 45.191 30.988 45.477 30.988 c 45.77 30.988
 46.004 30.754 46.004 30.469 c 46.004 30.176 45.77 29.941 45.477 29.941 
c 45.191 29.941 44.957 30.176 44.957 30.469 c h
44.957 30.469 m f*
43.902 31.172 m 41.805 30.469 l 43.902 29.77 l h
43.902 31.172 m f*
1 g
23.391 64.746 18.414 9.203 re f*
0 g
q 1 0 0 1 0 0 cm
23.391 64.746 18.414 9.203 re S Q
31.773 70.594 m 31.398 70.594 l 30.305 67.922 l 30.695 67.922 l 31.43 69.797
 l 31.586 70.281 l 31.742 69.797 l 32.492 67.922 l 32.867 67.922 l h
31.773 70.594 m f
33.094 70.594 m 33.094 70.359 l 33.156 70.203 33.234 70.074 33.328 69.969
 c 33.422 69.855 33.516 69.75 33.609 69.656 c 33.711 69.562 33.816 69.48
 33.922 69.406 c 34.023 69.324 34.113 69.246 34.188 69.172 c 34.27 69.09
 34.336 69.008 34.391 68.922 c 34.441 68.828 34.469 68.73 34.469 68.625 
c 34.469 68.48 34.422 68.367 34.328 68.281 c 34.242 68.199 34.129 68.156
 33.984 68.156 c 33.836 68.156 33.711 68.199 33.609 68.281 c 33.516 68.355
 33.461 68.465 33.453 68.609 c 33.094 68.578 l 33.125 68.359 33.219 68.188
 33.375 68.062 c 33.531 67.938 33.734 67.875 33.984 67.875 c 34.242 67.875
 34.445 67.945 34.594 68.078 c 34.738 68.203 34.812 68.383 34.812 68.609
 c 34.812 68.715 34.785 68.82 34.734 68.922 c 34.691 69.027 34.625 69.133
 34.531 69.234 c 34.438 69.328 34.258 69.484 34 69.703 c 33.852 69.828 33.734
 69.938 33.641 70.031 c 33.555 70.125 33.5 70.215 33.469 70.297 c 34.859
 70.297 l 34.859 70.594 l h
33.094 70.594 m f
1 g
45.477 64.746 18.414 9.203 re f*
0 g
q 1 0 0 1 0 0 cm
45.477 64.746 18.414 9.203 re S Q
53.863 70.594 m 53.488 70.594 l 52.395 67.922 l 52.785 67.922 l 53.52 69.797
 l 53.676 70.281 l 53.832 69.797 l 54.582 67.922 l 54.957 67.922 l h
53.863 70.594 m f
56.98 69.859 m 56.98 70.102 56.895 70.289 56.73 70.422 c 56.574 70.559 
56.348 70.625 56.059 70.625 c 55.785 70.625 55.566 70.57 55.402 70.453 c
 55.246 70.328 55.152 70.148 55.121 69.906 c 55.48 69.875 l 55.52 70.188
 55.715 70.344 56.059 70.344 c 56.234 70.344 56.371 70.305 56.465 70.219
 c 56.566 70.137 56.621 70.012 56.621 69.844 c 56.621 69.699 56.562 69.586
 56.449 69.5 c 56.332 69.418 56.172 69.375 55.965 69.375 c 55.777 69.375
 l 55.777 69.078 l 55.949 69.078 l 56.137 69.078 56.281 69.043 56.387 68.969
 c 56.488 68.887 56.543 68.773 56.543 68.625 c 56.543 68.48 56.5 68.367 
56.418 68.281 c 56.332 68.199 56.207 68.156 56.043 68.156 c 55.895 68.156
 55.777 68.199 55.684 68.281 c 55.59 68.355 55.531 68.461 55.512 68.594 
c 55.168 68.578 l 55.199 68.359 55.293 68.188 55.449 68.062 c 55.605 67.938
 55.801 67.875 56.043 67.875 c 56.312 67.875 56.52 67.938 56.668 68.062 
c 56.824 68.188 56.902 68.359 56.902 68.578 c 56.902 68.758 56.848 68.898
 56.746 69 c 56.652 69.105 56.516 69.18 56.34 69.219 c 56.34 69.234 l 56.535
 69.258 56.691 69.324 56.809 69.438 c 56.922 69.543 56.98 69.684 56.98 69.859
 c h
56.98 69.859 m f
1 g
1.305 64.746 18.414 9.203 re f*
0 g
q 1 0 0 1 0 0 cm
1.305 64.746 18.414 9.203 re S Q
9.688 70.594 m 9.312 70.594 l 8.219 67.922 l 8.609 67.922 l 9.344 69.797
 l 9.5 70.281 l 9.656 69.797 l 10.406 67.922 l 10.781 67.922 l h
9.688 70.594 m f
11.102 70.594 m 11.102 70.297 l 11.789 70.297 l 11.789 68.25 l 11.18 68.672
 l 11.18 68.359 l 11.805 67.922 l 12.133 67.922 l 12.133 70.297 l 12.773
 70.297 l 12.773 70.594 l h
11.102 70.594 m f
q 1 0 0 1 0 0 cm
23.391 69.656 m 21.645 69.656 l S Q
22.871 69.656 m 22.871 69.949 23.105 70.184 23.391 70.184 c 23.684 70.184
 23.918 69.949 23.918 69.656 c 23.918 69.363 23.684 69.129 23.391 69.129
 c 23.105 69.129 22.871 69.363 22.871 69.656 c h
22.871 69.656 m f*
21.816 70.355 m 19.719 69.656 l 21.816 68.957 l h
21.816 70.355 m f*
q 1 0 0 1 0 0 cm
45.477 69.656 m 43.73 69.656 l S Q
44.957 69.656 m 44.957 69.949 45.191 70.184 45.477 70.184 c 45.77 70.184
 46.004 69.949 46.004 69.656 c 46.004 69.363 45.77 69.129 45.477 69.129 
c 45.191 69.129 44.957 69.363 44.957 69.656 c h
44.957 69.656 m f*
43.902 70.355 m 41.805 69.656 l 43.902 68.957 l h
43.902 70.355 m f*
q
0 0 115 100 re W n
[ 1 0 0 1 0 0 ] concat
  q
0 g
0.152179 w
1 J
1 j
[] 0.0 d
4 M q 1 0 0 -1 0 0 cm
54.453 -78.594 m 54.453 -75.5 l S Q
  Q
Q
q
0 0 115 100 re W n
[ 1 0 0 1 0 0 ] concat
  q
0 g
53.59 75.715 m 54.453 74 l 55.305 75.715 l h
53.59 75.715 m f*
  Q
Q
q
0 0 115 100 re W n
[ 1 0 0 1 0 0 ] concat
  q
0 g
43.707 78.406 21.48 7.668 re f*
  Q
Q
q
0 0 115 100 re W n
[ 1 0 0 1 0 0 ] concat
  q
0 g
0.152179 w
1 J
1 j
[] 0.0 d
4 M q 1 0 0 1 0 0 cm
43.707 78.406 21.48 7.668 re S Q
  Q
Q
q
0 0 115 100 re W n
[ 1 0 0 1 0 0 ] concat
  q
1 g
47.391 81.656 m 47.391 81.824 47.348 81.977 47.266 82.109 c 47.18 82.246
 47.066 82.355 46.922 82.438 c 46.773 82.512 46.602 82.547 46.406 82.547
 c 45.75 82.547 l 45.75 83.484 l 45.188 83.484 l 45.188 80.812 l 46.391 
80.812 l 46.703 80.812 46.945 80.887 47.125 81.031 c 47.301 81.18 47.391
 81.387 47.391 81.656 c h
46.812 81.672 m 46.812 81.391 46.648 81.25 46.328 81.25 c 45.75 81.25 l
 45.75 82.109 l 46.344 82.109 l 46.488 82.109 46.602 82.074 46.688 82 c 
46.77 81.918 46.812 81.809 46.812 81.672 c h
46.812 81.672 m f
49.961 82.719 m 49.961 82.98 49.859 83.18 49.664 83.312 c 49.477 83.449
 49.195 83.516 48.82 83.516 c 48.477 83.516 48.203 83.461 48.008 83.344 
c 47.82 83.219 47.695 83.031 47.633 82.781 c 48.18 82.703 l 48.211 82.84
 48.277 82.945 48.383 83.016 c 48.496 83.078 48.648 83.109 48.836 83.109
 c 49.219 83.109 49.414 82.992 49.414 82.75 c 49.414 82.668 49.391 82.605
 49.352 82.562 c 49.309 82.512 49.246 82.469 49.164 82.438 c 49.078 82.406
 48.922 82.367 48.695 82.312 c 48.496 82.273 48.355 82.234 48.273 82.203
 c 48.199 82.172 48.125 82.141 48.055 82.109 c 47.992 82.07 47.938 82.023
 47.898 81.969 c 47.855 81.906 47.82 81.84 47.789 81.766 c 47.766 81.695
 47.758 81.609 47.758 81.516 c 47.758 81.277 47.844 81.094 48.023 80.969
 c 48.211 80.836 48.477 80.766 48.82 80.766 c 49.152 80.766 49.402 80.82
 49.57 80.922 c 49.734 81.027 49.844 81.199 49.898 81.438 c 49.352 81.516
 l 49.32 81.402 49.262 81.32 49.18 81.266 c 49.094 81.203 48.977 81.172 
48.82 81.172 c 48.477 81.172 48.305 81.277 48.305 81.484 c 48.305 81.559
 48.32 81.617 48.352 81.656 c 48.391 81.699 48.449 81.734 48.523 81.766 
c 48.594 81.797 48.734 81.84 48.945 81.891 c 49.203 81.945 49.387 81.996
 49.492 82.047 c 49.605 82.09 49.695 82.141 49.758 82.203 c 49.828 82.266
 49.883 82.34 49.914 82.422 c 49.945 82.508 49.961 82.605 49.961 82.719 
c h
49.961 82.719 m f
50.156 83.562 m 50.719 80.672 l 51.172 80.672 l 50.625 83.562 l h
50.156 83.562 m f
53.688 83.484 m 53.688 81.859 l 53.688 81.828 53.688 81.797 53.688 81.766
 c 53.688 81.727 53.691 81.562 53.703 81.281 c 53.609 81.625 53.539 81.859
 53.5 81.984 c 53.016 83.484 l 52.625 83.484 l 52.141 81.984 l 51.938 81.281
 l 51.957 81.574 51.969 81.766 51.969 81.859 c 51.969 83.484 l 51.469 83.484
 l 51.469 80.812 l 52.219 80.812 l 52.688 82.297 l 52.734 82.453 l 52.828
 82.812 l 52.938 82.375 l 53.438 80.812 l 54.188 80.812 l 54.188 83.484 
l h
53.688 83.484 m f
55.203 83.516 m 55.004 83.516 54.848 83.465 54.734 83.359 c 54.617 83.258
 54.562 83.105 54.562 82.906 c 54.562 82.688 54.629 82.527 54.766 82.422
 c 54.91 82.309 55.113 82.25 55.375 82.25 c 55.828 82.234 l 55.828 82.141
 l 55.828 82.008 55.801 81.906 55.75 81.844 c 55.707 81.773 55.629 81.734
 55.516 81.734 c 55.422 81.734 55.348 81.762 55.297 81.812 c 55.254 81.855
 55.227 81.93 55.219 82.031 c 54.656 82 l 54.695 81.805 54.789 81.652 54.938
 81.547 c 55.082 81.445 55.285 81.391 55.547 81.391 c 55.805 81.391 56.004
 81.461 56.141 81.594 c 56.285 81.719 56.359 81.898 56.359 82.125 c 56.359
 82.875 l 56.359 82.992 56.367 83.074 56.391 83.125 c 56.422 83.168 56.469
 83.188 56.531 83.188 c 56.562 83.188 56.598 83.184 56.641 83.172 c 56.641
 83.453 l 56.609 83.465 56.578 83.477 56.547 83.484 c 56.523 83.484 56.5
 83.484 56.469 83.484 c 56.445 83.492 56.422 83.5 56.391 83.5 c 56.367 83.5
 56.336 83.5 56.297 83.5 c 56.16 83.5 56.062 83.469 56 83.406 c 55.938 83.344
 55.898 83.25 55.891 83.125 c 55.875 83.125 l 55.727 83.387 55.504 83.516
 55.203 83.516 c h
55.828 82.531 m 55.547 82.531 l 55.422 82.543 55.332 82.559 55.281 82.578
 c 55.227 82.602 55.188 82.637 55.156 82.688 c 55.133 82.73 55.125 82.789
 55.125 82.859 c 55.125 82.953 55.145 83.027 55.188 83.078 c 55.238 83.133
 55.301 83.156 55.375 83.156 c 55.457 83.156 55.531 83.137 55.594 83.094
 c 55.664 83.043 55.723 82.977 55.766 82.891 c 55.805 82.809 55.828 82.727
 55.828 82.641 c h
55.828 82.531 m f
58.621 82.891 m 58.621 83.09 58.535 83.246 58.371 83.359 c 58.215 83.465
 57.988 83.516 57.699 83.516 c 57.418 83.516 57.199 83.477 57.043 83.391
 c 56.895 83.297 56.801 83.156 56.762 82.969 c 57.23 82.906 l 57.25 83 57.293
 83.07 57.355 83.109 c 57.426 83.152 57.543 83.172 57.699 83.172 c 57.855
 83.172 57.965 83.156 58.027 83.125 c 58.098 83.086 58.137 83.023 58.137
 82.938 c 58.137 82.867 58.105 82.812 58.043 82.781 c 57.988 82.742 57.902
 82.703 57.777 82.672 c 57.473 82.621 57.27 82.57 57.168 82.516 c 57.062
 82.465 56.98 82.398 56.918 82.312 c 56.863 82.23 56.84 82.133 56.84 82.016
 c 56.84 81.82 56.91 81.668 57.059 81.562 c 57.215 81.449 57.434 81.391 
57.715 81.391 c 57.953 81.391 58.145 81.438 58.293 81.531 c 58.449 81.625
 58.543 81.762 58.574 81.938 c 58.105 82 l 58.082 81.918 58.043 81.855 57.98
 81.812 c 57.926 81.773 57.84 81.75 57.715 81.75 c 57.59 81.75 57.488 81.766
 57.418 81.797 c 57.355 81.828 57.324 81.883 57.324 81.953 c 57.324 82.016
 57.348 82.07 57.402 82.109 c 57.453 82.141 57.535 82.168 57.652 82.188 
c 57.809 82.219 57.949 82.258 58.074 82.297 c 58.199 82.328 58.297 82.371
 58.371 82.422 c 58.453 82.465 58.516 82.523 58.559 82.594 c 58.598 82.668
 58.621 82.766 58.621 82.891 c h
58.621 82.891 m f
59.586 83.516 m 59.43 83.516 59.309 83.477 59.227 83.391 c 59.141 83.309
 59.102 83.18 59.102 83 c 59.102 81.797 l 58.836 81.797 l 58.836 81.422 
l 59.117 81.422 l 59.289 80.953 l 59.617 80.953 l 59.617 81.422 l 60.008
 81.422 l 60.008 81.797 l 59.617 81.797 l 59.617 82.859 l 59.617 82.953 
59.637 83.027 59.68 83.078 c 59.719 83.133 59.777 83.156 59.852 83.156 c
 59.891 83.156 59.953 83.148 60.039 83.125 c 60.039 83.453 l 59.902 83.492
 59.75 83.516 59.586 83.516 c h
59.586 83.516 m f
61.199 83.516 m 60.895 83.516 60.66 83.43 60.496 83.25 c 60.328 83.062 
60.246 82.797 60.246 82.453 c 60.246 82.109 60.328 81.852 60.496 81.672 
c 60.66 81.484 60.902 81.391 61.215 81.391 c 61.504 81.391 61.73 81.492 
61.887 81.688 c 62.043 81.887 62.121 82.172 62.121 82.547 c 62.121 82.562
 l 60.809 82.562 l 60.809 82.762 60.844 82.914 60.918 83.016 c 60.988 83.121
 61.094 83.172 61.23 83.172 c 61.418 83.172 61.535 83.09 61.59 82.922 c 
62.09 82.969 l 61.941 83.336 61.645 83.516 61.199 83.516 c h
61.199 81.734 m 61.074 81.734 60.973 81.777 60.902 81.859 c 60.84 81.945
 60.809 82.062 60.809 82.219 c 61.605 82.219 l 61.594 82.055 61.551 81.934
 61.48 81.859 c 61.418 81.777 61.324 81.734 61.199 81.734 c h
61.199 81.734 m f
62.523 83.484 m 62.523 81.906 l 62.523 81.805 62.523 81.715 62.523 81.641
 c 62.523 81.559 62.516 81.484 62.508 81.422 c 63.023 81.422 l 63.023 81.453
 63.027 81.527 63.039 81.641 c 63.047 81.758 63.055 81.836 63.055 81.875
 c 63.105 81.73 63.152 81.625 63.195 81.562 c 63.234 81.5 63.281 81.461 
63.336 81.438 c 63.398 81.406 63.469 81.391 63.555 81.391 c 63.617 81.391
 63.668 81.402 63.711 81.422 c 63.711 81.859 l 63.625 81.84 63.555 81.828
 63.492 81.828 c 63.355 81.828 63.25 81.887 63.18 82 c 63.105 82.105 63.07
 82.262 63.07 82.469 c 63.07 83.484 l h
62.523 83.484 m f
  Q
Q
q
0 0 115 100 re W n
[ 1 0 0 1 0 0 ] concat
  q
0 g
0.152179 w
1 J
1 j
[] 0.0 d
4 M q 1 0 0 1 0 0 cm
76.957 60.148 m 76.957 63.242 l S Q
76.094 63.031 m 76.957 64.746 l 77.809 63.031 l h
76.094 63.031 m f*
66.215 52.48 21.477 7.668 re f*
q 1 0 0 1 0 0 cm
66.215 52.48 21.477 7.668 re S Q
1 g
73.234 57.559 m 73.234 55.934 l 73.234 55.902 73.234 55.871 73.234 55.84
 c 73.234 55.801 73.238 55.637 73.25 55.355 c 73.156 55.699 73.086 55.934
 73.047 56.059 c 72.562 57.559 l 72.172 57.559 l 71.688 56.059 l 71.484 
55.355 l 71.504 55.648 71.516 55.84 71.516 55.934 c 71.516 57.559 l 71.016
 57.559 l 71.016 54.887 l 71.766 54.887 l 72.234 56.371 l 72.281 56.527 
l 72.375 56.887 l 72.484 56.449 l 72.984 54.887 l 73.734 54.887 l 73.734
 57.559 l h
73.234 57.559 m f
74.75 57.59 m 74.551 57.59 74.395 57.539 74.281 57.434 c 74.164 57.332 
74.109 57.18 74.109 56.98 c 74.109 56.762 74.176 56.602 74.312 56.496 c 
74.457 56.383 74.66 56.324 74.922 56.324 c 75.375 56.309 l 75.375 56.215
 l 75.375 56.082 75.348 55.98 75.297 55.918 c 75.254 55.848 75.176 55.809
 75.062 55.809 c 74.969 55.809 74.895 55.836 74.844 55.887 c 74.801 55.93
 74.773 56.004 74.766 56.105 c 74.203 56.074 l 74.242 55.879 74.336 55.727
 74.484 55.621 c 74.629 55.52 74.832 55.465 75.094 55.465 c 75.352 55.465
 75.551 55.535 75.688 55.668 c 75.832 55.793 75.906 55.973 75.906 56.199
 c 75.906 56.949 l 75.906 57.066 75.914 57.148 75.938 57.199 c 75.969 57.242
 76.016 57.262 76.078 57.262 c 76.109 57.262 76.145 57.258 76.188 57.246
 c 76.188 57.527 l 76.156 57.539 76.125 57.551 76.094 57.559 c 76.07 57.559
 76.047 57.559 76.016 57.559 c 75.992 57.566 75.969 57.574 75.938 57.574
 c 75.914 57.574 75.883 57.574 75.844 57.574 c 75.707 57.574 75.609 57.543
 75.547 57.48 c 75.484 57.418 75.445 57.324 75.438 57.199 c 75.422 57.199
 l 75.273 57.461 75.051 57.59 74.75 57.59 c h
75.375 56.605 m 75.094 56.605 l 74.969 56.617 74.879 56.633 74.828 56.652
 c 74.773 56.676 74.734 56.711 74.703 56.762 c 74.68 56.805 74.672 56.863
 74.672 56.934 c 74.672 57.027 74.691 57.102 74.734 57.152 c 74.785 57.207
 74.848 57.23 74.922 57.23 c 75.004 57.23 75.078 57.211 75.141 57.168 c 
75.211 57.117 75.27 57.051 75.312 56.965 c 75.352 56.883 75.375 56.801 75.375
 56.715 c h
75.375 56.605 m f
78.168 56.965 m 78.168 57.164 78.082 57.32 77.918 57.434 c 77.762 57.539
 77.535 57.59 77.246 57.59 c 76.965 57.59 76.746 57.551 76.59 57.465 c 76.441
 57.371 76.348 57.23 76.309 57.043 c 76.777 56.98 l 76.797 57.074 76.84 
57.145 76.902 57.184 c 76.973 57.227 77.09 57.246 77.246 57.246 c 77.402
 57.246 77.512 57.23 77.574 57.199 c 77.645 57.16 77.684 57.098 77.684 57.012
 c 77.684 56.941 77.652 56.887 77.59 56.855 c 77.535 56.816 77.449 56.777
 77.324 56.746 c 77.02 56.695 76.816 56.645 76.715 56.59 c 76.609 56.539
 76.527 56.473 76.465 56.387 c 76.41 56.305 76.387 56.207 76.387 56.09 c
 76.387 55.895 76.457 55.742 76.605 55.637 c 76.762 55.523 76.98 55.465 
77.262 55.465 c 77.5 55.465 77.691 55.512 77.84 55.605 c 77.996 55.699 78.09
 55.836 78.121 56.012 c 77.652 56.074 l 77.629 55.992 77.59 55.93 77.527
 55.887 c 77.473 55.848 77.387 55.824 77.262 55.824 c 77.137 55.824 77.035
 55.84 76.965 55.871 c 76.902 55.902 76.871 55.957 76.871 56.027 c 76.871
 56.09 76.895 56.145 76.949 56.184 c 77 56.215 77.082 56.242 77.199 56.262
 c 77.355 56.293 77.496 56.332 77.621 56.371 c 77.746 56.402 77.844 56.445
 77.918 56.496 c 78 56.539 78.062 56.598 78.105 56.668 c 78.145 56.742 78.168
 56.84 78.168 56.965 c h
78.168 56.965 m f
79.133 57.59 m 78.977 57.59 78.855 57.551 78.773 57.465 c 78.688 57.383
 78.648 57.254 78.648 57.074 c 78.648 55.871 l 78.383 55.871 l 78.383 55.496
 l 78.664 55.496 l 78.836 55.027 l 79.164 55.027 l 79.164 55.496 l 79.555
 55.496 l 79.555 55.871 l 79.164 55.871 l 79.164 56.934 l 79.164 57.027 
79.184 57.102 79.227 57.152 c 79.266 57.207 79.324 57.23 79.398 57.23 c 
79.438 57.23 79.5 57.223 79.586 57.199 c 79.586 57.527 l 79.449 57.566 79.297
 57.59 79.133 57.59 c h
79.133 57.59 m f
80.746 57.59 m 80.441 57.59 80.207 57.504 80.043 57.324 c 79.875 57.137
 79.793 56.871 79.793 56.527 c 79.793 56.184 79.875 55.926 80.043 55.746
 c 80.207 55.559 80.449 55.465 80.762 55.465 c 81.051 55.465 81.277 55.566
 81.434 55.762 c 81.59 55.961 81.668 56.246 81.668 56.621 c 81.668 56.637
 l 80.355 56.637 l 80.355 56.836 80.391 56.988 80.465 57.09 c 80.535 57.195
 80.641 57.246 80.777 57.246 c 80.965 57.246 81.082 57.164 81.137 56.996
 c 81.637 57.043 l 81.488 57.41 81.191 57.59 80.746 57.59 c h
80.746 55.809 m 80.621 55.809 80.52 55.852 80.449 55.934 c 80.387 56.02
 80.355 56.137 80.355 56.293 c 81.152 56.293 l 81.141 56.129 81.098 56.008
 81.027 55.934 c 80.965 55.852 80.871 55.809 80.746 55.809 c h
80.746 55.809 m f
82.07 57.559 m 82.07 55.98 l 82.07 55.879 82.07 55.789 82.07 55.715 c 82.07
 55.633 82.062 55.559 82.055 55.496 c 82.57 55.496 l 82.57 55.527 82.574
 55.602 82.586 55.715 c 82.594 55.832 82.602 55.91 82.602 55.949 c 82.652
 55.805 82.699 55.699 82.742 55.637 c 82.781 55.574 82.828 55.535 82.883
 55.512 c 82.945 55.48 83.016 55.465 83.102 55.465 c 83.164 55.465 83.215
 55.477 83.258 55.496 c 83.258 55.934 l 83.172 55.914 83.102 55.902 83.039
 55.902 c 82.902 55.902 82.797 55.961 82.727 56.074 c 82.652 56.18 82.617
 56.336 82.617 56.543 c 82.617 57.559 l h
82.07 57.559 m f
  Q
Q
q
0 0 115 100 re W n
[ 1 0 0 1 0 0 ] concat
  q
0 g
0.152179 w
1 J
1 j
[] 0.0 d
4 M q 1 0 0 1 0 0 cm
76.957 60.148 m 76.957 63.242 l S Q
76.094 63.031 m 76.957 64.746 l 77.809 63.031 l h
76.094 63.031 m f*
66.215 52.48 21.477 7.668 re f*
q 1 0 0 1 0 0 cm
66.215 52.48 21.477 7.668 re S Q
1 g
73.234 57.559 m 73.234 55.934 l 73.234 55.902 73.234 55.871 73.234 55.84
 c 73.234 55.801 73.238 55.637 73.25 55.355 c 73.156 55.699 73.086 55.934
 73.047 56.059 c 72.562 57.559 l 72.172 57.559 l 71.688 56.059 l 71.484 
55.355 l 71.504 55.648 71.516 55.84 71.516 55.934 c 71.516 57.559 l 71.016
 57.559 l 71.016 54.887 l 71.766 54.887 l 72.234 56.371 l 72.281 56.527 
l 72.375 56.887 l 72.484 56.449 l 72.984 54.887 l 73.734 54.887 l 73.734
 57.559 l h
73.234 57.559 m f
74.75 57.59 m 74.551 57.59 74.395 57.539 74.281 57.434 c 74.164 57.332 
74.109 57.18 74.109 56.98 c 74.109 56.762 74.176 56.602 74.312 56.496 c 
74.457 56.383 74.66 56.324 74.922 56.324 c 75.375 56.309 l 75.375 56.215
 l 75.375 56.082 75.348 55.98 75.297 55.918 c 75.254 55.848 75.176 55.809
 75.062 55.809 c 74.969 55.809 74.895 55.836 74.844 55.887 c 74.801 55.93
 74.773 56.004 74.766 56.105 c 74.203 56.074 l 74.242 55.879 74.336 55.727
 74.484 55.621 c 74.629 55.52 74.832 55.465 75.094 55.465 c 75.352 55.465
 75.551 55.535 75.688 55.668 c 75.832 55.793 75.906 55.973 75.906 56.199
 c 75.906 56.949 l 75.906 57.066 75.914 57.148 75.938 57.199 c 75.969 57.242
 76.016 57.262 76.078 57.262 c 76.109 57.262 76.145 57.258 76.188 57.246
 c 76.188 57.527 l 76.156 57.539 76.125 57.551 76.094 57.559 c 76.07 57.559
 76.047 57.559 76.016 57.559 c 75.992 57.566 75.969 57.574 75.938 57.574
 c 75.914 57.574 75.883 57.574 75.844 57.574 c 75.707 57.574 75.609 57.543
 75.547 57.48 c 75.484 57.418 75.445 57.324 75.438 57.199 c 75.422 57.199
 l 75.273 57.461 75.051 57.59 74.75 57.59 c h
75.375 56.605 m 75.094 56.605 l 74.969 56.617 74.879 56.633 74.828 56.652
 c 74.773 56.676 74.734 56.711 74.703 56.762 c 74.68 56.805 74.672 56.863
 74.672 56.934 c 74.672 57.027 74.691 57.102 74.734 57.152 c 74.785 57.207
 74.848 57.23 74.922 57.23 c 75.004 57.23 75.078 57.211 75.141 57.168 c 
75.211 57.117 75.27 57.051 75.312 56.965 c 75.352 56.883 75.375 56.801 75.375
 56.715 c h
75.375 56.605 m f
78.168 56.965 m 78.168 57.164 78.082 57.32 77.918 57.434 c 77.762 57.539
 77.535 57.59 77.246 57.59 c 76.965 57.59 76.746 57.551 76.59 57.465 c 76.441
 57.371 76.348 57.23 76.309 57.043 c 76.777 56.98 l 76.797 57.074 76.84 
57.145 76.902 57.184 c 76.973 57.227 77.09 57.246 77.246 57.246 c 77.402
 57.246 77.512 57.23 77.574 57.199 c 77.645 57.16 77.684 57.098 77.684 57.012
 c 77.684 56.941 77.652 56.887 77.59 56.855 c 77.535 56.816 77.449 56.777
 77.324 56.746 c 77.02 56.695 76.816 56.645 76.715 56.59 c 76.609 56.539
 76.527 56.473 76.465 56.387 c 76.41 56.305 76.387 56.207 76.387 56.09 c
 76.387 55.895 76.457 55.742 76.605 55.637 c 76.762 55.523 76.98 55.465 
77.262 55.465 c 77.5 55.465 77.691 55.512 77.84 55.605 c 77.996 55.699 78.09
 55.836 78.121 56.012 c 77.652 56.074 l 77.629 55.992 77.59 55.93 77.527
 55.887 c 77.473 55.848 77.387 55.824 77.262 55.824 c 77.137 55.824 77.035
 55.84 76.965 55.871 c 76.902 55.902 76.871 55.957 76.871 56.027 c 76.871
 56.09 76.895 56.145 76.949 56.184 c 77 56.215 77.082 56.242 77.199 56.262
 c 77.355 56.293 77.496 56.332 77.621 56.371 c 77.746 56.402 77.844 56.445
 77.918 56.496 c 78 56.539 78.062 56.598 78.105 56.668 c 78.145 56.742 78.168
 56.84 78.168 56.965 c h
78.168 56.965 m f
79.133 57.59 m 78.977 57.59 78.855 57.551 78.773 57.465 c 78.688 57.383
 78.648 57.254 78.648 57.074 c 78.648 55.871 l 78.383 55.871 l 78.383 55.496
 l 78.664 55.496 l 78.836 55.027 l 79.164 55.027 l 79.164 55.496 l 79.555
 55.496 l 79.555 55.871 l 79.164 55.871 l 79.164 56.934 l 79.164 57.027 
79.184 57.102 79.227 57.152 c 79.266 57.207 79.324 57.23 79.398 57.23 c 
79.438 57.23 79.5 57.223 79.586 57.199 c 79.586 57.527 l 79.449 57.566 79.297
 57.59 79.133 57.59 c h
79.133 57.59 m f
80.746 57.59 m 80.441 57.59 80.207 57.504 80.043 57.324 c 79.875 57.137
 79.793 56.871 79.793 56.527 c 79.793 56.184 79.875 55.926 80.043 55.746
 c 80.207 55.559 80.449 55.465 80.762 55.465 c 81.051 55.465 81.277 55.566
 81.434 55.762 c 81.59 55.961 81.668 56.246 81.668 56.621 c 81.668 56.637
 l 80.355 56.637 l 80.355 56.836 80.391 56.988 80.465 57.09 c 80.535 57.195
 80.641 57.246 80.777 57.246 c 80.965 57.246 81.082 57.164 81.137 56.996
 c 81.637 57.043 l 81.488 57.41 81.191 57.59 80.746 57.59 c h
80.746 55.809 m 80.621 55.809 80.52 55.852 80.449 55.934 c 80.387 56.02
 80.355 56.137 80.355 56.293 c 81.152 56.293 l 81.141 56.129 81.098 56.008
 81.027 55.934 c 80.965 55.852 80.871 55.809 80.746 55.809 c h
80.746 55.809 m f
82.07 57.559 m 82.07 55.98 l 82.07 55.879 82.07 55.789 82.07 55.715 c 82.07
 55.633 82.062 55.559 82.055 55.496 c 82.57 55.496 l 82.57 55.527 82.574
 55.602 82.586 55.715 c 82.594 55.832 82.602 55.91 82.602 55.949 c 82.652
 55.805 82.699 55.699 82.742 55.637 c 82.781 55.574 82.828 55.535 82.883
 55.512 c 82.945 55.48 83.016 55.465 83.102 55.465 c 83.164 55.465 83.215
 55.477 83.258 55.496 c 83.258 55.934 l 83.172 55.914 83.102 55.902 83.039
 55.902 c 82.902 55.902 82.797 55.961 82.727 56.074 c 82.652 56.18 82.617
 56.336 82.617 56.543 c 82.617 57.559 l h
82.07 57.559 m f
  Q
Q
q
0 0 115 100 re W n
[ 1 0 0 1 0 0 ] concat
  q
1 g
67.562 64.746 18.414 9.203 re f*
0 g
0.152179 w
1 J
1 j
[] 0.0 d
4 M q 1 0 0 1 0 0 cm
67.562 64.746 18.414 9.203 re S Q
75.949 70.594 m 75.574 70.594 l 74.48 67.922 l 74.871 67.922 l 75.605 69.797
 l 75.762 70.281 l 75.918 69.797 l 76.668 67.922 l 77.043 67.922 l h
75.949 70.594 m f
78.738 69.984 m 78.738 70.594 l 78.41 70.594 l 78.41 69.984 l 77.16 69.984
 l 77.16 69.719 l 78.379 67.922 l 78.738 67.922 l 78.738 69.719 l 79.113
 69.719 l 79.113 69.984 l h
78.41 68.297 m 78.41 68.309 78.395 68.344 78.363 68.406 c 78.332 68.469
 78.305 68.512 78.285 68.531 c 77.598 69.547 l 77.504 69.688 l 77.473 69.719
 l 78.41 69.719 l h
78.41 68.297 m f
q 1 0 0 1 0 0 cm
67.609 69.656 m 65.863 69.656 l S Q
67.094 69.656 m 67.094 69.949 67.324 70.184 67.609 70.184 c 67.902 70.184
 68.137 69.949 68.137 69.656 c 68.137 69.363 67.902 69.129 67.609 69.129
 c 67.324 69.129 67.094 69.363 67.094 69.656 c h
67.094 69.656 m f*
66.035 70.355 m 63.938 69.656 l 66.035 68.957 l h
66.035 70.355 m f*
  Q
Q
q
0 0 115 100 re W n
[ 1 0 0 1 0 0 ] concat
  q
1 g
67.562 25.559 18.414 9.203 re f*
  Q
Q
q
0 0 115 100 re W n
[ 1 0 0 1 0 0 ] concat
  q
0 g
0.152179 w
1 J
1 j
[] 0.0 d
4 M q 1 0 0 1 0 0 cm
67.562 25.559 18.414 9.203 re S Q
  Q
Q
q
0 0 115 100 re W n
[ 1 0 0 1 0 0 ] concat
  q
0 g
75.949 31.406 m 75.574 31.406 l 74.48 28.734 l 74.871 28.734 l 75.605 30.609
 l 75.762 31.094 l 75.918 30.609 l 76.668 28.734 l 77.043 28.734 l h
75.949 31.406 m f
79.066 30.531 m 79.066 30.812 78.98 31.039 78.816 31.203 c 78.648 31.359
 78.414 31.438 78.113 31.438 c 77.863 31.438 77.66 31.387 77.504 31.281 
c 77.355 31.18 77.262 31.023 77.223 30.812 c 77.566 30.766 l 77.637 31.039
 77.824 31.172 78.129 31.172 c 78.305 31.172 78.445 31.117 78.551 31 c 78.652
 30.887 78.707 30.734 78.707 30.547 c 78.707 30.383 78.652 30.246 78.551
 30.141 c 78.445 30.039 78.305 29.984 78.129 29.984 c 78.035 29.984 77.945
 30 77.863 30.031 c 77.789 30.055 77.711 30.102 77.629 30.172 c 77.301 30.172
 l 77.395 28.734 l 78.91 28.734 l 78.91 29.016 l 77.707 29.016 l 77.645 
29.875 l 77.801 29.762 77.988 29.703 78.207 29.703 c 78.465 29.703 78.676
 29.781 78.832 29.938 c 78.988 30.086 79.066 30.281 79.066 30.531 c h
79.066 30.531 m f
  Q
Q
q
0 0 115 100 re W n
[ 1 0 0 1 0 0 ] concat
  q
0 g
0.152179 w
1 J
1 j
[] 0.0 d
4 M q 1 0 0 1 0 0 cm
67.562 30.469 m 65.816 30.469 l S Q
  Q
Q
q
0 0 115 100 re W n
[ 1 0 0 1 0 0 ] concat
  q
0 g
67.047 30.469 m 67.047 30.754 67.277 30.988 67.562 30.988 c 67.855 30.988
 68.09 30.754 68.09 30.469 c 68.09 30.176 67.855 29.941 67.562 29.941 c 
67.277 29.941 67.047 30.176 67.047 30.469 c h
67.047 30.469 m f*
  Q
Q
q
0 0 115 100 re W n
[ 1 0 0 1 0 0 ] concat
  q
0 g
65.988 31.172 m 63.891 30.469 l 65.988 29.77 l h
65.988 31.172 m f*
  Q
Q
q
0 0 115 100 re W n
[ 1 0 0 1 0 0 ] concat
  q
1 g
67.562 64.746 18.414 9.203 re f*
0 g
0.152179 w
1 J
1 j
[] 0.0 d
4 M q 1 0 0 1 0 0 cm
67.562 64.746 18.414 9.203 re S Q
75.949 70.594 m 75.574 70.594 l 74.48 67.922 l 74.871 67.922 l 75.605 69.797
 l 75.762 70.281 l 75.918 69.797 l 76.668 67.922 l 77.043 67.922 l h
75.949 70.594 m f
78.738 69.984 m 78.738 70.594 l 78.41 70.594 l 78.41 69.984 l 77.16 69.984
 l 77.16 69.719 l 78.379 67.922 l 78.738 67.922 l 78.738 69.719 l 79.113
 69.719 l 79.113 69.984 l h
78.41 68.297 m 78.41 68.309 78.395 68.344 78.363 68.406 c 78.332 68.469
 78.305 68.512 78.285 68.531 c 77.598 69.547 l 77.504 69.688 l 77.473 69.719
 l 78.41 69.719 l h
78.41 68.297 m f
q 1 0 0 1 0 0 cm
67.609 69.656 m 65.863 69.656 l S Q
67.094 69.656 m 67.094 69.949 67.324 70.184 67.609 70.184 c 67.902 70.184
 68.137 69.949 68.137 69.656 c 68.137 69.363 67.902 69.129 67.609 69.129
 c 67.324 69.129 67.094 69.363 67.094 69.656 c h
67.094 69.656 m f*
66.035 70.355 m 63.938 69.656 l 66.035 68.957 l h
66.035 70.355 m f*
  Q
Q
q
0 0 115 100 re W n
[ 1 0 0 1 0 0 ] concat
  q
0 g
66.031 13.309 21.477 7.672 re f*
0.152179 w
1 J
1 j
[] 0.0 d
4 M q 1 0 0 1 0 0 cm
66.031 13.309 21.477 7.672 re S Q
1 g
73.047 18.395 m 73.047 16.77 l 73.047 16.738 73.047 16.707 73.047 16.676
 c 73.047 16.637 73.051 16.473 73.062 16.191 c 72.969 16.535 72.898 16.77
 72.859 16.895 c 72.375 18.395 l 71.984 18.395 l 71.5 16.895 l 71.297 16.191
 l 71.316 16.484 71.328 16.676 71.328 16.77 c 71.328 18.395 l 70.828 18.395
 l 70.828 15.723 l 71.578 15.723 l 72.047 17.207 l 72.094 17.363 l 72.188
 17.723 l 72.297 17.285 l 72.797 15.723 l 73.547 15.723 l 73.547 18.395 
l h
73.047 18.395 m f
74.562 18.426 m 74.363 18.426 74.207 18.375 74.094 18.27 c 73.977 18.168
 73.922 18.016 73.922 17.816 c 73.922 17.598 73.988 17.438 74.125 17.332
 c 74.27 17.219 74.473 17.16 74.734 17.16 c 75.188 17.145 l 75.188 17.051
 l 75.188 16.918 75.16 16.816 75.109 16.754 c 75.066 16.684 74.988 16.645
 74.875 16.645 c 74.781 16.645 74.707 16.672 74.656 16.723 c 74.613 16.766
 74.586 16.84 74.578 16.941 c 74.016 16.91 l 74.055 16.715 74.148 16.562
 74.297 16.457 c 74.441 16.355 74.645 16.301 74.906 16.301 c 75.164 16.301
 75.363 16.371 75.5 16.504 c 75.645 16.629 75.719 16.809 75.719 17.035 c
 75.719 17.785 l 75.719 17.902 75.727 17.984 75.75 18.035 c 75.781 18.078
 75.828 18.098 75.891 18.098 c 75.922 18.098 75.957 18.094 76 18.082 c 76
 18.363 l 75.969 18.375 75.938 18.387 75.906 18.395 c 75.883 18.395 75.859
 18.395 75.828 18.395 c 75.805 18.402 75.781 18.41 75.75 18.41 c 75.727 
18.41 75.695 18.41 75.656 18.41 c 75.52 18.41 75.422 18.379 75.359 18.316
 c 75.297 18.254 75.258 18.16 75.25 18.035 c 75.234 18.035 l 75.086 18.297
 74.863 18.426 74.562 18.426 c h
75.188 17.441 m 74.906 17.441 l 74.781 17.453 74.691 17.469 74.641 17.488
 c 74.586 17.512 74.547 17.547 74.516 17.598 c 74.492 17.641 74.484 17.699
 74.484 17.77 c 74.484 17.863 74.504 17.938 74.547 17.988 c 74.598 18.043
 74.66 18.066 74.734 18.066 c 74.816 18.066 74.891 18.047 74.953 18.004 
c 75.023 17.953 75.082 17.887 75.125 17.801 c 75.164 17.719 75.188 17.637
 75.188 17.551 c h
75.188 17.441 m f
77.98 17.801 m 77.98 18 77.895 18.156 77.73 18.27 c 77.574 18.375 77.348
 18.426 77.059 18.426 c 76.777 18.426 76.559 18.387 76.402 18.301 c 76.254
 18.207 76.16 18.066 76.121 17.879 c 76.59 17.816 l 76.609 17.91 76.652 
17.98 76.715 18.02 c 76.785 18.062 76.902 18.082 77.059 18.082 c 77.215 
18.082 77.324 18.066 77.387 18.035 c 77.457 17.996 77.496 17.934 77.496 
17.848 c 77.496 17.777 77.465 17.723 77.402 17.691 c 77.348 17.652 77.262
 17.613 77.137 17.582 c 76.832 17.531 76.629 17.48 76.527 17.426 c 76.422
 17.375 76.34 17.309 76.277 17.223 c 76.223 17.141 76.199 17.043 76.199 
16.926 c 76.199 16.73 76.27 16.578 76.418 16.473 c 76.574 16.359 76.793 
16.301 77.074 16.301 c 77.312 16.301 77.504 16.348 77.652 16.441 c 77.809
 16.535 77.902 16.672 77.934 16.848 c 77.465 16.91 l 77.441 16.828 77.402
 16.766 77.34 16.723 c 77.285 16.684 77.199 16.66 77.074 16.66 c 76.949 
16.66 76.848 16.676 76.777 16.707 c 76.715 16.738 76.684 16.793 76.684 16.863
 c 76.684 16.926 76.707 16.98 76.762 17.02 c 76.812 17.051 76.895 17.078
 77.012 17.098 c 77.168 17.129 77.309 17.168 77.434 17.207 c 77.559 17.238
 77.656 17.281 77.73 17.332 c 77.812 17.375 77.875 17.434 77.918 17.504 
c 77.957 17.578 77.98 17.676 77.98 17.801 c h
77.98 17.801 m f
78.945 18.426 m 78.789 18.426 78.668 18.387 78.586 18.301 c 78.5 18.219
 78.461 18.09 78.461 17.91 c 78.461 16.707 l 78.195 16.707 l 78.195 16.332
 l 78.477 16.332 l 78.648 15.863 l 78.977 15.863 l 78.977 16.332 l 79.367
 16.332 l 79.367 16.707 l 78.977 16.707 l 78.977 17.77 l 78.977 17.863 78.996
 17.938 79.039 17.988 c 79.078 18.043 79.137 18.066 79.211 18.066 c 79.25
 18.066 79.312 18.059 79.398 18.035 c 79.398 18.363 l 79.262 18.402 79.109
 18.426 78.945 18.426 c h
78.945 18.426 m f
80.559 18.426 m 80.254 18.426 80.02 18.34 79.855 18.16 c 79.688 17.973 
79.605 17.707 79.605 17.363 c 79.605 17.02 79.688 16.762 79.855 16.582 c
 80.02 16.395 80.262 16.301 80.574 16.301 c 80.863 16.301 81.09 16.402 81.246
 16.598 c 81.402 16.797 81.48 17.082 81.48 17.457 c 81.48 17.473 l 80.168
 17.473 l 80.168 17.672 80.203 17.824 80.277 17.926 c 80.348 18.031 80.453
 18.082 80.59 18.082 c 80.777 18.082 80.895 18 80.949 17.832 c 81.449 17.879
 l 81.301 18.246 81.004 18.426 80.559 18.426 c h
80.559 16.645 m 80.434 16.645 80.332 16.688 80.262 16.77 c 80.199 16.855
 80.168 16.973 80.168 17.129 c 80.965 17.129 l 80.953 16.965 80.91 16.844
 80.84 16.77 c 80.777 16.688 80.684 16.645 80.559 16.645 c h
80.559 16.645 m f
81.883 18.395 m 81.883 16.816 l 81.883 16.715 81.883 16.625 81.883 16.551
 c 81.883 16.469 81.875 16.395 81.867 16.332 c 82.383 16.332 l 82.383 16.363
 82.387 16.438 82.398 16.551 c 82.406 16.668 82.414 16.746 82.414 16.785
 c 82.465 16.641 82.512 16.535 82.555 16.473 c 82.594 16.41 82.641 16.371
 82.695 16.348 c 82.758 16.316 82.828 16.301 82.914 16.301 c 82.977 16.301
 83.027 16.312 83.07 16.332 c 83.07 16.77 l 82.984 16.75 82.914 16.738 82.852
 16.738 c 82.715 16.738 82.609 16.797 82.539 16.91 c 82.465 17.016 82.43
 17.172 82.43 17.379 c 82.43 18.395 l h
81.883 18.395 m f
0 g
q 1 0 0 1 0 0 cm
76.766 20.91 m 76.766 24.012 l S Q
75.91 23.801 m 76.766 25.516 l 77.625 23.801 l h
75.91 23.801 m f*
  Q
Q
Q Q
showpage
%%Trailer
end
%%EOF
