<?xml version="1.0" encoding="UTF-8" standalone="no"?>
<!-- Created with Inkscape (http://www.inkscape.org/) -->

<svg
   xmlns:dc="http://purl.org/dc/elements/1.1/"
   xmlns:cc="http://creativecommons.org/ns#"
   xmlns:rdf="http://www.w3.org/1999/02/22-rdf-syntax-ns#"
   xmlns:svg="http://www.w3.org/2000/svg"
   xmlns="http://www.w3.org/2000/svg"
   xmlns:sodipodi="http://sodipodi.sourceforge.net/DTD/sodipodi-0.dtd"
   xmlns:inkscape="http://www.inkscape.org/namespaces/inkscape"
   width="579.14813"
   height="435.27045"
   viewBox="0 0 153.23294 115.16531"
   version="1.1"
   id="svg8"
   inkscape:version="0.92.4 (5da689c313, 2019-01-14)"
   sodipodi:docname="ramificacion.svg">
  <defs
     id="defs2">
    <clipPath
       id="clipEmfPath1"
       clipPathUnits="userSpaceOnUse">
      <path
         id="path815"
         d="M 0,0 H 630.40504 V 473.84063 H 0 Z"
         inkscape:connector-curvature="0" />
    </clipPath>
    <pattern
       y="0"
       x="0"
       height="6"
       width="6"
       patternUnits="userSpaceOnUse"
       id="EMFhbasepattern" />
  </defs>
  <sodipodi:namedview
     id="base"
     pagecolor="#ffffff"
     bordercolor="#666666"
     borderopacity="1.0"
     inkscape:pageopacity="0.0"
     inkscape:pageshadow="2"
     inkscape:zoom="1.9482141"
     inkscape:cx="289.57407"
     inkscape:cy="299.76172"
     inkscape:document-units="mm"
     inkscape:current-layer="layer9"
     showgrid="true"
     units="px"
     fit-margin-top="0"
     fit-margin-left="0"
     fit-margin-right="0"
     fit-margin-bottom="0"
     inkscape:window-width="1920"
     inkscape:window-height="1017"
     inkscape:window-x="-8"
     inkscape:window-y="-8"
     inkscape:window-maximized="1"
     showguides="true"
     inkscape:guide-bbox="true">
    <inkscape:grid
       type="xygrid"
       id="grid1058"
       originx="-67.855545"
       originy="-37.82279" />
    <sodipodi:guide
       position="162.33195,57.427215"
       orientation="0,1"
       id="guide1060"
       inkscape:locked="false" />
    <sodipodi:guide
       position="75.019452,102.35646"
       orientation="1,0"
       id="guide1062"
       inkscape:locked="false" />
  </sodipodi:namedview>
  <metadata
     id="metadata5">
    <rdf:RDF>
      <cc:Work
         rdf:about="">
        <dc:format>image/svg+xml</dc:format>
        <dc:type
           rdf:resource="http://purl.org/dc/dcmitype/StillImage" />
        <dc:title></dc:title>
      </cc:Work>
    </rdf:RDF>
  </metadata>
  <g
     inkscape:label="Base"
     inkscape:groupmode="layer"
     id="layer1"
     transform="translate(-67.855547,-144.01189)"
     style="display:inline"
     sodipodi:insensitive="true">
    <rect
       style="display:inline;fill:#ffffff;fill-opacity:1;stroke:none;stroke-width:3.01290321;stroke-miterlimit:4;stroke-dasharray:none;stroke-opacity:1"
       id="rect154"
       width="154.78125"
       height="116.41666"
       x="67.46875"
       y="143.54166" />
    <path
       id="path915"
       d="M 67.984141,193.85643 V 209.4077 H 99.086676 V 193.85643 Z"
       style="fill:#ffffff;fill-opacity:1;fill-rule:evenodd;stroke:none;stroke-width:0.26458332"
       inkscape:connector-curvature="0" />
    <path
       id="path917"
       d="M 67.984141,209.4077 H 99.086676 V 193.85643 H 67.984141 Z"
       style="fill:none;stroke:#000000;stroke-width:0.25718752px;stroke-linecap:round;stroke-linejoin:round;stroke-miterlimit:4;stroke-dasharray:none;stroke-opacity:1"
       inkscape:connector-curvature="0" />
    <text
       id="text923"
       y="203.73326"
       x="79.631111"
       style="font-style:normal;font-variant:normal;font-weight:400;font-size:6.58151054px;line-height:125%;font-family:Arial;text-align:start;letter-spacing:0px;word-spacing:0px;text-anchor:start;fill:#000000;fill-opacity:1;stroke:none;stroke-width:0.26458332"
       xml:space="preserve"><tspan
         id="tspan921"
         y="203.73326"
         x="79.631111"
         sodipodi:role="line"
         style="stroke-width:0.26458332"><tspan
           id="tspan919"
           style="font-style:normal;font-variant:normal;font-weight:400;font-size:6.58151054px;font-family:Arial;fill:#000000;stroke-width:0.26458332"
           dy="0"
           dx="0">V1</tspan></tspan></text>
    <path
       id="path925"
       d="m 106.85378,193.85643 v 15.55127 h 31.10256 v -15.55127 z"
       style="fill:#ffffff;fill-opacity:1;fill-rule:evenodd;stroke:none;stroke-width:0.26458332"
       inkscape:connector-curvature="0" />
    <path
       id="path927"
       d="m 106.85378,209.4077 h 31.10256 v -15.55127 h -31.10256 z"
       style="fill:none;stroke:#000000;stroke-width:0.25718752px;stroke-linecap:round;stroke-linejoin:round;stroke-miterlimit:4;stroke-dasharray:none;stroke-opacity:1"
       inkscape:connector-curvature="0" />
    <text
       id="text933"
       y="203.73326"
       x="118.51301"
       style="font-style:normal;font-variant:normal;font-weight:400;font-size:6.58151054px;line-height:125%;font-family:Arial;text-align:start;letter-spacing:0px;word-spacing:0px;text-anchor:start;fill:#000000;fill-opacity:1;stroke:none;stroke-width:0.26458332"
       xml:space="preserve"><tspan
         id="tspan931"
         y="203.73326"
         x="118.51301"
         sodipodi:role="line"
         style="stroke-width:0.26458332"><tspan
           id="tspan929"
           style="font-style:normal;font-variant:normal;font-weight:400;font-size:6.58151054px;font-family:Arial;fill:#000000;stroke-width:0.26458332"
           dy="0"
           dx="0">V2</tspan></tspan></text>
    <path
       id="path935"
       d="m 106.85378,201.62349 h -5.69245"
       style="fill:none;stroke:#000000;stroke-width:0.25718752px;stroke-linecap:round;stroke-linejoin:round;stroke-miterlimit:4;stroke-dasharray:none;stroke-opacity:1"
       inkscape:connector-curvature="0" />
    <path
       id="path937"
       d="m 105.96219,201.62349 c 0,0.49723 0.41151,0.89159 0.89159,0.89159 0.49723,0 0.89159,-0.39436 0.89159,-0.89159 0,-0.48008 -0.39436,-0.89158 -0.89159,-0.89158 -0.48008,0 -0.89159,0.4115 -0.89159,0.89158 z"
       style="fill:#000000;fill-opacity:1;fill-rule:evenodd;stroke:none;stroke-width:0.26458332"
       inkscape:connector-curvature="0" />
    <path
       id="path939"
       d="m 101.45281,202.80655 -2.366134,-1.18306 2.366134,-1.18306 z"
       style="fill:#000000;fill-opacity:1;fill-rule:evenodd;stroke:none;stroke-width:0.26458332"
       inkscape:connector-curvature="0" />
  </g>
  <g
     inkscape:groupmode="layer"
     id="layer2"
     inkscape:label="Inicio"
     style="display:inline"
     sodipodi:insensitive="true"
     transform="translate(-67.855547,-37.51191)">
    <g
       id="g1365"
       transform="translate(93.133331,-69.458313)">
      <g
         id="g1274-7"
         transform="translate(-132.29167,-37.041666)">
        <path
           id="path901-2"
           d="m 143.15153,173.10997 v 12.96225 h 36.28058 v -12.96225 z"
           style="fill:#000000;fill-opacity:1;fill-rule:evenodd;stroke:none;stroke-width:0.26458332"
           inkscape:connector-curvature="0" />
        <path
           id="path903-7"
           d="m 143.15153,186.07222 h 36.28058 v -12.96225 h -36.28058 z"
           style="fill:none;stroke:#000000;stroke-width:0.25718752px;stroke-linecap:round;stroke-linejoin:round;stroke-miterlimit:4;stroke-dasharray:none;stroke-opacity:1"
           inkscape:connector-curvature="0" />
        <text
           id="text909-1"
           y="181.70016"
           x="150.80908"
           style="font-style:normal;font-variant:normal;font-weight:700;font-size:6.58151054px;line-height:125%;font-family:Arial;text-align:start;letter-spacing:0px;word-spacing:0px;text-anchor:start;fill:#000000;fill-opacity:1;stroke:none;stroke-width:0.26458332"
           xml:space="preserve"><tspan
             id="tspan907-0"
             y="181.70016"
             x="150.80908"
             sodipodi:role="line"
             style="stroke-width:0.26458332"><tspan
               id="tspan905-1"
               style="font-style:normal;font-variant:normal;font-weight:700;font-size:6.58151054px;font-family:Arial;fill:#ffffff;stroke-width:0.26458332"
               dy="0"
               dx="0">Master</tspan></tspan></text>
        <path
           id="path911-9"
           d="m 161.29182,186.07222 v 5.24663"
           style="fill:none;stroke:#000000;stroke-width:0.25718752px;stroke-linecap:round;stroke-linejoin:round;stroke-miterlimit:4;stroke-dasharray:none;stroke-opacity:1"
           inkscape:connector-curvature="0" />
        <path
           id="path913-0"
           d="m 162.74922,190.95878 -1.4574,2.89765 -1.44025,-2.89765 z"
           style="fill:#000000;fill-opacity:1;fill-rule:evenodd;stroke:none;stroke-width:0.26458332"
           inkscape:connector-curvature="0" />
      </g>
      <g
         transform="translate(-172.59029,-26.989029)"
         id="g1072-0">
        <path
           id="path945-6"
           d="m 201.69446,157.30151 v 2.65761"
           style="fill:none;stroke:#000000;stroke-width:0.25718752px;stroke-linecap:round;stroke-linejoin:round;stroke-miterlimit:4;stroke-dasharray:none;stroke-opacity:1"
           inkscape:connector-curvature="0" />
        <path
           id="path947-6"
           d="m 200.25421,159.59905 1.44025,2.8805 1.45739,-2.8805 z"
           style="fill:#000000;fill-opacity:1;fill-rule:evenodd;stroke:none;stroke-width:0.26458332"
           inkscape:connector-curvature="0" />
        <path
           id="path959-2"
           d="m 183.55417,144.33926 v 12.96225 h 36.28058 v -12.96225 z"
           style="fill:#ffffff;fill-opacity:1;fill-rule:evenodd;stroke:none;stroke-width:0.26458332"
           inkscape:connector-curvature="0" />
        <path
           id="path961-4"
           d="m 183.55417,144.33926 h 36.28058 v 12.96225 h -36.28058 z"
           style="fill:none;stroke:#000000;stroke-width:0.25718752px;stroke-linecap:round;stroke-linejoin:round;stroke-miterlimit:4;stroke-dasharray:none;stroke-opacity:1"
           inkscape:connector-curvature="0" />
        <text
           id="text967-5"
           y="152.92757"
           x="192.49835"
           style="font-style:normal;font-variant:normal;font-weight:700;font-size:6.58151054px;line-height:125%;font-family:Arial;text-align:start;letter-spacing:0px;word-spacing:0px;text-anchor:start;fill:#000000;fill-opacity:1;stroke:none;stroke-width:0.26458332"
           xml:space="preserve"><tspan
             id="tspan965-2"
             y="152.92757"
             x="192.49835"
             sodipodi:role="line"
             style="stroke-width:0.26458332"><tspan
               id="tspan963-1"
               style="font-style:normal;font-variant:normal;font-weight:700;font-size:6.58151054px;font-family:Arial;fill:#000000;stroke-width:0.26458332"
               dy="0"
               dx="0">HEAD</tspan></tspan></text>
        <path
           id="path971-0"
           d="m 201.69446,157.30151 v 5.17804"
           style="fill:none;stroke:#000000;stroke-width:0.08572917px;stroke-linecap:round;stroke-linejoin:round;stroke-miterlimit:4;stroke-dasharray:none;stroke-opacity:1"
           inkscape:connector-curvature="0" />
      </g>
    </g>
  </g>
  <g
     inkscape:groupmode="layer"
     id="layer3"
     inkscape:label="Primer Avance - Commit"
     style="display:inline"
     sodipodi:insensitive="true"
     transform="translate(-67.855547,-37.51191)">
    <path
       transform="translate(0,-106.49998)"
       id="path837"
       d="m 145.74055,193.85643 v 15.55127 h 31.10254 v -15.55127 z"
       style="display:inline;fill:#ffffff;fill-opacity:1;fill-rule:evenodd;stroke:none;stroke-width:0.26458332"
       inkscape:connector-curvature="0" />
    <path
       transform="translate(0,-106.49998)"
       id="path839"
       d="m 145.74055,209.4077 h 31.10254 v -15.55127 h -31.10254 z"
       style="display:inline;fill:none;stroke:#000000;stroke-width:0.25718752px;stroke-linecap:round;stroke-linejoin:round;stroke-miterlimit:4;stroke-dasharray:none;stroke-opacity:1"
       inkscape:connector-curvature="0" />
    <text
       transform="translate(0,-106.49998)"
       id="text845"
       y="203.73326"
       x="157.39474"
       style="font-style:normal;font-variant:normal;font-weight:400;font-size:6.58151054px;line-height:125%;font-family:Arial;text-align:start;letter-spacing:0px;word-spacing:0px;text-anchor:start;display:inline;fill:#000000;fill-opacity:1;stroke:none;stroke-width:0.26458332"
       xml:space="preserve"><tspan
         id="tspan843"
         y="203.73326"
         x="157.39474"
         sodipodi:role="line"
         style="stroke-width:0.26458332"><tspan
           id="tspan841"
           style="font-style:normal;font-variant:normal;font-weight:400;font-size:6.58151054px;font-family:Arial;fill:#000000;stroke-width:0.26458332"
           dy="0"
           dx="0">V3</tspan></tspan></text>
    <g
       id="g1724">
      <g
         id="g1687"
         style="display:inline"
         transform="translate(0,-106.49998)">
        <path
           id="path847"
           d="m 145.74055,201.62349 h -5.70956"
           style="fill:none;stroke:#000000;stroke-width:0.25718752px;stroke-linecap:round;stroke-linejoin:round;stroke-miterlimit:4;stroke-dasharray:none;stroke-opacity:1"
           inkscape:connector-curvature="0" />
        <path
           id="path849"
           d="m 144.84897,201.62349 c 0,0.49723 0.39435,0.89159 0.89158,0.89159 0.49723,0 0.89159,-0.39436 0.89159,-0.89159 0,-0.48008 -0.39436,-0.89158 -0.89159,-0.89158 -0.49723,0 -0.89158,0.4115 -0.89158,0.89158 z"
           style="fill:#000000;fill-opacity:1;fill-rule:evenodd;stroke:none;stroke-width:0.26458332"
           inkscape:connector-curvature="0" />
      </g>
      <path
         inkscape:connector-curvature="0"
         style="display:inline;fill:#000000;fill-opacity:1;fill-rule:evenodd;stroke:none;stroke-width:0.26458332"
         d="m 140.33961,202.80655 -2.38327,-1.18306 2.38327,-1.18306 z"
         id="path851"
         transform="translate(0,-106.49998)" />
    </g>
  </g>
  <g
     inkscape:groupmode="layer"
     id="layer10"
     inkscape:label="Primer Avance - Rama"
     sodipodi:insensitive="true"
     style="display:inline"
     transform="translate(-67.855547,-37.51191)">
    <g
       style="display:inline"
       id="g1274"
       transform="translate(0.52916667,-106.49998)">
      <path
         inkscape:connector-curvature="0"
         style="fill:#000000;fill-opacity:1;fill-rule:evenodd;stroke:none;stroke-width:0.26458332"
         d="m 143.15153,173.10997 v 12.96225 h 36.28058 v -12.96225 z"
         id="path901" />
      <path
         inkscape:connector-curvature="0"
         style="fill:none;stroke:#000000;stroke-width:0.25718752px;stroke-linecap:round;stroke-linejoin:round;stroke-miterlimit:4;stroke-dasharray:none;stroke-opacity:1"
         d="m 143.15153,186.07222 h 36.28058 v -12.96225 h -36.28058 z"
         id="path903" />
      <text
         xml:space="preserve"
         style="font-style:normal;font-variant:normal;font-weight:700;font-size:6.58151054px;line-height:125%;font-family:Arial;text-align:start;letter-spacing:0px;word-spacing:0px;text-anchor:start;fill:#000000;fill-opacity:1;stroke:none;stroke-width:0.26458332"
         x="150.80908"
         y="181.70016"
         id="text909"><tspan
           style="stroke-width:0.26458332"
           sodipodi:role="line"
           x="150.80908"
           y="181.70016"
           id="tspan907"><tspan
             dx="0"
             dy="0"
             style="font-style:normal;font-variant:normal;font-weight:700;font-size:6.58151054px;font-family:Arial;fill:#ffffff;stroke-width:0.26458332"
             id="tspan905">Master</tspan></tspan></text>
      <path
         inkscape:connector-curvature="0"
         style="fill:none;stroke:#000000;stroke-width:0.25718752px;stroke-linecap:round;stroke-linejoin:round;stroke-miterlimit:4;stroke-dasharray:none;stroke-opacity:1"
         d="m 161.29182,186.07222 v 5.24663"
         id="path911" />
      <path
         inkscape:connector-curvature="0"
         style="fill:#000000;fill-opacity:1;fill-rule:evenodd;stroke:none;stroke-width:0.26458332"
         d="m 162.74922,190.95878 -1.4574,2.89765 -1.44025,-2.89765 z"
         id="path913" />
    </g>
  </g>
  <g
     inkscape:groupmode="layer"
     id="layer7"
     inkscape:label="Primer Avance - Cabeza"
     style="display:inline"
     transform="translate(-67.855547,-37.51191)"
     sodipodi:insensitive="true">
    <g
       id="g1072"
       transform="translate(-39.76946,-96.447343)">
      <path
         inkscape:connector-curvature="0"
         style="fill:none;stroke:#000000;stroke-width:0.25718752px;stroke-linecap:round;stroke-linejoin:round;stroke-miterlimit:4;stroke-dasharray:none;stroke-opacity:1"
         d="m 201.69446,157.30151 v 2.65761"
         id="path945" />
      <path
         inkscape:connector-curvature="0"
         style="fill:#000000;fill-opacity:1;fill-rule:evenodd;stroke:none;stroke-width:0.26458332"
         d="m 200.25421,159.59905 1.44025,2.8805 1.45739,-2.8805 z"
         id="path947" />
      <path
         inkscape:connector-curvature="0"
         style="fill:#ffffff;fill-opacity:1;fill-rule:evenodd;stroke:none;stroke-width:0.26458332"
         d="m 183.55417,144.33926 v 12.96225 h 36.28058 v -12.96225 z"
         id="path959" />
      <path
         inkscape:connector-curvature="0"
         style="fill:none;stroke:#000000;stroke-width:0.25718752px;stroke-linecap:round;stroke-linejoin:round;stroke-miterlimit:4;stroke-dasharray:none;stroke-opacity:1"
         d="m 183.55417,144.33926 h 36.28058 v 12.96225 h -36.28058 z"
         id="path961" />
      <text
         xml:space="preserve"
         style="font-style:normal;font-variant:normal;font-weight:700;font-size:6.58151054px;line-height:125%;font-family:Arial;text-align:start;letter-spacing:0px;word-spacing:0px;text-anchor:start;fill:#000000;fill-opacity:1;stroke:none;stroke-width:0.26458332"
         x="192.49835"
         y="152.92757"
         id="text967"><tspan
           style="stroke-width:0.26458332"
           sodipodi:role="line"
           x="192.49835"
           y="152.92757"
           id="tspan965"><tspan
             dx="0"
             dy="0"
             style="font-style:normal;font-variant:normal;font-weight:700;font-size:6.58151054px;font-family:Arial;fill:#000000;stroke-width:0.26458332"
             id="tspan963">HEAD</tspan></tspan></text>
      <path
         inkscape:connector-curvature="0"
         style="fill:none;stroke:#000000;stroke-width:0.08572917px;stroke-linecap:round;stroke-linejoin:round;stroke-miterlimit:4;stroke-dasharray:none;stroke-opacity:1"
         d="m 201.69446,157.30151 v 5.17804"
         id="path971" />
    </g>
  </g>
  <g
     inkscape:groupmode="layer"
     id="layer5"
     inkscape:label="Crear Rama"
     style="display:inline"
     sodipodi:insensitive="true"
     transform="translate(-67.855547,-37.51191)">
    <g
       style="display:inline"
       id="g1082"
       transform="translate(-38.74071,-116.81735)">
      <path
         inkscape:connector-curvature="0"
         style="fill:none;stroke:#000000;stroke-width:0.25718752px;stroke-linecap:round;stroke-linejoin:round;stroke-miterlimit:4;stroke-dasharray:none;stroke-opacity:1"
         d="m 200.66571,227.94235 v -5.24663"
         id="path853" />
      <path
         inkscape:connector-curvature="0"
         style="fill:#000000;fill-opacity:1;fill-rule:evenodd;stroke:none;stroke-width:0.26458332"
         d="m 199.20831,223.05578 1.4574,-2.89764 1.44025,2.89764 z"
         id="path855" />
      <path
         inkscape:connector-curvature="0"
         style="fill:#000000;fill-opacity:1;fill-rule:evenodd;stroke:none;stroke-width:0.26458332"
         d="M 182.50827,227.94235 V 240.9046 H 218.806 v -12.96225 z"
         id="path889" />
      <path
         inkscape:connector-curvature="0"
         style="fill:none;stroke:#000000;stroke-width:0.25718752px;stroke-linecap:round;stroke-linejoin:round;stroke-miterlimit:4;stroke-dasharray:none;stroke-opacity:1"
         d="M 182.50827,240.9046 H 218.806 v -12.96225 h -36.29773 z"
         id="path891" />
      <text
         xml:space="preserve"
         style="font-style:normal;font-variant:normal;font-weight:700;font-size:6.58151054px;line-height:125%;font-family:Arial;text-align:start;letter-spacing:0px;word-spacing:0px;text-anchor:start;fill:#000000;fill-opacity:1;stroke:none;stroke-width:0.26458332"
         x="188.89445"
         y="236.52364"
         id="text897"><tspan
           style="stroke-width:0.26458332"
           sodipodi:role="line"
           x="188.89445"
           y="236.52364"
           id="tspan895"><tspan
             dx="0"
             dy="0"
             style="font-style:normal;font-variant:normal;font-weight:700;font-size:6.58151054px;font-family:Arial;fill:#ffffff;stroke-width:0.26458332"
             id="tspan893">Tarea X</tspan></tspan></text>
      <path
         inkscape:connector-curvature="0"
         style="fill:none;stroke:#000000;stroke-width:0.08572917px;stroke-linecap:round;stroke-linejoin:round;stroke-miterlimit:4;stroke-dasharray:none;stroke-opacity:1"
         d="m 200.66571,227.94235 v -8.0414"
         id="path899" />
    </g>
  </g>
  <g
     inkscape:groupmode="layer"
     id="layer6"
     inkscape:label="MoverCabeza"
     sodipodi:insensitive="true"
     style="display:inline"
     transform="translate(-67.855547,-37.51191)">
    <g
       id="g1507"
       transform="translate(-2.654405,-118.8227)">
      <path
         inkscape:connector-curvature="0"
         style="fill:#ffffff;fill-opacity:1;fill-rule:evenodd;stroke:none;stroke-width:0.26458332"
         d="m 146.43054,243.02732 v 12.96225 h 36.28058 v -12.96225 z"
         id="path959-5" />
      <text
         xml:space="preserve"
         style="font-style:normal;font-variant:normal;font-weight:700;font-size:6.58151054px;line-height:125%;font-family:Arial;text-align:start;letter-spacing:0px;word-spacing:0px;text-anchor:start;fill:#000000;fill-opacity:1;stroke:none;stroke-width:0.26458332"
         x="155.16293"
         y="256.95694"
         id="text967-7"><tspan
           style="stroke-width:0.26458332"
           sodipodi:role="line"
           x="155.16293"
           y="256.95694"
           id="tspan965-4"><tspan
             dx="0"
             dy="0"
             style="font-style:normal;font-variant:normal;font-weight:700;font-size:6.58151054px;font-family:Arial;fill:#000000;stroke-width:0.26458332"
             id="tspan963-3">HEAD</tspan></tspan></text>
      <path
         inkscape:connector-curvature="0"
         style="fill:none;stroke:#000000;stroke-width:0.25718752px;stroke-linecap:round;stroke-linejoin:round;stroke-miterlimit:4;stroke-dasharray:none;stroke-opacity:1"
         d="m 146.43054,261.08249 h 36.28058 v -12.96225 h -36.28058 z"
         id="path961-3" />
      <g
         transform="matrix(1,0,0,-1,0,504.10981)"
         id="g1484">
        <path
           id="path945-4"
           d="m 164.57083,255.98957 v 2.65761"
           style="fill:none;stroke:#000000;stroke-width:0.25718752px;stroke-linecap:round;stroke-linejoin:round;stroke-miterlimit:4;stroke-dasharray:none;stroke-opacity:1"
           inkscape:connector-curvature="0" />
        <path
           id="path947-8"
           d="m 163.13058,258.28711 1.44025,2.8805 1.45739,-2.8805 z"
           style="fill:#000000;fill-opacity:1;fill-rule:evenodd;stroke:none;stroke-width:0.26458332"
           inkscape:connector-curvature="0" />
        <path
           id="path971-7"
           d="m 164.57083,255.98957 v 5.17804"
           style="fill:none;stroke:#000000;stroke-width:0.08572917px;stroke-linecap:round;stroke-linejoin:round;stroke-miterlimit:4;stroke-dasharray:none;stroke-opacity:1"
           inkscape:connector-curvature="0" />
      </g>
    </g>
  </g>
  <g
     inkscape:groupmode="layer"
     id="layer8"
     inkscape:label="Avanzar Tarea X"
     sodipodi:insensitive="true"
     style="display:inline"
     transform="translate(-67.855547,-37.51191)">
    <g
       style="display:inline"
       id="g1082-0"
       transform="translate(2.11046,-106.52852)">
      <path
         inkscape:connector-curvature="0"
         style="fill:none;stroke:#000000;stroke-width:0.25718752px;stroke-linecap:round;stroke-linejoin:round;stroke-miterlimit:4;stroke-dasharray:none;stroke-opacity:1"
         d="m 200.66571,227.94235 v -5.24663"
         id="path853-2" />
      <path
         inkscape:connector-curvature="0"
         style="fill:#000000;fill-opacity:1;fill-rule:evenodd;stroke:none;stroke-width:0.26458332"
         d="m 199.20831,223.05578 1.4574,-2.89764 1.44025,2.89764 z"
         id="path855-6" />
      <path
         inkscape:connector-curvature="0"
         style="fill:#000000;fill-opacity:1;fill-rule:evenodd;stroke:none;stroke-width:0.26458332"
         d="M 182.50827,227.94235 V 240.9046 H 218.806 v -12.96225 z"
         id="path889-3" />
      <path
         inkscape:connector-curvature="0"
         style="fill:none;stroke:#000000;stroke-width:0.25718752px;stroke-linecap:round;stroke-linejoin:round;stroke-miterlimit:4;stroke-dasharray:none;stroke-opacity:1"
         d="M 182.50827,240.9046 H 218.806 v -12.96225 h -36.29773 z"
         id="path891-4" />
      <text
         xml:space="preserve"
         style="font-style:normal;font-variant:normal;font-weight:700;font-size:6.58151054px;line-height:125%;font-family:Arial;text-align:start;letter-spacing:0px;word-spacing:0px;text-anchor:start;fill:#000000;fill-opacity:1;stroke:none;stroke-width:0.26458332"
         x="188.89445"
         y="236.52364"
         id="text897-4"><tspan
           style="stroke-width:0.26458332"
           sodipodi:role="line"
           x="188.89445"
           y="236.52364"
           id="tspan895-2"><tspan
             dx="0"
             dy="0"
             style="font-style:normal;font-variant:normal;font-weight:700;font-size:6.58151054px;font-family:Arial;fill:#ffffff;stroke-width:0.26458332"
             id="tspan893-7">Tarea X</tspan></tspan></text>
      <path
         inkscape:connector-curvature="0"
         style="fill:none;stroke:#000000;stroke-width:0.08572917px;stroke-linecap:round;stroke-linejoin:round;stroke-miterlimit:4;stroke-dasharray:none;stroke-opacity:1"
         d="m 200.66571,227.94235 v -8.0414"
         id="path899-6" />
    </g>
    <path
       transform="translate(0,-106.49998)"
       id="path857"
       d="m 187.21632,204.21251 v 15.56842 h 31.10255 v -15.56842 z"
       style="display:inline;fill:#ffffff;fill-opacity:1;fill-rule:evenodd;stroke:none;stroke-width:0.26458332"
       inkscape:connector-curvature="0" />
    <g
       style="display:inline"
       transform="translate(0,-106.49998)"
       id="g1393">
      <path
         inkscape:connector-curvature="0"
         style="fill:none;stroke:#000000;stroke-width:0.25718752px;stroke-linecap:round;stroke-linejoin:round;stroke-miterlimit:4;stroke-dasharray:none;stroke-opacity:1"
         d="m 187.21632,211.99672 -8.71008,-6.53256"
         id="path867" />
      <path
         inkscape:connector-curvature="0"
         style="fill:#000000;fill-opacity:1;fill-rule:evenodd;stroke:none;stroke-width:0.26458332"
         d="m 186.4962,211.4652 c -0.29148,0.39436 -0.20575,0.94302 0.1886,1.25165 0.39436,0.29148 0.94302,0.20575 1.2345,-0.18861 0.29148,-0.39435 0.2229,-0.94302 -0.17146,-1.2345 -0.39435,-0.30862 -0.94302,-0.22289 -1.25164,0.17146 z"
         id="path869" />
      <path
         inkscape:connector-curvature="0"
         style="fill:#000000;fill-opacity:1;fill-rule:evenodd;stroke:none;stroke-width:0.26458332"
         d="m 178.02615,206.59578 -1.18306,-2.38327 2.60617,0.48009 z"
         id="path871" />
    </g>
    <path
       transform="translate(0,-106.49998)"
       id="path859"
       d="m 187.21632,219.78093 h 31.10255 v -15.56842 h -31.10255 z"
       style="display:inline;fill:none;stroke:#000000;stroke-width:0.25718752px;stroke-linecap:round;stroke-linejoin:round;stroke-miterlimit:4;stroke-dasharray:none;stroke-opacity:1"
       inkscape:connector-curvature="0" />
    <text
       transform="translate(0,-106.49998)"
       id="text865"
       y="214.10176"
       x="198.86874"
       style="font-style:normal;font-variant:normal;font-weight:400;font-size:6.58151054px;line-height:125%;font-family:Arial;text-align:start;letter-spacing:0px;word-spacing:0px;text-anchor:start;display:inline;fill:#000000;fill-opacity:1;stroke:none;stroke-width:0.26458332"
       xml:space="preserve"><tspan
         id="tspan863"
         y="214.10176"
         x="198.86874"
         sodipodi:role="line"
         style="stroke-width:0.26458332"><tspan
           id="tspan861"
           style="font-style:normal;font-variant:normal;font-weight:400;font-size:6.58151054px;font-family:Arial;fill:#000000;stroke-width:0.26458332"
           dy="0"
           dx="0">V4</tspan></tspan></text>
  </g>
  <g
     inkscape:groupmode="layer"
     id="layer9"
     inkscape:label="Avanzar Tarea X - Cabeza"
     style="display:inline"
     sodipodi:insensitive="true"
     transform="translate(-67.855547,-37.51191)">
    <g
       id="g1507-9"
       transform="translate(38.196769,-108.53387)">
      <path
         inkscape:connector-curvature="0"
         style="fill:#ffffff;fill-opacity:1;fill-rule:evenodd;stroke:none;stroke-width:0.26458332"
         d="m 146.43054,243.02732 v 12.96225 h 36.28058 v -12.96225 z"
         id="path959-5-7" />
      <text
         xml:space="preserve"
         style="font-style:normal;font-variant:normal;font-weight:700;font-size:6.58151054px;line-height:125%;font-family:Arial;text-align:start;letter-spacing:0px;word-spacing:0px;text-anchor:start;fill:#000000;fill-opacity:1;stroke:none;stroke-width:0.26458332"
         x="155.16293"
         y="256.95694"
         id="text967-7-0"><tspan
           style="stroke-width:0.26458332"
           sodipodi:role="line"
           x="155.16293"
           y="256.95694"
           id="tspan965-4-6"><tspan
             dx="0"
             dy="0"
             style="font-style:normal;font-variant:normal;font-weight:700;font-size:6.58151054px;font-family:Arial;fill:#000000;stroke-width:0.26458332"
             id="tspan963-3-2">HEAD</tspan></tspan></text>
      <path
         inkscape:connector-curvature="0"
         style="fill:none;stroke:#000000;stroke-width:0.25718752px;stroke-linecap:round;stroke-linejoin:round;stroke-miterlimit:4;stroke-dasharray:none;stroke-opacity:1"
         d="m 146.43054,261.08249 h 36.28058 v -12.96225 h -36.28058 z"
         id="path961-3-8" />
      <g
         transform="matrix(1,0,0,-1,0,504.10981)"
         id="g1484-8">
        <path
           id="path945-4-4"
           d="m 164.57083,255.98957 v 2.65761"
           style="fill:none;stroke:#000000;stroke-width:0.25718752px;stroke-linecap:round;stroke-linejoin:round;stroke-miterlimit:4;stroke-dasharray:none;stroke-opacity:1"
           inkscape:connector-curvature="0" />
        <path
           id="path947-8-7"
           d="m 163.13058,258.28711 1.44025,2.8805 1.45739,-2.8805 z"
           style="fill:#000000;fill-opacity:1;fill-rule:evenodd;stroke:none;stroke-width:0.26458332"
           inkscape:connector-curvature="0" />
        <path
           id="path971-7-5"
           d="m 164.57083,255.98957 v 5.17804"
           style="fill:none;stroke:#000000;stroke-width:0.08572917px;stroke-linecap:round;stroke-linejoin:round;stroke-miterlimit:4;stroke-dasharray:none;stroke-opacity:1"
           inkscape:connector-curvature="0" />
      </g>
    </g>
  </g>
  <g
     inkscape:groupmode="layer"
     id="layer4"
     inkscape:label="Mover Master"
     style="display:inline"
     transform="translate(-67.855547,-37.51191)"
     sodipodi:insensitive="true">
    <path
       transform="translate(0,-106.49998)"
       id="path873"
       d="m 187.21632,183.4832 v 15.55127 h 31.10255 V 183.4832 Z"
       style="fill:#ffffff;fill-opacity:1;fill-rule:evenodd;stroke:none;stroke-width:0.26458332"
       inkscape:connector-curvature="0" />
    <path
       transform="translate(0,-106.49998)"
       id="path875"
       d="m 187.21632,199.03447 h 31.10255 V 183.4832 h -31.10255 z"
       style="fill:none;stroke:#000000;stroke-width:0.25718752px;stroke-linecap:round;stroke-linejoin:round;stroke-miterlimit:4;stroke-dasharray:none;stroke-opacity:1"
       inkscape:connector-curvature="0" />
    <text
       transform="translate(0,-106.49998)"
       id="text881"
       y="193.36475"
       x="198.86874"
       style="font-style:normal;font-variant:normal;font-weight:400;font-size:6.58151054px;line-height:125%;font-family:Arial;text-align:start;letter-spacing:0px;word-spacing:0px;text-anchor:start;fill:#000000;fill-opacity:1;stroke:none;stroke-width:0.26458332"
       xml:space="preserve"><tspan
         id="tspan879"
         y="193.36475"
         x="198.86874"
         sodipodi:role="line"
         style="stroke-width:0.26458332"><tspan
           id="tspan877"
           style="font-style:normal;font-variant:normal;font-weight:400;font-size:6.58151054px;font-family:Arial;fill:#000000;stroke-width:0.26458332"
           dy="0"
           dx="0">V5</tspan></tspan></text>
    <g
       transform="translate(0,-106.49998)"
       id="g1388">
      <path
         inkscape:connector-curvature="0"
         style="fill:none;stroke:#000000;stroke-width:0.25718752px;stroke-linecap:round;stroke-linejoin:round;stroke-miterlimit:4;stroke-dasharray:none;stroke-opacity:1"
         d="m 187.21632,191.26741 -8.71008,6.53256"
         id="path883" />
      <path
         inkscape:connector-curvature="0"
         style="fill:#000000;fill-opacity:1;fill-rule:evenodd;stroke:none;stroke-width:0.26458332"
         d="m 186.4962,191.79893 c 0.30862,0.39435 0.85729,0.46294 1.25164,0.17146 0.39436,-0.29148 0.46294,-0.85729 0.17146,-1.25165 -0.29148,-0.37721 -0.84014,-0.46293 -1.2345,-0.17146 -0.39435,0.29148 -0.48008,0.8573 -0.1886,1.25165 z"
         id="path885" />
      <path
         inkscape:connector-curvature="0"
         style="fill:#000000;fill-opacity:1;fill-rule:evenodd;stroke:none;stroke-width:0.26458332"
         d="m 179.44926,198.55439 -2.60617,0.48008 1.18306,-2.36612 z"
         id="path887" />
    </g>
    <g
       style="display:inline"
       id="g1806"
       transform="translate(-2.6130219,-2.3139166)">
      <g
         transform="translate(44.036787,-114.43747)"
         id="g1274-5"
         style="display:inline">
        <path
           id="path901-9"
           d="m 143.15153,173.10997 v 12.96225 h 36.28058 v -12.96225 z"
           style="fill:#000000;fill-opacity:1;fill-rule:evenodd;stroke:none;stroke-width:0.26458332"
           inkscape:connector-curvature="0" />
        <path
           id="path903-2"
           d="m 143.15153,186.07222 h 36.28058 v -12.96225 h -36.28058 z"
           style="fill:none;stroke:#000000;stroke-width:0.25718752px;stroke-linecap:round;stroke-linejoin:round;stroke-miterlimit:4;stroke-dasharray:none;stroke-opacity:1"
           inkscape:connector-curvature="0" />
        <text
           id="text909-5"
           y="181.70016"
           x="150.80908"
           style="font-style:normal;font-variant:normal;font-weight:700;font-size:6.58151054px;line-height:125%;font-family:Arial;text-align:start;letter-spacing:0px;word-spacing:0px;text-anchor:start;fill:#000000;fill-opacity:1;stroke:none;stroke-width:0.26458332"
           xml:space="preserve"><tspan
             id="tspan907-9"
             y="181.70016"
             x="150.80908"
             sodipodi:role="line"
             style="stroke-width:0.26458332"><tspan
               id="tspan905-6"
               style="font-style:normal;font-variant:normal;font-weight:700;font-size:6.58151054px;font-family:Arial;fill:#ffffff;stroke-width:0.26458332"
               dy="0"
               dx="0">Master</tspan></tspan></text>
        <path
           id="path911-7"
           d="m 161.29182,186.07222 v 5.24663"
           style="fill:none;stroke:#000000;stroke-width:0.25718752px;stroke-linecap:round;stroke-linejoin:round;stroke-miterlimit:4;stroke-dasharray:none;stroke-opacity:1"
           inkscape:connector-curvature="0" />
        <path
           id="path913-2"
           d="m 162.74922,190.95878 -1.4574,2.89765 -1.44025,-2.89765 z"
           style="fill:#000000;fill-opacity:1;fill-rule:evenodd;stroke:none;stroke-width:0.26458332"
           inkscape:connector-curvature="0" />
      </g>
      <g
         transform="translate(3.7381667,-104.38484)"
         id="g1072-03"
         style="display:inline">
        <path
           id="path945-8"
           d="m 201.69446,157.30151 v 2.65761"
           style="fill:none;stroke:#000000;stroke-width:0.25718752px;stroke-linecap:round;stroke-linejoin:round;stroke-miterlimit:4;stroke-dasharray:none;stroke-opacity:1"
           inkscape:connector-curvature="0" />
        <path
           id="path947-82"
           d="m 200.25421,159.59905 1.44025,2.8805 1.45739,-2.8805 z"
           style="fill:#000000;fill-opacity:1;fill-rule:evenodd;stroke:none;stroke-width:0.26458332"
           inkscape:connector-curvature="0" />
        <path
           id="path959-7"
           d="m 183.55417,144.33926 v 12.96225 h 36.28058 v -12.96225 z"
           style="fill:#ffffff;fill-opacity:1;fill-rule:evenodd;stroke:none;stroke-width:0.26458332"
           inkscape:connector-curvature="0" />
        <path
           id="path961-7"
           d="m 183.55417,144.33926 h 36.28058 v 12.96225 h -36.28058 z"
           style="fill:none;stroke:#000000;stroke-width:0.25718752px;stroke-linecap:round;stroke-linejoin:round;stroke-miterlimit:4;stroke-dasharray:none;stroke-opacity:1"
           inkscape:connector-curvature="0" />
        <text
           id="text967-2"
           y="152.92757"
           x="192.49835"
           style="font-style:normal;font-variant:normal;font-weight:700;font-size:6.58151054px;line-height:125%;font-family:Arial;text-align:start;letter-spacing:0px;word-spacing:0px;text-anchor:start;fill:#000000;fill-opacity:1;stroke:none;stroke-width:0.26458332"
           xml:space="preserve"><tspan
             id="tspan965-42"
             y="152.92757"
             x="192.49835"
             sodipodi:role="line"
             style="stroke-width:0.26458332"><tspan
               id="tspan963-2"
               style="font-style:normal;font-variant:normal;font-weight:700;font-size:6.58151054px;font-family:Arial;fill:#000000;stroke-width:0.26458332"
               dy="0"
               dx="0">HEAD</tspan></tspan></text>
        <path
           id="path971-1"
           d="m 201.69446,157.30151 v 5.17804"
           style="fill:none;stroke:#000000;stroke-width:0.08572917px;stroke-linecap:round;stroke-linejoin:round;stroke-miterlimit:4;stroke-dasharray:none;stroke-opacity:1"
           inkscape:connector-curvature="0" />
      </g>
    </g>
  </g>
</svg>
