/Users/larry.ngako/Documents/onepay/src/main/java/fr/decathlon/onepay/OnepayApplication.java
/Users/larry.ngako/Documents/onepay/src/main/java/fr/decathlon/onepay/application/config/ApiPortConfiguration.java
/Users/larry.ngako/Documents/onepay/src/main/java/fr/decathlon/onepay/application/controller/TransactionController.java
/Users/larry.ngako/Documents/onepay/src/main/java/fr/decathlon/onepay/domain/api/ApiTransactionPort.java
/Users/larry.ngako/Documents/onepay/src/main/java/fr/decathlon/onepay/domain/dto/ItemDto.java
/Users/larry.ngako/Documents/onepay/src/main/java/fr/decathlon/onepay/domain/dto/TransactionDto.java
/Users/larry.ngako/Documents/onepay/src/main/java/fr/decathlon/onepay/domain/service/LogicService.java
/Users/larry.ngako/Documents/onepay/src/main/java/fr/decathlon/onepay/domain/spy/TransactionPersistancePort.java
/Users/larry.ngako/Documents/onepay/src/main/java/fr/decathlon/onepay/domain/util/PaymentStatus.java
/Users/larry.ngako/Documents/onepay/src/main/java/fr/decathlon/onepay/domain/util/PaymentType.java
/Users/larry.ngako/Documents/onepay/src/main/java/fr/decathlon/onepay/infrastructure/adapter/TransactionAdapter.java
/Users/larry.ngako/Documents/onepay/src/main/java/fr/decathlon/onepay/infrastructure/config/SpyPortConfiguration.java
/Users/larry.ngako/Documents/onepay/src/main/java/fr/decathlon/onepay/infrastructure/entity/AbstractAuditingEntity.java
/Users/larry.ngako/Documents/onepay/src/main/java/fr/decathlon/onepay/infrastructure/entity/Item.java
/Users/larry.ngako/Documents/onepay/src/main/java/fr/decathlon/onepay/infrastructure/entity/Transaction.java
/Users/larry.ngako/Documents/onepay/src/main/java/fr/decathlon/onepay/infrastructure/mapper/ItemMapper.java
/Users/larry.ngako/Documents/onepay/src/main/java/fr/decathlon/onepay/infrastructure/mapper/TransactionMapper.java
/Users/larry.ngako/Documents/onepay/src/main/java/fr/decathlon/onepay/infrastructure/repository/ItemRepository.java
/Users/larry.ngako/Documents/onepay/src/main/java/fr/decathlon/onepay/infrastructure/repository/PaymentTypeRepository.java
/Users/larry.ngako/Documents/onepay/src/main/java/fr/decathlon/onepay/infrastructure/repository/TransactionRepository.java
