{
    "name": "Larning Dashboard",
    "description":"The main application to manage the Larning school system",
    "author": "Justus Fluegel <justusfluegel@gmail.com>",
    "icon": "https://assets.gitlab-static.net/uploads/-/system/project/avatar/16105012/appicon.png?width=64",
    "banner": "https://images.pexels.com/photos/572056/pexels-photo-572056.jpeg?cs=srgb&dl=pexels-serpstat-572056.jpg&fm=jpg",
    "repo": "https://gitlab.com/larning/apps/dashboard.git",
    "versions": {
        "nightly": "tag::@nightly gitlab-ci::last-pipeline",
        "latest": "version::#nightly",
        "default": "version::#latest",
        "add::additional-versions": "git::read-releases"
    }
}
