GLOBAL_SIZE_0;GLOBAL_SIZE_1;LOCAL_SIZE_0;LOCAL_SIZE_1;v_TP_112;v_TP_113;cost
64;128;1;16;4094;23;629177192
1;256;1;8;1;2047;18411091275
1;16;1;1;178;1;3914560152
1024;2;128;2;2047;89;8994210167
1024;2;128;1;2047;46;8983030498
4096;8;128;8;2047;89;18446744073709551615
1024;2;128;1;2047;89;8783292949
1024;8;128;8;2047;178;18446744073709551615
1024;2;64;1;2047;1;17365707500
1024;1;128;1;2047;89;18076731083
32;2;2;1;4094;89;17756012093
1024;4;1;2;2047;89;4567515906
1024;2;128;1;2047;1;17302421067
1024;2;64;2;2047;1;17335381486
1024;2;16;1;2047;1;17350751431
1024;2;64;1;178;1;1724869484
1024;4096;128;4;2047;178;18446744073709551615
4;2;2;1;2047;1;17332425625
8;2;8;1;2047;2;13493571917
1;2;1;1;2047;1;34961460040
1024;1;128;1;2047;1;35004163834
1024;2;128;2;2047;1;17343946375
1024;1;64;1;4094;1;71573081274
256;2;16;1;178;1;1746423318
512;2;128;1;178;1;1754194542
1024;4;64;4;2047;1;8613202724
1024;8;128;4;2047;1;18446744073709551615
1024;4;64;1;2047;4094;17756466750
1024;2;64;1;178;4094;2070514030
512;4;64;4;2047;1;8600067717
2048;4;32;4;2047;1;8557815750
512;4;64;4;178;1;864095341
512;1;64;1;2047;1;34965768959
1024;4;64;4;1;2047;617385010
512;16;64;1;2047;1;2113406977
256;8;64;2;178;1;994053547
1024;4;64;1;178;1;856517000
128;4;128;4;2047;1;18446744073709551615
512;4;64;2;2047;1;8556249171
2048;4;128;1;4094;1;17492191312
64;64;1;2;2;4094;823824824
4;512;2;4;2;89;525387012
1024;1;128;1;2;178;1624806162
1;4;1;4;2047;1;17234287968
512;4;64;4;89;1;790440142
512;4;1;4;2047;1;8571378911
512;4;64;1;2047;1;8635453693
512;1;64;1;2047;1;34947741414
512;4;64;1;2047;1;8636469662
64;8;32;4;178;1;900400846
512;4;64;4;1;1;655073438
1024;4;4;1;2047;2047;9177152299
64;2;32;1;2047;46;9227383009
128;32;16;4;23;2;2012789413
256;4096;16;32;4094;178;18446744073709551615
256;2;64;2;2047;1;17304844679
512;4;32;1;2047;1;8630150677
512;4;32;4;2047;4094;17751990750
512;1;64;1;23;1;1509872961
512;4;64;4;2047;1;8589910115
512;4;64;4;2047;23;4586977375
512;4;1;4;2047;2047;9103245913
4096;4;64;4;2047;1;8592207767
512;4;64;4;4094;1;17591766291
256;4;256;4;2047;1;18446744073709551615
2048;4;64;4;1;1;493942093
1024;8;64;4;2047;1;4223841468
4096;4;64;4;4094;1;17590593184
2048;2;64;1;4094;1;35581338458
4096;4;16;4;2047;4094;17757115084
4096;4;64;2;2047;1;8624974469
1;8;1;4;2047;1;8581945798
1;4;1;4;4094;1;17393494516
4096;4;8;2;1;1;476073464
4096;4;32;2;2047;1;8524665105
4096;4;128;4;2047;1;18446744073709551615
4096;4;32;4;2047;1;8557269477
4096;4;64;1;2047;1;8603092734
4096;2;32;1;2047;1;17349474556
4096;4;64;4;178;1;864587235
4096;2;64;1;2047;1;17341573125
4096;4;1;4;178;1;829823171
512;128;4;1;89;178;1220022708
64;128;8;8;4094;2;430855351
1;16;1;1;1;23;2537063250
4096;8;64;8;2047;1;18446744073709551615
2048;4;32;2;2047;1;8595427650
4096;1;32;1;2047;1;35000575375
1;4;1;4;2047;1;17234260375
4096;1;64;1;1;1;909440276
1;4;1;4;178;1;15738955978
4096;4;64;4;2047;4094;17755206292
4096;2;64;2;2047;1;17293508887
4096;1;64;1;2047;1;34966598124
4096;4;128;4;178;1;18446744073709551615
4096;4;64;4;2047;1;8600203750
4096;4;64;4;89;1;761928730
4096;4;64;4;2;1;619853975
1;8;1;2;178;4094;36040500376
4096;256;32;1;2;2;1612891498
64;256;4;32;178;178;402564135
64;2;16;2;2;2047;614038836
4096;4;64;1;2047;1;8587712441
2048;2;64;1;2047;1;17337436473
4096;4;32;4;4094;1;17370589099
1;4;1;4;4094;4094;36095949834
1;128;1;2;1;1;477624889
4096;8;64;1;2047;1;4282129703
4096;4;32;2;4094;1;17381003167
1;1;1;1;2047;1;70626426000
1;1024;1;32;2047;1;158405212
4096;4;1;4;2047;1;8573402482
4096;4;64;2;2047;1;8607978734
4096;16;64;4;2047;1;2119786287
4096;1;64;1;4094;1;71573762333
