epoch;GLOBAL_SIZE_0;GLOBAL_SIZE_1;GLOBAL_SIZE_2;LOCAL_SIZE_0;LOCAL_SIZE_1;LOCAL_SIZE_2;cost
1505191575;64;512;128;4;8;1;66857926
1505191575;512;1;128;8;1;128;18446744073709551615
1505191576;8;2;32;2;1;4;135404297
1505191576;2;512;4;2;256;4;18446744073709551615
1505191576;64;128;32;8;8;1;42773778
1505191577;128;512;128;4;8;1;63863851
1505191577;64;256;64;4;8;1;75723407
1505191578;64;256;128;2;8;1;133084297
1505191591;1;1;4;1;1;2;13457617482
1505191592;4;16;256;1;1;32;388349333
1505191593;128;16;4;1;8;1;253525926
1505191593;8;256;4;8;64;4;18446744073709551615
1505191593;256;512;32;8;8;1;39305926
1505191594;64;128;32;4;8;1;76481778
1505191594;64;128;16;8;8;1;43776000
1505191595;256;512;4;8;8;1;40929926
1505191595;256;1;32;8;1;1;46740593
1505191595;1;256;64;1;8;1;161683259
1505191596;64;512;16;8;8;1;42960297
1505191596;256;4;1;8;1;1;96177629
1505191597;256;512;64;8;8;1;38242815
1505191597;256;512;1;16;2;1;25604296
1505191598;4;1;512;1;1;16;236535111
1505191598;1;512;1;1;2;1;148660148
1505191598;256;512;4;16;2;1;28972149
1505191599;256;512;512;16;32;1;18446744073709551615
1505191599;64;512;1;16;2;1;25348000
1505191600;64;512;256;16;2;1;18229926
1505191600;32;512;1;8;2;1;45530519
1505191600;64;512;512;16;2;1;16554223
1505191601;64;512;1;4;2;1;81101778
1505191601;256;512;512;16;64;1;18446744073709551615
1505191601;64;512;512;16;2;128;18446744073709551615
1505191602;64;16;512;16;2;1;22994222
1505191602;64;512;1;16;2;1;25722222
1505191602;64;64;512;16;2;1;20320148
1505191603;64;512;512;16;2;8;14663704
1505191603;64;512;512;16;8;4;18446744073709551615
1505191603;64;16;512;16;2;2;21773630
1505191604;64;512;16;16;2;8;35816741
1505191605;64;64;512;16;2;8;19242815
1505191605;64;64;32;16;32;8;18446744073709551615
1505191605;64;1;512;16;1;8;29077185
1505191606;512;32;512;16;2;8;20169926
1505191606;64;512;2;2;2;2;157121629
1505191607;16;512;128;16;2;8;20321333
1505191607;128;512;512;16;2;8;12617778
1505191607;128;512;512;16;1;8;14431852
1505191608;128;512;512;128;2;8;18446744073709551615
1505191608;2;512;4;1;2;1;142969481
1505191609;128;512;64;16;1;1;19786963
1505191609;16;1;512;16;1;8;25638815
1505191609;4;512;512;2;2;8;86048148
1505191610;1;512;512;1;2;8;233756148
1505191611;128;1;1;128;1;1;692594519
1505191611;128;512;512;16;2;256;18446744073709551615
1505191612;128;512;8;16;2;8;26396296
1505191612;128;32;512;16;2;8;18218222
1505191612;128;512;1;16;2;1;25360000
1505191613;128;256;512;16;2;8;14440148
1505191613;256;512;512;16;1;4;13404000
1505191613;32;512;512;16;2;8;18635259
1505191614;128;512;256;8;1;8;30878370
1505191614;8;512;512;1;2;8;163383555
1505191615;128;512;64;16;2;8;20912296
1505191615;128;512;1;16;2;1;25803852
1505191615;128;512;512;16;2;16;18446744073709551615
1505191619;4;2;2;1;1;1;3536954963
1505191620;256;256;256;16;32;16;18446744073709551615
1505191620;256;2;2;32;2;1;93981778
1505191621;256;1;128;1;1;32;411839852
1505191621;128;64;2;2;2;2;211335112
1505191622;128;512;512;1;4;8;85449630
1505191622;128;512;512;16;32;8;18446744073709551615
1505191622;512;4;256;2;1;256;18446744073709551615
1505191623;16;512;512;16;2;16;18446744073709551615
1505191623;128;2;4;8;2;1;84625185
1505191624;128;16;64;8;16;64;18446744073709551615
1505191624;128;512;512;16;4;8;18446744073709551615
1505191624;128;16;512;16;2;8;19528000
1505191625;128;4;512;16;2;8;22564444
1505191625;128;512;512;16;4;16;18446744073709551615
1505191625;128;128;512;32;2;8;18446744073709551615
1505191626;128;1;512;16;1;8;42221037
1505191626;128;1;256;32;1;8;18164592
1505191627;16;128;1;2;128;1;266041778
1505191627;128;1;512;16;1;8;29317185
1505191627;128;512;512;16;128;8;18446744073709551615
1505191628;32;64;4;32;64;4;18446744073709551615
1505191628;128;8;512;16;2;8;21081926
1505191628;64;1;256;64;1;4;15375556
1505191629;128;128;1;2;64;1;156179408
1505191629;1;8;256;1;2;1;145236296
1505191637;2;1;4;1;1;1;6543548889
1505191637;32;32;64;16;16;16;18446744073709551615
1505191637;128;256;16;64;64;2;18446744073709551615
1505191638;128;128;32;32;8;32;18446744073709551615
1505191638;16;128;256;8;16;8;18446744073709551615
1505191638;128;512;512;16;64;8;18446744073709551615
1505191639;128;512;512;1;2;8;58958814
1505191639;256;64;512;16;2;8;17047407
1505191640;128;512;512;2;2;8;58533778
1505191641;128;1;1;16;1;1;686259111
1505191641;128;1;512;16;1;4;28933926
1505191641;256;128;512;16;2;8;16937778
1505191642;256;512;512;32;8;8;18446744073709551615
1505191642;128;512;512;16;2;1;15822074
1505191643;128;1;1;16;1;1;698658222
1505191643;128;512;512;8;2;8;23757333
1505191644;1;8;512;1;2;16;254378666
1505191645;8;1;8;2;1;2;991913333
1505191646;128;1;8;1;1;2;262005037
1505191646;128;2;64;2;2;16;141074963
1505191647;128;512;128;8;2;8;30011260
1505191647;128;512;32;16;2;8;24140741
1505191648;16;64;1;16;2;1;80668889
1505191648;128;512;512;64;64;16;18446744073709551615
1505191648;128;512;256;16;2;8;15046074
1505191649;128;128;512;16;4;8;18446744073709551615
1505191649;256;1;32;2;1;2;131801630
1505191649;128;128;128;8;16;8;18446744073709551615
1505191650;128;512;512;1;2;8;59752740
1505191650;128;512;128;16;2;8;16710519
1505191651;16;1;16;8;1;1;307009037
1505191651;128;512;512;64;2;8;18446744073709551615
1505191652;8;512;1;1;2;1;166202519
1505191652;64;256;512;16;2;8;16147111
1505191652;64;1;128;16;1;4;30419556
1505191653;64;512;256;16;2;16;18446744073709551615
1505191654;8;2;8;1;2;4;535941037
1505191654;256;16;2;32;16;1;18446744073709551615
1505191654;256;4;512;2;1;1;125664000
1505191655;1;128;512;1;16;1;296427555
1505191655;32;512;32;8;16;2;40682222
1505191656;128;16;2;1;2;2;258143111
1505191656;128;32;512;16;2;8;18261926
1505191657;128;512;512;16;16;8;18446744073709551615
1505191671;1;1;4;1;1;1;13367324444
1505191671;128;512;128;16;64;8;18446744073709551615
1505191672;128;512;512;16;2;1;16885778
1505191672;128;512;512;16;2;4;13214518
1505191672;128;512;512;16;16;1;17360741
1505191673;128;512;512;16;2;128;18446744073709551615
1505191673;2;512;512;1;2;64;412678518
1505191674;128;1;512;4;1;8;85617926
1505191674;512;512;512;16;64;8;18446744073709551615
1505191675;128;512;1;16;128;1;18446744073709551615
1505191675;128;512;512;32;2;8;18446744073709551615
1505191675;128;2;512;16;2;8;23159852
1505191676;256;512;512;128;2;8;18446744073709551615
1505191676;128;512;128;16;16;8;18446744073709551615
1505191676;128;512;512;1;2;4;68975408
1505191677;8;8;4;1;2;2;262208148
1505191677;128;2;512;16;1;8;27836741
1505191678;128;512;512;16;2;64;18446744073709551615
1505191678;256;512;16;8;16;2;36279704
1505191678;128;512;16;16;2;8;25528889
1505191679;128;1;32;1;1;1;354463852
1505191680;1;512;512;1;2;8;234470815
1505191680;16;1;256;16;1;32;18446744073709551615
1505191681;512;16;4;1;2;1;430665334
1505191681;16;256;64;8;1;4;39111407
1505191686;8;1;2;4;1;2;4111554667
1505191686;128;512;512;8;2;2;16596445
1505191686;256;1;512;16;1;8;27379260
1505191687;512;512;512;16;2;8;8148592
1505191687;512;1;512;16;1;8;22744296
1505191687;512;1;512;16;1;8;22529037
1505191688;512;1;512;16;1;8;22815259
1505191688;1;512;1;1;2;1;153433185
1505191689;512;512;512;16;4;8;18446744073709551615
1505191689;256;512;512;8;2;8;17150963
1505191689;512;1;512;32;1;8;16478814
1505191690;512;512;512;16;2;16;18446744073709551615
1505191690;1;512;1;1;2;1;153510370
1505191691;512;512;512;8;2;8;11497629
1505191691;512;512;128;16;2;8;15438666
1505191691;512;512;512;32;2;16;18446744073709551615
1505191692;512;512;256;16;1;8;16037185
1505191692;256;512;128;64;2;8;18446744073709551615
1505191692;256;256;256;16;2;8;22238370
1505191693;512;512;256;16;2;8;14704148
1505191693;256;512;512;32;8;4;18446744073709551615
1505191693;512;512;1;16;2;1;36854222
1505191694;256;512;512;16;2;8;11421778
1505191694;512;512;512;8;4;8;12803852
1505191694;512;256;1;16;2;1;28460741
1505191695;512;512;512;16;1;8;9946815
1505191695;512;512;1;16;2;1;23276297
1505191696;1;512;512;1;1;8;184505037
1505191696;512;512;512;32;2;8;18446744073709551615
1505191696;512;128;1;16;1;1;42912889
1505191697;1;512;512;1;2;2;92667852
1505191697;512;256;128;16;2;8;18582074
1505191698;512;1;512;64;1;8;18446744073709551615
1505191698;1;512;128;1;2;8;226536148
1505191698;512;256;512;16;1;8;12085482
1505191699;128;512;32;4;32;2;68263852
1505191699;512;512;512;16;16;8;18446744073709551615
1505191700;512;512;512;16;2;2;14242815
1505191700;128;256;128;1;1;2;152308297
1505191700;512;512;256;16;2;16;18446744073709551615
1505191701;512;512;512;2;2;8;49781333
1505191702;1;512;512;1;2;8;231076889
1505191702;128;256;64;4;4;2;58646815
1505191703;16;16;512;16;2;8;21437778
1505191703;512;512;512;8;2;256;18446744073709551615
1505191703;512;512;512;1;2;1;164106814
1505191711;1;1;8;1;1;1;6662114963
1505191711;16;64;1;2;2;1;89387852
1505191712;4;4;8;4;2;1;455836149
1505191716;4;1;4;1;1;2;3518540296
1505191716;512;1;512;16;1;4;22932296
1505191716;512;512;1;16;2;1;23019703
1505191717;512;512;16;2;16;2;140576889
1505191717;512;512;1;16;2;1;23072593
1505191718;512;512;2;16;2;2;23741037
1505191718;8;512;128;1;16;2;268045185
1505191719;512;512;512;16;2;4;8594963
1505191719;256;512;32;4;16;2;73299556
1505191719;512;4;512;16;2;8;19832148
1505191720;512;512;512;1;2;8;59505186
1505191720;512;512;512;4;2;16;23897777
1505191720;128;128;512;8;2;128;18446744073709551615
1505191721;256;256;1;32;8;1;17664000
1505191721;512;128;1;8;16;1;46589630
1505191722;64;2;64;2;1;64;122440741
1505191722;32;128;32;16;4;2;23380889
1505191722;512;64;512;16;2;4;17323260
1505191723;512;512;512;2;8;4;56202074
1505191723;512;128;512;16;2;32;18446744073709551615
1505191724;8;32;32;4;1;2;52150814
1505191724;512;512;512;32;4;8;18446744073709551615
1505191724;512;512;512;64;2;8;18446744073709551615
1505191725;32;512;32;32;2;2;17716889
1505191725;512;512;16;16;2;8;25806667
1505191725;8;512;512;1;256;16;18446744073709551615
1505191726;8;512;32;8;1;2;32583556
1505191726;512;512;512;16;2;32;18446744073709551615
1505191727;1;512;512;1;2;8;244720741
1505191727;1;512;512;1;1;8;186848000
1505191735;1;1;8;1;1;2;6770206518
1505191735;1;512;4;1;2;2;82516000
1505191736;4;1;512;1;1;1;215665333
1505191740;4;2;2;2;2;1;3550503852
1505191740;16;512;32;1;1;2;233744148
1505191741;2;1;512;1;1;8;171157037
1505191741;128;512;32;8;16;2;37422963
1505191742;256;512;512;16;4;16;18446744073709551615
1505191742;64;512;2;32;8;2;18446744073709551615
1505191742;512;512;32;8;2;8;46951556
1505191743;32;512;512;16;2;64;18446744073709551615
1505191743;512;512;128;16;8;1;19145630
1505191743;256;1;256;16;1;16;26306815
1505191744;256;2;8;32;2;1;26072000
1505191744;256;1;128;1;1;16;305865185
1505191745;128;1;256;64;1;4;17089185
1505191745;64;512;64;8;8;2;40232000
1505191746;512;512;256;32;4;8;18446744073709551615
1505191746;1;512;256;1;2;16;339016000
1505191747;256;512;2;4;2;2;82758815
1505191747;512;512;512;1;2;8;59794074
1505191747;64;512;16;4;2;8;74722518
1505191748;512;128;512;16;2;8;15426518
1505191749;16;1;8;1;1;2;586622814
1505191749;512;512;512;4;2;8;25644296
1505191749;256;512;512;16;4;4;10776296
1505191750;128;512;64;8;8;2;38693037
1505191750;512;512;512;1;32;8;149111704
1505191751;512;512;1;16;1;1;30427704
1505191751;256;512;32;8;2;2;33584592
1505191752;128;128;1;2;1;1;308906222
1505191752;1;8;32;1;2;1;251887555
1505191759;2;1;4;1;1;1;6633312000
1505191760;128;512;32;8;4;2;33489037
1505191760;512;256;512;16;2;8;12025037
1505191761;64;512;8;8;8;2;41792889
1505191761;512;512;64;16;2;8;18310370
1505191761;128;512;512;16;256;8;18446744073709551615
1505191762;512;512;512;16;16;16;18446744073709551615
1505191762;1;1;512;1;1;16;142165038
1505191767;8;1;2;2;1;2;4103296296
1505191768;128;1;128;1;1;2;276626074
1505191768;128;128;64;2;64;16;18446744073709551615
1505191768;512;512;1;16;2;1;22757037
1505191769;512;256;128;16;4;8;18446744073709551615
1505191769;512;512;1;16;2;1;23000445
1505191769;512;512;512;32;2;2;7959852
1505191770;256;512;512;32;1;2;11312148
1505191770;256;512;512;64;2;1;12427852
1505191771;256;256;512;32;2;2;13032741
1505191771;512;512;128;32;2;2;13141481
1505191771;512;1;1;32;1;1;203192593
1505191772;512;512;512;32;4;1;9486222
1505191772;512;512;512;32;2;4;7506074
1505191772;512;512;512;32;1;2;11871555
1505191773;64;512;512;32;2;8;18446744073709551615
1505191773;1;1;512;1;1;4;147610371
1505191774;1;1;512;1;1;4;132379852
1505191774;128;256;512;32;2;4;11417185
1505191774;512;512;256;32;1;4;9393333
1505191775;512;512;512;64;2;4;18446744073709551615
1505191775;1;512;512;1;2;4;112600149
1505191776;1;512;512;1;1;8;158214222
1505191776;512;256;128;32;2;4;13160889
1505191776;128;1;256;32;1;4;18413778
1505191777;512;512;1;32;2;1;17136889
1505191777;512;256;512;32;2;4;9921629
1505191778;512;512;512;64;1;8;18446744073709551615
1505191778;512;512;1;32;4;1;16498371
1505191778;1;512;512;1;2;4;128373629
1505191779;256;512;512;64;2;4;18446744073709551615
1505191779;256;256;256;32;1;4;13271259
1505191779;512;512;256;32;2;4;10573482
1505191780;512;1;512;32;1;4;26772296
1505191780;512;512;512;32;1;4;7278222
1505191780;256;512;512;32;2;4;9646519
1505191781;128;512;512;128;1;4;18446744073709551615
1505191781;512;512;512;64;2;2;7896297
1505191782;1;512;512;1;1;2;140453333
1505191782;1;512;512;1;1;4;103294074
1505191782;512;256;512;128;1;4;18446744073709551615
1505191783;256;1;512;32;1;4;18430371
1505191783;512;256;512;8;1;8;17023111
1505191783;256;512;512;32;1;4;9268000
1505191784;512;512;128;32;1;4;11794223
1505191784;512;256;512;32;1;4;9629926
1505191784;512;512;512;32;1;8;8237926
1505191785;256;512;512;8;1;4;13512445
1505191785;1;512;256;1;1;4;104056445
1505191786;512;1;256;32;1;4;16887259
1505191786;512;512;512;16;1;4;14738963
1505191787;1;64;512;1;1;8;218626518
1505191787;512;512;512;32;1;16;18446744073709551615
1505191787;512;512;1;16;1;1;30244593
1505191788;128;256;512;16;1;4;17301926
1505191788;512;512;512;64;1;2;7383704
1505191788;512;256;1;32;2;1;17943852
1505191789;512;1;512;32;1;4;16502963
1505191789;1;512;64;1;1;4;125854962
1505191790;256;256;256;32;1;2;14505777
1505191790;512;1;512;64;1;4;15806074
1505191790;1;512;256;1;1;2;139852741
1505191791;1;512;512;1;1;4;106770815
1505191791;512;256;1;32;1;1;21665630
1505191792;1;512;512;1;1;4;112318963
1505191792;1;512;512;1;2;4;138751555
1505191792;512;512;1;32;1;1;29818963
1505191793;512;512;256;32;1;2;11544297
1505191793;512;512;1;32;1;1;18379852
1505191794;512;256;256;32;1;4;11820741
1505191794;64;512;1;32;1;1;21456593
1505191794;512;512;256;16;1;4;11606074
1505191795;512;64;512;32;1;4;14011851
1505191795;512;1;256;16;1;4;22572740
1505191795;128;1;512;32;1;4;18903852
1505191796;256;1;512;16;1;4;27344740
1505191796;256;1;512;32;1;4;18462667
1505191796;512;512;512;32;4;4;18446744073709551615
1505191797;512;512;512;64;1;4;6935852
1505191798;256;512;512;64;1;4;8147407
1505191798;64;512;512;64;1;2;11250222
1505191798;256;512;1;64;1;1;18967111
1505191799;1;512;512;1;1;2;153178666
1505191799;512;512;1;64;1;1;17826518
1505191800;1;512;512;1;1;16;300380741
1505191800;128;512;512;64;1;4;10060593
1505191801;1;512;128;1;1;4;109558667
1505191801;1;512;256;1;2;16;333809926
1505191854;1;1;1;1;1;1;52605902815
1505191855;512;512;256;64;1;4;8469037
1505191855;256;256;512;64;1;4;9892296
1505191856;128;512;512;32;1;2;11672297
1505191856;512;128;512;64;2;2;10618814
1505191856;256;512;512;8;1;1;26292148
1505191857;256;512;1;64;1;1;19029926
1505191857;512;512;512;128;1;4;18446744073709551615
1505191857;512;512;1;32;2;1;17115852
1505191858;512;512;32;64;1;4;13414519
1505191858;256;512;512;64;1;8;18446744073709551615
1505191858;512;512;512;128;1;1;9363852
1505191859;256;512;128;32;1;4;13794518
1505191859;1;512;512;1;1;4;103966667
1505191860;256;512;512;128;1;4;18446744073709551615
1505191860;512;256;512;16;1;2;14981630
1505191860;512;128;512;64;1;4;14453926
1505191861;512;512;1;64;1;1;22586518
1505191861;512;256;512;64;1;4;14054815
1505191861;512;1;512;64;1;4;21626667
1505191862;1;1;512;1;1;4;146862814
1505191862;512;1;512;64;1;2;16522519
1505191863;512;512;512;64;4;4;18446744073709551615
1505191863;512;512;1;64;2;1;16850963
1505191863;512;512;512;256;1;4;18446744073709551615
1505191864;512;512;512;128;4;4;18446744073709551615
1505191864;256;512;256;16;1;4;15179703
1505191864;512;1;512;128;1;4;18446744073709551615
1505191865;512;256;128;64;1;4;12073482
1505191865;512;512;256;64;1;2;9561778
1505191865;512;1;512;64;1;16;18446744073709551615
1505191866;512;512;1;64;2;1;16736741
1505191866;512;512;256;128;1;4;18446744073709551615
1505191866;256;1;256;128;1;2;17044592
1505191867;1;512;512;1;1;8;164072296
1505191867;512;1;1;64;1;1;207739704
1505191868;512;512;1;128;1;1;23388741
1505191868;1;512;256;1;4;1;120910222
1505191869;1;512;256;1;2;4;134259704
1505191869;256;1;512;64;1;4;17420889
1505191869;512;1;512;64;1;8;18446744073709551615
1505191870;128;512;512;64;2;4;18446744073709551615
1505191870;512;1;256;64;1;4;15589926
1505191871;512;512;1;64;1;1;17811408
1505191871;256;512;256;64;1;8;18446744073709551615
1505191871;512;256;64;32;1;16;18446744073709551615
1505191872;512;512;64;64;2;16;18446744073709551615
1505191872;512;512;256;64;2;4;18446744073709551615
1505191872;256;512;1;256;1;1;16695852
1505191873;512;512;512;64;2;1;9713482
1505191873;1;1;512;1;1;4;131863703
1505191873;512;128;512;32;1;4;11854222
1505191874;512;512;512;64;1;16;18446744073709551615
1505191874;512;512;256;64;1;8;18446744073709551615
1505191874;512;512;1;64;1;1;22528889
1505191875;512;512;1;64;4;1;21491851
1505191875;512;512;256;64;1;16;18446744073709551615
1505191876;256;1;256;64;1;8;18446744073709551615
1505191876;128;512;256;128;1;4;18446744073709551615
1505191876;512;512;512;64;4;8;18446744073709551615
1505191877;512;1;512;256;1;4;18446744073709551615
1505191877;512;512;512;8;1;4;18438074
1505191877;512;512;512;128;2;4;18446744073709551615
1505191878;512;512;256;32;4;4;18446744073709551615
1505191878;512;256;512;32;2;8;18446744073709551615
1505191878;512;256;256;64;1;8;18446744073709551615
1505191879;512;256;256;64;1;4;14508889
1505191879;1;512;256;1;1;4;111648148
1505191880;512;512;1;64;2;1;17024444
1505191880;512;256;64;64;1;4;13209926
1505191880;512;1;512;32;1;8;16376296
1505191881;512;1;512;64;1;16;18446744073709551615
1505191881;512;512;512;128;1;32;18446744073709551615
1505191881;1;512;128;1;1;4;112744593
1505191882;128;512;1;64;1;1;18434519
1505191882;512;512;512;16;1;2;10446370
1505191882;512;1;512;128;1;8;18446744073709551615
1505191883;512;256;1;64;8;1;18446744073709551615
1505191883;64;512;512;32;1;4;12472888
1505191884;512;256;1;64;1;1;20396444
1505191884;128;256;512;64;1;4;11453926
1505191884;512;512;256;64;4;4;18446744073709551615
1505191885;1;512;1;1;1;1;238803111
1505191886;512;512;512;64;2;16;18446744073709551615
1505191887;1;1;128;1;1;4;461648889
1505191887;512;256;512;64;1;8;18446744073709551615
1505191887;512;512;512;32;1;1;10866222
1505191888;128;256;512;64;2;8;18446744073709551615
1505191888;256;128;512;64;1;2;13764296
1505191888;512;512;512;64;1;1;10735260
1505191889;256;1;512;64;1;8;18446744073709551615
1505191889;256;512;256;64;1;2;11836148
1505191889;512;256;1;64;1;1;20939407
1505191890;256;512;256;64;1;4;8902371
1505191890;1;256;512;1;2;4;136547407
1505191891;1;512;512;1;1;8;181245482
1505191891;128;512;512;8;1;4;16446519
1505191892;512;512;128;64;1;2;11905482
1505191892;512;128;512;64;1;16;18446744073709551615
1505191946;1;1;1;1;1;1;53120101778
1505191946;256;16;4;32;16;1;18446744073709551615
1505191947;1;128;512;1;1;1;208527259
1505191948;1;128;1;1;1;1;497328444
1505191948;256;128;512;64;1;4;11146963
1505191948;512;512;512;1;4;4;53082370
1505191949;128;1;512;64;1;8;18446744073709551615
1505191949;16;8;256;1;2;32;368512149
1505191950;512;16;1;1;2;1;480810223
1505191951;16;512;64;8;1;4;36587851
1505191955;8;1;2;4;1;2;4158340000
1505191955;512;512;512;64;64;4;18446744073709551615
1505191956;512;512;512;64;256;4;18446744073709551615
1505191956;512;512;512;64;1;32;18446744073709551615
1505191956;512;256;512;64;32;4;18446744073709551615
1505191957;4;512;512;1;1;4;85333037
1505191957;512;512;256;8;1;1;26889481
1505191958;512;512;512;64;1;1;10662519
1505191958;2;64;1;1;2;1;443597333
1505191959;128;4;8;4;4;2;23816296
1505191959;4;16;16;1;16;1;99128296
1505191960;128;128;512;8;32;128;18446744073709551615
1505191960;128;512;512;16;1;4;15046963
1505191960;512;512;256;64;2;16;18446744073709551615
1505191961;128;512;512;64;4;4;18446744073709551615
1505191961;4;512;512;1;2;4;122710963
1505191961;512;512;1;64;128;1;18446744073709551615
1505191962;512;256;1;32;8;1;17512741
1505191962;512;128;128;8;16;4;18446744073709551615
1505191963;64;2;64;2;1;64;122772889
1505191963;1;32;32;1;16;2;85058815
1505191963;512;512;512;4;1;4;23217333
1505191964;2;512;512;1;1;4;96352148
1505191964;512;512;64;64;4;2;18446744073709551615
1505191965;512;512;1;8;1;1;61704592
1505191979;1;1;4;1;1;2;13495368740
1505191979;256;1;512;8;1;16;45485333
1505191980;512;512;8;64;1;4;15071704
1505191980;512;512;512;64;128;4;18446744073709551615
1505191984;4;2;2;1;1;1;3466187408
1505191984;256;4;256;128;4;4;18446744073709551615
1505191985;256;2;8;32;2;2;26401037
1505191985;256;256;64;1;1;16;395508296
1505191986;512;512;64;64;1;8;18446744073709551615
1505191986;512;256;512;64;256;4;18446744073709551615
1505191987;32;512;1;1;1;1;391446963
1505191987;64;1;256;64;1;4;15455259
1505191987;512;2;512;64;1;4;15850666
1505191989;1;128;1;1;64;1;1315681926
1505191990;1;8;256;1;2;1;147958519
1505191991;2;1;32;2;1;8;954796296
1505191992;1;1;128;1;1;1;490857333
1505191992;512;512;512;8;2;4;13520593
1505191992;256;512;256;128;1;4;18446744073709551615
1505191993;512;1;1;128;1;1;211476000
1505191993;512;512;512;1;1;4;81145926
1505191994;32;512;512;8;1;4;26481777
1505191994;512;512;2;64;1;1;17668445
1505191996;8;1;8;2;1;2;1015311111
1505191996;128;1;8;1;1;2;260940000
1505191997;128;2;64;2;1;16;165913630
1505191998;8;1;8;2;1;4;1036360000
1505191999;1;512;256;1;1;8;194614815
1505191999;512;512;256;128;1;8;18446744073709551615
1505191999;64;512;1;32;1;1;21452741
1505192000;512;512;1;64;1;1;17941185
1505192000;2;512;512;1;8;4;268325037
1505192001;512;128;512;64;16;4;18446744073709551615
1505192001;256;16;2;32;16;1;18446744073709551615
1505192001;64;4;256;4;1;1;91943111
1505192055;1;1;1;1;1;1;52605957778
1505192055;16;512;2;4;32;2;74483555
1505192056;512;512;512;128;1;8;18446744073709551615
1505192056;1;512;512;1;1;16;309492296
1505192057;512;1;512;16;1;4;22807704
1505192057;256;512;256;32;2;8;18446744073709551615
1505192057;1;512;32;1;1;4;132128740
1505192058;512;512;512;64;1;64;18446744073709551615
1505192058;32;512;512;1;1;4;75557481
1505192059;512;4;512;64;1;256;18446744073709551615
1505192059;128;512;1;64;1;1;18415259
1505192060;512;16;4;1;1;1;749538963
1505192060;16;512;64;8;1;64;18446744073709551615
1505192065;8;1;2;4;1;2;4162454815
1505192065;64;64;128;4;2;8;75283556
1505192066;512;512;512;64;1;4;6957037
1505192066;1;512;512;1;1;4;100977778
1505192066;512;4;512;64;1;4;16147852
1505192067;128;4;32;2;4;8;117709186
1505192067;4;64;16;1;4;2;131966370
1505192068;128;1;512;64;1;128;18446744073709551615
1505192068;512;256;1;32;8;1;17472000
1505192068;512;512;128;64;1;4;9794519
1505192069;512;32;512;64;2;4;18446744073709551615
1505192069;512;128;512;64;1;8;18446744073709551615
1505192070;1;128;1;1;16;1;548430518
1505192071;64;2;64;1;2;64;202084593
1505192071;1;512;32;1;1;2;153782963
1505192072;1;512;128;1;2;128;493075704
1505192072;256;512;256;128;1;8;18446744073709551615
1505192073;512;128;512;128;4;4;18446744073709551615
1505192073;1;512;256;1;1;2;139597481
1505192073;512;1;256;64;1;2;17745630
1505192074;256;128;512;256;1;4;18446744073709551615
1505192074;1;256;512;1;1;4;105065629
1505192075;256;512;512;64;1;1;11572593
1505192075;512;512;512;1;1;4;83901037
1505192076;128;512;256;64;2;2;11672445
1505192076;512;512;128;64;2;4;18446744073709551615
1505192076;512;512;256;256;1;4;18446744073709551615
1505192077;256;1;512;1;1;16;300501630
1505192084;4;1;2;1;1;1;7067676296
1505192085;256;32;128;1;1;16;405347555
1505192086;256;2;8;32;1;1;24166519
1505192086;512;512;64;64;256;4;18446744073709551615
1505192087;512;512;4;64;1;4;15761926
1505192087;1;1;128;1;1;16;571066815
1505192088;64;1;256;64;1;8;18446744073709551615
1505192088;2;128;1;2;1;1;252786518
1505192089;128;1;256;2;1;8;154097482
1505192089;512;512;16;1;256;4;18446744073709551615
1505192090;512;2;512;64;1;64;18446744073709551615
1505192090;256;512;512;128;1;8;18446744073709551615
1505192090;1;64;512;1;1;4;121217481
1505192092;2;1;32;2;1;8;952502815
1505192096;1;1;512;1;1;256;3599831408
1505192096;64;1;8;32;1;8;165475259
1505192097;128;1;8;1;1;2;259740000
1505192097;512;512;512;64;8;4;18446744073709551615
1505192097;512;512;512;64;2;256;18446744073709551615
1505192098;512;512;512;128;1;16;18446744073709551615
1505192098;512;256;512;64;4;4;18446744073709551615
1505192099;128;2;64;2;1;16;166192297
1505192099;8;2;8;1;2;1;504818223
1505192100;64;16;8;32;16;1;18446744073709551615
1505192100;1;4;256;1;1;1;221863704
1505192101;512;512;64;64;1;32;18446744073709551615
1505192101;512;1;64;128;1;2;14849926
1505192102;512;128;256;64;1;4;11224148
1505192102;256;256;512;32;1;4;11790667
1505192102;512;64;512;64;1;4;15836000
1505192103;256;512;64;64;1;2;18589185
1505192103;512;64;512;64;2;4;18446744073709551615
1505192103;512;1;512;128;1;4;18446744073709551615
1505192104;1;256;512;1;1;4;110434370
1505192104;512;128;512;64;4;4;18446744073709551615
1505192104;512;512;64;64;1;4;12218371
1505192105;1;512;64;1;1;8;224448148
1505192105;512;1;512;64;1;2;16878074
1505192106;512;512;512;64;4;2;18446744073709551615
1505192106;512;512;512;256;1;1;9317482
1505192106;128;512;1;64;1;1;18406814
1505192107;1;512;512;1;2;4;115508296
1505192107;256;512;512;128;2;4;18446744073709551615
1505192108;256;1;512;64;1;16;18446744073709551615
1505192108;128;512;512;64;1;8;18446744073709551615
1505192108;512;256;512;64;2;4;18446744073709551615
1505192109;256;512;128;64;1;4;10222519
1505192109;512;1;512;256;1;8;18446744073709551615
1505192109;512;256;512;32;1;8;9741778
1505192110;256;256;256;64;1;4;11735111
1505192110;256;256;512;64;1;2;14286222
1505192110;512;512;512;16;1;16;14036296
1505192111;512;256;512;64;1;2;13118370
1505192111;1;128;512;1;1;4;118471704
1505192112;1;1;512;1;1;4;135252889
1505192112;512;512;1;32;1;1;18263852
1505192113;512;512;512;128;1;2;7706223
1505192113;512;256;256;128;2;4;18446744073709551615
1505192114;1;512;512;1;4;4;221918519
1505192114;128;512;256;64;1;8;18446744073709551615
1505192114;128;512;512;32;1;4;11224297
1505192115;256;512;512;128;4;4;18446744073709551615
1505192115;256;512;128;64;1;2;13462370
1505192115;64;256;256;64;1;4;13184296
1505192116;256;512;512;64;4;4;18446744073709551615
1505192116;512;128;512;64;1;2;11976593
1505192117;1;512;512;1;1;1;208627407
1505192118;1;256;256;1;1;2;152586074
1505192118;256;1;512;64;1;4;17409037
1505192118;1;512;1;1;1;1;238363852
1505192119;512;512;1;64;1;1;17831111
1505192119;128;128;512;64;1;8;18446744073709551615
1505192120;512;512;1;32;1;1;18200445
1505192120;256;512;256;32;1;4;11745185
1505192121;1;512;256;1;4;4;209924000
1505192121;128;128;512;64;1;4;12500741
1505192121;512;128;512;64;2;4;18446744073709551615
1505192122;256;512;64;64;1;4;12551260
1505192122;1;1;512;1;1;8;126142370
1505192122;512;512;256;128;1;1;12208741
1505192123;128;512;128;64;2;4;18446744073709551615
1505192123;1;1;512;1;1;4;134222222
1505192124;512;1;256;64;1;4;21472000
1505192124;512;256;1;128;1;1;25196000
1505192124;512;128;256;32;1;4;14299112
1505192125;512;512;1;128;1;1;17498074
1505192125;512;1;1;32;1;1;204619704
1505192126;64;512;512;64;1;4;10445629
1505192126;256;512;512;64;1;2;9484297
1505192126;512;1;512;128;1;2;16079260
1505192127;1;1;256;1;1;8;231964740
1505192127;512;512;128;256;1;2;18446744073709551615
1505192128;512;256;1;64;1;1;20826815
1505192128;1;512;512;1;2;2;92589482
1505192129;512;128;1;64;1;1;21708889
1505192129;512;512;512;32;2;1;11991852
1505192130;1;512;256;1;8;4;313732000
1505192130;128;512;1;32;1;1;21266963
1505192130;512;512;1;256;1;1;22547408
1505192131;512;512;128;32;2;4;12907260
1505192131;512;256;512;64;1;16;18446744073709551615
1505192132;512;1;256;32;1;4;27516741
1505192132;512;512;64;64;1;2;13720297
1505192132;128;512;256;32;1;4;12616148
1505192133;128;1;512;64;1;4;17229185
1505192133;512;1;256;64;1;2;17566518
1505192133;128;512;512;64;2;16;18446744073709551615
1505192134;512;512;256;32;1;16;18446744073709551615
1505192134;1;256;512;1;1;2;139553778
1505192135;256;512;1;32;1;1;21307556
1505192135;512;1;128;32;1;4;16658519
1505192135;256;512;1;32;1;1;21222074
1505192136;1;256;512;1;1;4;110177777
1505192136;1;128;512;1;1;4;117060000
1505192137;1;512;256;1;1;16;325780889
1505192137;1;512;512;1;1;4;104801185
1505192138;1;512;1;1;1;1;251429185
1505192138;512;512;512;256;4;1;18446744073709551615
1505192139;256;1;512;32;1;2;18194963
1505192139;512;256;512;256;1;8;18446744073709551615
1505192193;1;1;1;1;1;1;53074202963
1505192194;1;2;512;1;1;4;112113482
1505192194;1;1;512;1;1;1;230333630
1505192195;1;128;128;1;32;32;18446744073709551615
1505192195;512;16;4;1;8;4;431500297
1505192196;16;512;8;8;1;2;42702519
1505192200;8;1;2;4;1;1;4037852444
1505192200;256;512;128;1;256;8;18446744073709551615
1505192215;1;4;1;1;2;1;13888684296
1505192216;4;1;16;1;1;8;969143111
1505192216;512;2;512;64;2;4;18446744073709551615
1505192217;1;512;512;1;64;16;18446744073709551615
1505192217;512;512;16;64;1;8;18446744073709551615
1505192217;128;128;512;8;8;128;18446744073709551615
1505192218;8;256;1;2;8;1;61818666
1505192218;512;128;1;8;64;1;18446744073709551615
1505192226;4;2;1;4;1;1;7165780000
1505192226;512;512;128;64;128;4;18446744073709551615
1505192227;512;1;512;64;1;4;15667408
1505192227;8;512;512;4;1;4;33324148
1505192228;8;512;512;1;1;2;138374370
1505192228;1;1;512;1;1;4;132034371
1505192228;512;512;2;64;1;1;17685630
1505192229;16;512;512;2;1;4;47154814
1505192229;512;512;512;2;1;4;52984296
1505192230;32;512;64;1;1;4;208510370
1505192230;512;4;512;64;1;4;16039556
1505192231;512;16;512;64;1;4;13827407
1505192231;512;1;4;64;1;4;49233481
1505192231;1;512;4;1;1;1;230550519
1505192232;8;256;512;4;1;4;37512296
1505192232;1;32;32;1;16;2;85742223
1505192233;64;512;512;8;32;128;18446744073709551615
1505192233;256;1;512;1;1;16;292622074
1505192234;64;2;2;8;1;1;324366222
1505192234;64;512;8;64;1;1;17652592
1505192235;256;1;256;16;1;1;29014371
1505192235;256;2;4;4;1;4;50328592
1505192236;256;1;128;1;1;16;307027259
1505192236;64;1;256;4;1;128;18446744073709551615
1505192236;512;1;512;64;1;1;17865778
1505192237;512;64;256;64;1;4;12970666
1505192237;256;512;256;64;2;2;10176741
1505192238;512;256;1;128;1;1;18754815
1505192238;256;1;1;64;1;1;385350963
1505192239;512;256;512;64;4;2;18446744073709551615
1505192239;1;512;512;1;1;1;208626814
1505192240;64;256;256;64;1;8;18446744073709551615
1505192240;512;256;512;16;1;4;11576741
1505192240;128;512;1;64;1;1;18245185
1505192241;1;256;1;1;1;1;280974963
1505192242;512;512;512;32;1;32;18446744073709551615
1505192242;1;128;1;1;1;1;502852741
1505192243;1;128;256;1;1;4;117455556
1505192243;1;512;512;1;4;4;226492148
1505192244;128;1;1;64;1;1;700937037
1505192245;256;1;512;128;1;2;17303259
1505192245;512;512;32;32;1;4;16520148
1505192246;128;512;256;32;1;8;11112296
1505192246;512;512;256;64;1;1;12082074
1505192246;512;256;512;64;1;1;12137037
1505192247;256;256;512;1;1;4;74606519
1505192247;1;256;512;1;1;4;107119407
1505192248;1;128;1;1;1;1;500382519
1505192248;128;256;1;64;1;1;18261185
1505192249;512;256;512;128;1;8;18446744073709551615
1505192249;512;1;64;64;1;4;14735704
1505192250;512;1;1;64;1;1;205053482
1505192250;512;1;512;64;1;4;15718963
1505192251;512;512;1;128;2;1;18985482
1505192251;512;512;1;64;2;1;16972444
1505192251;512;256;1;16;1;1;39320592
1505192252;512;512;128;32;1;8;11873037
1505192252;1;512;512;1;1;16;298042518
1505192253;256;1;512;64;1;2;19213926
1505192253;512;1;1;32;1;1;204092593
1505192254;512;512;128;64;4;4;18446744073709551615
1505192255;1;128;1;1;64;1;1348848296
1505192256;1;8;256;1;2;1;144955556
1505192263;2;1;4;2;1;1;6671980593
1505192264;1;1;512;1;1;16;142212148
1505192264;1;128;512;1;1;2;139765185
1505192265;1;1;512;1;1;8;125852148
1505192265;512;512;512;64;4;16;18446744073709551615
1505192266;512;512;128;256;1;8;18446744073709551615
1505192266;128;1;512;64;1;4;17333630
1505192266;256;512;512;32;1;8;9483259
1505192267;512;512;256;64;2;8;18446744073709551615
1505192267;512;1;1;256;1;1;203126814
1505192268;512;256;256;128;2;16;18446744073709551615
1505192268;512;256;256;64;4;4;18446744073709551615
1505192268;256;1;256;64;1;4;17421037
1505192276;1;1;8;1;1;8;7152293482
1505192276;128;1;8;1;1;2;266188000
1505192277;32;2;64;8;1;16;36056741
1505192277;32;1;8;1;1;1;324559112
1505192278;512;128;512;256;1;4;18446744073709551615
1505192278;512;512;64;128;2;2;18446744073709551615
1505192279;128;16;2;8;16;1;30504000
1505192279;1;4;256;1;4;1;87737481
1505192279;64;1;512;16;1;1;33340444
1505192280;1;512;2;1;32;2;176296592
1505192280;2;512;512;1;1;8;146769481
1505192281;16;512;2;2;1;2;159472000
1505192281;512;1;512;16;1;8;22707259
1505192282;256;256;512;128;2;4;18446744073709551615
1505192282;64;512;256;64;1;4;16087555
1505192283;512;1;256;128;1;4;18446744073709551615
1505192283;512;16;32;1;2;8;360940148
1505192284;1;512;64;1;1;4;123274667
1505192284;128;1;2;32;1;1;339739408
1505192285;64;64;1;4;4;1;46151111
1505192285;64;512;512;16;1;4;17480000
1505192286;64;512;512;64;2;4;18446744073709551615
1505192286;128;256;8;64;32;2;18446744073709551615
1505192287;4;16;2;1;16;1;551818223
1505192287;128;128;1;8;2;1;52020889
1505192288;1;256;1;1;8;1;226505925
1505192288;512;32;512;64;1;4;13387111
1505192289;1;512;512;1;4;1;105461481
1505192289;512;1;1;8;1;1;207554222
1505192290;64;2;64;2;2;64;99741925
1505192290;1;32;32;1;16;1;87549926
1505192291;1;512;1;1;2;1;149741630
1505192291;512;1;512;32;1;2;29742222
1505192291;256;1;512;8;1;1;50950814
1505192292;64;1;2;8;1;1;642074222
1505192293;256;1;256;32;1;16;18446744073709551615
1505192294;64;2;32;1;1;4;262346075
1505192294;16;1;128;16;1;16;45776889
1505192295;64;1;16;4;1;2;81538963
1505192295;128;128;1;128;32;1;18446744073709551615
1505192349;1;1;1;1;1;1;52840308000
1505192349;64;32;32;32;8;8;18446744073709551615
1505192349;1;1;512;1;1;4;131996741
1505192350;512;512;512;256;1;2;18446744073709551615
1505192350;512;512;128;64;4;8;18446744073709551615
1505192354;2;1;8;2;1;8;3851296889
1505192355;128;1;8;1;1;2;253839408
1505192355;32;2;64;2;1;32;125291852
1505192356;32;1;256;1;1;256;385436741
1505192357;128;16;16;8;16;1;41387259
1505192357;1;512;512;1;64;4;345784148
1505192358;512;1;512;64;1;4;15850371
1505192358;512;512;512;64;32;4;18446744073709551615
1505192359;1;512;512;1;16;4;445122815
1505192359;512;512;4;64;1;2;17572000
1505192359;512;1;512;64;1;4;15692592
1505192360;512;1;512;64;1;2;16775111
1505192360;1;4;256;1;4;1;90179704
1505192361;64;32;1;32;8;1;46299259
1505192361;16;512;4;16;32;2;18446744073709551615
1505192363;1;1;32;1;1;1;1676347111
1505192363;128;512;512;64;1;1;12522667
1505192364;512;1;1;64;1;1;208516592
1505192364;512;1;128;64;1;16;18446744073709551615
1505192365;256;512;512;16;1;2;11049334
1505192365;128;512;256;64;1;4;11360741
1505192366;512;1;512;8;1;4;34268445
1505192366;16;512;16;8;1;16;46219704
