GLOBAL_SIZE_0;GLOBAL_SIZE_1;LOCAL_SIZE_0;LOCAL_SIZE_1;v_TP_358;v_TP_359;cost
32;2;2;1;91;35;1054461481
2048;128;32;128;1;91;18446744073709551615
1;1;1;1;117;182;18446744073709551615
4096;1;16;1;126;2;332062667
4096;1;32;1;126;2;525454370
2048;1;16;1;126;2;511640148
4096;1;4;1;210;9;203035111
4096;2;16;1;91;2;371485333
1;64;1;32;65;39;1466627556
32;1;16;1;35;819;18446744073709551615
2;1;2;1;1;546;46939650222
256;1024;64;128;1170;315;18446744073709551615
4096;4096;4;16;210;9;13135259
32;2048;4;1;210;9;225548296
4096;2;4;1;210;4095;18446744073709551615
4096;32;4;16;210;9;14219259
4096;512;4;16;182;13;12686223
4096;1;4;1;210;9;202674074
8192;2048;4;16;210;9;13108889
8192;4096;4;32;210;9;9385481
8192;1024;4;32;210;9;9258814
8192;4096;4;32;210;14;8965778
1;4096;1;32;210;10;87432593
8192;4096;2;32;210;1;92331852
8192;4096;4;32;210;35;11338075
8192;4096;4;32;182;9;8847111
8192;4096;4;16;210;13;13481037
1;4096;1;64;210;14;67975556
1;4096;1;32;130;9;77846074
8192;4096;4;32;182;13;9337185
4096;4096;2;32;182;30;20297926
8192;1024;4;32;182;9;9496000
1024;4096;4;32;182;9;11683111
8192;4096;4;32;195;10;8949037
8192;1024;4;64;182;13;12294962
2048;4096;4;16;182;3;27600148
8192;4096;128;32;182;9;18446744073709551615
8192;4096;2;16;182;9;27772445
8192;4;4;4;182;9;42900889
32;4096;1;32;182;9;29388296
8192;4096;4;32;182;7;12551555
8192;4096;1;32;90;5;19280889
8192;4096;4;32;117;9;8726963
8192;4096;4;16;63;15;7091111
8192;4096;4;32;90;9;8397482
8192;4096;4;32;130;26;8099407
1;2048;1;32;117;9;106906815
8192;4096;4;16;63;18;6761482
8192;4096;4;16;30;15;6276445
8192;4096;4;32;63;15;6591704
8192;8192;4;16;63;13;8296296
8192;2048;4;16;30;15;7318074
2048;4096;4;64;21;10;20009037
8192;4096;4;32;30;15;7279111
1;4096;1;8;30;15;67589481
8192;4096;4;16;35;15;7811852
8192;4096;4;32;18;15;11780592
8192;4096;2;16;30;15;10024149
8192;4096;4;8;30;15;12267555
2048;4096;4;16;30;15;6339555
8192;2048;4;32;30;2;29034814
1;8192;1;16;26;15;70625333
8192;1;2;1;105;195;18446744073709551615
4;32;1;2;1170;30;18446744073709551615
8;2048;4;1;10;117;78328148
4096;4096;1;128;10;35;37482518
8192;4096;4;32;39;15;17717185
1024;4096;2;16;30;10;21296592
1;4096;1;16;30;15;65224445
8192;4096;4;64;9;13;15762519
8192;4096;4;16;42;21;6438370
8192;4096;2;16;13;14;11727259
8192;4096;4;16;45;7;8734222
128;4096;16;16;1638;1;298745778
4096;128;2;32;546;21;18446744073709551615
8192;1024;4;16;30;15;9144148
8192;4096;4;8;30;315;18446744073709551615
256;256;64;32;63;15;18446744073709551615
8192;4096;4;256;30;126;18446744073709551615
8192;4096;1;16;30;65;25266815
8192;1;4;1;30;7;139481333
1024;1024;4;4;30;15;22439259
8192;1;4;1;30;15;115468444
8192;1024;4;16;14;5;13112889
8192;4096;4;16;30;13;6658963
8192;4096;4;16;91;15;8025630
1;2048;1;32;30;15;48194222
1;128;1;32;6;455;2546026519
8192;1;16;1;30;35;47069037
8192;2048;2;16;30;15;10606074
8192;4096;4;8;18;15;14611111
1024;4096;4;16;30;15;7458667
8192;1;8;1;91;6;107150370
8192;4096;2;4;42;15;44132741
4096;4096;4;16;21;15;8497185
8;128;8;32;35;130;133926074
8192;4096;4;256;30;15;18446744073709551615
8192;4096;4;16;30;9;8000297
1;4096;1;16;30;21;64818666
8192;4096;4;16;30;35;5798370
2048;1;4;1;45;15;137470963
4096;2048;4;16;30;42;5672741
4096;512;8;8;30;45;6609333
4096;2048;4;32;42;42;6478963
2048;2048;2;8;30;45;20080445
4096;512;4;16;30;39;5814370
4096;1024;4;16;30;42;5758815
4096;2048;4;16;30;63;6962815
4096;2048;8;16;30;42;5343260
2048;2048;4;16;18;42;7777926
8192;2048;8;16;15;42;6765482
4096;2048;8;32;30;26;13619704
2048;1024;8;16;30;42;11111111
2048;2048;8;16;30;26;13045185
4096;2048;8;16;70;42;14276888
1024;512;8;16;30;42;11895407
4096;2048;8;16;15;63;11171111
8192;2048;8;16;30;42;11045037
8192;2048;8;4;18;18;27101333
2048;2048;8;16;39;42;5896000
4096;1024;8;16;9;21;13223555
4096;4096;8;16;30;30;5871408
2048;2048;8;16;30;42;5226815
8192;2048;8;16;26;39;6269481
4096;2048;8;16;30;126;6779556
4096;2048;16;16;15;42;7754963
2048;4096;16;16;30;70;5950074
2048;1024;2;16;18;42;13743852
2048;8192;8;16;30;42;5457037
2048;2048;16;16;30;42;6744741
2048;2048;4;16;30;42;5485926
2048;4096;8;16;30;63;5635555
2048;2048;8;16;30;39;5412444
2048;2048;8;64;30;42;18446744073709551615
512;2048;4;16;117;42;12952741
256;2048;8;16;15;70;5883704
2048;2048;8;8;30;42;5840148
2048;512;8;16;26;39;6285926
2048;4096;8;16;30;39;5456889
2048;2048;8;32;30;7;13107407
2048;2048;4;16;26;42;6074666
512;2048;8;16;30;42;5410963
2048;2048;8;8;65;42;10560444
2048;2048;8;16;30;18;8555111
4096;4096;2;4;21;42;36716444
2048;2048;8;16;26;42;12670666
128;2048;8;16;30;42;12765925
2048;2048;8;8;26;42;13381481
8192;8192;8;16;30;42;12939111
1024;2048;8;16;30;42;11194371
2048;2048;8;2;30;42;34642518
2048;1;8;1;30;42;71331111
2048;2048;8;16;30;15;8921186
1024;1024;8;4;30;78;15869925
1024;2048;8;4;18;42;10783703
2048;512;16;16;39;42;7897777
256;2048;8;16;30;42;5729926
2048;4096;8;16;30;70;5633778
2048;1024;8;16;35;42;6682074
1;4096;1;16;30;42;54153037
4096;2048;8;16;39;42;6013333
4096;2048;8;8;30;18;7350963
512;2048;32;16;30;65;18446744073709551615
2048;2048;32;4;30;42;9793926
2048;2048;8;16;63;42;6761926
2048;4096;1;16;65;63;51498667
2048;2048;8;16;30;63;5677926
2048;2048;8;32;21;42;6384741
2048;1;4;1;13;78;224433778
2048;2048;8;16;30;65;5583555
2048;2048;4;64;30;42;7151555
2048;2048;8;16;39;90;7587407
2048;2048;4;4;30;42;19775408
2048;2048;8;16;45;42;6068296
1;2;1;2;1;1;224255504889
16;8192;4;256;5;9;18446744073709551615
256;4096;1;4;30;15;65210815
4096;4096;1;16;1;546;357330371
2048;2048;8;16;42;39;6037333
1;2048;1;16;30;90;53635556
2048;4096;8;32;30;42;5339259
4096;1024;8;32;30;42;6441037
2048;2048;8;16;70;13;8405630
8192;2048;8;16;42;42;5931407
2048;512;8;16;30;182;10408593
8;16;1;8;21;18;596462815
2048;2048;8;16;10;42;9134371
1024;1024;8;16;30;42;5497778
2048;2048;32;8;30;91;6340296
2048;2048;8;16;35;42;6573481
2048;2048;8;16;30;21;7361778
2048;2048;8;16;90;42;6913037
4;1;2;1;126;1;65133144296
2048;1024;8;16;21;63;6027259
2048;8192;8;32;30;42;5290370
1024;8192;8;16;30;35;6221037
2048;2048;8;32;30;42;5654222
2048;2048;1;1;30;42;268539556
2048;2048;8;256;30;182;18446744073709551615
2048;1024;8;16;30;63;5745926
1024;2048;8;16;35;78;7524593
4096;2048;8;16;5;42;12277630
8;1024;4;32;90;15;21219407
1;4096;1;16;315;455;18446744073709551615
1024;32;2;32;42;1365;18446744073709551615
1;1;1;1;21;455;18446744073709551615
2048;512;8;16;39;42;6030666
1024;2048;8;8;14;42;5555556
4096;2048;2;16;18;42;13951407
2048;2048;8;16;30;45;5325630
2048;4096;8;16;30;42;5253926
2048;2048;8;16;42;42;5818074
2048;2048;8;8;63;35;9472889
1024;1;32;1;1;1;7273201185
2048;2048;16;32;30;13;18446744073709551615
2048;8192;8;16;70;42;7307259
2048;4096;4;8;30;42;10278370
512;2048;8;16;10;91;7231408
128;16;32;8;315;13;184833185
2048;2048;8;16;30;91;6391852
2048;2048;16;128;30;42;18446744073709551615
2048;512;4;16;30;42;6262815
2048;2048;4;32;18;26;9913334
1;64;1;2;7;182;1164265333
2;1024;1;4;1;126;271467556
32;4;8;2;3;1365;1082499407
64;1024;4;32;2;39;52461482
1;64;1;4;390;2;2634886963
2048;2048;4;16;30;90;9083851
2048;2048;8;16;14;42;6474074
2048;2048;8;16;21;42;6324593
8;64;8;32;90;30;199623851
8192;2048;4;16;78;42;9778667
2048;256;8;16;30;21;7548148
2048;2048;2;4;30;42;35267556
2048;512;8;16;30;42;5580889
2048;2048;8;8;15;42;5621777
1024;8192;8;16;35;63;6681926
2048;2048;8;16;30;117;6632297
512;1024;128;64;1;13;18446744073709551615
2048;2048;8;16;1638;42;18446744073709551615
2048;16;8;16;30;42;9794074
2048;2048;8;1;78;42;82833925
2048;256;8;16;30;42;5883112
16;32;1;16;45;18;143944000
1024;8192;8;8;26;42;6776000
2048;2048;8;16;18;42;7297185
32;1;32;1;63;315;18446744073709551615
256;1024;1;256;39;42;23276296
16;8;4;2;2730;630;18446744073709551615
2048;2;1;2;7;1;368938370
1;1;1;1;91;130;18446744073709551615
2048;2048;16;16;21;42;8266074
2048;1024;8;16;30;195;10514074
2048;2048;8;16;6;42;20311556
2048;2048;8;16;91;30;15421926
2048;2048;8;16;30;35;12715704
2048;2048;8;16;130;42;22096000
512;8;32;1;117;9;146586963
2048;2048;8;32;18;42;7436889
8192;4096;8;16;42;42;6045333
2048;2048;16;32;42;42;18446744073709551615
2;1;2;1;1;273;47072553482
2048;2048;8;8;30;15;7472148
2048;2048;8;32;15;65;5601482
64;512;32;16;390;9;18446744073709551615
2048;1024;8;32;30;65;5620593
16;8192;8;1;91;273;18446744073709551615
1;32;1;32;1638;1;6548504297
1;256;1;2;10;2730;18446744073709551615
4096;32;1;8;117;13;46187408
8;512;8;32;63;63;27342518
16;128;2;32;70;18;52205926
64;128;64;32;105;13;18446744073709551615
32;128;1;16;130;14;42212593
2048;2048;1;16;14;42;16654519
2048;2048;256;16;30;42;18446744073709551615
2048;4;8;2;30;42;33559260
2048;2048;8;16;30;315;18446744073709551615
8192;1024;8;16;30;39;5684445
4096;1024;4;32;9;42;12661185
2048;2048;8;8;30;35;6707852
2048;8192;2;8;30;42;19249630
2048;512;8;16;30;13;9721334
2048;4096;8;16;14;42;6521185
2048;512;4;16;39;42;7106815
2048;1024;8;16;21;42;6487407
2048;2048;1;16;30;42;18324444
8192;1024;4;16;14;42;7191852
2048;1024;8;16;45;39;5820741
256;2048;8;16;30;39;5812445
2048;2048;4;16;21;42;6838518
2048;2048;4;16;13;42;6158667
8192;2048;8;16;35;42;6686074
2048;2048;8;32;90;42;11585185
1024;2048;8;16;35;42;13559703
4096;4096;8;4;30;42;22909778
1;2048;1;16;30;42;65933926
2048;2048;16;16;39;42;7828445
4096;2048;16;16;30;42;6846667
8192;2048;8;8;30;42;6020296
2048;4096;16;16;15;90;5925777
8192;2048;8;16;45;26;6476148
4096;2048;8;16;30;65;5697185
8192;2048;32;8;30;42;9628445
2048;2048;8;16;21;35;7263407
2048;256;8;16;45;42;6374815
2048;2048;8;16;78;42;6623703
2048;2048;8;16;14;39;6727852
2048;1;32;1;30;42;104186222
1;512;1;1;3;910;809503704
8192;4;1;1;390;91;18446744073709551615
1024;16;64;16;273;65;18446744073709551615
2048;1;16;1;10;195;132707408
512;2048;8;16;30;21;7396740
1024;2048;4;16;30;42;5447556
2048;512;8;16;18;42;7562815
1024;4096;8;16;30;42;5319852
8;256;8;32;90;21;59529333
32;2048;32;32;315;7;18446744073709551615
2048;8;8;1;30;42;46874667
512;2048;8;16;1365;42;18446744073709551615
2048;2048;4;16;21;35;7097778
1024;2048;8;16;18;14;23871259
2048;2048;8;16;30;105;13829185
2048;2048;16;16;30;78;11164445
2048;2048;4;16;21;9;22139703
2048;8192;8;16;9;63;19153777
2048;2048;16;32;18;30;18446744073709551615
4;4;4;4;10;90;5258154370
2048;2048;4;16;117;42;13011111
8;32;8;32;39;42;557939852
256;2048;8;16;15;45;6442519
1;4;1;1;42;1;36430331704
64;16;8;8;30;8190;18446744073709551615
4096;16;2;16;15;1638;18446744073709551615
1;1;1;1;5;182;67551330814
8192;2048;8;16;70;105;11891407
2048;2048;8;16;45;30;6064889
4096;2048;8;4;30;42;11606222
2048;2048;8;16;6;21;12498666
1024;2048;8;16;30;45;5492445
2048;2048;16;8;30;42;6884149
512;2048;8;16;30;78;5668148
2048;2048;16;16;26;91;6083556
2048;2048;2;8;30;63;23063111
2048;4096;16;8;30;42;7036888
8192;2048;4;16;21;42;7019704
2048;1024;8;32;30;42;6453926
2048;2048;8;4;30;1;124163111
2048;2048;4;8;30;45;11190370
2048;2048;4;16;30;30;5986518
2048;2048;4;8;18;42;11394518
2048;2048;8;4;13;35;13297037
2048;2048;8;32;30;39;5592741
2048;4096;8;64;30;42;18446744073709551615
1024;1024;8;8;30;42;6116593
512;2048;16;8;30;42;6853926
2048;2048;32;16;26;42;18446744073709551615
2048;1024;8;16;42;42;12135555
2048;2048;16;32;14;42;18446744073709551615
2048;2048;8;16;91;91;18446744073709551615
4096;2048;8;16;18;42;15247111
2048;4096;8;8;35;42;16305482
512;2048;16;16;30;42;14428296
2048;4096;4;16;30;42;10974222
1024;2048;8;8;30;39;12021778
8192;4096;8;16;30;42;11014370
1024;2048;4;16;30;45;12184000
2048;1024;8;16;14;42;13698370
2048;2048;8;16;13;42;14792297
256;4096;8;16;30;42;11390222
2048;512;8;16;30;15;18898666
4096;2048;16;16;35;42;17128592
2048;4096;8;8;30;42;12269185
2048;2048;8;8;35;42;15890518
2048;2048;8;16;30;78;11434074
2048;2048;8;16;30;30;12257926
2048;2048;8;32;63;42;11134074
1;1024;1;32;39;65;127664148
2048;2048;32;8;30;42;9804148
4;512;1;32;63;39;42915704
2048;2048;8;16;21;70;6599555
2048;4096;4;64;30;42;6428593
4;2048;1;16;30;182;71634074
2048;1;8;1;30;30;91518814
2048;2048;16;16;18;65;6729333
2048;2048;2;16;30;42;9536000
8;1;1;1;210;7;9434069778
1024;1;16;1;105;546;18446744073709551615
8;32;8;2;1170;30;18446744073709551615
256;2048;4;1;10;117;72500296
8;128;8;32;63;35;113307408
1024;2048;8;16;30;9;13874814
2048;2048;8;16;30;126;6583407
4096;2048;8;16;30;21;7429481
2048;2048;8;16;30;90;6417629
8;1024;1;32;130;14;84608444
2048;1;4;1;30;63;175177630
1024;2048;8;16;30;7;14349629
256;1024;8;16;70;42;7221926
2048;2048;4;4;65;42;33561333
2048;2048;8;8;30;78;8136740
2048;1024;4;16;65;65;15585926
8192;8192;8;8;30;42;7467852
2048;256;4;16;30;18;13309629
2048;4096;8;8;21;42;5764297
2048;2048;16;16;30;39;7355852
2048;1024;8;16;26;42;6168889
1024;512;32;32;30;91;18446744073709551615
4096;2048;8;16;30;117;6804741
1;2048;1;32;30;42;44242518
1024;2048;8;16;42;42;5959260
4096;4096;1;128;39;1;93020297
16;8192;4;64;5;9;44612445
256;4096;1;1;30;15;245309926
4096;4096;16;16;1;546;50889185
8;512;2;32;105;18;25870815
2048;2048;16;32;35;26;18446744073709551615
2048;2048;4;8;45;42;12658370
8;256;1;32;90;35;38328000
2048;2048;16;16;14;14;13885630
8192;1024;32;8;30;26;11825482
2048;2048;8;64;18;26;18446744073709551615
8;256;2;32;90;30;41244741
512;2048;8;16;30;39;5635407
8;512;4;32;91;18;26359259
8;512;8;32;70;35;35741037
16;512;2;32;117;15;34856148
8;512;4;32;70;26;31774074
2048;2048;8;16;30;2730;18446744073709551615
1;16;1;16;315;455;18446744073709551615
1;2048;1;8;1;1365;701041334
16;512;2;32;78;18;25620741
8;512;8;32;90;18;35249482
1;2048;1;16;30;1170;18446744073709551615
1;8192;1;16;21;455;18446744073709551615
2048;2048;8;16;1;42;56500297
1;64;1;2;2;182;1198067259
2048;2048;8;16;273;42;18446744073709551615
2048;512;8;16;315;42;18446744073709551615
2048;2048;64;16;30;42;18446744073709551615
8;2048;8;16;30;18;17954815
8;512;1;32;126;9;78209185
2048;2048;8;16;15;42;6674370
4096;2048;8;32;30;42;5668889
8;512;8;32;78;26;34310815
1;1;1;1;1;126;91256326222
32;4;32;2;3;1365;923724148
8;512;1;32;90;18;41545334
2;2048;2;16;30;45;36445778
2048;2048;32;16;30;42;18446744073709551615
1024;2048;8;64;30;42;18446744073709551615
2048;2048;16;16;18;10;19375703
64;1024;4;32;2;70;41558074
32;16;32;4;1;315;677473482
256;1024;1;4;39;42;78157037
16;8;1;1;2730;1;18446744073709551615
2048;256;1;32;7;1;85558222
64;8192;8;1;1;1;755878667
1;32;1;1;1638;1;33605697777
1;256;1;2;21;10;390458667
8;32;1;1;234;13;718352296
512;1024;1;1;1170;910;18446744073709551615
2048;2048;8;16;30;70;5642222
2048;1;32;1;63;42;104689778
2048;512;4;16;21;42;6869778
2048;2048;8;32;130;39;6714519
8192;2048;128;16;30;42;18446744073709551615
2048;2048;1;1;30;546;18446744073709551615
1024;2048;8;16;1365;42;18446744073709551615
2048;2048;2;16;30;130;24818518
1;2048;1;16;30;14;65741037
4;2048;1;16;30;1365;18446744073709551615
1;2048;1;16;234;42;18446744073709551615
8192;2;1;1;1;1;827426370
1024;16;1;16;910;70;18446744073709551615
128;2048;8;16;15;42;7096444
2048;2048;1;16;30;105;34401778
2048;1;4;1;26;195;397912445
1;2048;1;64;42;8190;18446744073709551615
4096;2048;256;16;30;13;18446744073709551615
4;1;1;1;30;42;15887805037
4096;2048;8;32;35;42;7762519
8192;2048;8;16;26;45;6349186
64;16;8;8;1;8190;18446744073709551615
1024;16;32;16;15;1638;18446744073709551615
2048;128;8;16;234;234;18446744073709551615
512;1;1;1;5;182;1509396444
8192;1;2;1;105;1;522540741
4;128;2;16;1170;30;18446744073709551615
2048;512;8;8;30;42;6075111
8192;2048;8;16;39;42;6023704
2048;8192;4;32;30;42;5413630
128;2048;4;1;10;117;74362074
4096;4096;2;1;10;273;289796000
16;8192;2;8;5;9;35949481
8;4096;1;32;2;15;137880888
2048;2048;2;16;30;45;10596445
2048;2048;16;16;30;65;6187259
1024;4096;8;32;30;39;5462667
2048;2048;16;16;18;42;7799852
2048;2048;8;4;30;42;11348889
2048;2048;16;16;630;42;18446744073709551615
2048;128;8;16;30;42;6131852
2048;4096;16;16;30;42;6813629
2048;2048;8;16;35;39;6357778
2048;2048;16;64;42;42;18446744073709551615
4096;2048;8;16;13;42;7182963
4096;8;16;2;1;546;153872148
1;4096;1;16;78;455;18446744073709551615
1;2048;1;8;1;1365;698356000
1;1;1;1;21;2;101202608741
2048;1;2;1;26;78;411727852
2048;8192;8;8;90;26;10812889
4;2048;1;16;30;42;27657481
2048;2048;8;2;130;42;83068889
2048;2048;8;16;30;455;18446744073709551615
2048;512;8;16;14;42;6636444
2048;2048;8;16;45;65;6323556
2048;2048;8;16;30;14;9399555
1;8192;1;128;7;26;150211259
4096;8;8;4;1;126;92603704
32;2048;32;64;3;195;18446744073709551615
1;8;1;8;6;70;10386334667
2048;2048;8;32;91;63;6768889
2048;2048;8;1;30;42;42854223
1;8192;1;16;30;42;47863703
2048;2048;8;2;10;42;19118370
2048;2048;8;16;630;42;18446744073709551615
2048;2048;8;16;21;45;6590074
256;2048;32;16;39;18;18446744073709551615
2048;2048;8;64;126;42;18446744073709551615
2048;2048;32;128;1;315;18446744073709551615
2048;1024;1;1;14;42;231896593
16;8;4;2;2730;1;18446744073709551615
2048;256;1;1;7;390;578697482
2048;512;2;8;30;42;18198519
4;8192;2;256;1;1;18446744073709551615
1;1;1;1;1638;1;166371664593
1;256;1;2;7;10;447208889
128;32;4;8;117;13;27844445
2048;512;8;16;45;42;6254074
2048;2048;8;16;1;42;55042963
16;2048;8;16;30;5;29538222
8;2048;4;16;30;42;13959703
1;512;1;1;10;910;18446744073709551615
8192;8;1;1;1;65;350049926
1024;16;64;16;273;39;18446744073709551615
128;1;1;1;10;1;1335353334
2048;2048;8;16;10;30;10659407
1;4;1;1;42;39;15563222519
2048;8192;8;1;30;42;45941037
2048;2048;8;16;30;546;18446744073709551615
2048;1024;8;16;30;45;5391407
2048;2048;8;32;30;1365;18446744073709551615
2048;2048;64;16;30;117;18446744073709551615
2048;2048;8;16;18;90;7305037
64;16;1;8;117;585;18446744073709551615
4096;16;128;16;15;1638;18446744073709551615
512;1024;1;1;1;273;270475704
8192;1024;2;1;234;910;18446744073709551615
4;256;1;1;1170;30;18446744073709551615
256;2048;1;1;10;117;263558963
4096;4096;1;128;10;13;39557037
2;8192;2;8;5;35;37448741
2048;2048;8;16;30;630;18446744073709551615
2048;2048;1;256;30;42;16754963
2048;4096;8;1;30;42;43926815
2048;1024;8;16;30;13;9650667
2048;512;8;16;1;42;55673481
2048;2048;8;128;30;42;18446744073709551615
2048;2048;2;16;18;15;16192741
256;2048;8;16;15;21;8954074
256;1;1;1;30;15;502632296
4096;4096;16;16;7;105;8588000
1;128;1;2;35;455;18446744073709551615
1;32;1;8;1;126;15580710370
1;1;1;1;21;315;61896248445
1;8192;1;128;7;390;140751852
2;2048;2;4;15;126;58800741
32;512;32;16;3;1365;18446744073709551615
8;2048;8;16;30;42;12670963
2048;2048;8;16;30;182;10534963
8;2048;8;32;30;42;9360889
64;1024;4;32;455;70;18446744073709551615
32;16;8;4;1;315;613551555
2048;2048;8;16;819;42;18446744073709551615
16;2048;8;16;126;42;19036593
2048;2;8;1;630;42;18446744073709551615
2048;2048;128;16;30;8190;18446744073709551615
1;2048;1;16;30;42;54091260
2048;2048;8;2;26;42;20944445
2048;2048;8;16;45;182;18446744073709551615
2048;2048;256;8;45;42;18446744073709551615
1;128;1;16;30;42;545555852
2048;2048;8;1;30;42;42850963
2048;2048;128;16;30;42;18446744073709551615
16;2048;16;16;30;42;10515852
2048;2048;8;16;30;6;15608148
2048;2048;8;16;30;130;7897481
4096;2048;8;16;30;630;18446744073709551615
16;2048;8;16;210;42;18446744073709551615
2048;2048;8;16;126;42;10793333
2048;1;8;1;210;42;18446744073709551615
2048;2048;8;16;30;2;41186518
2048;1;8;1;1170;42;18446744073709551615
2048;2048;1;16;105;42;45013334
2048;2048;8;16;30;1;85620445
2048;2048;32;16;30;390;18446744073709551615
2048;2048;8;1;90;42;82881185
2048;64;8;1;30;42;43214519
2048;2048;8;16;1170;42;18446744073709551615
2048;2048;8;16;30;9;13757630
16;2048;8;16;30;42;9321333
64;1;4;1;30;42;1177351111
4;2048;1;16;30;30;33658815
2048;2048;16;16;273;42;18446744073709551615
2048;2048;8;16;30;273;18446744073709551615
2;2048;2;16;30;42;38444889
8;2048;8;2;30;42;36662963
2048;2048;32;1;30;42;20929629
