epoch;GLOBAL_SIZE_0;GLOBAL_SIZE_1;LOCAL_SIZE_0;LOCAL_SIZE_1;v_TP_41;v_TP_42;cost
1505163522;32;64;32;8;46;2047;55743852
1505163523;8;256;2;64;89;2;164103555
1505163524;4;2048;2;2;92;1;918458963
1505163525;8;512;2;1;89;1;1254007704
1505163625;1;1;1;1;92;23;98700745926
1505163651;4;1;1;1;89;4;25990866518
1505163651;2048;8192;128;8;178;356;18446744073709551615
1505163658;16;1;4;1;46;89;6629458223
1505163658;16;512;2;8;89;2047;72918223
1505163659;32;64;8;8;178;2047;52039259
1505163659;32;64;32;4;46;2047;58814370
1505163660;16;32;1;8;46;2047;773766963
1505163660;16;32;8;8;178;2047;206232000
1505163661;8;64;1;8;178;2047;387410666
1505163661;32;64;8;4;46;356;61532445
1505163662;32;64;8;4;356;2047;68822074
1505163662;32;64;8;2;178;2047;70935852
1505163662;32;512;8;8;178;2047;14493481
1505163662;32;64;8;8;92;2047;54488000
1505163663;32;16;8;8;178;2047;197756296
1505163663;32;512;32;8;178;2047;13880148
1505163663;32;512;8;4;178;2047;26287555
1505163666;4096;1;8;1;178;2047;3008751852
1505163667;32;512;32;8;2;2047;24211704
1505163668;32;512;32;8;178;1;961807555
1505163668;32;4096;32;8;178;2047;13787259
1505163668;1;512;1;8;178;2047;259571408
1505163669;32;4096;32;8;89;2047;10336296
1505163669;32;4096;2;8;178;2047;114588148
1505163670;1;4096;1;8;178;4;321798519
1505163670;2048;4096;32;256;178;2047;18446744073709551615
1505163670;32;32;2;8;89;2047;392305777
1505163671;32;4096;1;8;89;2047;123050074
1505163671;32;16;32;8;46;2047;215044000
1505163671;32;4096;2;8;89;2047;61993778
1505163675;32;1;32;1;89;2047;3217552445
1505163675;32;64;32;8;89;2047;58555704
1505163675;2;4096;2;8;89;2047;70089926
1505163676;32;4096;32;8;89;1;738800741
1505163677;32;4096;8;8;178;2047;14496148
1505163677;32;128;32;8;89;2047;29822667
1505163678;32;4096;1;8;2047;2047;710822222
1505163678;32;4096;1;8;89;2;102809037
1505163678;32;4096;32;32;89;2047;18446744073709551615
1505163678;128;4096;32;8;89;2047;8933037
1505163679;32;8192;16;8;89;8188;22935556
1505163679;16;4096;16;8;23;2047;13369185
1505163679;256;4096;32;8;89;2047;8854666
1505163679;128;4096;32;8;89;8188;30363555
1505163680;128;8192;32;8;178;2047;9081333
1505163680;128;4096;32;8;46;2047;8369926
1505163680;256;1024;32;8;46;2047;9513778
1505163681;128;1;32;1;89;2047;804240444
1505163681;128;4096;64;8;46;92;18446744073709551615
1505163681;128;1024;64;8;46;2047;18446744073709551615
1505163684;64;1;32;1;46;356;2020528149
1505163684;128;4096;16;8;46;2047;11062814
1505163684;64;8192;32;8;89;2047;9366223
1505163684;128;4096;32;8;46;178;11857037
1505163685;128;4096;32;8;46;356;10402519
1505163685;256;4096;32;4;89;356;10661629
1505163685;128;4096;64;8;46;2047;18446744073709551615
1505163685;128;1024;32;8;46;2047;8666518
1505163686;128;4096;128;8;46;356;18446744073709551615
1505163686;128;4096;32;2;46;2047;10584000
1505163686;32;4096;32;8;46;2047;10298963
1505163686;128;4096;128;4;46;2047;18446744073709551615
1505163686;128;4096;16;8;92;2047;12529482
1505163688;64;1;32;1;23;2047;1601751704
1505163689;32;4096;32;8;46;356;13129630
1505163689;128;4096;32;16;4;356;18446744073709551615
1505163689;2048;2048;64;8;46;356;18446744073709551615
1505163689;128;4096;32;16;46;2047;18446744073709551615
1505163690;256;4096;32;8;46;356;9910518
1505163690;128;4096;32;8;46;1;576859111
1505163691;128;4096;32;16;46;4094;18446744073709551615
1505163691;128;4096;32;8;46;8188;29424592
1505163691;512;4096;32;8;23;2047;8179259
1505163691;64;4096;32;8;46;2047;8866370
1505163691;128;4096;32;8;23;2047;8130370
1505163692;128;4096;8;8;23;2047;16603111
1505163692;512;4096;32;8;23;4094;15656889
1505163692;128;256;32;8;23;4094;17656741
1505163692;128;4096;32;8;23;4094;15680149
1505163693;512;4096;32;4;23;2047;9081185
1505163693;128;2048;32;8;23;356;10397334
1505163693;128;4096;128;4;23;2047;18446744073709551615
1505163693;128;4096;32;8;23;356;10313186
1505163697;64;1;1;1;23;356;4042391556
1505163698;16;4096;1;8;2;2047;211145185
1505163698;128;4096;8;8;46;4094;20553037
1505163698;128;4096;64;8;2;2047;18446744073709551615
1505163699;128;1024;32;16;23;2047;18446744073709551615
1505163699;256;8192;32;8;4;2047;11732889
1505163699;128;8192;32;8;23;2047;8161038
1505163699;16;4096;1;8;23;2047;86517185
1505163699;64;4096;32;8;23;356;10987408
1505163700;128;4096;64;8;23;2047;18446744073709551615
1505163700;256;4096;32;8;4;4094;21659704
1505163700;128;4096;128;4;23;356;18446744073709551615
1505163700;32;4096;32;8;4;2047;9686815
1505163701;128;1024;64;8;23;2047;18446744073709551615
1505163701;256;4096;32;8;23;2047;8069481
1505163701;128;4096;32;16;23;2047;18446744073709551615
1505163701;256;1024;16;8;1;178;39952445
1505163702;256;4096;32;8;23;8188;29111852
1505163702;2048;4096;32;4;23;356;10264148
1505163702;256;2048;32;8;46;2047;10572741
1505163702;256;4096;16;8;23;2047;11222667
1505163703;256;8192;32;8;4;1;471099556
1505163703;256;4096;64;8;23;2047;18446744073709551615
1505163703;256;4096;16;8;23;4094;28529037
1505163704;512;4096;32;8;2;2047;8236889
1505163704;256;8192;32;16;23;356;18446744073709551615
1505163704;128;4096;8;8;23;1;145617038
1505163704;256;4096;32;8;23;4094;15666222
1505163705;256;2048;16;8;23;8188;30112000
1505163705;64;4096;32;8;23;2047;8866963
1505163705;64;32;32;8;23;2047;53615556
1505163705;256;4096;32;16;4;2047;18446744073709551615
1505163705;256;256;32;8;23;2047;10920296
1505163706;256;4096;64;8;23;178;18446744073709551615
1505163706;256;1;16;1;23;178;500720149
1505163707;256;8192;32;8;4;4094;23040741
1505163707;256;4096;8;8;23;2047;16474074
1505163707;4096;4;256;2;89;4;18446744073709551615
1505163707;8192;64;128;64;178;356;18446744073709551615
1505163708;2048;1024;32;1;2;89;24250814
1505163732;4;1;1;1;89;89;24368830370
1505163733;256;4096;32;1;23;2047;17509629
1505163733;256;4096;32;8;23;178;11506814
1505163733;256;4;32;1;23;2047;202828741
1505163733;256;4096;32;8;1;2047;15706074
1505163734;64;1024;32;8;23;178;12313186
1505163734;256;4096;16;8;4;2047;9402666
1505163734;512;8192;32;4;23;2047;9312296
1505163734;256;4096;128;16;23;2047;18446744073709551615
1505163735;256;4096;32;8;2;92;13395111
1505163735;4096;4096;32;8;23;2047;8426815
1505163735;128;4096;32;8;23;178;11803112
1505163736;256;1;32;1;23;2047;800300000
1505163737;256;1;32;1;23;2047;800093481
1505163737;256;1024;32;2;4;2047;8881629
1505163737;256;4096;32;8;92;2047;9198667
1505163738;512;2;32;2;46;2047;410461481
1505163738;256;4096;1;8;23;2047;87792296
1505163739;256;4096;32;8;2;356;9768296
1505163739;64;4096;32;16;23;2047;18446744073709551615
1505163739;256;4096;16;16;23;2047;13641778
1505163739;16;4096;1;16;23;2047;107082074
1505163740;256;4096;32;8;23;356;10073037
1505163740;256;2048;32;8;23;2047;8318518
1505163740;256;2048;32;8;4;4094;15963259
1505163740;256;4096;128;8;4;2047;18446744073709551615
1505163740;256;4096;128;16;4;2047;18446744073709551615
1505163741;1024;4096;32;8;89;2047;8910667
1505163741;2048;4096;32;4;89;2047;10624000
1505163741;128;1024;16;16;23;2047;12567556
1505163741;64;4096;64;8;46;2047;18446744073709551615
1505163742;256;2048;32;8;23;356;10086963
1505163742;64;4096;32;2;23;2047;10721185
1505163742;256;2048;32;4;4;356;8579407
1505163742;256;8192;32;8;46;2047;10689185
1505163742;256;4096;32;16;23;2047;18446744073709551615
1505163743;256;2048;16;8;23;2047;18306814
1505163744;64;1;32;1;89;2047;1624697778
1505163745;64;4096;32;4;4;2047;7281481
1505163745;64;1024;32;8;1;2047;30698814
1505163745;256;4096;32;4;46;2047;9575704
1505163745;64;4096;32;4;1;356;20032148
1505163746;8;4096;2;4;46;2047;73737630
1505163746;64;4096;32;4;1;2047;15665778
1505163746;64;4096;32;8;4;2047;8268592
1505163746;64;4096;32;4;4;4094;7589778
1505163749;128;1;32;1;2;8188;2875082815
1505163751;64;1;32;1;4;2047;1476660741
1505163751;32;4096;32;8;46;8188;10164592
1505163752;128;4096;32;4;4;178;9804296
1505163752;64;4096;8;2;4;2047;26547704
1505163754;64;1;32;1;4;356;1830174074
1505163754;16;4096;1;4;4;2047;107285926
1505163754;16;4096;16;4;23;2047;14315111
1505163755;32;4096;16;4;2;356;16213777
1505163755;64;8192;32;4;46;2047;10235260
1505163755;64;4096;32;4;2;2047;8442815
1505163755;256;4096;32;2;4;2047;8191852
1505163755;128;4096;32;4;4;2047;6917778
1505163756;64;8192;32;4;4;2047;6949037
1505163756;256;4096;32;4;4;2047;6956000
1505163756;64;4096;64;4;23;2047;10569629
1505163756;128;4096;32;4;4;4094;13218962
1505163757;128;1;32;1;4;2047;737024296
1505163758;128;4096;32;8;4;2047;7936296
1505163758;32;4096;32;4;4;2047;8557926
1505163758;128;4096;32;2;4;2047;7358074
1505163758;32;8192;8;64;89;92;18446744073709551615
1505163759;8;4096;4;1;1;23;147289926
1505163759;2048;128;8;2;356;89;39011407
1505163763;2;16;2;16;178;23;3759446519
1505163763;256;1024;16;4;4;2047;10937482
1505163763;128;4096;32;4;23;4094;16472148
1505163764;128;4096;32;4;4;8188;24801778
1505163764;512;4096;32;4;4;2047;7000593
1505163765;128;1;32;1;4;2047;738189037
1505163765;64;4096;8;4;23;8188;64136148
1505163765;128;4096;32;4;23;2047;9059704
1505163766;8;4096;2;4;4;2047;54192000
1505163766;128;4096;2;4;4;2047;53712740
1505163766;128;2048;32;4;4;2047;7313482
1505163766;256;4096;16;2;4;356;15259556
1505163767;128;4096;128;4;4;2047;18446744073709551615
1505163767;128;4096;32;16;2;2047;18446744073709551615
1505163767;128;4096;64;4;4;2047;6677778
1505163770;128;1;8;1;4;2047;2776838370
1505163770;256;4096;32;4;4;356;8549630
1505163770;128;4096;64;4;4;356;9777778
1505163771;128;4096;64;4;2;2047;9234667
1505163771;128;4096;64;4;4;8188;12433185
1505163771;256;8192;64;2;4;2047;8387408
1505163771;512;4096;64;2;2;356;10017037
1505163772;128;512;32;4;23;2047;9487259
1505163772;128;4096;64;8;4;2047;18446744073709551615
1505163773;128;1;128;1;1;2047;779692889
1505163773;32;4096;1;4;4;2047;106838814
1505163797;32;1;1;1;23;2047;23598429630
1505163797;128;512;64;2;23;4094;11340000
1505163798;32;4096;2;8;4;2047;54988741
1505163798;128;4096;1;4;23;4094;269819704
1505163800;2;64;2;2;23;4;1210944741
1505163800;128;4096;16;4;4;356;7737037
1505163800;128;4096;64;4;23;2047;10249778
1505163800;256;4096;64;4;2;2047;8413185
1505163817;128;2;1;1;4;2047;16062688000
1505163817;128;128;64;4;4;46;31484741
1505163817;4;4096;1;4;23;2;219057630
1505163818;128;64;64;4;8188;2047;202682370
1505163818;128;4096;64;2;4;2047;8881334
1505163818;128;4096;64;4;4;178;11652296
1505163818;128;4096;64;4;4;92;18195407
1505163829;16;1;2;1;4;2047;10666785334
1505163830;128;2048;64;2;1;4094;9829778
1505163830;256;1;64;1;89;2047;408753037
1505163831;128;1;64;1;4;4094;741039852
1505163834;1;64;1;1;2;1;2850349481
1505163835;64;4096;2;8;1;2047;215540445
1505163835;128;4096;64;4;1;2047;10015111
1505163835;512;4096;64;4;1;2047;9252741
1505163835;64;2048;64;4;4;2047;8212149
1505163836;128;4096;64;2;4;178;11674223
1505163836;512;4096;64;4;4;4094;13022370
1505163837;1;64;1;32;89;8188;1516450370
1505163838;8;64;8;4;23;23;324514667
1505163838;8192;32;8;32;8188;92;11099852
1505163861;8;4;1;2;92;8188;22875329778
1505163862;128;4096;64;4;4094;2047;104487704
1505163862;128;4096;64;256;4;2047;18446744073709551615
1505163863;128;4096;16;8;2047;2;447313778
1505163863;1024;4096;64;4;4;2047;6673630
1505163864;128;8192;64;4;4;1;914042815
1505163864;512;8192;64;4;4;4094;13027111
1505163864;512;4096;64;4;4;46;27059408
1505163865;2048;8192;128;4;4;2047;18446744073709551615
1505163865;2048;4096;128;4;4;2047;18446744073709551615
1505163865;1024;1;64;1;23;2047;406576296
1505163866;512;4096;128;4;4;356;18446744073709551615
1505163866;512;4096;128;4;4;2047;18446744073709551615
1505163866;1024;4096;64;4;4;8188;24733777
1505163866;1024;4096;32;4;4;2047;6974815
1505163867;256;4096;128;4;2;2047;18446744073709551615
1505163867;1024;8192;64;4;2;356;11116444
1505163867;1024;4096;64;4;4;4094;13029778
1505163867;1024;4096;64;8;4;8188;18446744073709551615
1505163867;1024;8192;64;4;4;2047;6792296
1505163868;1024;4096;64;1;4;2047;10137037
1505163869;1024;1;32;1;92;2047;804921185
1505163869;1024;4096;64;16;2;4094;18446744073709551615
1505163869;1024;4096;64;4;4;356;9876593
1505163869;4096;4096;64;4;4;2047;6764445
1505163955;1;1;1;1;4;356;84862934815
1505163955;512;4096;128;2;46;2047;10052445
1505163955;1024;4096;256;4;4;2047;18446744073709551615
1505163955;1024;4096;64;4;4;178;12056297
1505163955;1024;4096;64;2;4;2047;8705482
1505163956;1024;4096;64;16;4;2047;18446744073709551615
1505163956;1024;4096;64;8;2;4094;18446744073709551615
1505163956;8;1024;8;2;23;92;67360740
1505163956;4096;4096;64;4;2;356;11350074
1505163957;512;4096;64;2;23;2047;10508296
1505163957;1024;4096;128;2;4;4094;13118074
1505163957;1024;4096;128;4;178;2047;18446744073709551615
1505163958;1024;1;64;1;4;2047;374548000
1505163958;8;4096;4;4;1;2047;108059111
1505163959;1024;4096;1;4;4;8188;399420445
1505163959;1024;4096;32;2;4;2047;8110370
1505163959;1024;4096;64;2;4;178;11918667
1505163959;4096;4096;64;4;4;178;12113334
1505163959;1024;8192;128;4;4;2047;18446744073709551615
1505163960;4096;1024;16;2;2047;2047;414239852
1505163961;256;1;1;1;4;89;927781185
1505163975;1;8;1;1;178;4;13796016296
1505163979;128;2;8;1;2047;2;3533488148
1505163979;2048;4096;64;8;4;2047;18446744073709551615
1505163979;256;4096;16;4;2;2047;13785333
1505163980;1024;4096;128;4;4;2047;18446744073709551615
1505163980;2048;1024;64;4;4;2047;6859555
1505163980;1024;4096;64;8;4;2047;18446744073709551615
1505163980;2048;4096;32;4;23;2047;9290370
1505163980;2048;4096;64;4;4;8188;24884889
1505163981;64;2048;1;2;23;89;250322963
1505163981;1024;1;64;1;23;356;186104444
1505163982;1024;4096;64;4;1;2047;9430074
1505163982;1024;4096;1;4;4;2047;105471555
1505163982;4096;4096;128;1;4;2047;10349481
1505163983;1024;4096;64;4;4;2;496057333
1505163983;1024;2048;64;4;4;2047;6828000
1505163986;64;512;32;8;1;1;2253121778
1505163986;512;4096;64;4;23;356;11200740
1505163986;1024;256;64;4;4;2047;8799556
1505163986;256;1024;64;4;2;2047;9759556
1505163987;2048;4096;64;4;89;2047;10034963
1505163987;1024;4096;64;4;46;4094;15867407
1505163987;1024;1024;64;4;46;8188;28937630
1505164012;1;32;1;1;2047;356;24251087704
1505164012;2;512;2;32;89;1;468998074
1505164012;128;2048;128;32;8188;46;18446744073709551615
1505164039;1;4;1;2;89;4;25878880148
1505164039;16;512;1;2;46;356;269332741
1505164039;256;4096;128;4;4;356;18446744073709551615
1505164040;1024;4096;64;4;46;2047;9733038
1505164040;1024;4096;64;16;2;356;18446744073709551615
1505164040;1024;1;32;1;23;356;168255111
1505164041;1;4096;1;4;4;2047;117915259
1505164041;64;4096;64;4;4;2047;7798074
1505164041;1024;4096;64;4;1;46;29541186
1505164041;512;512;128;4;4;178;18446744073709551615
1505164042;1024;4096;64;4;46;356;11412444
1505164042;1024;4096;32;4;2;2047;7856296
1505164042;128;4096;32;2;23;92;17088444
1505164042;1024;4096;64;2;2;2047;7068889
1505164042;1024;4096;128;8;89;2047;18446744073709551615
1505164043;4096;4096;64;4;1;2047;9817333
1505164043;1024;4096;32;4;4;356;8464000
1505164043;1024;2048;32;4;4;2047;7380148
1505164044;2048;256;2;2;1;1;954003259
1505164045;1024;4096;64;128;4;2047;18446744073709551615
1505164045;256;1024;64;8;4;2047;18446744073709551615
1505164045;512;2048;64;4;4;2047;6813629
1505164047;128;1;16;1;178;2047;1577222963
1505164047;16;2048;2;2;89;23;164586667
1505164047;1024;2048;256;4;178;1;18446744073709551615
1505164048;1024;2;128;2;1;178;234145481
1505164048;1;4096;1;16;4;2047;181275111
1505164048;256;4096;64;2;1;2047;7838371
1505164072;512;1;1;1;23;2047;23599101926
1505164073;512;4096;128;4;23;4094;18446744073709551615
1505164073;1024;4096;128;16;4;2047;18446744073709551615
1505164085;2;4096;1;4;8188;2047;11515295555
1505164085;16;256;16;4;23;46;45353630
1505164085;64;8192;64;4;23;178;16157482
1505164085;1024;4096;64;4;92;356;11439555
1505164086;512;4096;64;4;4;2047;6614519
1505164086;1024;2048;64;4;1;2047;9914223
1505164086;512;4096;64;8;4;356;18446744073709551615
1505164086;512;4096;64;2;4;2047;8578815
1505164086;512;8192;64;4;2;2047;9242370
1505164087;512;4096;64;4;2;2047;10366371
1505164087;256;8192;64;4;4;2047;6592296
1505164087;512;8192;64;4;4;8188;24617334
1505164087;512;4096;64;4;4;8188;24685333
1505164088;512;4096;64;2;1;2047;8845482
1505164088;256;8192;64;4;4;4094;12982815
1505164088;256;8192;64;4;1;2047;8370963
1505164088;64;8192;16;4;4;178;8849037
1505164088;128;8192;64;4;4;2047;6620000
1505164089;256;8192;32;4;4;2047;6783704
1505164089;256;8192;64;4;2;2047;7995111
1505164089;64;8192;1;4;4;2047;105519259
1505164089;128;8192;64;8;1;8188;18446744073709551615
1505164090;256;1024;64;4;4;356;9857630
1505164090;256;8192;64;4;4;356;9672740
1505164090;256;1;64;1;4;2047;377514963
1505164091;256;4096;128;4;4;2047;18446744073709551615
1505164091;256;8192;64;4;4;8188;24669333
1505164091;512;1;128;1;4;2047;190496592
1505164091;256;8192;64;1;4;2047;9739555
1505164092;512;8192;64;4;4;2047;6594667
1505164092;64;8192;64;4;46;2047;10766815
1505164092;256;8192;64;2;23;2047;10684889
1505164092;256;4096;64;16;4;2047;18446744073709551615
1505164093;1024;8192;64;2;4;2047;8938370
1505164093;256;1024;64;4;46;2047;9698370
1505164114;32;1;1;1;2;2047;21113469334
1505164115;128;8192;64;4;2;2047;8815704
1505164115;512;8192;128;4;4;356;18446744073709551615
1505164115;256;1;64;1;2;2047;376598074
1505164139;32;1;1;1;46;2047;23597288149
1505164141;512;1;64;1;4;8188;1431520296
1505164141;256;2048;64;8;4;4094;18446744073709551615
1505164141;128;8192;64;4;4;4094;6648148
1505164141;1024;8192;64;4;23;2047;10052593
1505164142;256;4096;64;4;4;2047;6612296
1505164142;32;8192;1;4;4;356;108326815
1505164142;256;8192;64;4;89;356;12065482
1505164142;256;4096;32;4;4;4094;13252445
1505164144;256;8192;64;4;4;1;912763111
1505164144;256;8192;64;8;23;2047;18446744073709551615
1505164144;1024;8192;64;4;4;178;12158963
1505164144;256;8192;64;2;46;2047;10973778
1505164145;256;4096;64;4;4;4094;13032592
1505164146;256;1;16;1;4;2047;1462903704
1505164147;256;4096;64;8;1;2047;18446744073709551615
1505164147;512;8192;128;4;4;2047;18446744073709551615
1505164147;256;8192;64;16;1;4094;18446744073709551615
1505164147;2048;8192;128;4;4;356;18446744073709551615
1505164148;256;1;128;1;89;8188;773843556
1505164148;256;8192;64;4;2;356;10631852
1505164149;1024;1;64;1;4;2047;374325185
1505164149;1024;8192;64;2;1;8188;27277333
1505164150;256;2048;64;4;4;2047;6746370
1505164150;2048;1;64;1;4;2047;373808149
1505164150;256;8192;64;4;23;178;14160592
1505164151;512;8192;256;4;4;2047;18446744073709551615
1505164151;256;4096;64;4;1;2047;8968445
1505164151;256;4096;64;8;4;2047;18446744073709551615
1505164152;1024;4096;32;2;2;1;515610667
1505164152;512;8192;32;4;4;356;8718666
1505164152;256;8192;64;16;4;178;18446744073709551615
1505164152;1024;8192;32;4;4;2047;7160741
1505164163;1;8;1;1;2;4094;10569053037
1505164173;1;16;1;8;356;2;9467970962
1505164218;1024;16;1;2;8188;8188;44732528444
1505164218;1024;256;64;16;4;8188;18446744073709551615
1505164218;32;512;32;2;46;178;24885482
1505164219;128;8192;32;4;4;2047;6782370
1505164220;128;1;64;1;4;2047;746851111
1505164220;256;8192;16;4;4;2047;8745482
1505164220;2048;8192;16;4;4;2047;9901186
1505164220;256;8192;128;4;46;2047;18446744073709551615
1505164221;64;256;2;2;23;89;132254963
1505164221;32;128;1;16;2047;46;78791851
1505164221;512;1024;16;256;23;178;18446744073709551615
1505164221;1024;128;1;128;356;356;64829037
1505164222;256;1;64;1;4;356;505383259
1505164222;256;8192;64;4;4;178;12101630
1505164223;256;2048;32;4;4;2047;7211852
1505164223;64;512;8;2;23;89;39893482
1505164223;256;8192;32;4;4;4094;13127704
1505164223;256;8192;256;4;4;2047;18446744073709551615
1505164224;1024;1024;64;4;23;2047;9717629
1505164224;128;8192;64;4;46;2047;10388000
1505164224;256;8192;64;4;89;2047;9653037
1505164225;1024;256;1;2;1;2047;573772444
1505164225;256;8192;64;4;46;2047;9722814
1505164225;256;2048;64;8;4;2047;18446744073709551615
1505164225;8;8192;4;4;4;356;28918518
1505164283;8;1;8;1;2047;4;56625331704
1505164285;2;256;1;16;1;2047;2711678667
1505164286;32;2048;32;2;46;46;38881630
1505164287;1;256;1;128;92;23;732643111
1505164287;256;8192;64;8;2;2047;18446744073709551615
1505164287;256;8192;64;8;4;8188;18446744073709551615
1505164308;32;1;1;1;4;2047;21109911408
1505164309;4096;1024;64;2;23;23;61341038
1505164309;256;8192;256;32;4;2047;18446744073709551615
1505164309;256;8192;64;8;4;4094;18446744073709551615
1505164309;512;1024;32;2;23;46;21911704
1505164310;256;8192;128;4;4;4094;18446744073709551615
1505164310;64;8192;1;4;23;2047;138586518
1505164346;4;1;2;1;89;4;35509120741
1505164346;8192;1;128;1;23;178;62648296
1505164346;2048;8192;2;8;178;356;36510074
1505164353;16;1;4;1;46;89;6632160296
1505164354;64;512;32;4;23;89;20394963
1505164354;512;8192;64;4;4;178;12085482
1505164354;512;4096;1;2;23;89;247961185
1505164356;256;1;64;1;23;8188;1563624741
1505164360;32;1;8;1;89;92;3790428000
1505164360;128;512;16;2;23;89;23359704
1505164361;2048;4096;1;1;1;23;456219704
1505164362;2048;128;1;2;2047;89;451883407
1505164362;256;8192;64;8;4;2047;18446744073709551615
1505164362;256;8192;128;4;4;8188;18446744073709551615
1505164362;2048;256;32;2;2;178;10171852
1505164363;256;8192;64;1;4;4094;13410963
1505164363;16;8192;2;4;4;356;54741630
1505164366;1;64;1;2;1;2047;2710546370
1505164369;2;16;2;16;178;8188;3086264593
1505164373;1;32;1;32;89;46;3174238667
1505164373;8192;32;1;32;8188;92;44899111
1505164373;1;4096;1;2;2;46;223071112
1505164373;256;8192;64;4;23;2047;9372741
1505164374;256;1;128;1;4;2047;379689333
1505164374;128;512;32;2;46;178;14873333
1505164375;16;8192;2;4;23;2047;70453629
1505164375;256;8192;128;4;1;356;18446744073709551615
1505164375;4;1024;4;8;178;356;71167111
1505164379;8;4;8;2;356;8188;3149962667
1505164379;4096;8192;1;2;2047;23;309908592
1505164392;1;8;1;2;46;4;12827668889
1505164393;512;1024;32;2;4;92;11665186
1505164393;32;8192;1;4;2;2047;206692444
1505164393;256;8192;32;4;4;92;11630371
1505164394;1024;4096;128;2;23;356;13821925
1505164394;256;4096;64;4;1;2047;9137482
1505164394;8;8192;4;4;4;2047;27747703
1505164395;256;8192;64;4;46;1;1142461778
1505164396;512;2048;64;2;23;178;14075259
1505164399;128;1;8;1;2047;2047;3007707556
1505164424;1;32;1;1;2047;356;24252344148
1505164424;512;512;128;32;92;1;18446744073709551615
1505164424;1024;512;32;2;4;178;10011259
1505164424;512;512;32;2;23;178;11673333
1505164425;512;1024;32;2;4;178;9704444
1505164425;512;512;32;4;4;92;11976149
1505164425;256;8192;32;4;89;2047;10022815
1505164425;4096;8192;64;4;4;2047;6723556
1505164425;256;8192;64;64;4;2047;18446744073709551615
1505164426;512;8192;32;4;4;2047;6823111
1505164426;256;8192;64;16;4;2047;18446744073709551615
1505164426;128;2048;128;32;8188;1;18446744073709551615
1505164448;1;4;1;2;4;4;21480612741
1505164449;128;1;128;1;178;4094;814896297
1505164449;1024;2048;256;8;178;1;18446744073709551615
1505164449;1024;512;32;2;4;92;11655704
1505164449;512;512;32;2;4;92;11801037
1505164450;64;8192;64;4;4;2047;6749185
1505164450;4096;512;32;1;4;2047;14649778
1505164450;256;8192;128;4;4;2047;18446744073709551615
1505164450;512;8192;64;8;1;2047;18446744073709551615
1505164451;32;8192;1;4;4;8188;396321629
1505164451;512;512;32;4;4;178;9871111
1505164452;1024;1;128;1;1;178;234065630
1505164452;1;1024;1;1;1;4094;442280740
1505164453;256;16;16;1;356;92;82144592
1505164453;4096;512;32;2;4;2047;9232000
1505164453;256;8192;128;8;4;2047;18446744073709551615
1505164453;256;32;64;4;4;2047;12212888
1505164454;32;8192;1;4;4;2047;105823111
1505164454;256;8192;32;4;178;2047;14505482
1505164455;1;512;1;2;4;8188;341918963
1505164455;256;8192;64;4;4;4;250790518
1505164455;256;8;64;4;4;2047;48366963
1505164456;4096;512;32;2;1;178;19834667
1505164456;1024;256;1;2;8188;1;489414519
1505164457;1024;256;64;32;4;8188;18446744073709551615
1505164457;32;128;1;32;2047;46;55007704
1505164457;256;16;64;4;4;2047;24279407
1505164458;256;8192;1;4;4;2047;105379704
1505164458;256;8192;8;4;4;2047;14195408
1505164458;256;128;64;1;4;2047;10913185
1505164458;2048;8192;64;256;4;2047;18446744073709551615
1505164458;512;1024;32;256;23;178;18446744073709551615
1505164459;1024;128;16;128;1;356;18446744073709551615
1505164516;8;1;8;1;2047;4;56663413037
1505164516;2;256;1;16;92;89;207321185
1505164516;256;8192;64;2;4;356;9706371
1505164517;256;8192;64;4;46;4094;15600297
1505164517;128;8192;1;2;4;4094;412784740
1505164518;256;8192;64;4;4;2;496401629
1505164518;256;256;64;4;4;8188;26536889
1505164519;2;256;1;128;92;23;365344444
1505164519;1;512;1;4;89;4;346942815
1505164520;256;1;32;1;2;2047;740779111
1505164521;32;8192;1;4;1;2047;420769185
1505164521;256;8192;4;128;4;2047;18446744073709551615
1505164521;256;64;64;4;4;2047;8878667
1505164621;1;1;1;1;178;23;99085558963
1505164648;4;1;4;1;46;89;26499664445
1505164652;32;1;8;1;89;46;3975300000
1505164653;1;4096;1;1;1;23;462461185
1505164653;256;8192;64;2;4;8188;24748296
1505164653;256;8192;16;4;4;4094;13538518
1505164656;1;256;1;2;356;89;2061523852
1505164656;4096;16;16;16;2047;8188;387436000
1505164657;256;8192;64;4;4;89;18497037
1505164657;1;4096;1;32;89;8188;133762223
1505164658;8192;1;64;1;23;2047;406298370
1505164658;256;8192;64;8;178;2;18446744073709551615
1505164658;256;8192;1;4;178;2047;439989778
1505164659;256;8192;1;4;2;2047;206444740
1505164659;8192;1;8;1;8188;92;159512000
1505164665;8;4;8;2;1;8188;5396472740
1505164665;4096;8192;1;16;2047;23;84462519
1505164665;4096;1;8;1;46;23;122390666
1505164666;256;4096;64;8;4;4094;18446744073709551615
1505164691;64;1;8;1;2047;1;24747714222
1505164715;1;8;1;1;2047;356;24252066371
1505164718;2;512;2;32;4;1;2601802667
1505164718;16;2048;1;128;8188;92;83349037
1505164719;1;8192;1;4;4;1;239534667
1505164719;256;512;64;4;4;2047;7695260
1505164719;4096;8192;64;4;178;2047;10332148
1505164720;1024;8192;64;4;2;2047;9568148
1505164720;32;8192;1;4;4;4094;207588000
1505164720;64;8192;64;4;23;2047;10589333
1505164721;2048;4;32;2;4;4;291730963
1505164722;128;1;128;1;178;4094;818354074
1505164722;1024;2048;256;4;1;1;18446744073709551615
1505164723;1024;1;128;1;1;178;233986667
1505164723;16;8192;2;32;2047;2047;94493778
1505164725;1;64;1;4;4;2047;1313485333
1505164725;256;8192;64;128;4;2047;18446744073709551615
1505164725;256;8192;64;2;2;2047;6709037
1505164725;256;8192;128;4;2;4094;18446744073709551615
1505164725;128;8192;64;4;4;8188;12360000
1505164726;256;1;256;1;89;2047;445262222
1505164726;256;8192;64;4;4;92;18499851
1505164727;256;2;64;1;4;356;252367259
1505164727;512;1024;4;1;1;4094;212344741
1505164777;1;16;1;1;4094;92;49238306222
1505164789;1024;256;1;2;8188;2047;11522009186
1505164789;4096;256;16;1;23;8188;122735556
1505164789;256;8192;1;4;4;2047;105248445
1505164790;128;4096;64;8;4;356;18446744073709551615
1505164790;64;128;64;32;2047;4;18446744073709551615
1505164790;2048;1024;16;256;23;178;18446744073709551615
1505164790;8;128;2;128;356;356;190941926
1505164989;8;1;8;1;2047;1;197884610371
1505164989;256;512;64;4;4;4;256586519
1505164990;256;64;64;2;8188;2047;201163260
1505164990;256;8192;64;256;4;23;18446744073709551615
1505164990;256;4;64;4;4;2047;96826519
1505164991;2;256;1;16;2047;89;771037926
1505164992;1;256;1;128;89;23;689729333
1505164993;1;512;1;1;89;4;1137935111
1505164994;2048;8192;2;8;1;178;224383111
1505165000;16;1;4;1;1;89;6132215259
1505165000;256;8192;64;4;23;4094;15199112
1505165001;256;8192;32;4;4;2;248203111
1505165001;1024;8192;64;128;4;2047;18446744073709551615
1505165001;256;1024;2;4;4;2047;57241482
1505165002;32;4096;1;32;89;92;104430667
1505165002;8;4096;4;1;1;92;116261333
1505165003;8;1024;8;2;356;89;334395852
1505165003;8192;16;1;16;2047;46;54095852
1505165003;256;512;1;4;4;2047;141769630
1505165004;256;8192;16;4;23;8188;32269334
1505165004;256;1;64;1;1;2047;383113185
1505165004;256;8192;32;2;4;2047;7935408
1505165005;256;8192;32;4;2;2047;7833037
1505165005;256;8192;32;16;1;2047;18446744073709551615
1505165005;256;1;128;1;4;2047;379494222
1505165006;512;1;64;1;4;2047;373862667
1505165006;512;8192;128;4;2;356;18446744073709551615
1505165006;256;8192;64;2;23;178;14906074
1505165007;1024;8192;32;4;1;2047;15379111
1505165007;2048;8192;64;4;4;2047;6720741
1505165007;256;8192;1;4;4;4094;207146667
1505165008;256;4096;64;4;46;2047;9747703
1505165008;256;1;64;1;2;178;620636296
1505165009;256;8192;64;8;89;2047;18446744073709551615
1505165009;512;8192;64;8;4;4094;18446744073709551615
1505165009;128;8192;8;4;4;2047;14282963
1505165009;256;8192;32;4;4;356;8476889
1505165010;256;1;64;1;23;2047;405805629
1505165011;256;2048;64;4;4;1;916615704
1505165011;256;8192;64;4;4;23;53488593
1505165012;256;8192;64;4;4;46;27054074
1505165012;256;128;1;4;4;2047;355139112
1505165013;1;4096;1;32;89;8188;137590074
1505165013;1024;32;8;32;8188;92;11109186
1505165036;8;4;1;2;356;8188;23137426963
1505165038;1;8192;1;16;2047;23;1545396592
1505165038;4;2048;4;4;4;92;35222074
1505165038;256;8192;8;8;4;2047;14523556
1505165039;256;8192;64;1;89;2047;12717630
1505165039;512;8192;1;4;4;2047;104833926
1505165138;1;1;1;1;46;23;98438817926
1505165141;128;1;8;1;4;2047;2778590666
1505165165;1;16;1;1;2047;356;24251361037
1505165167;2;8192;2;32;2047;1;1721010815
1505165176;16;2048;16;1;8188;92;8206995259
1505165177;2048;8;32;1;4;4;263639408
1505165380;128;1;128;1;178;1;202592240889
1505165380;256;1;64;1;4;2047;374135259
1505165381;2;256;1;4;4;2047;164226814
1505165381;256;8192;64;128;89;2047;18446744073709551615
1505165381;256;8192;64;4;92;2047;9124593
1505165382;256;1024;64;4;4;1;921785037
1505165424;1024;1;256;1;8188;1;41472900148
1505165431;16;1;4;1;1;178;6016833778
1505165431;64;1024;4;1;1;89;118886963
1505165431;256;256;8;1;356;92;86452000
1505165431;256;8192;4;1;4;2047;103743111
1505165432;256;8192;1;2;4;2047;206629482
1505165432;256;64;64;4;4;2047;8892148
1505165432;256;8192;64;16;4;356;18446744073709551615
1505165434;1024;1;1;1;8188;1;978529926
1505165434;256;8192;64;2;4;4094;13129482
1505165434;256;1024;64;4;4;2047;6816889
1505165434;4096;256;16;2;23;92;21929777
1505165434;256;8192;256;4;4;89;18446744073709551615
1505165435;16;8192;2;4;4;2047;53185037
1505165435;256;8192;128;4;4;356;18446744073709551615
1505165436;32;128;1;1;2047;46;787089334
1505165436;512;1024;16;256;23;356;18446744073709551615
1505165436;1024;128;128;8;356;46;18446744073709551615
1505165452;8;1;8;1;2047;92;15088052889
1505165455;128;1;32;1;4;8188;2853153037
1505165455;256;2;64;1;4;2047;182282815
1505165456;256;8192;64;4;4094;46;180987704
1505165457;256;8192;64;4;4;1;912767556
1505165457;256;8192;64;4;89;4094;16222222
1505165457;512;8192;128;4;46;4094;18446744073709551615
1505165458;256;8192;64;2;1;356;10563260
1505165459;2;256;1;1;1;2;851065925
1505165461;2;32;1;2;92;23;1672138074
1505165563;1;1;1;1;92;4;102104242519
1505165564;1;8192;1;8;178;356;262102667
1505165564;512;8192;64;8;1;4094;18446744073709551615
1505165564;256;8192;64;4;46;356;11670519
1505165564;1024;8192;64;2;2;2047;6966814
1505165565;256;8192;32;2;46;2047;11154370
1505165565;256;1;64;1;4;178;590407259
1505165566;256;8192;16;2;4;2047;13852445
1505165566;256;8192;64;256;4;2047;18446744073709551615
1505165566;256;8192;64;16;23;2047;18446744073709551615
1505165566;256;8192;64;1;2;2047;7004593
1505165567;256;8192;64;4;2;23;61678222
1505165567;256;8192;32;4;4;23;26760741
1505165567;4096;8192;32;4;4;356;8554371
1505165567;512;4096;64;4;4;356;9666370
1505165567;256;4096;64;4;4;356;9699852
1505165576;16;1;16;1;8188;89;8457237926
1505165576;32;4096;1;32;89;92;104198667
1505165578;8;4096;1;1;1;4094;838277778
1505165579;1;128;1;128;89;89;1455145333
1505165579;256;16;1;16;2047;23;60540741
1505165580;128;8192;64;4;4;356;9752445
1505165580;1;4096;1;32;92;8188;128064148
1505165668;1;32;1;32;1;92;87312250667
1505165674;1024;2;8;2;356;8188;6044960741
1505165674;512;8192;64;4;23;2047;10297185
1505165676;1;8192;1;16;2047;23;1545004445
1505165677;512;1;8;1;4094;23;331446371
1505165677;128;512;8;256;4;178;18446744073709551615
1505165677;256;8192;128;16;4;2047;18446744073709551615
1505165677;256;8192;32;8;4;356;9031260
1505165678;256;1;64;1;2;356;522268592
1505165678;256;8192;64;4;23;356;11350222
1505165679;256;8192;64;2;1;2047;7446370
1505165679;32;8192;1;4;46;2047;145553186
1505165679;64;8192;64;4;4;4094;6782667
1505165679;128;8192;64;4;4;178;11597037
1505165680;256;8192;64;8;1;4094;18446744073709551615
1505165680;1024;8192;64;4;4;356;9921185
1505165680;256;8192;64;8;4;92;18446744073709551615
1505165680;256;2048;128;4;4;2047;18446744073709551615
1505165680;256;8192;16;8;4;356;8096741
1505165681;256;2048;64;4;4;356;9754962
1505165681;512;8192;64;2;1;2047;8032592
1505165681;256;8192;32;8;1;2047;15366815
1505165682;256;1;32;1;4;2047;739461926
1505165682;256;4096;64;4;4;178;12126963
1505165683;512;8192;64;2;4;2047;8477778
1505165683;128;8192;128;4;4;2047;18446744073709551615
1505165683;256;8192;128;4;23;2047;18446744073709551615
1505165683;256;8192;64;32;2;4094;18446744073709551615
1505165684;64;8192;2;8;1;2047;225974074
1505165684;256;8192;32;4;4;8188;24718074
1505165684;256;4096;16;2;4;2047;13754666
1505165685;32;8192;2;4;4;8188;197487704
1505165685;256;8192;16;2;4;4094;26390518
1505165685;128;2048;64;4;4;2047;7318075
1505165685;128;2048;64;32;4;2047;18446744073709551615
1505165686;256;1;64;1;23;356;559257037
1505165686;256;8192;64;1;1;178;12413037
1505165686;256;8192;64;4;2;4094;13491851
1505165687;256;8192;16;8;4;2047;8591704
1505165687;256;8192;64;2;4;178;11975112
1505165690;1;32;1;1;23;356;3133342222
1505165692;256;512;8;32;1;1;1538933037
1505165790;1;1;1;1;92;92;97416270963
1505165801;1;8;1;1;4;4;10606470667
1505165801;128;64;128;1;178;8188;25014074
1505165803;1024;1;1;1;8188;89;1594834667
1505165803;512;8192;64;4;46;356;11251704
1505165803;1024;8192;128;1;1;178;17422518
1505165804;64;1024;4;1;92;356;155204740
1505165804;256;16;16;2;356;92;57564296
1505165815;1024;256;128;2;8188;1;10355051260
1505165815;4096;256;16;2;23;1;562280889
1505165819;32;1;2;1;23;46;3327468296
1505165819;512;1024;16;256;46;178;18446744073709551615
1505165821;8;128;1;128;356;8188;1218461926
1505165821;1;8192;1;4;4;2047;114612740
1505165821;256;8192;64;4;2047;2047;25889482
1505165822;256;8192;64;4;1;2047;8010519
1505165824;256;32;4;4;1;2047;1902197926
1505165824;256;8192;64;32;4;2047;18446744073709551615
1505165824;256;8192;64;64;4;46;18446744073709551615
1505165837;8;1;2;1;2047;92;13101010223
1505165838;128;256;1;1;92;89;477482223
1505165884;1;256;1;128;1;23;45575869333
1505165987;1;1;1;1;89;4;102119592741
1505165987;1024;8192;64;4;4;4094;13149778
1505165993;256;1;4;1;1;2047;5511640296
1505165993;256;8192;2;4;4;2047;53243555
1505165993;256;8192;32;4;4;89;11610519
1505165994;256;1;64;1;8188;2047;403792296
1505165994;256;16;64;8;4;2047;18446744073709551615
1505165994;256;8192;16;4;4;356;7681777
1505166018;2048;1;2;1;178;4094;23176037629
1505166064;16;1;4;1;1;1;45189133481
1505166064;32;4096;1;32;89;1;118547556
1505166065;8;4096;4;64;1;92;288016444
1505166065;2048;256;8;2;178;89;38450666
1505166065;8192;16;1;16;8188;46;53983852
1505166068;4;8;1;4;4;2047;2624944889
1505166069;256;8192;64;1;8188;2047;403380445
1505166069;512;8192;32;16;4;8188;18446744073709551615
1505166160;1;1;1;1;92;8188;90310261481
1505166160;8192;32;1;32;4;1;229938223
1505166160;8;512;8;128;356;8188;18446744073709551615
1505166160;4096;128;4;16;2047;23;26721926
1505166161;256;8192;2;2;4;2047;103636889
1505166161;256;8192;4;4;4;2047;26952296
1505166256;1;1;1;1;46;46;94472550814
epoch;GLOBAL_SIZE_0;GLOBAL_SIZE_1;LOCAL_SIZE_0;LOCAL_SIZE_1;cost
1505166272;4;1;4;1;9402520000
1505166272;256;64;16;64;18446744073709551615
1505166281;4;1;1;1;9293197037
1505166282;8192;32;1;8;193285333
1505166282;8;256;8;1;30600592
1505166282;32;4096;8;4;15079259
1505166282;128;16;32;2;24042371
1505166285;2;8;1;1;2255209630
1505166285;4096;2;2;1;120944148
1505166285;32;4096;16;4;10059556
1505166287;32;1;16;1;1468846222
1505166287;1;4096;1;16;96086222
1505166288;32;8192;8;2;16381037
1505166288;16;8192;16;4;9808000
1505166288;32;4096;32;2;7756889
1505166288;32;4096;32;4;7195556
1505166288;32;2048;32;2;7785630
1505166290;32;1;32;1;1501049185
1505166290;32;8192;32;1;8966815
1505166290;16;256;16;4;13689333
1505166291;256;1;16;1;190837778
1505166291;16;4096;1;4;75316740
1505166291;4;4096;1;4;76097037
1505166292;4;256;2;2;70241333
1505166292;32;64;32;4;24569037
1505166292;16;256;2;64;37601629
1505166292;4;2048;2;4;43682075
1505166293;1;2048;1;64;71903259
1505166293;16;32;4;2;97101777
1505166293;16;64;1;4;76545926
1505166293;64;4096;32;4;7562371
1505166294;16;4096;1;2;140013037
1505166294;32;8192;32;8;6000000
1505166294;64;2048;32;4;7801334
1505166294;32;4096;32;8;6433333
1505166296;32;1;32;1;1493138222
1505166296;16;2048;1;64;218732740
1505166297;32;8192;16;8;9555852
1505166297;64;8192;32;8;6579111
1505166297;256;8192;16;16;6270518
1505166297;32;8192;16;4;9837629
1505166297;16;2048;2;2;70065630
1505166298;16;4096;1;8;59440741
1505166307;4;1;1;1;9285833630
1505166307;128;8192;32;8;5602963
1505166308;128;2048;32;8;6781037
1505166308;128;8192;32;16;18446744073709551615
1505166308;32;8192;32;4;6884296
1505166308;128;1;64;1;380303259
1505166310;2;16;1;1;1128455407
1505166310;16;64;1;8;54548592
1505166310;2;8192;1;8;63927852
1505166311;128;8192;8;1;29290222
1505166311;128;1;64;1;381921630
1505166311;64;2048;32;2;8009778
1505166311;128;8192;32;4;6821037
1505166312;64;8192;32;4;7418371
1505166312;128;1;32;1;372997778
1505166312;128;8192;16;8;7412889
1505166313;128;8192;8;32;11897777
1505166313;1024;256;2;1;117072593
1505166313;4096;8192;1;32;43975407
1505166313;4096;512;128;64;18446744073709551615
1505166314;4;2048;4;8;15584296
1505166314;256;1;64;1;191986815
1505166314;128;8192;32;32;18446744073709551615
1505166314;1024;8192;32;8;3955851
1505166315;1024;4096;16;8;5157926
1505166315;2048;8192;32;8;3921185
1505166315;1024;4096;32;4;5886370
1505166315;1024;8192;16;4;4977037
1505166315;2048;2048;32;8;4751407
1505166315;1024;8192;64;8;18446744073709551615
1505166316;2048;1;16;1;26857037
1505166316;2048;8192;64;8;18446744073709551615
1505166316;2048;4096;64;16;18446744073709551615
1505166316;2048;8192;32;16;18446744073709551615
1505166316;4096;4096;32;8;7899111
1505166317;2048;2048;32;16;18446744073709551615
1505166317;128;8192;64;8;18446744073709551615
1505166317;8192;8192;32;16;18446744073709551615
1505166317;4096;8192;16;8;8211703
1505166317;4096;1;32;1;24785630
1505166318;2048;1024;32;2;7202222
1505166318;2048;8192;32;32;18446744073709551615
1505166318;2048;4096;32;4;3966518
1505166318;4096;2048;32;8;4034667
1505166318;8192;1;32;1;9036296
1505166319;2048;1;32;1;25552888
1505166319;512;8192;32;8;3828741
1505166319;2048;8192;16;8;4578370
1505166319;512;4096;16;8;6824593
1505166319;512;8192;64;8;18446744073709551615
1505166319;1024;4096;32;8;4499259
1505166320;256;8192;32;8;4889482
1505166320;512;8192;32;16;18446744073709551615
1505166320;512;8192;32;4;3852445
1505166320;256;1;32;1;191036444
1505166321;512;2048;16;8;7057334
1505166321;1024;1;32;1;49922222
1505166321;512;8192;32;2;3866963
1505166321;512;8192;128;8;18446744073709551615
1505166322;512;1;64;1;96392741
1505166322;512;1;32;1;96664592
1505166322;16;2048;16;8;9407852
1505166322;512;8192;16;8;4866370
1505166323;512;8192;16;32;18446744073709551615
1505166323;512;8192;2;8;27720000
1505166323;256;2048;32;8;6232889
1505166323;1024;1;32;1;49814814
1505166324;64;16;16;4;59665186
1505166324;512;1;32;1;96413038
1505166324;512;1;32;1;96390223
1505166324;512;1024;32;4;7110963
1505166325;512;1;128;1;97669778
1505166325;128;1;32;1;373622667
1505166325;512;4096;32;8;4960592
1505166326;256;8192;32;16;18446744073709551615
1505166326;512;8192;16;16;5615704
1505166326;512;4096;32;16;18446744073709551615
1505166326;1024;2048;32;8;5421038
1505166326;512;8192;32;32;18446744073709551615
1505166327;256;4096;32;8;5731852
1505166327;128;1;32;1;380513630
1505166327;8192;128;32;64;18446744073709551615
1505166328;8;256;2;8;29425926
1505166328;512;8192;32;1;7399407
1505166328;512;8192;1;8;47437333
1505166328;128;8192;64;4;5571852
1505166328;512;2048;32;8;5633037
1505166329;512;1;8;1;95450223
1505166329;512;1;16;1;95994519
1505166329;512;8192;128;4;18446744073709551615
1505166329;512;8192;8;8;8976445
1505166330;512;4096;8;8;10382519
1505166330;512;8192;16;4;4936889
1505166330;4096;8192;32;32;18446744073709551615
1505166330;64;8192;2;8;42361926
1505166331;64;1;16;1;737177185
1505166331;64;4096;16;8;9239852
1505166331;512;8192;64;4;3810666
1505166332;256;8192;32;4;6243408
1505166332;512;4096;64;16;18446744073709551615
1505166332;512;1;64;1;96428593
1505166332;512;4096;64;4;4257333
1505166333;64;1;1;1;744405926
1505166333;1024;8192;64;4;3896593
1505166334;512;8192;64;1;3939408
1505166334;512;8192;64;2;3880148
1505166334;256;8192;64;8;18446744073709551615
1505166334;512;4096;64;8;18446744073709551615
1505166334;2048;8192;64;2;3867259
1505166335;512;8192;256;4;18446744073709551615
1505166335;8;32;8;2;158511260
1505166335;1;4096;1;2;141432000
1505166336;8;64;2;4;95462666
1505166336;128;1;4;1;371786666
1505166336;256;2048;64;4;6203556
1505166336;2048;8192;64;4;3844889
1505166337;1024;2048;64;4;5067259
1505166337;512;32;8;16;12556445
1505166337;512;8192;64;32;18446744073709551615
1505166337;256;8192;128;4;18446744073709551615
1505166338;2048;1;128;1;26509778
1505166338;256;8192;64;1;4224593
1505166338;8192;32;8;1;31460889
1505166338;8192;8192;64;4;3931704
1505166338;512;8192;4;4;16708444
1505166339;512;1;64;1;96671259
1505166339;512;2048;64;4;5382074
1505166339;128;8192;1;4;88902963
1505166339;64;2048;16;1;14890223
1505166340;2048;8;2;4;67034519
1505166340;32;128;2;4;44552148
1505166340;128;4;32;1;94347259
1505166341;1;8192;1;1;234533333
1505166341;512;4096;64;1;6536148
1505166341;512;8192;8;2;15559556
1505166341;512;1024;64;8;18446744073709551615
1505166341;256;1;64;1;192642519
1505166342;2048;8192;64;32;18446744073709551615
1505166342;64;4096;32;2;7794815
1505166342;1024;4096;64;8;18446744073709551615
1505166342;512;8;4;4;21657334
1505166343;2048;4096;64;4;3901037
1505166343;128;1;64;1;381633186
1505166343;512;8192;256;16;18446744073709551615
1505166353;1;4;1;2;9030166815
1505166353;512;32;64;8;18446744073709551615
1505166353;1;8192;1;4;83408741
1505166353;512;2;64;1;48811259
1505166354;1024;1;16;1;48547556
1505166354;256;8192;64;4;4177778
1505166354;1024;1;64;1;49042370
1505166354;512;4096;128;4;18446744073709551615
1505166355;256;8192;16;2;7398074
1505166355;512;8192;128;1;3877037
1505166355;512;8192;1;4;75194667
1505166355;512;8192;256;2;18446744073709551615
1505166355;16;128;4;4;27069778
1505166356;256;8192;256;4;18446744073709551615
1505166356;128;8192;2;16;39611852
1505166356;128;1;32;1;373815259
1505166357;16;512;16;2;8943111
1505166357;16;2048;2;4;42818371
1505166357;64;128;2;32;41086074
1505166357;128;4096;64;4;6270371
1505166358;4096;8192;64;4;3826963
1505166358;512;8192;4;32;20130963
1505166358;64;64;4;16;20052148
1505166358;256;8192;64;2;5943259
1505166358;1024;8192;128;4;18446744073709551615
1505166359;1024;8192;32;4;7929481
1505166359;1024;8192;32;2;7981629
1505166359;1024;4096;64;4;7843407
1505166359;1024;4;1;1;314755704
1505166360;512;4096;32;4;6538963
1505166360;512;1024;128;4;18446744073709551615
1505166360;512;2048;64;2;6913630
1505166360;256;1024;64;4;6668296
1505166360;32;128;32;32;18446744073709551615
1505166361;4;512;4;128;18446744073709551615
1505166361;512;128;256;128;18446744073709551615
1505166361;256;2048;256;256;18446744073709551615
1505166361;128;64;8;16;14562518
1505166361;512;256;64;4;7157925
1505166362;512;16;8;8;13267259
1505166362;512;4096;64;2;6666518
1505166362;256;1;128;1;193727407
1505166362;64;8192;64;4;5888296
1505166363;512;1024;64;2;7318519
1505166363;2048;2048;64;4;4161037
1505166363;512;1;256;1;99920297
1505166363;512;8192;8;4;8142074
1505166363;128;64;8;8;11706222
1505166364;128;128;32;32;18446744073709551615
1505166364;16;16;8;8;185190074
1505166364;1;256;1;16;154710666
1505166365;4096;8192;1;16;37263111
1505166369;4;2;4;1;4678922074
1505166370;512;1;128;1;97049629
1505166370;128;8192;64;1;6710519
1505166370;512;4;64;4;30071259
1505166371;1024;16;1;4;136433778
1505166371;512;1;16;1;96713482
1505166371;512;32;4;8;21980000
1505166371;256;4096;64;4;5388148
1505166372;256;1;8;1;186772444
1505166372;64;32;32;8;31730519
1505166372;1;128;1;2;301884000
1505166373;2;4096;2;4;47712889
1505166375;1;16;1;4;2261296444
1505166375;256;1;64;1;190323111
1505166376;512;32;8;8;11884000
1505166376;512;8192;2;4;41890371
1505166376;1024;8;8;2;19553482
1505166376;64;4096;64;2;7747852
1505166377;512;8;1;2;154061185
1505166377;4;4096;4;4;20911259
1505166377;1;2048;1;1;236072741
1505166378;16;32;4;4;92457778
1505166378;512;128;64;4;7402519
1505166378;512;32;64;4;5925926
1505166378;2048;8192;32;4;3855408
1505166379;512;8192;128;2;3822074
1505166379;16;64;4;4;50427556
1505166379;1024;4096;32;1;7414815
1505166379;4096;8192;1;16;37237333
1505166380;64;512;1;64;199236889
1505166380;2048;8192;128;4;18446744073709551615
1505166381;16;4;16;4;737384000
1505166381;512;8192;64;128;18446744073709551615
1505166381;512;8192;64;64;18446744073709551615
1505166381;64;8192;64;8;18446744073709551615
1505166382;512;1024;64;4;6327111
1505166382;4;64;4;8;148378667
1505166382;1;4096;1;2;141470370
1505166383;32;64;1;4;87407408
1505166383;128;1;64;1;381860148
1505166384;512;8192;64;1;3931259
1505166384;1;64;1;4;567449482
1505166385;512;2048;256;4;18446744073709551615
1505166385;512;1;64;1;96246074
1505166385;512;2048;64;8;18446744073709551615
1505166385;4;8192;1;1;234111111
1505166386;512;8192;64;256;18446744073709551615
1505166386;512;2048;16;1;14734815
1505166386;32;32;2;1;135341334
1505166386;32;128;8;4;14670222
1505166387;16;4;16;1;722489334
1505166388;512;1;64;1;96276445
1505166388;4;8192;1;4;75782223
1505166388;512;2048;8;4;10131408
1505166388;128;8192;2;4;41920148
1505166389;4;64;4;2;147518963
1505166389;64;512;4;2;31384000
1505166389;1;2048;1;4;85718074
1505166390;1;512;1;128;282163852
1505166390;512;128;1;2;139979704
1505166390;256;2048;2;256;18446744073709551615
1505166390;256;8192;8;16;10740444
1505166391;512;8;64;4;16055555
1505166391;1;1024;1;16;49344740
1505166391;16;8192;16;4;10046074
1505166391;256;2;4;1;124274222
1505166392;8;256;1;1;242048296
1505166392;16;8192;2;4;41952148
1505166392;512;256;64;256;18446744073709551615
1505166392;512;2048;2;4;41898518
1505166394;32;1;8;1;1465983408
1505166394;4096;1;32;1;14252149
1505166395;512;1024;1;1;233913037
1505166395;1024;4096;256;4;18446744073709551615
1505166432;1;1;1;1;36118816593
1505166432;64;32;16;4;24848741
1505166432;16;64;4;4;51196741
1505166432;1;4096;1;1;235180741
1505166433;2048;8192;64;64;18446744073709551615
1505166433;8;8192;4;64;27012741
1505166433;4096;1;1;1;244285333
1505166434;64;64;1;64;58493333
1505166434;8;2048;4;1;59265334
1505166434;1;256;1;2;172119556
1505166434;512;4;64;4;30092297
1505166435;4096;8192;1;4;75297037
1505166435;128;1;64;1;381659704
1505166436;1024;2048;1;1;233901629
1505166436;1;1024;1;32;52981778
1505166436;32;4096;8;8;14805333
1505166436;128;4;128;4;18446744073709551615
1505166437;16;8192;16;8;9301185
1505166437;4;64;1;1;244042667
1505166437;512;512;8;4;12608445
1505166438;1;512;1;2;138877630
1505166438;512;1;2;1;126668889
1505166438;1;512;1;128;280420593
1505166439;512;128;1;1;234094815
1505166439;512;1;64;1;96551852
1505166439;256;16;256;8;18446744073709551615
1505166440;1;8192;1;16;102309482
1505166440;16;1024;1;4;75577926
1505166440;2048;8192;1;4;75275259
1505166440;256;1;4;1;190661333
1505166441;8;256;4;1;61313333
1505166441;32;4096;8;2;17642815
1505166441;16;256;1;128;79416592
1505166441;8;8192;4;4;18927556
1505166442;512;8192;2;64;46244296
1505166442;64;8;1;2;141100296
1505166452;4;1;4;1;9398029777
1505166453;1;32;1;1;1128044741
1505166458;8;1;1;1;5009155851
1505166458;16;4096;2;4;42003408
1505166459;16;64;16;4;46542963
1505166459;64;4096;1;1;233942963
1505166459;1;4096;1;16;112725926
1505166460;64;64;1;1;236963852
1505166460;1;8192;1;4;83200593
1505166460;32;8192;1;4;75240740
1505166461;512;2048;64;1;7418222
1505166461;4;128;4;8;74236148
1505166461;1;8192;1;2;141268000
1505166462;4096;8192;1;1;234001778
1505166462;128;256;128;4;18446744073709551615
1505166462;4;8192;2;4;43332297
1505166462;4096;16;64;4;7737926
1505166463;512;2048;1;1;233902370
1505166463;1;128;1;32;402950518
1505166464;32;128;1;128;57724000
1505166473;1;4;1;4;9037420888
1505166473;512;16;64;4;8770518
1505166473;16;32;16;8;95116741
1505166474;4;64;2;2;154721333
1505166475;16;4;4;2;716427111
1505166484;1;4;1;4;9040721778
1505166484;1;512;1;1;242340889
1505166485;1;128;1;64;674791407
1505166485;256;2048;256;1;7685778
1505166486;256;1;1;1;257932741
1505166486;512;4096;1;4;75200593
1505166487;16;8192;1;1;233982815
1505166487;256;2;4;1;124176889
1505166487;8;256;1;1;241885333
1505166488;128;2;64;1;190456445
1505166488;256;8192;64;1;4928296
1505166488;512;512;64;4;6836592
1505166488;512;64;64;4;7449333
1505166489;32;2;16;1;733386667
1505166490;4096;1;32;1;14409333
1505166490;64;512;1;2;140159703
1505166490;4;4096;2;4;43622370
1505166490;256;2048;16;64;18446744073709551615
1505166490;4096;32;256;8;18446744073709551615
1505166491;128;64;16;4;9730222
1505166491;1024;4096;32;32;18446744073709551615
1505166491;4096;2048;1;16;37647852
1505166491;64;2048;1;64;179091852
1505166528;1;1;1;1;36135105778
1505166529;1;8192;1;1;234542370
1505166529;512;64;64;1;8719111
1505166529;512;256;128;4;18446744073709551615
1505166530;128;1;16;1;371415407
1505166530;512;512;16;1;14760740
1505166531;1;64;1;4;567480444
1505166531;512;1024;64;64;18446744073709551615
1505166531;2048;128;64;4;7046667
1505166531;512;128;1;4;88449926
1505166533;8;4;4;1;1258806815
1505166533;16;8192;16;1;15175852
1505166543;4;1;4;1;9416883852
1505166543;16;512;1;1;235937630
1505166543;512;8192;1;32;61865333
1505166545;2;16;2;16;1323179852
1505166581;1;1;1;1;36115005186
1505166582;1;128;1;2;297927407
1505166582;256;512;256;1;8120000
1505166582;1;8192;1;16;102524444
1505166583;1;1024;1;1;238095703
1505166583;2048;8192;1;4;75277629
1505166583;256;2;4;2;103100000
1505166584;128;1;1;1;372285185
1505166584;512;8192;1;4;75195852
1505166584;512;8192;64;16;18446744073709551615
1505166585;512;1024;128;8;18446744073709551615
1505166585;128;1;64;1;380338815
1505166585;1024;1;32;1;49393481
1505166586;64;512;64;4;7100148
1505166586;128;4096;64;16;18446744073709551615
1505166586;2048;8192;64;16;18446744073709551615
1505166586;512;512;128;2;7324000
1505166586;4096;8192;16;4;4575852
1505166587;256;8192;16;4;6494519
1505166587;128;8192;16;1;14680296
1505166587;4096;8192;32;4;3845185
1505166587;256;4096;64;16;18446744073709551615
1505166588;512;2048;32;1;7447111
1505166588;1024;4096;128;4;18446744073709551615
1505166588;256;4096;64;2;6839555
1505166588;1024;4096;64;1;4068000
1505166588;2048;8192;32;2;3883408
1505166589;128;2048;128;4;18446744073709551615
1505166589;2048;4096;64;2;7967259
1505166589;256;2048;64;1;8162815
1505166589;512;4096;128;8;18446744073709551615
1505166589;256;8192;128;2;7923407
1505166590;512;1;128;1;110035407
1505166590;256;8192;128;8;18446744073709551615
1505166590;128;8192;128;2;5993185
1505166590;512;2048;16;4;7197926
1505166591;512;2048;128;4;18446744073709551615
1505166591;512;1024;64;32;18446744073709551615
1505166591;32;8192;4;8;23542074
1505166591;2048;8192;256;4;18446744073709551615
1505166592;16;4096;16;4;10044593
1505166592;1024;8192;64;2;3934666
1505166592;512;2048;256;2;18446744073709551615
1505166592;256;4096;256;4;18446744073709551615
1505166592;512;1024;256;16;18446744073709551615
1505166593;4096;8192;64;1;3961778
1505166593;512;2048;32;4;6858223
1505166593;1024;8192;256;4;18446744073709551615
1505166593;128;2048;64;4;6712000
1505166594;256;2048;64;8;18446744073709551615
1505166594;64;4096;64;8;18446744073709551615
1505166594;256;8192;64;16;18446744073709551615
1505166594;1024;2048;64;8;18446744073709551615
1505166594;2048;1;64;1;25487111
1505166595;1024;8192;16;2;7464444
1505166595;512;1;32;1;96408889
1505166595;1024;1;256;1;49234815
1505166596;256;1;32;1;191547111
1505166596;128;8192;64;2;8115704
1505166596;64;128;1;1;249856593
1505166596;16;2048;8;4;15122074
1505166597;4096;2048;32;128;18446744073709551615
1505166597;16;8192;1;2;139935704
1505166597;512;8192;1;1;233897185
1505166598;64;4096;2;4;41872741
1505166616;1;2;1;1;18030853482
1505166617;64;32;64;4;31226814
1505166617;8;64;1;4;100089482
1505166617;1024;16;64;2;7859407
1505166618;1024;4096;1;1;233897629
1505166618;4096;4096;1;16;37223704
1505166619;1;64;1;1;577892593
1505166619;4;2048;1;2;140998667
1505166656;1;1;1;1;36118632741
1505166656;4096;1;1;1;240873186
1505166656;128;16;1;4;87706370
1505166656;512;64;16;1;17218815
1505166657;1;1024;1;2;146961333
1505166658;32;1;8;1;1465150667
1505166659;1;2048;1;1;236066963
1505166659;64;16;4;1;64465037
1505166659;8192;8192;64;32;18446744073709551615
1505166660;64;64;32;2;13193333
1505166662;1;16;1;2;2259348000
1505166662;16;2048;4;4;24602963
1505166663;1;1024;1;1;238123556
1505166663;512;512;4;4;20911112
1505166663;512;8192;8;1;29284889
1505166664;512;1024;1;1;233916148
1505166664;8192;8192;256;64;18446744073709551615
1505166664;32;8192;8;16;14535112
1505166664;1;1024;1;16;47040148
1505166674;4;1;1;1;9278398223
1505166674;256;32;64;2;10068592
1505166674;8;256;2;8;28257037
1505166674;32;4096;8;1;29362222
1505166675;32;8;1;1;259452148
1505166675;2;8192;1;4;83331111
1505166675;256;1;32;1;191494667
1505166679;16;1;16;1;2977502074
1505166679;4;4096;4;2;32032296
1505166679;1;256;1;1;240902667
1505166680;4;2048;1;128;162797629
1505166680;64;8;16;4;94858519
1505166680;1024;64;16;2;10437926
1505166680;1024;1024;32;1;7548741
1505166681;4096;4096;1;1;233970075
1505166681;1;8192;1;4;83718074
1505166681;8;8192;2;4;42433926
1505166682;2;8192;2;2;77395407
1505166682;64;1;1;1;735692740
1505166683;4;2048;4;1;59917926
1505166683;1;4096;1;2;141480297
1505166683;128;8192;1;4;75200000
1505166684;128;16;1;4;89678074
1505166684;128;2048;16;1;14714074
1505166684;64;2048;2;32;59152297
1505166685;32;2;1;1;736883407
1505166685;128;4;2;1;128461481
1505166686;16;8192;16;32;18446744073709551615
1505166687;64;2;32;1;372915111
1505166690;16;1;16;1;2965320592
1505166690;16;1024;4;4;24961334
1505166690;8192;1024;64;1;8738815
1505166691;128;1;128;1;383712148
1505166691;512;8192;128;16;18446744073709551615
1505166691;256;1024;64;2;7692593
1505166691;256;512;32;4;7401629
1505166692;512;1;128;1;97933926
1505166692;512;256;64;128;18446744073709551615
1505166692;4096;4096;256;4;18446744073709551615
1505166693;512;128;256;2;18446744073709551615
1505166693;256;1;256;1;199309334
1505166693;1;8192;1;16;101808593
1505166693;1;1024;1;16;48986074
1505166694;2048;4096;64;8;18446744073709551615
1505166694;512;256;64;16;18446744073709551615
1505166694;2048;2048;128;4;18446744073709551615
1505166694;1024;8192;64;1;3997630
1505166695;2;8192;2;4;47888148
1505166695;256;1;64;1;188751852
1505166695;8;32;2;8;165388741
1505166695;4096;4096;4;4;16781185
1505166696;4096;4096;32;128;18446744073709551615
1505166696;2048;8192;1;2;139814519
1505166696;4;8192;4;1;72221630
1505166698;1;32;1;1;1128265333
1505166698;64;64;16;4;14686371
1505166698;4096;64;1;1;234110370
1505166699;2;4096;2;1;131121482
1505166699;256;4096;1;16;55105630
1505166699;64;8192;4;4;16884741
1505166699;32;8192;2;4;41874370
1505166700;64;64;1;64;62780296
1505166700;4;2048;1;8;56410667
1505166700;2;8192;2;1;130083111
1505166700;128;1024;1;4;75247259
1505166703;1;16;1;4;2261352592
1505166703;128;1;16;1;371713333
1505166704;2048;1024;8;32;12689037
1505166705;32;1;8;1;1463136445
1505166706;4096;8192;128;4;18446744073709551615
1505166706;512;512;64;256;18446744073709551615
1505166706;128;1;2;1;376252592
1505166706;16;4096;16;1;15536444
1505166707;64;1024;32;8;7328296
1505166707;8;512;2;32;28803852
1505166707;2048;2048;32;2;6515111
1505166707;512;1024;8;1;29342074
1505166708;512;1024;32;1;7477186
1505166708;256;2048;256;128;18446744073709551615
1505166708;256;8192;2;16;37821037
1505166708;64;1024;64;16;18446744073709551615
1505166708;16;8192;1;4;75242815
1505166709;128;128;16;128;18446744073709551615
1505166709;1024;4;64;2;12773778
1505166709;8;256;2;4;41795556
1505166709;32;64;8;4;27765333
1505166710;4096;1;32;1;13526370
1505166710;1;8192;1;2;141317629
1505166710;512;64;1;4;96131556
1505166710;32;4096;2;4;41873185
1505166711;1;2048;1;2;141729778
1505166711;64;64;64;4;15976000
1505166711;128;512;16;1;14966519
1505166711;512;1;256;1;99463111
1505166712;512;8;64;1;23065926
1505166712;1024;4096;1;1;247374222
1505166712;64;64;1;16;72731556
1505166713;512;64;128;8;18446744073709551615
1505166722;4;1;4;1;9398053630
1505166723;512;8;1;4;109500296
1505166723;2;8192;1;4;83290371
1505166723;64;8192;1;4;75230963
1505166725;2;16;2;8;1175503112
1505166725;1;2048;1;1;236106223
1505166725;2048;1024;8;1;29290223
1505166726;32;128;8;8;16201629
1505166726;128;4;16;1;93852889
1505166726;16;128;16;8;24125630
1505166726;64;1024;1;8;79593630
1505166727;16;512;1;2;141541926
1505166727;2048;2048;32;256;18446744073709551615
1505166727;8192;1024;64;32;18446744073709551615
1505166727;64;4096;64;4;6602963
1505166732;8;1;2;1;5013810666
1505166733;4;2048;4;1;60826667
1505166733;256;1;128;1;192658074
1505166733;1;1024;1;16;49432741
1505166734;512;8192;256;1;3883407
1505166734;16;8192;16;2;9361185
1505166734;8192;1024;64;2;6363407
1505166734;8;256;2;128;114646519
1505166734;32;4096;8;16;14668444
1505166735;4096;2;16;1;17134074
1505166735;8192;8192;32;2;4184593
1505166735;2;512;1;4;84756741
1505166736;1;512;1;64;169836148
1505166736;64;64;1;4;81577037
1505166736;128;64;1;4;83319556
1505166736;1024;128;32;1;10824888
1505166737;128;4096;1;64;132728296
1505166738;1;64;1;64;1381384444
1505166738;4;4096;1;8;56371259
1505166739;2;8192;2;4;48039259
1505166739;1024;8192;1;4;75276000
1505166739;128;2048;1;4;75220889
epoch;GLOBAL_SIZE_0;GLOBAL_SIZE_1;LOCAL_SIZE_0;LOCAL_SIZE_1;v_TP_170;v_TP_171;cost
1505166748;8192;1;2;1;1;178;1906156445
1505166748;1024;1;64;1;2047;4094;18446744073709551615
1505166770;512;2;256;1;178;2;22511832593
1505166782;1;16;1;16;356;2;11087044741
1505166782;8;4096;8;32;4094;178;18446744073709551615
1505166782;16;64;8;64;356;356;18446744073709551615
1505166782;2;1;1;1;4094;92;18446744073709551615
1505166782;16;1;4;1;23;4094;18446744073709551615
1505166782;2048;1;32;1;89;356;18446744073709551615
1505166782;4096;16;256;2;356;8188;18446744073709551615
1505166782;4;1;4;1;356;23;18446744073709551615
1505166782;1024;1;1;1;356;4094;18446744073709551615
1505166786;8192;1;1;1;1;178;3647101185
1505166790;4096;1;2;1;1;356;3782489185
1505166798;8192;1;1;1;1;356;7287429185
1505166967;1;1;1;1;1;178;168960047407
1505166967;1;8;1;1;2047;8188;18446744073709551615
1505166967;8192;2;1;1;4094;2047;18446744073709551615
1505166969;8192;1;2;1;1;178;1907269333
1505166971;4096;1;2;1;1;178;1906574222
1505167009;2;2;2;1;2;92;36731158222
1505167010;1024;128;1;2;1;1;948299259
1505167010;32;8;1;2;2;4094;18446744073709551615
1505167013;2;128;2;1;2;1;2585813333
1505167014;512;1;1;1;356;1;1115627407
1505167015;1024;256;1;1;89;23;648378667
1505167015;256;256;4;32;2;4;124887260
1505167015;256;32;16;8;178;23;34405037
1505167015;1;1024;1;64;1;4094;18446744073709551615
1505167016;1;4;1;1;8188;4;18446744073709551615
1505167023;8;2;2;2;46;92;7518614074
1505167023;2;32;2;2;8188;178;18446744073709551615
1505167023;256;1;128;1;8188;2;18446744073709551615
1505167024;128;8;8;8;46;23;168869481
1505167051;16;1;1;1;1;2;26922281333
1505167051;2;512;2;1;8188;4;18446744073709551615
1505167051;4;8;1;1;356;4094;18446744073709551615
1505167051;1024;32;4;8;8188;1;18446744073709551615
1505167053;128;16;2;16;1;178;1242293481
1505167053;64;128;64;2;178;4094;18446744073709551615
1505167053;256;8;256;4;4;178;18446744073709551615
1505167053;16;64;4;16;1;4094;18446744073709551615
1505167053;16;1024;16;1;4;356;69095555
1505167053;8192;256;8;128;8188;46;18446744073709551615
1505167053;256;1;1;1;8188;8188;18446744073709551615
1505167053;16;4096;1;64;4094;8188;18446744073709551615
1505167053;1;1;1;1;46;2047;18446744073709551615
1505167053;4096;4096;8;32;178;178;18446744073709551615
1505167053;4096;8;8;4;356;356;18446744073709551615
1505167053;2;8192;1;1;4094;92;18446744073709551615
1505167054;4096;1;1;1;89;1;608803259
1505167055;1024;2048;1;32;1;46;294607111
1505167325;1;1;1;1;1;4;270055468148
1505167326;256;32;16;1;178;23;146867703
1505167326;256;32;1;8;178;23;153179852
1505167326;64;32;16;8;178;92;18446744073709551615
1505167326;8192;2048;64;32;2;4094;18446744073709551615
1505167329;2;128;1;1;2;1;2288499259
1505167329;512;64;1;2;356;8188;18446744073709551615
1505167329;64;256;1;1;4094;23;18446744073709551615
1505167329;2048;2;128;2;23;89;82026815
1505167329;256;8;16;8;89;23;120886074
1505167330;512;32;16;4;178;23;40715259
1505167330;256;32;32;8;356;4;201309334
1505167332;128;8;1;1;1;2;1150080889
1505167337;256;1;4;1;2;1;5547853778
1505167338;256;16;16;8;178;23;57891259
1505167338;1;1024;1;32;1;4094;18446744073709551615
1505167419;1;8;1;1;1;1;81126197185
1505167419;256;32;32;8;178;8188;18446744073709551615
1505167420;4096;512;16;8;178;23;20771555
1505167427;8;2;1;2;178;23;7319031704
1505167428;4096;1;16;1;178;1;1126857186
1505167429;4096;512;16;8;4;23;16694223
1505167429;4096;512;8;128;178;23;18446744073709551615
1505167429;4096;512;16;16;178;23;12992888
1505167429;4096;512;16;16;89;89;18446744073709551615
1505167429;4096;128;16;16;1;23;72846222
1505167430;4096;4096;16;16;178;23;13382222
1505167430;4096;32;16;16;178;23;13942963
1505167430;4;512;2;16;178;23;96180444
1505167430;4096;512;16;16;178;1;142204444
1505167431;4096;512;16;16;4;23;36403852
1505167431;4096;512;128;2;178;23;64402370
1505167431;4096;512;8;16;178;23;14920148
1505167433;2;32;1;16;178;23;1965414666
1505167433;4096;512;1;4;178;4094;18446744073709551615
1505167433;4096;512;16;16;178;356;18446744073709551615
1505167434;1024;512;128;16;178;23;18446744073709551615
1505167434;256;2;16;1;178;23;448437482
1505167435;4096;512;16;16;89;23;11219852
1505167435;4096;512;8;16;89;23;9250222
1505167435;2;512;1;32;89;23;132474963
1505167435;4096;1024;16;16;89;23;11194075
1505167436;4096;512;256;16;89;23;18446744073709551615
1505167436;4096;512;256;128;89;23;18446744073709551615
1505167436;4096;512;4;128;89;23;18446744073709551615
1505167436;4096;1;8;1;89;23;127063703
1505167436;4096;512;128;16;89;23;18446744073709551615
1505167437;4096;512;8;16;1;23;82452444
1505167437;4096;512;8;16;4094;23;18446744073709551615
1505167437;128;512;8;16;89;23;11159703
1505167437;32;512;8;16;89;23;17068889
1505167437;4096;512;8;32;89;23;7559704
1505167438;4096;512;8;1;89;23;107530370
1505167438;8192;512;8;32;89;92;18446744073709551615
1505167438;4096;512;8;32;356;23;18446744073709551615
1505167438;4096;512;128;32;89;4094;18446744073709551615
1505167438;4096;512;16;32;89;23;18446744073709551615
1505167438;4096;512;8;32;89;4094;18446744073709551615
1505167439;4096;1;8;1;89;23;127087111
1505167439;4096;512;8;1;23;23;55689037
1505167439;128;512;8;32;89;4;24390370
1505167439;4096;512;8;128;89;23;18446744073709551615
1505167439;4096;512;8;8;89;23;14813334
1505167440;4096;512;8;32;89;178;18446744073709551615
1505167440;4096;512;128;32;89;23;18446744073709551615
1505167440;4096;4;8;4;89;23;46497037
1505167440;4096;512;8;32;2;23;80771407
1505167440;64;512;8;32;89;23;10486667
1505167441;8;512;8;32;89;23;44407259
1505167441;4096;512;32;32;89;23;18446744073709551615
1505167441;4096;512;8;32;1;23;88685185
1505167441;4096;512;8;32;92;23;7318371
1505167442;4096;512;8;32;2047;23;18446744073709551615
1505167442;16;8192;8;32;92;46;12182815
1505167442;4096;512;8;32;1;23;89050222
1505167442;8;512;8;32;92;23;44540741
1505167443;4096;512;8;32;92;46;7793185
1505167443;4096;512;8;32;46;23;8498815
1505167443;1024;512;8;32;178;23;9236445
1505167443;4096;512;8;4;92;23;27330518
1505167443;4096;512;8;32;92;4094;18446744073709551615
1505167444;1;512;1;32;92;23;263024592
1505167444;4096;512;8;32;92;2047;18446744073709551615
1505167444;4096;512;32;64;92;23;18446744073709551615
1505167444;8192;64;8;32;1;23;106241481
1505167444;4096;512;8;32;23;23;8915703
1505167445;4096;512;8;32;4;23;41632445
1505167445;8192;512;8;32;2047;23;18446744073709551615
1505167445;4096;1;8;1;2;23;134524445
1505167445;4096;256;8;8;92;23;14478963
1505167446;2048;512;8;32;92;23;7520592
1505167446;32;512;8;32;92;23;14427852
1505167446;4096;1;64;1;92;23;155280445
1505167446;4096;512;2;8;92;23;45376741
1505167447;16;512;8;32;92;1;223482222
1505167447;1024;512;8;32;92;1;74700148
1505167447;4096;512;8;256;92;23;18446744073709551615
1505167448;4096;512;8;32;92;1;91048000
1505167463;2;4;2;4;92;23;15346871556
1505167464;4096;512;64;32;92;23;18446744073709551615
1505167464;4096;8192;8;16;92;23;9546518
1505167464;4096;8;8;2;92;23;58554963
1505167464;4096;512;256;4;92;178;18446744073709551615
1505167464;4096;512;8;32;178;23;9201186
1505167464;4096;512;8;1;356;23;18446744073709551615
1505167465;4096;512;256;32;92;23;18446744073709551615
1505167465;4096;512;4;64;92;23;11109778
1505167465;4096;512;8;32;92;1;85505629
1505167466;2;512;2;32;92;23;144533777
1505167466;4096;2;8;2;92;2;182448000
1505167466;1024;512;8;32;92;23;7768444
1505167466;4096;512;8;32;92;356;18446744073709551615
1505167466;8192;512;1;32;92;23;23019556
1505167467;2048;4;32;2;4;2047;18446744073709551615
1505167467;4;4;1;1;8188;46;18446744073709551615
1505167475;8;2;2;2;23;92;7975322074
1505167475;2048;32;32;8;8188;1;18446744073709551615
1505167475;4096;256;8;32;92;23;7352889
1505167475;4096;256;8;64;92;89;18446744073709551615
1505167475;4096;128;8;16;92;23;9204740
1505167475;2048;2048;8;32;92;23;7223111
1505167476;2048;2048;8;32;356;23;18446744073709551615
1505167476;2048;2048;16;32;92;4;18446744073709551615
1505167476;2048;256;8;64;89;23;18446744073709551615
1505167476;2048;4096;8;32;92;23;7304000
1505167476;256;512;4;32;356;4;25159852
1505167477;2048;2048;8;32;178;23;8961777
1505167477;2048;2048;4;32;92;23;7658963
1505167477;8192;2048;4;32;92;4;11806963
1505167477;2048;4096;16;32;92;23;18446744073709551615
1505167477;2048;1024;4;16;178;46;18446744073709551615
1505167478;2048;2048;8;32;92;46;7543407
1505167478;1024;2048;4;64;92;89;18446744073709551615
1505167478;2048;2048;8;64;92;23;18446744073709551615
1505167478;2048;2048;2;64;89;23;13888888
1505167478;2048;2048;8;16;92;23;8802963
1505167478;1024;2048;8;32;92;4;19405333
1505167479;4096;2048;8;32;92;23;7229481
1505167479;2048;2048;8;32;89;23;7450222
1505167479;2048;2048;1;256;92;4094;18446744073709551615
1505167479;2048;2048;8;32;2;23;97258223
1505167481;16;64;8;32;2;178;1957641481
1505167482;2048;2048;64;32;92;23;18446744073709551615
1505167482;512;4;16;2;4;23;143250667
1505167482;4096;2;16;2;4;92;56376741
1505167484;64;2;2;2;4;92;1096123704
1505167484;2048;2;64;1;46;178;18446744073709551615
1505167484;1;1;1;1;8188;2;18446744073709551615
1505167484;128;8;4;8;46;89;135997630
1505167546;8;1;2;1;1;2;61334336296
1505167546;2;512;2;32;8188;4;18446744073709551615
1505167546;2048;1;8;1;92;23;129665926
1505167547;2048;2048;1;32;92;23;22494223
1505167547;2048;2048;8;128;92;23;18446744073709551615
1505167547;2048;2048;8;32;92;92;18446744073709551615
1505167547;4;2048;1;32;92;23;45706223
1505167547;2048;2048;32;32;8188;23;18446744073709551615
1505167547;32;2048;8;32;92;23;12767111
1505167548;2048;2048;8;32;4;23;47923111
1505167548;2048;1;4;1;89;23;216911111
1505167548;2048;2048;16;32;92;23;18446744073709551615
1505167548;128;2048;8;32;2047;23;18446744073709551615
1505167548;128;2048;8;32;92;23;8817185
1505167549;128;8;1;1;356;2047;18446744073709551615
1505167549;1024;32;8;8;8188;1;18446744073709551615
1505167551;128;16;1;16;1;178;2419861629
1505167551;64;128;2;2;8188;4094;18446744073709551615
1505167551;2048;8;256;2;92;356;18446744073709551615
1505167554;64;2;64;2;92;46;2229636445
1505167554;8192;8;8;2;92;23;58863555
1505167554;2048;1;8;1;92;23;129272741
1505167555;2048;2048;8;1;178;23;193341037
1505167555;2048;2048;8;32;1;2;421555703
1505167556;2048;16;8;1;92;23;110572444
1505167682;1;1;1;1;4;178;125348710371
1505167682;64;256;1;16;1;4;385890074
1505167684;16;8;16;2;4;356;1285157185
1505167684;8192;256;8;128;8188;2047;18446744073709551615
1505167684;2048;2048;8;32;92;4;19379556
1505167684;1024;512;16;32;178;23;18446744073709551615
1505167684;2048;4096;8;4;92;23;27686815
1505167699;32;1;4;1;1;4;14718679407
1505167700;16;1;8;1;92;356;18446744073709551615
1505167700;2048;1;8;1;1;2047;18446744073709551615
1505167701;128;2;16;2;4;46;768255111
1505167701;2048;4;8;4;92;23;33218667
1505167701;2048;2048;64;32;89;23;18446744073709551615
1505167701;2048;2048;2;32;92;23;12540297
1505167706;32;2;1;1;2;2;4687201778
1505167706;16;2048;8;16;92;23;17418518
1505167706;512;1;1;1;356;8188;18446744073709551615
1505167707;16;4096;1;64;4;8188;18446744073709551615
1505167707;1;1;1;1;46;2047;18446744073709551615
1505167708;1;4096;1;32;1;23;1038123704
1505167711;128;2;64;2;4;23;2681257334
1505167711;1;2048;1;32;23;23;90655703
1505167711;2048;2048;8;32;92;2;38714074
1505167712;2048;2;8;2;92;23;64820889
1505167712;4096;2048;4;32;92;23;7856444
1505167712;2048;1024;8;32;92;23;7319555
1505167712;1024;2;64;2;89;92;18446744073709551615
1505167713;2048;2048;128;128;92;23;18446744073709551615
1505167713;2048;2048;8;1;92;23;107444297
1505167713;2048;2048;32;32;92;23;18446744073709551615
1505167715;128;2;64;2;23;46;1179442518
1505167715;16;64;8;1;356;356;18446744073709551615
1505167715;2;4;1;1;4094;92;18446744073709551615
1505167774;4;1;1;1;89;1;58500344444
1505167774;512;2048;8;32;92;23;7626519
1505167774;2048;2048;8;32;92;178;18446744073709551615
1505167774;2048;2048;8;32;2047;23;18446744073709551615
1505167776;1;2048;1;32;1;23;1764163111
1505167776;4096;2;64;1;1;178;49618222
1505167776;2048;2048;8;64;46;23;18446744073709551615
1505167777;4096;1024;16;32;89;23;18446744073709551615
1505167777;512;2048;8;32;46;23;8515407
1505167777;1;2;1;1;1;2047;18446744073709551615
1505167777;2048;2048;1;4;1;46;299300740
1505167777;2048;2048;8;32;92;4094;18446744073709551615
1505167779;1024;1;1;1;1;46;1075736445
1505167779;32;8;1;2;178;4094;18446744073709551615
1505167779;2;128;1;1;2;2047;18446744073709551615
1505167780;512;1;1;1;46;1;836197926
1505167780;8192;2;64;2;1;178;75860592
1505167780;2048;2048;32;32;92;4094;18446744073709551615
1505167781;2048;2;64;2;2;92;86253778
1505167781;4096;4096;8;32;2047;2;18446744073709551615
1505167781;2048;2048;8;256;1;23;18446744073709551615
1505167781;2048;2048;8;256;92;23;18446744073709551615
1505167781;2048;8;8;2;92;23;59311407
1505167782;2048;1;32;1;92;23;147680444
1505167782;4096;2;32;2;2;178;66934667
1505167782;2048;2;128;2;4;92;95009925
1505167783;2048;4;32;2;2;89;38217185
1505167783;512;2;32;2;2;92;242265185
1505167783;1024;256;1;1;89;8188;18446744073709551615
1505167783;256;256;4;256;89;4;18446744073709551615
1505167784;256;1;2;1;178;23;992897185
1505167784;1;1024;1;64;1;4094;18446744073709551615
1505167786;2;2048;2;32;1;23;916357333
1505167786;8192;2048;8;1;92;23;110668000
1505167786;1;2048;1;32;92;23;114259704
1505167786;2048;256;8;32;92;23;7821037
1505167787;1024;2048;8;32;89;23;7521926
1505167787;2048;2048;8;32;92;89;18446744073709551615
1505167787;1024;2048;2;32;1;23;160062963
1505167787;2048;2048;8;32;8188;23;18446744073709551615
1505167787;2048;2048;8;1;92;4;144789926
1505167788;2048;2048;8;128;92;4;18446744073709551615
1505167788;1;4;1;1;8188;4;18446744073709551615
1505167796;8;2;4;2;46;92;7639840741
1505167796;2;32;2;2;89;178;18446744073709551615
1505167883;256;1;128;1;1;2;87283554222
1505167884;512;2;128;2;2;178;363848593
1505167885;512;2;64;2;4;92;293977037
1505167885;2048;2048;4;32;2;23;69168741
1505167885;4096;2;16;2;2;46;48398223
1505167885;2048;1024;8;32;89;23;7556296
1505167886;2048;512;16;32;92;23;18446744073709551615
1505167886;2048;2048;8;32;4094;1;18446744073709551615
1505167886;2048;2048;256;32;92;23;18446744073709551615
1505167886;2048;512;8;2;92;23;54323111
1505168033;1;2;1;2;1;92;145895748741
1505168033;32;32;1;4;46;89;353994667
1505168210;1;1;1;1;1;46;176410450963
1505168210;2;512;2;1;8188;1;18446744073709551615
1505168211;1024;2;64;2;4;92;147588000
1505168211;2048;64;8;4;92;23;28310222
1505168211;2;2048;2;32;92;23;62609630
1505168283;1;2;1;2;2;92;71181096741
1505168283;2048;2048;16;32;89;23;18446744073709551615
1505168283;1024;2048;8;8;92;23;14553482
1505168284;1024;2;32;2;2;92;115636592
1505168284;4;8;1;1;356;4094;18446744073709551615
1505168284;1024;8;4;8;4094;1;18446744073709551615
1505168396;1;16;1;16;1;178;111217836889
1505168396;512;2048;8;32;92;4094;18446744073709551615
1505168396;64;2048;8;32;1;23;114833630
1505168396;2048;2048;8;8;92;23;14282963
1505168397;8192;2;8;2;1;92;231804149
1505168397;2048;256;8;32;23;23;9631556
1505168397;2048;2;64;2;4;92;71274519
1505168398;64;128;64;2;178;4;650628000
1505168567;1;1;1;1;1;178;168923766223
1505168572;2;256;2;16;1;4;4681562519
1505168573;8;1024;4;1;1;356;203982074
1505168573;8192;2;32;2;2;92;38682815
1505168573;256;2048;8;32;92;23;7940741
1505168574;2048;2048;8;32;92;1;73483112
1505168719;1;2;1;2;1;92;145089931259
1505168719;8192;1024;8;32;92;23;7321482
1505168720;2048;8192;8;32;178;1;73742075
1505168720;2048;2048;8;32;92;356;18446744073709551615
1505168720;2048;2048;8;2;92;23;54494074
1505168721;2048;8192;8;32;1;2;416394518
1505168722;8192;1;8;1;1;1;1329674074
1505168722;1;64;1;32;1;8188;18446744073709551615
1505168722;1;4096;1;64;1;8188;18446744073709551615
1505168722;1024;2;8;2;46;2047;18446744073709551615
1505168723;2048;2048;128;32;92;23;18446744073709551615
1505168723;2048;2048;256;1;92;23;103044593
1505168723;2048;2048;8;16;92;2;40594815
1505168723;2048;2048;8;16;89;23;9145334
1505168724;1;4096;1;32;356;23;18446744073709551615
1505168729;32;64;2;64;1;356;4969027852
1505168743;2;32;1;8;1;356;14601949778
1505168756;64;1;4;1;89;1;12486040148
1505168757;2048;2048;16;32;92;8188;18446744073709551615
1505168757;2048;8192;8;32;92;23;7588593
1505168757;2048;16;8;4;92;23;29968148
1505168757;1024;2048;64;32;1;23;18446744073709551615
1505168757;256;8;128;2;2;4094;18446744073709551615
1505168759;2;128;1;1;2;356;1201396296
1505168767;16;1;1;1;23;92;7749747556
1505168767;2048;8192;8;32;89;4;20273630
1505168767;2048;4096;8;32;89;89;18446744073709551615
1505168767;4096;4096;8;32;92;23;7350667
1505168768;1024;1;1;1;4;1;890156593
1505168769;256;256;4;4;2;1;402685481
1505168770;256;1;16;1;178;23;899897333
1505168784;1;512;1;64;1;89;14144077630
1505168785;1024;2048;8;32;4;23;41309333
1505168785;64;8;8;2;92;23;314404148
1505168785;256;2048;8;32;356;23;18446744073709551615
1505168786;2048;1;8;1;178;23;208145778
1505168786;512;2048;8;32;92;4;19468740
1505168786;1;256;1;1;8188;89;18446744073709551615
1505168786;8;2;4;2;46;178;18446744073709551615
1505168786;64;32;32;2;8188;178;18446744073709551615
1505168854;256;1;128;1;2;2;67327649629
1505168854;4096;2048;8;32;92;1;73602075
1505168854;256;2048;8;64;92;23;18446744073709551615
1505168855;2048;4096;8;32;92;46;7623111
1505168855;8192;2048;8;32;89;23;7485037
1505168855;8192;8;4;8;46;89;44516000
1505168867;16;1;1;1;1;23;12158527260
1505168880;2;512;2;64;1;2;12778599111
1505168881;1;8;1;1;356;4094;18446744073709551615
1505168881;2048;2048;8;32;2047;46;18446744073709551615
1505168881;2048;64;8;32;92;23;8370370
1505168881;2048;512;1;32;92;23;22793630
1505168881;2048;2048;8;1;8188;23;18446744073709551615
1505168881;2048;1024;8;32;356;23;18446744073709551615
1505168881;1024;2048;4;32;92;23;7950074
1505168881;2048;2048;2;32;178;46;18446744073709551615
1505168882;256;2048;8;32;178;4;21048741
1505168971;1024;1;256;1;1;1;88671698371
1505168971;128;1024;2;1;1;178;229409037
1505168975;1;128;1;2;1;4;3089336148
1505169100;1;1;1;1;4;178;125344153630
1505169101;2048;1024;4;32;92;23;7961037
1505169101;256;1024;8;32;89;23;8173333
1505169101;1;512;1;32;92;23;263337333
1505169102;2048;2048;8;4;92;23;27365778
1505169102;2048;2048;8;256;92;2;18446744073709551615
1505169102;16;2048;8;8;92;23;23229778
1505169102;2048;2048;8;4;92;4;36481778
1505169103;2048;1024;8;32;46;23;9163703
1505169103;2048;1024;8;64;92;2;18446744073709551615
1505169103;1024;2048;8;32;92;23;7309037
1505169103;2048;2048;16;32;4094;1;18446744073709551615
1505169103;2048;2048;8;32;1;23;85709334
1505169103;16;2048;8;32;4094;23;18446744073709551615
1505169103;2048;8192;8;32;4094;23;18446744073709551615
1505169104;2048;1024;16;64;89;23;18446744073709551615
1505169104;4096;2048;16;32;92;23;18446744073709551615
1505169104;64;256;1;16;1;4;385951852
1505169105;128;1024;16;1;4;356;65808000
1505169106;8192;1;8;1;1;1;1454978963
1505169106;16;1;1;1;8188;8188;18446744073709551615
1505169106;16;4096;1;64;4094;178;18446744073709551615
1505169107;1;1;1;1;1;2047;18446744073709551615
1505169165;1;64;1;32;1;23;57940618371
1505169181;32;2;2;1;1;1;15679576149
1505169240;2;32;1;32;1;356;58508114518
1505169240;4096;2;1;2;89;1;310685778
1505169241;16;2048;16;32;178;46;18446744073709551615
1505169241;32;4;1;1;2;4094;18446744073709551615
1505169241;2;128;2;1;2;178;620437333
1505169242;512;1;1;1;46;1;837536445
1505169243;1024;256;1;1;89;356;18446744073709551615
1505169243;256;256;64;32;1;4;18446744073709551615
1505169243;2048;2048;2;32;89;23;12825926
1505169243;4096;2048;8;32;92;46;7704889
1505169244;64;32;1;8;178;23;171777186
1505169301;1;32;1;16;1;89;56564926370
1505169301;1;4;1;4;8188;4;18446744073709551615
1505169302;128;2;2;2;46;92;649086370
1505169302;256;2048;8;128;92;23;18446744073709551615
1505169302;256;4096;8;16;92;23;9166814
1505169302;2048;2048;1;32;178;23;40904740
1505169302;1;32;1;8;8188;178;18446744073709551615
1505169302;256;256;128;32;2;2;18446744073709551615
1505169304;8192;8;1;1;46;89;1196670815
1505169316;16;1;1;1;1;23;12256976741
1505169317;2048;8192;4;32;92;23;8000148
1505169317;2048;128;8;32;92;23;7954074
1505169317;8192;2048;8;128;92;23;18446744073709551615
1505169317;2;512;2;256;1;2;18446744073709551615
1505169317;4;8;1;1;356;178;18446744073709551615
1505169406;1024;1;256;1;1;1;88536135259
1505169406;2;1024;2;4;1;8188;18446744073709551615
1505169407;2048;2048;8;32;356;4;23835555
1505169407;2048;2048;8;64;356;23;18446744073709551615
1505169407;2048;2048;8;32;178;4;19253185
1505169407;2;1;1;1;178;46;18446744073709551615
1505169719;1;1;1;1;4;1;311923612889
