GLOBAL_SIZE_0;GLOBAL_SIZE_1;LOCAL_SIZE_0;LOCAL_SIZE_1;TILE_0;TILE_1;cost
32;16;8;1;8;16;53175104
32;8;1;4;1;4096;100881856
8;8;2;2;8;16;261203584
8;1024;2;8;1;32;11545216
8;2048;1;64;1;8;21337536
8;1024;8;8;1;32;17921344
16;2048;16;8;1;32;19124672
1024;4;4;4;8;256;10412896
1;512;1;8;4;2048;820361088
8;1;1;1;64;8;1841637024
4;512;4;4;1;1;98126016
1024;1024;32;1;1;1;64982080
128;512;1;64;1;64;1912544
512;256;2;1;4096;256;9394366816
1024;64;4;8;128;1;48158176
1024;512;1;1;2;1;86211072
8;32;8;8;1;1;3124012576
128;512;1;64;1;8;14233152
128;512;1;64;1024;64;8627008
2048;512;1;64;4096;64;2707646080
32;64;32;4;8;4;169956928
8;1;1;1;32;64;1810299296
64;2048;4;1;4;1024;75153376
16;1;16;1;128;16;2048323136
4096;1;1;1;64;2;254630496
256;1024;1;64;1;32;3918592
128;1024;1;64;1;64;1924288
128;512;1;16;1;64;5292608
512;1024;4;1;32;4;26533440
64;1;32;1;4096;1;1734293728
64;128;4;16;4;2;31578656
4;4096;1;16;2048;64;9275456
2048;4096;1;8;512;32;11797536
128;512;1;64;1;2;55723296
512;512;1;64;1;64;1952992
512;1024;4;16;128;16;3973536
128;512;2;64;4096;64;120435488
128;1024;1;32;1;64;3181024
16;64;16;1;1;512;18446744073709551615
128;16;2;1;4096;1024;3679785536
1;2048;1;4;32;1024;815558144
4096;64;128;2;2048;128;31737632
512;512;4;1;8;4;27160320
128;512;16;2;1;4096;7772194944
128;512;1;64;4096;64;170072992
128;64;1;64;1;64;2275712
2048;1;8;1;512;2;399393440
64;512;1;64;1;64;2169408
128;512;1;64;1;32;3855680
128;512;1;128;4096;64;382040096
64;64;8;4;16;16;8191968
4096;1;4;1;512;16;18446744073709551615
8;1024;2;4;1024;512;61871328
1;2048;1;16;4;2048;425327424
16;1;1;1;16;512;904307232
128;32;64;1;1;64;194912096
128;512;8;1;1;64;18446744073709551615
128;512;4;64;1;8;37320512
512;256;8;16;128;4;43260160
32;1024;1;64;1;64;2115008
128;512;2;64;1;64;2464480
64;256;1;64;1;128;2541632
8;2048;8;2;16;256;87882752
2048;64;8;2;2;4;46518816
1;32;1;1;16;1;18446744073709551615
2;4;1;1;4096;4096;12551969888
256;512;8;32;128;8;39554016
128;512;1;256;1;64;5699680
128;512;1;1;1;64;18446744073709551615
32;512;8;32;16;64;6731488
128;512;1;32;1;64;3095200
128;2048;1;64;1;32;3707904
128;256;1;32;1;256;2634208
64;512;8;32;32;32;8439552
1024;32;128;2;4;1;3127267424
32;4096;1;256;1;32;12245024
32;2048;8;8;1;16;10721408
256;1024;2;32;1024;32;2783136
128;256;4;16;512;32;5108800
32;1024;32;2;128;64;26767360
256;1024;2;128;512;16;21127840
256;512;2;128;256;16;18957248
256;512;4;64;1024;32;13001632
128;512;1;64;8;2048;2843648
2048;128;1;1;1;8;75210944
64;512;1;64;1;512;1788640
4;512;1;64;1;512;9351232
16;512;1;64;1;256;2311232
128;512;1;64;4096;512;184151520
64;512;1;64;1;128;1961280
64;1024;1;32;1;512;3059616
64;256;1;64;1;512;2278144
64;512;1;32;1;512;3069280
128;512;1;32;1;256;2694080
64;256;1;64;1;4096;9566560
64;1024;1;64;1;512;1789408
64;512;1;64;2048;512;18575392
32;32;1;1;1;2048;18446744073709551615
128;128;1;64;1;512;2287424
64;256;1;64;1;1024;2275936
64;512;1;64;1;2048;2341824
32;128;1;64;1;512;3818336
128;128;1;16;1;512;4778400
128;512;1;64;1;4096;15338272
64;512;1;256;1;512;2132224
64;1024;16;2;256;64;14467360
64;2048;1;64;1;512;1783936
256;2048;1;64;1;512;1659392
64;2048;1;64;1;1;73532320
64;2048;2;64;1;2048;4044512
64;2048;1;64;1;2048;2335936
256;2048;1;64;4096;512;373359680
256;512;1;64;2048;1024;34835680
256;2048;1;64;2048;1024;34786208
128;2048;4;32;1;1024;5222656
512;2048;1;128;1;512;1345792
256;1;1;1;1;512;95257152
512;2048;1;64;1;512;1683456
256;4096;2;32;1;512;3049536
128;2048;1;128;1;512;1453312
256;2048;1;128;4096;512;346945184
256;2048;1;128;2048;512;10261760
512;1;1;1;1;512;71406816
1024;2048;1;128;1;512;1361440
512;2048;1;1;1;64;18446744073709551615
512;2048;1;128;1;32;5244928
512;1024;2;1;1;512;18446744073709551615
256;2048;1;128;1;256;1345984
256;1;1;1;1;512;95226336
512;2048;1;128;4096;256;670815680
512;2048;1;128;2048;512;10239968
1024;2048;2;128;4096;256;1091020352
512;2048;1;128;4096;512;850852608
512;2048;1;256;1;256;1345696
512;4096;1;128;1;512;1451392
512;1024;2;128;1;512;1959616
512;2048;1;256;1;512;1342208
1024;1024;1;64;4096;256;1435390176
1024;2048;1;256;1;512;1339520
512;2048;1;256;1;16;22214656
128;2048;1;256;1;2048;1683008
1024;2048;1;1;1;512;18446744073709551615
256;2048;1;256;4096;512;347221920
256;2048;1;256;2048;512;6524928
1024;2048;2;1;1;512;18446744073709551615
1024;1024;1;1;1;64;18446744073709551615
1024;1024;1;256;1;512;1325280
1024;2048;1;256;1;128;2596672
4096;256;2;128;1;512;1898432
1024;1024;1;64;1;1;72425632
1024;1024;1;256;1;256;1323360
256;1024;1;256;1;256;1367264
1024;1024;1;1;1;256;18446744073709551615
512;1024;2;2;1;256;33264448
1024;512;1;256;1;256;1321472
1024;128;1;1;1;256;18446744073709551615
1024;1024;2;128;1;256;2007648
1024;512;1;256;1;128;2556640
1024;512;1;256;1024;256;8785824
4096;512;1;256;1;256;1312480
2048;512;1;256;1;128;2528448
1024;512;2;2;1;256;32400192
512;512;1;256;1;256;1350624
4096;512;1;128;2048;256;18966976
1;1024;1;1;1;512;18446744073709551615
2048;512;4;2;2048;256;74404448
1024;512;2;1;4096;256;18714994144
4096;1024;1;128;1;256;1319456
4096;512;2;128;1;256;1971680
4096;512;4;2;1;256;32719424
4096;1024;1;256;1;256;1331616
2048;512;2;1;4096;256;37444601920
4096;512;2;1;1;256;18446744073709551615
4096;512;1;256;1;64;4954880
4096;128;1;1;1;1024;59486528
2048;512;1;256;1;256;1320960
4096;1024;2;128;1;256;2053664
4096;1;1;1;1;256;67536032
4096;512;1;64;1;256;1690336
2048;512;1;256;1;512;1307264
4096;1024;1;256;1;1024;1319456
4096;64;2;2;1;128;31775712
1;512;1;256;1;512;38119264
2048;256;1;256;1;512;1313568
1024;512;2;1;1;512;18446744073709551615
2048;128;1;1;1;512;18446744073709551615
2048;256;1;256;4096;512;3363619168
1;512;1;256;1;2048;37171136
2048;512;2;1;4096;512;37446458336
4096;512;1;256;1;512;1316128
2048;512;4;4;1;512;16517504
2048;256;1;64;4096;512;2839630880
2048;512;1;256;4096;512;3247876992
1024;256;1;256;4096;512;1432827232
2048;512;1;128;1;512;1305728
2048;512;2;1;1;512;18446744073709551615
1024;256;1;128;1;1024;1371648
1024;512;1;128;1;256;1328352
2048;512;2;128;1;512;1927776
2048;512;1;1;1;1024;18446744073709551615
4096;512;1;128;2048;512;18308224
256;512;1;128;1;1024;1492896
2048;512;1;128;2048;512;18326656
2048;512;1;256;1;1024;1309600
2048;1024;1;128;1;512;1301696
2048;512;1;128;1;128;1322496
4096;512;1;128;4096;512;8610184128
2048;512;2;64;1;512;1924256
4096;1024;1;128;4096;4096;86750661152
2048;1024;2;128;4096;512;2857647840
2048;2048;1;128;1;2048;1448384
2048;2048;2;64;1;128;2004672
2048;1024;1;64;1;512;1675904
2048;1024;2;1;1;512;18446744073709551615
4096;1024;1;128;1;512;1309792
1024;256;1;1;1;1024;18446744073709551615
2048;1024;1;128;1;256;1311904
4096;1024;4;1;1;512;18446744073709551615
2048;1024;1;1;4096;512;18446744073709551615
1;1024;1;128;2048;512;19931904
1;2048;1;128;1;512;20674752
2048;2048;2;128;1;128;2267712
2048;1024;1;128;2048;512;10242336
2048;1024;1;256;1;512;1329824
4096;1024;1;64;2048;512;18528320
2048;1024;1;256;4096;512;3286439584
1024;512;1;128;1;512;1324416
1024;1024;2;1;1;512;18446744073709551615
2048;2048;1;128;1;512;1383296
2048;2048;1;128;1;4096;24604256
2048;2048;1;128;4096;1024;4310769696
1024;4096;1;128;1;512;1482816
2048;1024;1;256;1;128;2571072
2048;1024;1;64;1;1024;1678720
2048;1024;1;64;1;256;1700928
4096;1024;1;128;4096;256;6211404384
4096;4096;1;128;1;512;1624992
2048;1024;1;128;1;128;1340640
2048;2048;1;64;2048;256;10225856
2048;1;1;1;1;512;59949216
2048;256;1;128;1;256;1316832
1024;1024;1;128;1;512;1313472
1024;64;1;1;512;512;18446744073709551615
2048;1024;1;128;2048;1024;18469888
2048;1024;2;128;1;512;1928960
4096;1024;1;128;4096;512;7460203104
4096;1024;4;2;1;512;34189216
2048;1024;1;128;1;2048;1370048
1;2048;1;256;1;1024;20631456
2048;128;1;128;1;512;1337440
2048;4096;1;256;1;512;1505152
2048;4096;1;128;4096;512;3908301760
2048;512;1;128;1;1024;1313632
2048;1024;2;128;1;1024;1951360
2048;256;1;128;1;512;1318144
2048;4096;1;64;1;4096;110077344
2048;256;1;128;1;2048;1338816
1024;1024;2;64;1;512;1941088
4096;512;1;128;1;128;1316704
2048;512;1;256;2048;512;18938912
1024;1024;1;256;1;2048;1334496
512;1024;1;256;1;512;1337248
2048;1024;1;1;1024;256;18446744073709551615
4096;256;1;256;1;512;1309280
512;512;1;64;1;512;1606112
2048;256;1;128;2048;128;34415168
2048;1024;1;32;1;4096;81385216
512;1024;1;128;1;256;1337120
1024;1024;1;128;1;256;1317696
512;4096;1;64;1;512;1842336
2048;1024;2;128;1024;512;3673280
2048;1024;4;64;1;512;3455232
1024;1024;2;32;1;512;2747136
1024;1024;1;128;1;1024;1327264
4096;1024;1;128;1;2048;1397600
2048;1024;1;128;1;1024;1350688
2048;1024;8;1;1;512;18446744073709551615
512;512;1;128;1;512;1357888
2048;1024;2;128;2048;512;6502880
1024;1024;1;64;1;4096;28507680
2048;2048;1;256;4096;512;2908021056
4096;1024;1;1;1;512;69870336
2048;1024;4;1;1;512;18446744073709551615
512;1024;1;128;1;512;1327360
2048;1024;1;32;4096;512;4728140736
2048;4096;1;64;1;512;2096576
4096;1024;1;128;1;1024;1354272
2048;1024;1;32;1;512;2771808
1024;1024;1;64;4096;512;1444121952
2048;1024;1;128;512;512;2896096
256;256;1;32;1;512;2634336
1;1024;1;128;1;512;20592896
2048;1024;1;128;1;1;98675840
512;256;1;128;4096;1024;912538240
2048;4096;1;32;1;512;3610272
4096;1024;1;128;4096;1024;8689671232
1;1024;1;128;4096;512;20591136
1024;1024;1;256;1;1024;1312640
4096;1024;2;128;1;512;2027200
1024;1024;1;64;1;1024;1646592
2048;512;1;128;2048;256;18897632
2048;2048;1;128;4096;512;3740489216
4096;1024;2;128;1024;512;3645984
4096;1024;1;256;2048;512;10320480
2048;2048;2;128;1;256;2143008
2048;1024;1;128;4096;2048;4412879616
256;2048;1;128;1;512;1349632
1024;512;2;32;1;2048;2768384
2048;1024;2;32;1;512;2790880
2048;2048;1;256;1;512;1353504
2048;1024;1;128;2048;256;10391040
1024;1;1;1;1;512;59988288
2048;4096;1;128;1;512;1529472
2048;1024;1;128;4096;512;3669741760
2048;1024;4;2;1;512;33568992
2048;1024;1;1;1;2048;18446744073709551615
1;1;1;1;1;512;12561021920
2048;1024;1;256;1;1024;1311648
2048;1024;1;1;1;512;18446744073709551615
2048;1024;2;64;1;512;1955040
2048;2048;1;128;1;64;2632480
1;1024;1;128;4096;512;20667936
4096;512;1;128;1;512;1296512
1;512;1;128;1;4096;127402240
4096;1024;1;32;2048;512;31393152
4096;512;1;128;1;1024;1306496
4096;512;1;32;512;512;7883680
4096;512;8;1;1;512;18446744073709551615
1;64;1;1;1;512;18446744073709551615
4096;512;1;64;1;512;1642240
2048;512;1;128;1;256;1307648
1024;256;1;128;1;512;1345280
4096;512;4;1;1;512;18446744073709551615
4096;512;2;128;1;2048;1944640
4096;128;1;128;1;512;1305024
1;256;1;128;1;512;64830432
4096;512;1;128;1;256;1304896
4096;512;1;128;1;2048;1347072
1;512;1;128;2048;512;35665120
512;128;1;128;1;512;1507616
1;512;1;64;1;1;1560495232
4096;256;1;128;4096;512;8884072896
4096;512;1;128;1;4096;5381792
2048;512;1;128;1;2048;1332320
2048;512;1;128;4096;512;4086971840
1;512;1;128;1;512;37258656
4096;512;2;128;1;128;2036320
4096;256;1;128;1;1024;1307168
4096;128;1;128;2048;1024;63378208
4096;512;2;32;1;512;2676576
4096;256;1;128;1;512;1302080
4096;512;2;128;1;512;1917408
2048;512;8;4;1;512;16452640
1;256;1;64;1;256;65710848
4096;512;1;32;1;512;2707712
4096;1024;1;128;2048;512;10236224
2048;512;1;1;1;512;18446744073709551615
4096;2048;1;128;1;512;1408928
4096;512;2;64;1;1024;1965088
4096;512;2;2;1;512;33385504
4096;4096;1;64;1;512;2296512
4096;512;1;256;4096;512;6899286560
2048;512;4;1;1;512;18446744073709551615
1024;512;1;128;1;1024;1321728
4096;512;2;128;4096;512;5693354432
4096;512;1;64;4096;256;5673586656
4096;512;2;64;1;512;1924224
4096;512;1;1;1;512;63954560
4096;128;1;64;1;512;1568384
4096;32;1;32;1;512;2630272
4096;512;1;64;1;128;1821152
1;512;1;128;1;256;40241312
4096;512;1;256;2048;1024;18428352
512;512;1;256;1;512;1362304
4096;512;1;1;1;2048;63853344
1;1024;1;256;1;512;22193472
1;64;1;1;4096;1024;18446744073709551615
4096;512;1;32;4096;512;9252395008
4096;2048;1;128;1;256;1344672
4096;512;1;128;1024;512;9205440
4096;64;1;2;2048;512;421513376
4096;512;2;64;4096;512;6308442592
1;256;1;128;2048;512;67541696
4096;128;4;1;1;64;18446744073709551615
4096;256;1;256;4096;512;7541586528
4096;512;1;64;1;1024;1653632
4096;512;1;128;1;64;2600032
1024;512;2;128;1;512;1953888
4096;64;1;1;1;512;58831200
4096;512;1;64;2048;512;18536608
4096;512;2;1;1;512;18446744073709551615
4096;512;1;64;4096;512;5746827904
512;1024;2;1;1;128;18446744073709551615
4096;512;4;1;1;256;18446744073709551615
1;512;1;64;1;512;37726656
2048;1;1;1;1;256;59916160
4096;512;2;64;64;1024;3058624
512;2048;1;64;64;2048;2695648
1024;32;4;2;4;4;17777760
16;1024;1;1;128;512;18446744073709551615
2048;512;1;64;2048;512;18492512
2;512;1;128;1;512;16564256
4096;512;1;128;8;512;1859616
4096;512;1;16;1;512;4910400
4096;512;1;1;1;2;85234624
2048;64;1;4;1;16;18243936
4096;4;1;4;256;64;213081376
4096;16;4;1;4096;128;18446744073709551615
1024;1;8;1;8;256;29916480
32;128;16;16;4096;128;39728416
1;256;1;128;1;1024;63730944
1024;128;1;1;4096;512;18446744073709551615
256;1024;4;1;1024;32;18446744073709551615
2048;512;1;64;1;512;1604992
256;1024;2;64;2048;64;4582656
128;512;2;32;2048;64;10993248
256;512;2;64;2048;64;9073312
128;1024;4;64;2048;64;7956128
4;512;1;128;1;512;8585504
1;128;1;128;1;1024;110712288
4096;512;2;128;1024;4096;23517824
256;512;2;128;2048;32;36423872
256;1024;2;128;2048;32;27762144
1;256;1;64;1;512;63783616
4096;512;1;128;2048;128;17075648
1;512;1;32;4096;512;63538240
4096;512;1;128;4096;2048;9201824928
4096;512;8;2;1;512;32468768
4096;512;1;256;1;1024;1306432
4096;128;1;64;1;1024;1553408
2048;512;2;128;1;1024;1913504
1024;512;1;128;4096;256;1377698720
4096;512;1;32;1;256;2776672
2048;512;8;8;1;2048;10405088
4096;128;64;1;1;512;18446744073709551615
256;512;2;16;2048;256;18154976
4096;512;1;1;4096;512;18446744073709551615
4096;32;1;2;1;512;29634752
512;512;1;128;1;128;1369952
4096;512;1;64;2048;1024;34452896
4096;2048;1;128;2048;512;10221792
4096;64;1;64;1;512;1556160
256;512;2;32;2048;128;10609504
8;1;1;1;1;8;1658970592
4;512;2;4;1;1;104725600
1;1024;1;1;1;1;65151584
4096;512;1;256;2048;512;18874400
1;1024;1;128;1;1024;37933376
1;512;1;256;4096;512;37790016
256;128;2;16;2048;256;33135968
4096;512;1;64;1;8;13543680
4096;512;1;8;1;512;8508896
4096;512;1;128;32;256;1695680
4096;512;1;256;1;2048;1308320
4096;2048;2;64;1;512;2139456
4096;256;1;64;1;512;1578688
1;512;1;64;4096;512;37713952
256;1024;2;128;2048;64;9822080
4096;2048;1;64;1;512;1917504
1;512;1;1;1;256;18446744073709551615
256;512;1;128;1;512;1451744
4096;512;2;16;1;512;4746176
1;512;1;128;1;512;37106080
1;256;1;64;1;1024;71761696
4096;512;1;256;1;128;2522976
512;512;1;128;2048;256;18924000
2048;1024;1;64;4096;2048;3095007008
4096;512;1;128;4096;256;6808538592
2048;512;1;32;1;512;2635008
4096;64;1;2;1;512;29889792
1;512;1;128;1;1024;37756608
4096;512;1;1;1;256;63969504
4096;1024;1;64;1;512;1731232
4096;128;1;64;4096;4096;15588632384
1024;512;1;128;1;2048;1385632
1024;256;4;1;1;512;18446744073709551615
512;512;2;128;1;512;2043328
4096;128;2;2;1;256;31858976
4096;512;1;256;1;32;9861600
1024;4096;2;128;1;256;2257472
1024;512;2;2;4096;512;9465923712
2048;256;8;2;1;1024;32403872
4096;4096;1;128;4096;1024;9233984800
2048;1024;1;64;4096;512;2895526336
4096;512;1;128;4096;1024;8650460384
1;512;1;256;1;512;38506656
4096;64;1;64;1;1024;1546336
4096;64;1;32;1;512;2648320
4096;512;1;128;4096;4096;42852874208
4096;512;1;128;2048;32;69236480
8;1;1;1;32;1;18446744073709551615
64;2048;4;1;1;1;68523680
32;1;8;1;128;16;710812576
1024;512;2;1;2048;64;18446744073709551615
1024;256;2;128;1;512;1990816
1;128;1;128;1;512;120580288
1;512;1;128;1;512;37267968
1;1024;1;128;1;2048;71565344
1024;4096;1;32;2048;1024;60980064
4096;512;32;8;1;512;23788992
256;512;2;1;2048;16;18446744073709551615
4096;1024;1;128;2;512;1333472
4096;32;1;1;1;512;58371008
4096;512;1;128;512;512;4649952
1024;512;1;128;4096;1024;1981817216
4096;1024;2;128;1;1024;1989664
4096;2048;1;64;1;128;1967872
4096;512;2;128;1;4096;8093248
1;4096;1;128;1;512;20656448
1;512;1;1;1;1024;18446744073709551615
4096;128;2;128;1;1024;1977152
4096;256;2;1;1;512;18446744073709551615
4096;128;2;128;1;512;1930336
256;512;2;64;2048;128;11130432
1024;128;1;64;4096;2048;1543451328
4096;256;1;256;4096;2048;9824801920
4096;512;2;128;2048;512;10851616
4096;512;2;128;4096;256;4922095424
1024;512;2;64;1;4096;24889664
1;1024;1;256;1;512;22185600
1024;512;1;128;4096;512;1856478816
4096;256;1;64;1;2048;1670080
4096;512;1;64;4096;1024;6298419488
4096;256;4;1;1;512;18446744073709551615
2048;2048;1;128;1;1024;1419904
4096;512;1;1;1;64;65046592
1;32;1;2;1;512;830887296
4096;128;1;128;1;128;1294560
4096;128;2;128;1;64;3657344
4096;128;1;2;1;128;30556384
2048;128;2;128;1;128;1993952
1;512;1;128;1024;128;31362464
2048;128;1;128;1;256;1329056
2048;128;1;128;1;128;1334976
1024;256;1;128;1;128;1385184
4096;128;1;1;1;64;60603456
1;128;1;128;1;128;111106752
2048;64;1;1;4096;512;18446744073709551615
4096;128;1;128;2048;16;560447840
4096;128;1;64;1;128;1771712
4096;128;1;128;4096;128;5848488000
4096;128;2;128;4096;128;4819656544
4096;128;4;1;1;128;18446744073709551615
2048;256;1;128;1;128;1333536
1;128;1;128;1;128;111021056
4096;16;1;4;1;128;15691392
4096;8;1;8;2048;128;855653280
1;128;1;128;1;128;111203168
2048;128;1;1;1;128;18446744073709551615
4096;64;8;1;4096;128;18446744073709551615
1;32;1;2;4096;64;428652736
4096;128;1;128;1;256;1302944
4096;128;2;128;1;32;7112032
4096;16;1;4;1;32;16853440
4096;128;1;64;1;16;6462528
4096;4096;2;128;1;256;2421952
4096;64;1;64;1;128;1678656
4096;128;2;128;4096;512;6465887200
4096;64;1;1;1;128;59330400
4096;128;1;64;4096;128;5908966464
4096;64;1;32;1;1024;2609312
256;1;32;1;4096;1;1735880448
256;1024;2;64;4096;64;238063360
128;1024;2;64;4096;64;114554016
256;512;2;64;4096;64;236248064
64;128;4;64;4;2;131152192
8;4096;1;16;2048;64;9059232
128;1;1;1;4096;1024;12430779840
4096;128;1;128;1;2;88415456
4096;128;1;1;1;128;60050944
2048;1024;4;1;1;128;18446744073709551615
4096;32;1;4;1;128;15733536
1024;128;1;128;1;128;1430944
4096;256;1;128;1;128;1326464
4096;8;64;2;1;128;63870720
1;128;1;128;1;512;120875488
4096;128;1;128;8;128;1695072
4096;128;1;4;64;128;16761504
2048;128;1;64;4096;64;2735772384
4096;256;1;128;2048;128;33940384
4096;1024;1;64;1;128;1926016
512;128;1;128;1;128;1507552
4096;128;1;32;1;128;2732992
4096;128;1;128;1024;128;33636384
256;1024;2;128;4096;64;511728448
256;512;2;64;4096;128;242365440
2048;128;1;1;1;64;18446744073709551615
4096;256;1;64;1;256;1640256
4096;128;2;128;4096;64;9496544640
4096;128;2;1;1;128;18446744073709551615
1;2048;1;4;1;1;77861856
4096;64;128;2;2048;1;116877184
2048;1;4;1;512;64;18446744073709551615
8;1024;2;4;64;4;11036544
4096;128;1;128;4096;256;6936664960
1;128;1;1;1;128;18446744073709551615
4096;32;1;2;1;64;31124288
256;128;2;16;4096;64;358736032
4096;32;1;2;4096;32;18446744073709551615
256;128;1;1;1;128;18446744073709551615
4096;128;64;2;1;128;47232096
1;128;1;2;1;128;209019200
4096;128;2;128;1;128;1907840
256;256;2;32;4096;64;230770336
1024;32;1;2;1;128;30407616
4096;128;2;128;1;16;13969792
4096;128;1;128;2048;64;133972864
256;512;2;64;4096;16;1038848064
4096;128;1;1;2048;128;18446744073709551615
1;2048;1;1;4;16;18446744073709551615
512;4;8;1;2;8;132364320
16;32;8;1;32;1;51819616
2;4;1;1;64;2048;18446744073709551615
4096;128;1;128;1;64;2544000
1;128;1;128;4096;128;115559968
4096;128;1;128;1;32;5066560
4096;128;1;2;4096;128;18446744073709551615
4096;64;1;1;4096;128;18446744073709551615
16;128;1;128;128;1;18446744073709551615
4096;128;1;128;512;2048;16029952
4096;128;1;128;512;128;16894816
512;8;1;8;1;128;9576928
1024;32;1;2;2048;128;208460544
4096;128;1;64;2048;128;70648864
1;128;1;128;1;64;220957472
4096;256;1;1;1;256;61202112
4096;128;1;2;1;64;30730464
8;32;8;8;64;1;716702784
32;1;4;1;512;32;18446744073709551615
8;1;2;1;1;16;3247062080
64;512;8;1;64;1024;18446744073709551615
4;2048;1;64;64;2048;30605088
1024;32;4;2;1;4;40369312
16;1024;1;1;512;512;18446744073709551615
2048;256;8;8;1;16;10755584
4096;128;4;4;4096;128;6557347680
4096;128;1;128;4096;64;11516476384
4096;128;1;32;1;1024;2532416
256;2;2;2;1;128;49152800
4096;128;1;128;1;1024;1318432
4096;2;1;2;1;128;31445024
2048;256;2;2;1;512;32092064
1;128;1;1;1;64;18446744073709551615
4096;128;1;8;1;128;8436608
4096;4;1;4;256;64;213098272
4096;1;4;1;4096;128;25303843584
1024;4;4;1;8;256;25429504
2048;512;8;8;1024;2048;49623968
4096;128;1;128;1;1;95065312
4096;4;128;2;1;128;108869312
8;4096;1;1;1;8;18446744073709551615
4096;128;1;128;1;8;20417536
1;128;1;128;1;128;110721472
2;128;1;128;512;128;63656288
4096;1;1;1;1;128;67756672
4096;16;1;4;1;1024;15305280
2048;128;2;128;4096;128;2221035744
1;128;1;64;1;64;152826624
1;512;1;128;2048;128;31518016
1;64;1;1;1;128;18446744073709551615
4096;128;16;4;1;128;16772224
64;1;32;1;1;1;6047625280
4096;32;1;2;1;128;30808928
4096;64;1;1;2048;256;18446744073709551615
1;256;1;128;1;128;76769056
1024;1024;64;1;1;1;68626912
8;2;1;2;32;32;910560288
64;128;4;1;2048;1;45561472
2048;1;8;1;128;16;18446744073709551615
4096;128;1;64;4096;32;10902460128
4096;256;1;128;4096;128;5909971424
2048;128;1;1;4096;256;18446744073709551615
32;128;2;8;1;128;13502464
4096;1;1;1;1;128;67606432
4096;128;1;2;1;128;30542656
2048;128;4;1;1;256;18446744073709551615
64;1024;1;16;4096;1;3926301312
512;16;4;16;4;1024;3976640
512;4096;1;2;1;64;40583840
128;16;2;1;128;1024;18446744073709551615
4;256;2;128;1;128;30584672
4096;128;1;128;1;1;95200544
32;512;1;128;1;128;1539136
4096;1;1;1;1;128;67690944
2048;32;1;2;4096;128;62885009664
4096;128;1;1;4096;128;18446744073709551615
1;2048;1;4;16;1;18446744073709551615
4096;4096;1;32;8;128;4108832
4096;1;1;1;512;1;18446744073709551615
8;1024;2;4;64;512;63765920
1;2048;1;256;4;2048;36359456
256;64;16;4;2;4;150659456
16;1;8;1;32;1024;1322344000
4096;32;1;2;512;128;52648800
2048;128;1;32;1;128;2796832
4096;128;8;2;1;128;31635552
4096;128;1;128;64;128;2365344
256;128;1;8;1;128;8457952
4096;128;256;1;1;128;18446744073709551615
4096;8;128;2;1;128;140460960
4096;128;1;128;256;128;8584864
1024;4;64;1;32;128;53558464
1;32;1;8;64;256;436703200
32;32;1;32;32;32;15318880
4096;128;1;64;1;256;1644864
1024;128;1;1;1;128;18446744073709551615
1024;128;1;128;1;256;1396032
4096;8;1;8;1;128;8368640
4096;128;128;2;1;128;94818496
1;2048;1;8;1;16;19694144
4096;1;1;1;64;1024;197177888
512;2048;64;1;64;2048;58006688
1;1;1;1;4;1;13670359872
4096;128;8;2;1;512;32145504
4096;128;1;128;1;128;1304256
4096;128;256;1;4096;128;18446744073709551615
16;1024;16;16;128;32;12987776
128;256;8;4;1;1;70578720
4096;4;1;4;4096;64;63212046080
64;1;4;1;1024;128;18446744073709551615
4096;128;1;1;1;64;60589440
2048;128;1;128;2048;128;66852992
2048;128;1;128;4096;128;2768536224
4;4;4;4;8;256;1146913984
2048;1;16;1;1;2048;99277632
8;1;1;1;1;32;1599905760
512;512;32;4;1;1;151180288
4096;128;1;128;1;2048;1354848
4096;128;1;1;1;128;60006560
4096;128;64;2;8;128;171564832
1024;1024;32;1;1;1;65887744
32;2;2;2;32;32;257926464
128;256;2;128;2048;4;620782784
32;1;8;1;128;16;700354752
4096;128;1;2;1;512;30220544
4096;128;1;128;1;128;1300832
4096;128;16;4;1;2;48363680
4096;128;1;128;32;128;1608800
64;2;32;1;128;32;456629760
512;16;4;4;4;32;8193248
8;4096;2;16;2048;64;5758144
128;16;2;1;1;2048;18446744073709551615
4096;128;256;1;1;128;18446744073709551615
4096;128;1;4;1;128;15619936
1;1;1;1;256;1;18446744073709551615
4096;64;2;32;8;128;2080064
4096;1;4;1;512;16;18446744073709551615
32;1;4;1;64;4;583760576
4096;128;1;128;2048;128;66964096
1024;2048;1;256;4;2048;2211840
2048;64;1;16;2;4096;19939776
16;32;8;2;64;1;88095200
256;128;64;2;1;128;57197248
1;128;1;128;1;128;110926624
32;4;1;1;4;2;121538432
1;32;1;2;64;256;412756864
1;4096;1;256;1;32;40826976
32;8;8;8;1;256;450228640
512;128;16;4;1;128;17064224
64;128;1;128;1;128;2303712
16;512;8;1;64;1024;18446744073709551615
512;8;1;4;64;1;18446744073709551615
1024;32;1;2;4;256;31526976
16;64;16;16;128;32;48028832
1;256;1;16;1;16;76400672
4096;1;1;1;256;2048;815700064
4096;1;1;1;4096;128;18446744073709551615
1024;1;4;1;8;256;40369952
2048;512;64;1;1;2048;18446744073709551615
4096;128;8;2;1;512;32180640
4096;128;1;128;1024;1;18446744073709551615
1024;1;1;1;1;128;60148224
8;1;2;1;1;1024;3130443392
1;1;1;1;1;1;12486572000
1024;256;32;2;1;1;68145440
32;1;2;1;32;32;514599552
4096;256;128;2;1;128;94876320
4096;64;2;1;512;1;67720544
8;128;1;128;1;128;14027200
512;128;1;128;2048;8;1145759968
32;1;16;1;4;16;4407953216
4096;128;32;8;128;512;22913504
64;2;1;1;1;32;118238688
512;16;4;16;256;1024;19816128
8;64;1;16;2048;64;118909184
128;16;2;1;4096;1;2506992992
1;2048;1;4;1;1;77833568
64;128;1;128;256;128;8489824
4096;64;4;4;1;32;16784544
4096;1024;1;128;1;1;101691968
4096;1;1;1;512;16;18446744073709551615
128;1024;2;4;64;4;14295424
1024;2048;1;16;4096;2048;4944925952
2048;64;16;16;2048;4096;166331840
4096;16;1;4;4;128;16262560
4096;128;2;128;64;128;2052832
4096;128;1;16;1;128;4742368
16;32;16;16;32;1;1309235680
1024;1;64;1;1;128;785726368
1;1;1;1;64;256;14184935712
32;4096;16;8;1;32;18736576
4096;128;1;128;2;128;1419424
32;2048;2;8;1;32;9331936
4;1024;2;64;64;1024;18585152
512;4;1;2;1;2048;32510688
8;32;4;2;4;4;78836192
16;1024;2;16;128;256;4513088
4096;512;1;128;256;128;2661888
2048;64;4;4;1;16;18377376
4096;1;1;1;1;256;67696448
4096;256;4;32;1;128;3352800
1024;4;4;4;1024;4;308324576
4096;128;128;2;2;128;1364992512
2048;4096;1;128;1;128;1322144
4096;2048;1;128;128;32;6952000
2048;32;8;4;1;2048;19978496
8;4;1;1;64;32;447531520
4;512;1;4;1;1;75586720
1024;1024;16;1;1;1;68681408
1;128;1;128;256;128;117148608
1024;2;128;1;32;512;156550624
64;256;4;1;128;1;27500096
32;1024;4;1;1;2;80257600
64;2;2;1;1;32;235267136
2;1;1;1;1;128;6396039840
4096;4;1;2;2;128;31797888
32;128;1;128;4096;128;116304160
4096;128;32;8;1;128;23549472
512;16;4;16;4;1;45787104
2048;4096;32;2;8;64;86011072
128;16;8;16;4096;1;3283010400
1;4096;1;4;1;1;65203776
2048;128;1;128;1;32;5164288
4096;128;1;32;1;2;46188672
4096;128;1;1;1;512;59493376
4096;128;2;128;2048;128;35447872
1;16;1;4;2048;128;820876640
4096;256;2;128;1;128;2032864
4096;64;2;32;8;16;4447456
4096;128;1;2;2048;128;105546720
512;1;32;1;512;2;238807360
4096;128;1;32;4096;128;9476501152
2048;32;1;2;2048;128;211771488
8;1024;8;4;64;4;9229792
2048;2048;4;2;64;2048;20585152
512;64;1;64;1;4096;2012544
16;256;8;4;32;1;30147616
4096;256;1;256;1;128;2509536
4096;64;1;1;2048;128;18446744073709551615
512;32;1;2;1;128;30563488
4096;256;1;64;1;128;1771712
16;128;1;128;1;128;7154752
1;128;1;64;4096;128;144388768
2048;16;1;2;4096;128;62996173728
4096;512;1;128;4096;128;5747066912
4096;16;1;4;2048;128;422801664
1024;4;64;1;32;512;53576224
1;32;1;16;64;256;444216672
16;2048;1;256;1;32;14138752
32;1;2;1;1;32;796841760
1;128;1;32;1;128;125282272
1024;128;2;128;4096;128;1029605760
4096;128;1;128;512;256;17708096
4096;512;1;2;1;128;32789344
64;128;1;128;1;32;8426976
4096;128;1;128;4;4;48803424
4096;128;1;1;1;8;71318208
1;256;1;64;1;128;71189536
1;32;1;2;1;64;415752544
4096;64;1;1;4096;32;18446744073709551615
4096;128;1;64;1024;32;68669280
2048;64;1;2;2048;128;106421152
4096;32;1;4;2048;128;213217088
512;128;1;128;1;256;1470496
4096;256;1;128;1;64;2535904
1024;128;2;128;1;128;2017504
1024;128;1;128;1;64;2623680
4096;512;4;1;1;128;18446744073709551615
4096;128;1;32;1;256;2565888
1;16;1;4;1;64;865235552
1024;128;1;128;1;16;10373376
2048;128;1;2;1;128;32059008
4096;64;1;4;1;128;15877792
1;128;1;128;1;512;120595808
4096;64;1;1;1;64;59842144
4096;16;1;4;1;64;16153984
2048;128;1;128;4096;64;5465566528
4096;128;2;128;2048;64;70837280
4096;128;1;128;1;4;43056512
1024;128;1;128;2048;128;67021824
4096;512;1;256;2048;128;34791392
4096;128;2;64;1;256;1923616
1;512;1;128;1;128;38669184
2048;128;1;1;4096;1024;18446744073709551615
1024;64;1;1;1;1024;18446744073709551615
1;128;1;2;1;128;209035776
1;32;1;2;1;128;413372928
512;256;1;128;1;128;1440960
512;128;2;128;1;128;2055584
4096;128;2;64;1;128;1962624
1;128;1;128;1;64;221458848
1024;512;1;128;1;128;1354720
1;128;1;1;4096;128;18446744073709551615
4096;64;2;1;2048;128;18446744073709551615
16;1;2;1;1;1024;1582564160
512;512;1;64;64;2048;2721184
1024;4;4;2;4;4;16913440
16;1024;2;32;128;1;68485664
4096;128;1;4;1;512;15417120
4096;512;1;1;2048;128;18446744073709551615
2048;256;2;2;1;1;70466016
4096;2048;1;128;1;128;1472416
4096;64;1;2;1;2;43682656
32;128;8;2;1;128;52352160
4096;128;1;2;1;1;73038016
4096;128;128;2;1;256;94822336
4096;128;256;1;1;512;18446744073709551615
4096;16;256;1;1;128;248171328
1024;4;1;1;8;256;18446744073709551615
128;4;8;1;1;2048;18446744073709551615
8;4;1;2;64;32;451894688
4;4096;4;4;128;1;27324544
1024;16;32;1;1;512;18446744073709551615
1024;1;128;1;1;32;1583472032
64;256;4;1;128;1024;18446744073709551615
4096;64;4;1;1;128;18446744073709551615
4096;128;2;128;1024;512;20071968
32;2048;4;1;1;4096;18446744073709551615
64;1;4;1;1;32;800791392
4096;128;1;1;1;1;71401120
1024;128;1;128;1;1;97410176
512;16;4;2;1;1;68814528
8;64;2;16;2048;64;69858016
128;16;4;1;4096;1;966887712
2048;4096;8;4;1;1;75544384
128;128;1;128;1;256;1433280
4096;2;1;2;1;128;31444864
32;64;1;16;8;128;7449664
512;1;4;1;1;2;116538080
4096;1024;8;4;64;4;10096160
1024;64;2;2;4;32;20358848
4096;32;2;1;1;128;18446744073709551615
4096;128;1;1;2048;64;18446744073709551615
4096;128;4;64;1;128;3507232
1;64;1;1;1;4096;12584327488
512;256;256;1;32;1;376931552
1024;256;64;1;32;64;66237120
1;256;1;2;64;2;66172192
4096;1;128;1;1;128;387876320
32;16;1;8;8;32;29802144
32;2048;2;8;512;1;44585312
4096;128;1;128;1;4096;1383968
16;512;2;1;8;1024;18446744073709551615
64;2048;1;64;64;8;15161664
512;4;1;1;4;4;72830432
16;1024;2;16;128;16;3806816
4096;128;1;128;1;256;1304000
4096;4096;1;128;1;128;1471872
4;128;1;1;1;128;18446744073709551615
2;128;1;128;1;128;55923200
2048;256;8;4;1024;1;48009664
4096;1;1;1;1;2;74060352
256;256;4;32;1;128;4087808
1024;1;4;1;128;256;18446744073709551615
4096;128;1;16;1;32;5803712
16;128;1;128;1;4;256522464
256;128;1;128;1;128;1753888
512;512;8;1;1;2048;18446744073709551615
8;32;1;1;64;1;18446744073709551615
4;8;4;4;8;1;2369997728
32;128;1;16;1;128;7460224
4096;16;64;2;1;128;54822208
4096;8;1;8;1;8;8818016
2048;4;16;1;64;1;37363744
4096;2;16;1;32;512;18446744073709551615
1;256;1;128;128;2;4074682080
4096;128;1;128;1024;16;281441056
8;128;2;128;1;128;27893408
32;4096;4;1;1;2;82699360
64;2;4;1;1;64;465919648
1024;128;4;16;4;1024;3730016
8;1024;2;16;2048;64;5812928
4096;4;1;1;1;128;66254400
4096;128;1;8;256;128;13710112
128;16;16;1;4096;1;230552960
1;1;1;1;1;1;12412360256
4096;2048;2;32;1;128;3278464
512;2048;4;32;1;2;94020864
8;1024;8;1;64;4;22567200
1024;16;1;1;4;8;18446744073709551615
4096;128;1;128;4;128;1483808
4096;1024;1;128;1;128;1319008
512;64;1;1;1;4096;3681480384
1;256;1;4;32;1;18446744073709551615
1;16;1;1;128;512;18446744073709551615
1;256;1;1;1;4;117915296
32;16;4;8;1;2048;109557984
32;2048;2;8;2;1;41300512
4096;256;2;64;64;1;115430368
512;512;1;64;64;4;34695360
4096;128;256;1;128;128;102729440
4;4;4;2;4;1;2069859712
1;1024;1;16;128;16;15848480
128;256;8;8;1;16;12681376
512;128;1;128;1;1;105509184
4096;128;1;16;256;128;7516448
4096;128;64;2;4096;128;1388416000
4096;8;1;1;1;1;67992576
4096;256;4;32;1;1;99077440
1024;4;128;1;4;256;849170688
1;512;1;8;1;512;220744608
128;128;1;32;1;128;3326816
4096;2;8;2;1024;128;357767008
4096;4;1;2;1;128;30779328
8;4;2;1;32;32;498034400
4;4096;1;4;128;128;25915616
2048;1;16;1;64;1;44106592
2048;128;1;128;1;1;96868832
1024;2;16;1;32;512;27560160
64;2;64;2;128;1;955316224
32;1024;4;32;1;2;105452192
1;1024;1;16;1;32;21017920
1024;128;4;1;4;1024;26139648
256;16;32;1;2048;1;76531680
8;16;1;1;4096;2048;18446744073709551615
1;8;1;4;1;1;6262147008
4096;256;2;32;8;8;12243840
