GLOBAL_SIZE_0;GLOBAL_SIZE_1;LOCAL_SIZE_0;LOCAL_SIZE_1;cost
8;128;4;16;1276271333
1;64;1;64;2035723214
8;4;1;4;2381092301
16;64;4;2;2103290546
4;2;4;1;4944526375
32;1;2;1;2369130041
1;1;1;1;40699191292
1;2;1;2;20236065884
64;32;16;2;2358588950
128;256;1;256;844835882
64;16;2;16;1308385666
1;128;1;128;2215937628
16;2;4;1;2260753509
4;2;4;2;4944614831
4;2;1;1;4904771359
4;2;2;1;4941688760
8;2;1;2;3128587520
8;2;1;1;2806839791
4;1;1;1;9843016875
4;2;1;2;4945109870
2;2;1;1;9973035959
64;32;16;16;1986390081
4;1;4;1;9834559444
4;4;1;1;3180037410
32;2;1;1;2377381255
64;32;16;32;18446744073709551615
8;2;4;1;3069187833
32;32;2;2;2039237790
16;8;1;2;1238927712
64;16;16;4;1874435183
16;8;8;8;1271676920
2;32;1;1;2314260930
16;1;2;1;3468188708
1;32;1;1;2257935914
32;1;2;1;2378775270
4;1;2;1;9926240702
4;4;1;2;3037450739
4;2;1;1;4938233503
16;2;1;1;2217336980
4;128;1;64;1330887668
4;1;4;1;9923492615
4;1;2;1;9839401576
8;32;1;1;1255903128
128;32;1;16;1183749912
128;16;1;16;1196049550
4;2;2;1;4940969300
2;2;2;2;9972882459
4;1;1;1;9836923077
8;4;2;4;2329874501
4;256;1;64;1253278426
4;2;1;2;4935362531
8;4;1;1;2366368735
8;4;8;2;2360546655
16;8;4;8;1253913189
1;2;1;2;20235344833
4;2;2;1;4945076253
16;2;1;2;2184002069
8;1;2;1;5087246364
8;64;4;4;1642801101
16;256;8;4;1640835896
16;2;2;2;2226156043
1;8;1;4;5077691093
8;4;2;1;2403688801
4;2;1;2;4947243127
8;4;1;2;2365259916
8;2;1;2;2693358930
8;4;2;2;2374082328
4;2;1;1;4938271458
128;4;64;1;1926450160
64;128;8;2;2120813795
8;1;2;1;5079238170
4;256;4;2;1293926924
16;1;2;1;3374759584
4;64;1;64;1451721174
4;2;1;2;4946278753
4;2;1;1;4934883828
4;2;1;2;4918172590
1;4;1;1;9996235417
1;16;1;2;3315095454
2;8;1;4;3008546668
256;1;256;1;2278596320
4;8;1;4;2349668668
64;4;1;1;865037714
64;2;1;1;1154211253
4;2;4;1;4944041380
256;2;1;1;1226150185
4;8;1;4;2373116141
4;2;1;1;4939577365
4;32;1;1;1295451904
4;16;1;2;2132745708
16;1;1;1;3457071330
4;32;1;32;1206471935
4;2;1;2;4944369248
4;256;2;64;1234607655
32;2;1;1;2369774636
1;2;1;1;20239055884
4;2;1;1;4946150630
8;2;1;2;2887165880
4;4;1;1;3192502199
1;4;1;1;10001617792
32;2;1;2;2004022416
4;4;1;1;3172126625
4;2;1;2;4905997121
64;2;1;2;1178656268
8;2;4;1;2913412735
4;2;4;1;4943453828
4;8;2;4;2324172985
4;2;1;1;4938753713
2;2;1;2;9973460250
4;1;1;1;9838714618
4;8;2;2;2396332059
1;2;1;1;20237791968
1;2;1;1;20239213125
4;2;1;1;4925806163
4;2;2;1;4944584412
2;2;1;1;9972181542
2;2;2;1;9971854247
4;128;4;64;1328313167
32;2;32;1;2013625792
32;2;1;1;2367567856
32;2;1;1;2380090463
1;2;1;2;20235472125
64;1;32;1;2077414113
128;2;1;1;749982563
16;2;16;2;2251611657
4;1;4;1;9843762112
4;2;2;2;4904653200
4;64;2;32;1291215130
4;2;1;2;4945494074
4;32;2;2;1226409211
4;2;4;2;4900894071
4;2;2;2;4943934003
4;2;4;1;4943879662
256;2;256;1;2172328658
4;64;4;32;1313556562
4;1;4;1;9917424080
4;2;2;2;4906022375
4;1;1;1;9838658715
4;2;4;2;4939601703
4;16;4;1;2103757695
4;2;4;1;4939297282
4;32;4;32;2273529772
4;8;4;2;2389706032
8;2;4;2;2772390073
64;2;2;2;1171873041
2;2;1;2;9973078083
4;1;4;1;9920535660
4;32;4;32;2293544958
4;2;4;1;4944314741
4;256;4;32;1205775630
32;4;2;4;1229961730
4;1;1;1;9922155208
4;32;4;8;1216646771
32;2;4;2;2012259001
4;128;4;2;1459256762
4;2;4;2;4941607919
1;2;1;2;20235486301
1;64;1;32;2018053131
4;2;4;1;4944564535
4;2;2;2;4945890454
256;1;256;1;2277353454
4;2;1;2;4911396709
4;2;4;2;4938031042
64;2;2;1;1164334916
4;128;4;32;1346528723
4;64;2;32;1277669595
256;2;256;2;18446744073709551615
8;2;1;2;2881710735
8;2;1;1;2925062817
16;2;8;2;2309652458
4;1;1;1;9838206014
4;2;1;2;4947020247
4;16;4;4;2118444130
1;32;1;32;2312850679
16;2;4;2;2195462598
2;2;1;2;9972993294
2;2;1;1;9973027414
4;128;4;32;1330843875
2;2;2;2;9972745329
1;4;1;4;10005235083
8;4;1;4;2368153121
1;2;1;2;20235566958
32;2;32;2;1991594877
8;2;8;1;2799213734
16;256;4;1;1652065377
32;2;4;1;1991455126
4;256;2;32;1253750311
4;2;2;2;4939456010
4;32;4;1;1269135128
8;2;8;2;2975758207
4;2;4;2;4938758209
128;64;1;2;1330358594
16;1;16;1;3452780902
2;16;2;2;2272060546
64;1;1;1;2273613610
1;32;1;8;2317856155
1;128;1;32;1191588569
16;2;8;2;2167796500
4;2;4;2;4938592674
4;64;4;4;1464784198
4;1;4;1;9927362125
64;1;2;1;2071739908
8;16;1;1;1347818641
4;2;2;2;4940961032
16;128;8;32;1872305786
4;2;2;1;4946500083
1;8;1;2;5123922771
4;8;1;2;2359774464
4;64;1;32;1281267150
32;2;32;2;1979157120
1;2;1;2;20235655135
4;2;4;2;4907863587
4;64;4;32;1324797610
128;1;1;1;1196998584
128;2;64;2;1625340849
64;2;2;2;1171984984
2;2;1;1;9971971957
4;4;4;4;3169266229
4;2;1;2;4946264132
8;1;1;1;5020575460
2;2;2;2;9972706042
16;4;16;4;2077598256
2;2;2;1;9971355208
2;2;1;2;9973321040
4;4;4;2;3171130951
16;1;8;1;3450136261
4;4;4;4;3068301283
1;2;1;2;20235500237
8;1;2;1;5016766293
4;4;1;2;3058179912
4;8;1;2;2374611683
4;4;4;1;3204131683
1;1;1;1;40698816333
8;1;1;1;5189795700
8;2;2;2;2865030233
4;4;1;4;3111711773
2;2;2;1;9971551539
4;2;1;1;4944269591
4;4;2;4;3135482506
2;2;1;1;9972504335
4;1;1;1;9841514459
4;1;2;1;9841592272
1;2;1;2;20235572833
4;2;1;1;4902239530
4;4;4;1;3128380094
8;2;1;1;2661705401
2;4;1;2;4906931696
8;2;4;1;2859196726
4;4;2;1;3119188397
4;1;1;1;9882097380
4;8;4;4;2380354806
8;1;1;1;5032801169
2;2;1;2;9973131789
2;8;1;2;3237420647
2;2;2;2;9972657583
16;2;8;1;2226770505
2;1;1;1;20046822043
2;2;2;1;9971459625
2;2;1;2;9973375540
8;4;2;4;2344112891
2;1;2;1;20038398500
4;1;4;1;9829845617
1;1;1;1;40698701612
64;1;4;1;2068096292
1;1;1;1;40699020583
1;16;1;1;3222381666
8;2;8;2;2967762294
4;2;2;1;4936611492
8;2;8;1;2770611879
16;2;16;1;2263910114
8;2;2;1;2874835802
32;1;2;1;2386180048
1;32;1;4;2320600261
32;32;1;16;1702679112
128;1;1;1;1201522491
1;1;1;1;40698632529
4;8;4;1;2385485568
4;16;1;1;2356977354
2;2;2;2;9972726709
1;4;1;1;9947204706
1;1;1;1;40698858000
16;32;2;4;1854628430
32;256;4;1;1825928509
8;2;4;2;2722946879
8;2;1;1;2955956968
32;2;8;2;2008397793
8;2;2;1;2876075479
16;2;8;2;2205785584
4;1;1;1;9927365413
16;2;8;2;2197427625
1;2;1;1;20237493218
8;8;1;4;2146629899
1;1;1;1;40698928459
32;2;8;1;2032110573
16;1;8;1;3464732744
1;8;1;4;5146971167
128;4;64;4;1881193005
128;4;8;2;1818566891
8;1;2;1;5093224742
8;1;1;1;4952417373
1;4;1;1;9993651708
2;4;1;4;4900522133
4;16;2;1;2114549258
2;4;1;1;4891227620
8;4;1;1;2363018913
1;2;1;1;20237634968
2;4;1;1;4880241505
2;4;2;1;4894225847
2;8;1;8;2891940828
4;4;2;2;3160448499
2;8;2;8;3251145583
1;4;1;4;9983991666
2;4;1;4;4905078967
2;4;1;2;4894924583
2;4;2;1;4896569288
4;4;4;1;3129134036
2;4;2;1;4896559654
4;4;1;1;3198394791
2;2;2;2;9972385915
1;16;1;8;3278536148
4;4;1;2;3136685523
2;4;1;2;4903941883
2;16;1;8;2360676337
2;4;2;4;4902670833
1;4;1;1;9978566372
2;4;1;1;4891945435
32;4;1;1;1257553189
2;4;1;1;4888161912
2;2;1;2;9973271749
16;4;1;1;2404340583
2;4;1;4;4890394000
64;4;64;1;1363586011
64;16;64;8;18446744073709551615
1;4;1;1;9976453832
2;1;2;1;20038134208
4;16;1;8;2124959536
2;2;1;1;9973186125
1;2;1;2;20235250791
2;1;1;1;20046756459
2;4;2;1;4896203950
2;4;2;2;4899048620
1;4;1;2;9895815328
1;1;1;1;40699185904
2;4;2;4;4896352011
1;8;1;4;5080287128
4;1;1;1;9921077000
2;4;2;4;4927040753
4;4;2;1;3254230021
4;8;1;8;2347854984
2;8;2;8;3109080704
4;64;4;2;1404699818
2;4;1;4;4905160121
16;1;2;1;3440191759
1;8;1;8;5139364125
2;1;1;1;20046378666
2;2;2;1;9971571207
2;4;2;1;4895216825
128;4;64;1;1920639844
8;4;4;1;2369064614
4;4;4;2;3219290314
2;8;1;4;3173438714
2;8;1;1;3179944379
1;4;1;2;9949712625
2;4;2;4;4898454079
2;4;1;1;4885017157
2;4;2;2;4909012454
2;8;2;4;2997688458
32;16;8;2;1905116008
2;16;1;2;2341737500
256;1;256;1;2273584599
32;2;8;1;1985417788
128;4;128;1;2032455250
2;4;2;2;4903536875
2;128;1;8;1224176069
16;4;2;1;2133956792
16;4;2;1;2128787292
2;4;1;1;4888181106
2;4;1;1;4893212583
2;4;1;1;4891800676
2;32;1;4;2039385042
4;16;1;16;2164443862
2;4;1;1;4892636310
2;64;1;8;1192230024
8;4;4;1;2378200422
16;2;2;2;2182836947
2;4;1;2;4898941741
64;4;64;2;1425623422
256;32;64;8;18446744073709551615
16;8;2;8;1283765656
2;256;1;8;1292582776
2;4;2;4;4899793687
2;4;1;1;4882553912
8;32;2;16;1426894715
16;1;4;1;3428058595
8;1;2;1;5201380375
16;1;16;1;3434899637
16;32;2;8;1494447335
2;256;1;8;1293112110
1;4;1;1;9981559583
2;4;1;4;4907393916
256;4;64;1;2282751328
8;4;8;1;2327273389
2;128;1;128;1288847826
2;32;1;8;2082212337
32;4;2;1;1182552849
2;4;2;4;4904298946
2;1;2;1;20038081126
2;2;2;2;9972267832
64;256;1;2;1026527584
1;1;1;1;40699143571
1;1;1;1;40699099820
256;4;16;1;2305387576
2;4;1;1;4901094491
8;4;4;4;2346133110
2;8;1;8;3085601372
64;1;1;1;2262830550
1;1;1;1;40698594458
4;32;1;1;1312112466
32;1;8;1;2390480974
256;1;64;1;1851996971
8;256;1;1;1506462999
1;32;1;16;2234076442
128;1;64;1;1368345329
1;1;1;1;40699175779
