GLOBAL_SIZE_0;GLOBAL_SIZE_1;GLOBAL_SIZE_2;LOCAL_SIZE_0;LOCAL_SIZE_1;LOCAL_SIZE_2;cost
1;2;1;1;2;1;27547539852
8;256;8;1;32;2;250274815
4;8;32;1;1;8;108051704
512;128;64;64;4;2;18446744073709551615
8;32;64;2;1;16;158655111
4;8;32;2;8;8;145360000
4;8;16;1;1;16;151492296
2;8;8;1;2;2;425427259
256;32;512;1;8;8;269698518
64;32;64;1;32;1;203359704
16;2;64;2;2;2;70165630
16;4;8;4;4;2;173874074
1;1;64;1;1;1;884480592
16;2;64;2;2;1;141360296
32;2;8;2;2;2;163479259
16;2;512;2;2;2;147064741
8;4;64;4;1;4;41020148
16;2;32;2;2;2;82766075
32;4;256;8;2;16;37672889
32;4;16;32;1;1;40528148
1;512;128;1;1;1;208684296
4;4;8;1;2;1;472332148
1;128;256;1;128;2;416486222
1;1;1;1;1;1;52723023852
2;64;1;1;4;1;426772445
8;128;32;8;16;1;38130963
16;32;16;16;8;2;12041334
256;8;256;16;4;16;18446744073709551615
2;1;256;2;1;2;134398519
2;4;64;2;2;64;599442815
4;128;2;2;1;1;112938963
16;4;64;4;2;4;42511260
8;8;64;2;8;64;18446744073709551615
32;16;64;32;2;2;16782519
8;32;32;2;1;4;107361630
64;16;256;2;8;8;120109926
128;4;256;16;2;16;18446744073709551615
512;4;1;1;1;1;440952444
2;8;4;1;4;4;963255408
1;32;4;1;16;2;657038963
16;256;16;1;4;2;216476741
512;8;4;64;2;4;18446744073709551615
128;16;256;1;2;4;210203555
4;16;16;4;1;4;68431556
4;2;1;2;1;1;7112425629
64;512;2;2;64;1;132890518
8;64;4;1;32;2;127647407
64;8;64;1;2;1;295277630
128;1;4;1;1;1;264887704
2;16;32;1;2;4;77196148
1;512;64;1;1;32;465855852
32;8;64;32;8;4;18446744073709551615
16;32;16;8;8;2;29913482
16;64;8;16;8;4;18446744073709551615
32;32;16;8;8;2;36299556
16;8;64;16;4;4;13409630
32;8;64;16;2;4;21054222
16;16;32;16;2;4;14780296
16;32;64;1;1;4;300292592
64;16;128;8;4;4;34569778
16;16;64;8;1;16;42162666
8;8;256;4;8;128;18446744073709551615
8;64;8;8;8;1;20723260
128;4;64;4;1;4;79646963
16;32;8;16;8;4;18446744073709551615
16;32;32;16;4;2;17814223
64;8;64;8;4;4;34290666
256;4;1;32;1;1;94013037
512;8;1;1;2;1;491998963
1;32;128;1;1;4;119641630
128;16;64;64;8;1;18446744073709551615
16;32;16;2;8;2;122716000
256;32;16;1;8;8;388514815
4;32;16;2;8;2;45811408
32;16;64;16;2;8;20985926
512;512;8;4;32;8;18446744073709551615
8;32;64;2;1;1;105726666
16;4;8;4;2;2;160197037
8;16;16;4;16;4;78628593
16;32;16;16;4;2;14464148
16;32;16;16;16;4;18446744073709551615
16;32;64;16;8;64;18446744073709551615
64;16;128;16;4;4;22549630
8;32;8;2;8;4;58998963
16;32;1;16;16;1;167586074
16;32;16;1;8;2;216512444
8;64;64;4;64;4;18446744073709551615
32;1;256;4;1;16;62113777
4;4;16;4;1;1;257157926
1;512;1;1;32;1;184704445
64;16;64;16;2;4;22936445
16;32;8;8;8;4;25815408
16;128;16;16;4;2;21175112
16;32;16;16;16;2;18446744073709551615
8;16;64;1;2;4;174346815
16;32;16;8;8;2;29250963
16;32;16;16;1;2;17373334
4;32;8;1;2;1;148543408
4;8;256;2;8;8;92501037
2;1;1;1;1;1;26699225926
8;128;32;8;8;1;37144592
16;128;16;8;8;4;37605037
16;16;16;8;8;2;22378371
16;8;16;16;8;2;41908000
16;32;8;16;8;4;18446744073709551615
16;32;1;16;8;1;167894222
1;1;256;1;1;4;234146963
16;4;64;1;2;64;217423407
4;128;2;2;1;1;114946222
16;32;32;16;8;1;18455555
16;32;16;16;8;4;18446744073709551615
16;32;2;8;8;2;85149926
2;32;16;2;8;2;83594518
16;256;16;16;8;2;22010075
512;4;1;1;1;1;438358074
2;8;4;1;2;2;861126815
64;256;16;1;4;2;240057778
512;8;1;1;2;1;494193333
4;32;16;1;8;2;145006074
16;64;16;16;8;16;18446744073709551615
32;32;16;8;8;1;35865777
16;128;32;16;4;1;21735407
16;4;16;16;1;4;83544148
2;4;16;2;1;2;429509630
16;32;16;16;4;8;18446744073709551615
16;1;16;16;1;2;315767852
128;16;256;1;2;1;173023407
1;2;1;1;1;1;26847775852
64;32;2;2;1;1;197594519
8;64;4;1;64;2;195763407
8;64;16;2;8;2;94641481
16;32;4;16;8;1;41483556
16;64;16;16;8;2;16420148
16;32;32;2;8;2;123105481
16;16;16;16;8;2;21718667
16;32;16;16;8;4;18446744073709551615
16;128;16;16;8;2;20664148
16;32;1;16;8;1;167737037
128;16;4;1;8;1;243720296
8;16;1;1;4;1;508326370
1;2;64;1;1;32;789397185
8;8;256;8;8;128;18446744073709551615
8;32;16;2;8;4;48422370
8;32;16;2;8;1;89238222
16;32;16;16;8;2;12217778
16;32;16;16;8;16;18446744073709551615
16;32;16;16;4;2;13987259
8;64;1;8;8;1;138019555
256;4;1;1;1;1;415795556
512;16;32;1;2;4;289886222
1;32;128;1;4;4;153467112
16;32;4;8;8;4;44316889
32;32;8;4;2;4;56243704
16;32;16;16;8;1;14783260
16;32;64;4;8;64;18446744073709551615
16;512;16;16;1;16;25594370
1;32;16;1;8;2;137778963
16;32;16;16;8;8;18446744073709551615
1;512;8;1;64;8;18446744073709551615
512;32;1;2;1;1;258992296
16;4;8;4;1;2;154274074
32;4;256;8;2;1;47785482
16;32;16;16;8;2;12655556
16;32;16;16;8;16;18446744073709551615
32;4;16;1;2;1;276923852
1;512;1;1;128;1;527842815
64;32;8;8;2;1;46046222
4;8;256;4;8;8;46533926
16;128;16;16;32;2;18446744073709551615
16;16;32;16;8;1;14346815
16;32;16;4;8;2;52197926
16;32;128;16;8;64;18446744073709551615
2;64;1;1;4;1;441880889
8;64;32;8;8;8;18446744073709551615
16;32;16;16;8;1;14597630
2;1;256;2;1;32;235726222
8;8;16;2;8;2;84018223
8;32;16;2;8;2;73325186
16;32;16;16;2;2;14308296
16;32;16;16;2;2;13951259
16;32;256;2;4;64;18446744073709551615
8;32;8;2;32;4;180542815
32;32;16;8;4;4;30393333
16;32;64;16;8;32;18446744073709551615
16;4;64;1;2;32;243439556
64;128;2;4;1;1;115791408
4;512;1;1;1;1;229766222
8;8;4;1;2;2;266491704
16;32;16;16;8;8;18446744073709551615
16;32;16;16;4;4;12501333
16;16;16;16;8;16;18446744073709551615
1;256;16;1;4;2;119594222
1;8;256;1;2;256;18446744073709551615
64;16;256;2;2;1;139013037
4;1;1;2;1;1;14332697185
16;32;16;2;8;8;62753334
16;32;16;16;1;2;17920296
16;32;2;16;4;1;81513926
16;128;16;16;2;4;19510074
64;512;1;2;64;1;127155111
8;8;1;2;2;1;1007645926
128;16;32;1;8;1;246674074
2;1;8;1;1;4;3407871703
1;32;16;1;8;16;471853629
1;512;64;1;64;32;18446744073709551615
1;8;256;1;8;64;18446744073709551615
256;64;8;16;4;1;23628297
256;4;1;32;1;1;95367852
512;32;16;128;8;2;18446744073709551615
16;256;16;16;8;1;22246222
8;32;16;1;4;2;156225926
16;16;16;8;16;2;24931556
16;16;16;16;16;2;18446744073709551615
16;16;32;16;2;8;13706815
1;2;128;1;1;4;230523556
8;512;8;4;32;8;18446744073709551615
8;256;2;2;1;1;110757926
16;32;32;8;8;1;36772148
16;32;32;16;1;4;19410074
16;32;16;4;16;1;50240592
32;32;16;8;8;4;35184889
16;32;8;16;16;4;18446744073709551615
16;4;512;4;1;2;78823259
32;4;256;32;2;16;18446744073709551615
32;4;16;32;1;1;41243555
1;1;1;1;1;1;53221968148
16;32;16;16;2;1;16671852
16;64;16;16;16;2;18446744073709551615
16;32;1;16;8;1;167864000
16;32;16;16;8;8;18446744073709551615
64;32;16;8;2;1;46503704
4;8;256;4;8;1;63088148
1;128;1;1;2;1;458149630
8;8;32;8;8;8;18446744073709551615
16;32;16;2;8;2;115361333
16;16;16;16;2;2;23344445
64;32;16;4;8;2;64234074
16;32;16;16;16;1;12251408
16;32;8;16;8;2;21813333
128;32;128;2;8;64;18446744073709551615
2;4;256;2;4;8;63575852
16;32;256;1;2;64;381565778
4;4;2;4;1;1;1824551260
16;64;32;16;8;1;21948000
16;64;16;4;8;2;57760000
16;32;64;16;16;64;18446744073709551615
16;32;16;8;4;2;25886074
16;32;16;8;16;8;18446744073709551615
4;512;1;1;1;1;216272592
8;8;4;2;1;2;255899852
1;16;16;1;4;2;226748889
512;8;1;1;2;1;492938370
64;32;8;4;8;4;61469630
64;32;32;2;4;1;135804593
64;32;256;32;1;1;20771259
1;2;1;1;1;1;26598966666
64;4;1;2;1;1;355105630
1;64;4;1;32;2;576666519
16;32;2;16;8;2;83579852
256;32;16;1;8;2;213300296
8;16;16;2;8;2;51752592
128;16;4;128;8;1;18446744073709551615
2;16;16;1;2;4;126561037
1;1;64;1;1;32;1532940593
16;8;256;4;8;128;18446744073709551615
128;32;16;2;8;2;122619555
128;16;16;2;8;2;120822074
16;8;8;16;8;4;18446744073709551615
16;32;16;16;32;2;18446744073709551615
4;1;16;1;1;2;894309629
16;32;16;4;8;2;52833926
8;64;32;8;1;1;27647111
32;4;1;1;4;1;640552148
4;512;32;1;2;1;139293778
4;8;128;2;4;2;50784740
16;32;32;16;8;2;16451407
16;128;16;8;8;2;39049185
32;16;16;4;8;2;39294815
8;32;16;2;8;8;47548000
16;2;16;16;2;2;161678222
256;32;8;1;8;4;265562518
512;16;8;4;1;8;123160000
8;256;64;2;1;1;104754519
16;4;512;16;1;2;27768148
32;32;16;8;2;16;31383259
16;32;64;16;8;2;20552592
16;1;16;16;1;2;318147407
32;4;16;4;1;1;86796000
1;1;1;1;1;1;52722924593
64;32;32;64;2;1;16352444
1;8;256;1;1;8;110363260
16;32;32;8;8;2;35424889
16;2;16;16;2;2;163277926
16;16;1;16;8;1;325621630
2;64;1;1;4;1;426323852
8;128;512;8;1;1;26496000
16;512;16;16;8;1;23724593
2;8;64;2;4;8;98934370
16;64;16;16;8;4;18446744073709551615
16;2;32;16;2;1;78544741
8;32;16;2;8;2;58603111
16;32;16;16;4;2;14524593
4;32;16;1;8;16;174439704
16;4;128;1;2;64;194905334
32;256;2;16;1;2;24255259
4;8;1;1;1;1;1761195408
8;8;1;2;1;1;1003946519
16;64;16;8;8;2;35975703
16;32;16;16;32;1;18446744073709551615
2;32;16;2;1;2;77880148
16;32;16;4;1;2;85132445
1;32;16;1;1;2;155376000
1;32;16;1;8;2;123930814
16;32;32;1;8;1;253797185
64;32;32;4;8;2;65592741
32;16;16;8;8;1;34636593
16;512;16;16;8;2;22597481
16;32;16;16;8;4;18446744073709551615
1;256;64;1;4;2;151599407
1;1;1;1;1;1;52714603555
8;32;32;2;8;32;18446744073709551615
64;64;256;32;64;1;18446744073709551615
4;8;1;2;1;1;1782904741
64;32;1;2;1;1;195729333
4;64;256;4;32;2;74324741
16;16;4;1;8;1;87853186
1;16;32;1;2;1;155416297
1;512;64;1;1;8;220595704
1;1;256;1;1;128;1221099259
8;16;8;8;8;1;68770666
256;128;1;2;1;1;328313186
16;64;32;8;4;8;31666963
4;8;128;2;4;2;50209185
512;16;8;1;1;1;707864888
8;512;64;1;8;8;369459111
16;4;16;1;1;2;265567259
16;32;512;16;8;64;18446744073709551615
16;4;16;16;1;2;78636296
8;32;16;1;8;2;157883852
16;4;512;16;1;32;18446744073709551615
32;32;256;1;2;1;212887852
128;4;16;16;1;1;27521037
1;512;16;1;32;16;18446744073709551615
16;32;512;16;1;64;18446744073709551615
64;32;256;32;1;1;20886370
4;1;256;1;1;8;103873185
2;64;4;1;4;1;129563556
8;128;8;1;4;1;194246370
16;32;32;16;4;1;29989629
16;32;16;1;8;2;212180148
2;1;256;2;1;8;120275112
1;1;128;1;1;64;1344940445
32;256;2;16;4;1;21418370
16;32;8;16;2;4;22744000
512;32;16;1;2;8;332149333
8;32;16;2;4;2;59974074
16;32;16;4;4;4;48398815
4;8;1;1;1;1;1795878222
8;1;1;2;1;1;8154889778
1;256;16;1;32;2;182254371
2;8;256;2;4;1;58577926
32;32;32;8;8;8;18446744073709551615
32;32;16;2;8;2;110785482
32;64;32;8;2;1;45972889
16;32;2;16;8;1;85166519
64;32;256;32;8;1;17560889
32;32;32;8;8;1;39620593
1;32;16;1;8;2;125116296
2;32;16;2;2;2;65169481
4;512;64;2;16;64;18446744073709551615
64;1;1;2;1;1;1357735556
4;256;256;4;32;2;70497778
16;1;4;1;1;1;1189297334
128;4;32;1;2;4;224096889
16;32;4;16;8;2;41921481
16;32;8;16;8;2;21586223
16;4;16;16;4;2;82864000
32;1;16;8;1;2;163083704
1;1;64;1;1;2;853225629
1;2;256;1;2;128;1563478815
8;64;8;8;2;1;22677333
4;4;1;1;4;1;3565665629
8;16;16;8;8;8;18446744073709551615
16;32;16;16;8;2;12795407
16;16;64;16;2;4;16748740
4;16;128;2;8;2;93334223
512;16;8;4;1;2;91191703
256;256;64;1;1;1;208608297
16;32;16;8;8;4;27184296
16;16;16;16;8;4;18446744073709551615
1;4;512;1;1;2;148768148
16;32;16;2;4;2;114290519
512;1;1;4;1;1;205544296
128;4;256;16;1;2;26128148
1;1;1;1;1;1;52721409629
64;32;32;64;2;8;18446744073709551615
16;32;16;8;4;8;24261186
8;16;16;1;8;2;123942371
32;32;16;8;16;2;35736889
4;512;2;4;8;2;21249926
1;4;256;1;1;1;224028593
8;128;1;1;1;1;229309037
16;32;128;16;8;2;22167408
64;32;8;4;8;8;60235555
16;32;16;16;1;16;15778667
1;32;2;1;8;1;888382815
128;32;16;2;4;2;118502815
2;4;256;2;4;1;52469778
16;4;128;16;2;64;18446744073709551615
32;16;2;16;4;1;86468592
128;128;1;1;128;1;287360741
1;8;4;1;1;1;1730316000
512;256;16;1;4;1;281901630
2;8;1;2;4;1;3453980593
256;32;256;32;8;1;16921185
16;128;16;8;32;2;18446744073709551615
16;128;16;4;8;2;64234222
32;8;16;8;8;16;18446744073709551615
32;32;8;8;4;4;29096741
16;32;32;8;8;1;37206222
4;8;1;2;1;1;1805861778
64;1;1;2;1;1;1350526666
4;256;256;4;128;256;18446744073709551615
64;1;1;1;1;1;1317750074
1;256;1;1;8;1;225510370
16;32;16;2;8;1;138017481
16;32;16;16;4;1;13161778
64;32;16;4;16;2;75709778
2;16;32;1;2;1;149698667
1;512;512;1;1;1;208610222
1;1;256;1;1;16;282348000
8;16;8;8;8;1;68415111
16;32;16;8;4;2;25712296
256;32;256;1;8;64;18446744073709551615
16;32;16;16;16;8;18446744073709551615
256;128;16;32;1;4;19145481
16;1;512;16;1;256;18446744073709551615
256;8;1;16;4;1;49395556
2;256;8;1;32;2;173107111
16;32;256;16;8;64;18446744073709551615
16;32;4;16;4;1;41486519
128;256;64;2;1;1;104527555
8;4;8;1;4;2;272978074
1;32;1;1;4;1;1756816593
128;1;256;32;1;1;21464297
32;4;16;8;1;4;43391407
16;32;16;4;8;1;67456740
8;8;16;1;8;2;85583260
16;32;16;16;2;4;14784741
1;512;1;1;32;1;185200445
64;32;32;64;2;1;16364297
4;512;2;2;32;2;88588296
2;16;4;1;16;1;521920148
16;32;1;16;2;1;161082222
64;32;8;4;4;4;57906074
16;32;8;4;8;4;24847852
16;16;8;8;8;4;44602074
8;128;512;4;1;128;18446744073709551615
16;128;16;16;1;2;36600000
2;4;256;2;4;128;18446744073709551615
16;4;1;1;1;1;1194856592
16;64;8;8;8;4;26125926
16;16;16;16;4;2;22267407
128;32;16;2;32;2;131207852
32;256;2;1;4;1;275366963
4;512;512;1;1;1;208330370
1;1;4;1;1;2;13633913777
16;128;16;16;16;2;18446744073709551615
1;256;16;1;1;16;263145630
2;4;256;2;1;32;68978963
4;32;256;4;8;1;70928740
4;8;512;2;1;64;206207111
16;32;32;16;8;4;18446744073709551615
16;4;64;16;1;64;18446744073709551615
32;128;4;8;8;1;36005777
8;32;32;2;8;1;113158667
16;16;16;16;8;8;18446744073709551615
64;8;1;2;4;1;176350370
4;256;1;4;32;1;76900000
16;16;128;1;8;1;255463259
2;128;32;1;2;8;189022518
128;128;16;2;8;2;123781926
1;512;512;1;1;1;208594814
1;1;256;1;1;16;282413037
1;64;16;1;2;8;79606667
256;64;16;32;1;4;19893630
32;64;8;4;16;4;68867407
16;16;4;16;16;1;86122815
4;16;32;1;2;8;148008888
8;8;1;1;4;1;1010812889
4;16;8;1;1;2;147034667
1;32;16;1;8;2;124920297
2;32;128;2;8;64;18446744073709551615
128;256;64;64;1;8;18446744073709551615
32;32;8;8;8;4;34148000
16;32;8;16;2;8;23910814
16;32;16;4;1;2;84341630
16;4;512;16;1;128;18446744073709551615
32;32;16;8;2;1;45169037
128;32;256;32;8;1;17279111
32;64;512;4;32;256;18446744073709551615
16;64;16;16;8;8;18446744073709551615
16;32;4;4;8;2;48920592
1;32;16;1;8;2;127948296
128;32;1;64;1;1;26189926
4;512;2;4;8;1;21246963
1;64;4;1;4;1;226038667
8;128;512;2;1;1;104637926
16;32;64;16;32;16;18446744073709551615
32;32;4;8;8;1;26241186
256;32;16;16;8;2;22657926
4;8;16;1;8;2;131036592
1;8;16;1;8;2;487024593
2;4;256;2;4;64;18446744073709551615
16;1;128;2;1;1;181417778
32;256;2;16;1;1;31784148
16;32;16;8;4;1;32597333
16;32;1;16;8;1;179606666
4;512;512;1;2;1;138447407
64;8;4;4;2;2;47521482
1;1;512;1;1;2;160651852
1;8;256;1;4;256;18446744073709551615
1;32;16;1;8;1;128642074
32;32;16;8;2;16;31626222
4;32;4;1;4;2;127785185
64;64;256;16;4;1;22458074
