GLOBAL_SIZE_0;GLOBAL_SIZE_1;LOCAL_SIZE_0;LOCAL_SIZE_1;v_TP_76;v_TP_77;cost
2;2;1;2;21;117;12754476448
16;2;1;1;90;117;1664685504
128;1;32;1;21;182;2344360416
4;128;4;64;91;10;213714176
4;128;2;64;45;10;224898688
8;1024;8;64;126;1;119069536
4;128;4;1;91;10;135788768
4;128;1;8;91;14;167638624
8;1024;8;64;45;1;59826528
8;256;1;1;1365;1170;1111832320
128;128;4;8;8190;9;448248416
8;1024;1;64;126;1;197950816
8;2048;8;64;45;1;59416640
8;1024;8;1;45;1;51241696
8;1024;8;64;45;45;110744608
8;1024;8;4;45;1;49058816
8;1024;8;4;8190;1;4616448320
8;1024;8;32;45;63;86732128
16;1024;8;1;45;546;61047328
8;1;8;1;45;1;7287963168
128;128;1;4;9;546;94512672
64;32;32;8;9;15;41146912
4096;16;16;16;78;14;78619360
256;2;256;1;2730;42;350576608
64;2;32;1;9;195;1239592320
64;1;32;1;273;15;1221524800
16;512;1;128;9;15;219452256
64;32;32;8;315;15;49161824
64;8192;8;128;14;819;165731456
64;32;32;4;9;1;24378720
64;32;16;32;9;15;49716832
64;32;32;8;3;9;25326208
64;8;16;4;1;1;96927872
64;32;32;2;18;2;23920800
64;32;16;4;9;5;23854848
32;32;32;4;13;5;43927648
32;32;16;4;2;2;30318848
64;32;16;4;21;5;24897856
64;32;16;4;2;2;15255072
64;16;16;4;9;5;45997504
128;16;16;4;2;2;15394368
64;32;4;4;2;2;24508736
64;32;64;4;2;5;18522752
64;4;8;4;2;2;142192160
8192;16;32;2;2;39;50954368
32;256;2;32;630;39;227598336
8;64;8;16;1;1;97590368
1024;128;8;4;78;130;208432832
128;8;8;2;2;2;30750688
64;32;16;2;2;1;24692032
64;32;16;4;2;6;18392384
256;32;16;4;2;6;9258592
512;32;32;8;2;14;59758880
256;32;4;4;2;1;26458784
256;64;16;4;2;6;15032064
256;32;32;4;2;6;9624992
1;1024;1;64;91;65;1279491744
256;32;16;16;2;6;8955200
256;32;16;4;2;210;68430720
16;32;16;4;210;6;135418176
256;32;16;2;2;6;11141632
256;32;32;16;14;1638;457098048
256;32;2;16;2;819;289918304
256;32;16;16;2;18;47718496
2048;128;16;32;65;78;243529632
256;512;8;8;2;6;19604672
256;32;32;1;2;6;11030304
256;16;32;8;2;6;10855744
128;32;16;16;2;6;10200960
256;1024;16;32;2;6;20766304
256;32;16;4;2;6;9179488
256;32;4;16;2;6;27205504
1024;1;32;1;126;18;171441568
8192;32;16;32;2;6;23701152
128;32;16;16;2;9;14752800
128;256;16;16;2;6;20922560
512;1024;32;128;78;42;18446744073709551615
256;16;16;16;2;10;16432640
256;32;32;16;1;6;10118560
512;32;16;16;10;6;29604640
256;32;16;16;2;13;28549568
1;1;1;1;2;6;25242302944
256;32;16;16;819;6;19093248
512;32;32;1;30;15;56480288
128;64;8;8;9;90;180745984
64;512;2;32;13;105;236671296
512;64;32;16;26;39;271629248
256;32;16;1;2;6;12233600
128;32;16;16;14;13;25143040
256;32;8;16;1;6;10485792
128;32;16;16;9;15;29165056
4;32;2;16;2;6;417530848
256;32;16;16;4095;6;91226784
256;32;128;16;2;6;18446744073709551615
256;32;16;32;2;1638;353748352
16;32;16;16;2;6;70069568
256;32;16;8;15;9;30321952
256;32;8;2;2;6;12796064
256;32;16;16;10;6;14427808
256;2048;32;16;8190;3;150721088
16;8192;2;512;26;195;183322080
1;4;1;2;126;9;12965368704
2;512;2;1;910;63;2925114528
256;32;32;16;7;9;21800384
256;32;16;16;2;15;36341504
256;16;16;16;7;13;27188736
256;32;4;32;2;6;27444928
2048;32;16;16;195;6;24950720
2;256;1;16;2;6;96099488
128;8;128;1;117;30;124569696
128;8;32;8;14;65;120908960
4096;32;8;8;2;6;20740768
256;32;16;16;2;2;7525888
256;8;16;1;3;2;13615936
256;32;16;16;1;2;8499936
64;32;16;16;2;2;15196288
128;16;32;16;2;2;15405280
256;8;8;1;10;15;69884544
16;32;16;16;2;2;59938912
128;8;8;1;2;2;28168896
256;32;16;16;9;1;15976576
256;32;32;16;10;26;152094368
512;16;8;2;2;5;15491648
256;16;16;1;7;2;21567584
256;32;16;16;2;5;8785216
256;32;16;16;2;14;31245088
256;32;64;16;2;2;5662976
256;32;16;16;15;1;15662368
128;32;8;1;2;2;22671328
256;32;64;16;2;14;18446744073709551615
512;32;64;32;2;6;18446744073709551615
512;32;64;16;2;1;11331872
256;32;32;16;2;2;7224064
128;32;64;16;2;2;10161952
256;32;64;16;2;3;7143424
128;256;64;16;7;2;7774464
256;8;64;1;2;2;14488992
256;32;64;16;2;10;26566784
256;32;16;16;2;1;15980320
256;16;64;16;2;2;10169728
256;32;64;16;7;2;8905536
256;32;32;32;2;2;6299936
256;16;16;16;7;2;13167872
128;32;64;16;3;7;23487264
512;32;16;16;2;2;11070912
8;8;2;1;15;63;871474080
256;32;64;16;2;30;18446744073709551615
256;32;64;16;4095;2;88589312
8192;32;64;16;2;2;5491488
256;128;64;16;2;390;80348000
8192;2048;64;64;78;2;18446744073709551615
256;32;8;16;2;2;16788800
32;32;2;16;2;2;60667296
8192;32;64;2;2;2;8300160
8192;1;64;1;2;2;8020864
2;32;1;16;2;2;790085312
8192;2;64;1;2;2;7675584
256;4;64;2;2;2;28981152
8192;32;64;16;13;315;213648608
8192;32;8;16;130;2;25523616
8192;16;64;16;2;234;398944512
512;8192;64;16;2;2;5141824
64;32;64;16;2;2;20296704
512;4;64;2;2;390;831431232
512;8192;64;256;2;2;18446744073709551615
512;512;64;16;2;2;5308224
128;8192;64;16;2;2;5144704
256;8192;4;16;2;2;17648064
512;64;64;8;2;2;7791584
32;8192;1;16;273;2;69382592
512;8192;128;16;2;2;18446744073709551615
512;8192;64;64;2;2;18446744073709551615
512;2048;64;16;2;2;5155520
2;8192;1;16;2;1;96463136
512;8;64;1;2;2;8806784
512;8192;64;8;2;2;4437472
512;8192;2;16;2;2;9926240
8;8192;4;16;2;2;31203936
512;8192;64;16;2;45;18446744073709551615
1;8192;1;8;2;63;47887104
512;8192;64;2;2;2;4297376
512;8192;64;32;2;195;18446744073709551615
16;8192;4;8;2;2;23675488
512;8192;64;2;5;30;203045920
512;8192;64;16;2;90;216484544
512;8192;64;1;2;2;4173600
8192;8192;64;2;2;130;258635712
512;8192;64;64;70;2;18446744073709551615
512;8192;128;1;2;2;4268832
512;8192;64;1;2;210;129970080
512;8192;8;1;2;390;38606176
512;8192;64;1;2;7;9097728
512;8192;64;1;2;117;123716704
512;8192;64;1;1170;2;14058624
1;8192;1;4;2;1170;57249984
512;8192;64;1;4095;2;44352448
2;8192;1;1;2;2;130902208
512;8192;256;1;2;2;4306784
512;8192;256;1;910;2;11507296
512;512;64;1;2;2;5589568
512;4;64;2;2;2;14515936
16;8192;2;256;2;2;81723584
512;8192;64;1;70;2;6962432
128;8192;64;1;2;2;4504224
512;8192;64;1;63;2;6724960
64;8192;64;1;2;2;5271744
512;8192;8;1;2;2;18008256
512;8192;1;1;1170;2;211823488
512;8192;16;1;2;2;9248160
512;8;2;4;2;2;40647744
2;8192;1;1;2;90;196710560
512;8192;64;1024;2;390;18446744073709551615
512;8192;64;1;65;2;6781824
512;8192;64;1;2;390;102429184
512;8192;64;1;126;5;13603456
512;8192;64;8;91;2;9052512
512;8192;64;256;130;2;18446744073709551615
512;8192;2;1;2;2;70523040
1;8192;1;256;9;2730;195343264
512;8192;64;1;1638;2;19014240
4096;8192;64;8;2;2;4336704
1024;128;64;128;2;2;18446744073709551615
512;256;64;1;2;91;204169632
512;64;256;1;585;2;8579648
512;128;64;1;7;2;6464352
512;8192;64;1;2;65;142026048
512;16;64;1;9;2;7343232
512;8192;64;32;2;2;18446744073709551615
512;8192;64;1;2;30;23383584
512;8192;4;1;2;2;35495808
512;8192;512;1;2;2;4399872
512;64;64;1;2;2;7499424
512;8192;64;1;2;15;16284192
512;8192;256;1;315;2;6995488
256;64;32;16;26;42;262059936
16;8;1;1;39;315;473359264
256;64;8;16;210;2730;635790048
1024;1024;512;2;26;130;80441056
512;8192;128;1;18;5;16105728
512;2048;64;2;7;2;5989312
512;1;64;1;7;2;89561920
512;1;128;1;2;2;57368576
512;256;64;1;2;2;5575552
64;8192;2;1;63;2;109560192
32;8;32;1;15;42;418701312
512;8192;64;1;2;2730;106738080
512;8192;64;1;2;14;14609792
512;8192;64;1;546;2;8378752
1024;8192;64;1;3;2;4483232
4096;4096;128;4;2;2;3901856
512;1;64;1;3;2;51968928
4096;4096;128;4;2;7;9161088
1;4096;1;8;2;2;34465312
4096;4096;64;4;2;2;3847488
2048;8192;128;4;2;2;4104096
1024;4096;64;4;2;2;3999232
4096;4096;128;4;5;2;5430976
4096;4096;128;4;2;1;5919168
4096;4096;32;4;6;2;5255488
4096;4096;64;4;14;2;5781888
4096;4096;64;4;9;1;7710240
4096;4096;256;4;2;3;6591232
1024;2048;64;4;15;7;28243040
1024;2048;64;4;2;2;4350272
1024;2048;32;4;2;7;12765856
4096;4096;64;2;2;2;3717344
2048;4096;64;2;2;2;3860672
4096;4096;8;2;2;15;16910624
4096;4096;64;2;2;10;12273472
4096;4096;64;1;3;2;4430720
4096;4096;64;2;6;2;5140288
4096;4096;64;4;2;5;6870944
4096;4096;64;1;6;9;28422176
4096;4096;64;1;9;7;15974880
4096;4096;64;2;2;7;9521472
4096;4096;256;2;2;2;3822240
4096;4096;64;1;2;2;3937344
4096;4096;64;2;7;10;44558688
8192;4096;64;2;5;2;5475072
512;4096;64;1;7;2;5616384
8192;1024;64;2;2;2;4204416
4096;1;64;1;2;2;8008768
4096;1;64;1;2;2;8041536
4096;512;64;2;2;2;5051744
4096;4096;8;2;2;14;16799296
4096;4096;32;2;2;2;4102240
4096;512;64;1;26;1;7627072
4096;4096;64;2;1;26;81597568
128;64;32;16;26;42;214587136
4096;8192;64;2;2;2;4081312
4096;4096;64;1;6;2;5194624
4096;2048;512;2;2;2;5657280
4096;4096;16;2;2;2;6470112
1;4096;1;2;126;105;787293824
4096;4;4;2;2;2;25371584
4096;4096;64;2;2;910;95319136
4096;4096;128;1;2;2;3617568
4096;4096;128;2;5;2;5013984
4096;4096;64;2;14;6;21490368
8192;4096;128;1;2;2;3823488
128;4096;128;2;5;2;6992768
4096;4096;512;1;2;2;3800448
2048;4096;64;1;13;2;5618464
1024;4096;128;1;2;2;3985568
4096;4096;128;1;2;3;4202080
2048;4096;128;1;2;2;3816832
1;4096;1;1;2;3;115346272
2048;4096;64;1;3;2;4273696
2048;4096;128;2;2;26;28049888
8192;512;128;4;2;9;15913664
4096;4096;32;1;2;5;7580544
256;4096;128;1;2;2;4646944
512;1;1;1;65;2;249044192
4096;8192;256;1;2;2;3971456
4096;2048;128;1;2;1;5594112
1;4096;1;1;2;2;130194912
4096;2;4;1;2;2;38346880
4096;4096;128;1;2;30;22751424
4096;4096;128;1;390;5;17328032
4;1;2;1;210;1638;19786475776
2048;16;1;4;15;182;89887008
8192;8;16;1;1365;273;455103712
4;8192;1;1024;1170;6;1456516832
128;128;128;32;15;70;18446744073709551615
4096;4096;128;1;1;2;4167328
4096;4096;1024;1;26;2;6634688
4096;8192;128;1;2;2;4004224
4096;8;128;1;2;2;8803552
4096;4096;128;1;5;4095;197300576
4096;512;4;1;2;2;36345088
4096;4096;256;1;7;2;5012832
4096;4096;128;2;6;6;17954528
8192;4096;256;1;2;14;15681792
128;32;32;32;15;15;54767840
128;16;32;8;13;35;75474976
128;16;64;16;39;21;119204544
128;64;16;8;9;42;213767424
4096;4096;1;1;2;2;166158048
4096;4096;128;1;2;182;146254912
4;4096;2;1;2;2;65909888
4096;4096;128;1;2;273;132056896
4096;4096;128;1;1;3;3971232
2048;1024;128;1;2;2;4304224
4096;2048;128;1;14;2;5420576
4096;4096;128;1;2;65;194406688
4096;4096;32;1;2;2;6076064
4096;4096;128;1;45;2;6071904
4096;256;256;2;2;2;5428480
2048;8192;256;1;2;7;9004704
4096;4096;256;1;3;9;11382848
4096;4096;128;1;2;5;5918528
8;4096;8;1;2;2;16956320
1024;4096;128;1;2;455;98637952
4096;4096;128;1;630;2;7276352
4096;4096;4;1;2;2;42311136
4096;4096;128;1;3;3;4830496
4096;1024;128;1;2;2;4037216
4096;4096;128;1;10;2;5123296
4096;4096;128;2;2;5;6285792
4096;128;1024;8;210;4095;18446744073709551615
32;512;32;2;70;1;14325440
1;2;1;1;1638;78;27421575552
8;128;1;128;39;15;163224768
128;64;32;16;14;30;182268128
64;128;1;16;10;45;204517792
8192;4096;64;2;2;2;3906304
2048;1;128;1;2;3;21907232
128;128;128;1;78;2;7257344
128;4096;128;512;2;195;18446744073709551615
256;4096;2;1;2;2;66024864
4096;4096;128;1;2;1;5721312
1;4096;1;1;15;2;235298304
4096;4096;128;1;1365;2;8722752
8192;4096;128;1024;1365;2;18446744073709551615
4096;4096;128;1;8190;2;11994016
4096;4096;2;1;2;2;83873280
4096;1024;128;2;2;2;4315552
4096;4096;256;1;18;2;5823200
4096;2048;128;1;5;2;4846912
4096;4096;256;1;2;2;3683680
1024;4096;128;1;7;2;5468256
4096;8192;128;1;1;2;4245536
8192;4096;128;1;9;2;5465216
2048;4096;128;4;2;6;8539008
1;4096;1;1;3;2;142186688
4096;4096;128;2;2;2;3712928
4096;4096;512;1;5;2;5280576
4096;8192;128;1;7;2;5352160
4096;4096;128;1;2;26;20576320
8192;1;128;1;2;5;23945216
4096;4096;128;1;3;10;12200864
4096;4096;128;2;18;2;5909184
4096;4096;256;2;3;3;6046144
4096;4096;512;1;2;6;8030304
4096;2048;512;2;10;2;6297536
4096;4096;512;1;3;2;4226112
128;8;128;4;35;13;87083712
4096;1;128;1;273;2;11725600
512;2;128;2;2;2;28519136
4096;4096;1024;1;2;4095;1803707488
128;16;64;1;21;18;45253664
4096;4096;128;1;21;3;5541472
2048;4096;128;1;3;1;6699520
8192;4096;64;2;2;10;11944448
1024;4096;128;1;2;6;9949408
1024;4096;256;1;2;2;3962688
4096;4096;128;1;2;10;11542272
4096;2048;512;1;2;2;3904128
4096;2048;128;1;2;3;4584448
1024;4096;128;2;2;2;3972224
2048;1024;256;1;2;2;4315520
1024;8192;64;2;2;2;4078880
4096;1024;64;1;2;2;4071488
4096;4096;128;8;2;13;18446744073709551615
4096;4096;64;2;2;9;11787200
2048;1;128;1;2;2;14732544
4096;4096;128;1;5;10;42684192
8192;8192;128;1;2;1;6339232
4096;1024;128;1;7;2;4739456
4096;8192;128;8;2;5;9443840
256;128;2;1;91;105;134567008
1;8;1;1;126;210;6497402880
1;32;1;32;42;910;3382029568
4;1024;1;4;1170;39;1929661248
512;4096;128;1;2;3;4827136
8192;4096;128;1;5;2;5438016
4096;4096;128;1;39;2;5994240
64;4096;1;1;2;2;129438272
4096;4096;128;16;2;21;18446744073709551615
512;2;16;1;39;5;48785792
4096;4096;128;1;6;1;6681664
4096;4096;128;1;2;14;19205056
256;8;32;1;26;13;48833248
4096;4096;128;1024;2;2;18446744073709551615
4096;4096;128;1;2;585;63400000
2048;4096;32;1;2;2;5389792
4096;1;128;1;2;3;11412544
128;32;64;16;14;18;64112320
128;32;32;16;13;15;31373824
128;32;32;8;10;26;98347360
128;32;64;16;18;18;63337952
4096;1024;128;512;117;2;18446744073709551615
4096;4096;128;1;26;2;5862016
4096;2;128;1;2;2;7212896
4096;1;128;1;2;15;98325056
2048;4096;128;1;7;2;5135168
4096;1;128;1;9;2;11720800
4096;4096;32;1;9;14;34271328
4096;4096;128;1;1;6;6333568
8192;4096;256;1;2;2;3913280
2;4096;2;1;2;2;65765536
4096;4096;128;256;2;2;18446744073709551615
32;256;2;2;273;91;119305952
128;8192;64;16;273;234;211243136
1024;4096;2;32;39;126;246566432
2048;16;1024;16;18;65;18446744073709551615
2048;8192;128;1;1;2;3789088
2048;4096;128;4;2;2;3939232
4096;1;32;1;2;2;7977056
4096;2048;64;1;5;13;38783520
2048;4096;64;1;2;2;4121728
4096;4096;128;2;1;1;5962432
16;1;1;1;1365;234;3984249920
8;16;1;4;1365;630;1451536576
8;128;4;8;8190;9;6332538144
2048;16;32;2;30;39;123060224
256;4096;256;2;2;2;4904960
4096;4096;128;1;3;2;4165952
4096;1024;128;4;2;1;5959072
4096;2048;128;1;1;6;6331712
4096;256;128;1;2;2;6655456
8;4096;8;512;2;2;18446744073709551615
4096;2048;128;1;2;2;3762112
2048;1;64;1;7;2;22892640
4096;4096;128;1;5;2;5027328
4096;4096;128;1;1;1;5877568
128;64;32;16;13;21;116340224
64;64;64;16;10;30;148025664
1;256;1;4;630;39;4131982688
8;2048;2;4;1;1;31258144
4096;4096;8;1;2;2;21483904
4096;4096;16;1;2;2730;79768608
4096;4096;128;128;2;2;18446744073709551615
1024;128;4;4;1;130;39378688
32;256;32;16;8190;1;1260094688
16;8192;2;512;26;455;264922592
1;4;1;2;126;455;12915136512
512;8;8;1;15;13;53489024
4096;4096;128;1;7;2;4971552
2048;4096;256;1;2;2;3796960
4096;1;256;1;2;3;11725088
2;512;2;2;910;63;3189051232
256;16;16;16;14;15;33826112
16;8;1;2;39;315;495019776
256;1;8;1;13;2730;18613539744
128;8;32;1;13;14;73883872
4096;16;32;1;2;2;7975168
4096;1024;128;1;2;9;17506560
4096;4096;64;16;2;2;6388992
128;16;32;16;13;15;53849984
4096;1;32;1;18;2;11999168
2048;4096;512;2;2;2;5720544
4096;4096;128;2;2;3;4168640
128;32;32;1;15;10;18506016
4096;1;128;1;30;2;11757504
1024;4096;512;1;2;1;5789888
4096;4096;128;1;10;6;19816896
128;32;32;4;21;5;12362816
1024;1024;128;2;26;130;254536352
4;1;2;1;210;1638;19954311520
2048;8;1;8;15;182;186903584
128;32;8;16;14;7;15028864
1;4096;1;1;1;2;141266272
2048;4096;128;2;2;2;3836928
128;32;8;16;7;3;16132352
4096;4096;8;1;2;15;29460096
4096;4096;128;1;15;130;264793728
4096;4096;128;1;117;2;6664288
128;32;16;16;10;7;13869024
8192;4096;128;1;10;2;5583680
4096;8192;128;1;15;2;6107200
128;128;4;16;13;6;64847648
8192;8;16;4;1;273;410491968
4;8192;1;1024;117;6;314810496
4096;128;1024;8;10;273;18446744073709551615
128;32;32;16;13;14;28374368
8192;4096;128;1;26;2;6178784
512;32;4;1;21;2;56642176
32;2048;32;1;90;234;114989376
1;2;1;1;1638;90;27405453760
8;64;1;1;39;15;299603200
128;32;32;16;10;14;28752320
1024;4096;128;1;2;3;4967712
4096;4096;128;1;7;3;5590080
1024;4096;32;1;2;6;6630464
32;128;16;128;14;2;18446744073709551615
64;2;2;1;546;105;706072160
1;8;1;4;126;1;5750324352
1;32;1;2;42;910;1897911936
128;32;16;32;14;14;33186016
4;256;1;1;1170;39;1594786176
32;256;2;4;273;91;81907840
4;8192;1;16;1;1;23797856
128;32;16;32;14;5;13545600
4096;2048;256;1;2;2;3710560
128;32;4;2;18;1;42817568
1;4096;1;32;1;126;34834560
2048;16;1024;2;18;65;18446744073709551615
4096;2;32;1;90;21;110588640
128;32;32;32;14;13;47875200
4096;4096;256;1;6;2;5111392
4096;4096;512;2;2;2;6359392
1;4096;1;1;2;1;203153024
128;32;32;2;18;5;12072608
128;32;32;1;14;6;11329632
128;32;16;1;18;6;18199328
128;32;32;1;15;9;19397280
128;32;32;1;14;9;18998560
4096;4096;128;1;70;2;6257696
32;4096;2;1;2;2;65051264
4096;4096;128;1;39;70;281444064
128;32;32;1;15;5;12073824
8;4;1;1;1365;210;1988666592
128;128;4;64;1;65;189176000
8192;4;32;2;2;70;208710880
128;32;32;1;15;6;11621440
4096;4096;128;1;2;78;127737408
4096;4096;128;1;1638;2;9579648
128;32;32;1;21;1;13471200
4096;4096;128;1;2;2;3623488
8192;4096;128;512;2;2;18446744073709551615
128;32;32;1;18;3;10869504
32;2048;2;32;630;39;227993664
4096;2048;32;4;1;1;5855424
1024;128;64;4;1;130;159722336
128;32;32;1;26;1;12141120
4096;4096;128;32;15;2;18446744073709551615
4096;4096;128;1;273;2;6974720
4096;4096;128;1;2;910;44878240
128;32;32;1;21;3;11875936
256;2048;32;256;8190;910;18446744073709551615
1;8192;1;2;26;195;181829056
1;4;1;2;126;315;13119778496
128;32;128;1;18;2;12594880
4096;1;128;1;1;5;18630304
4096;8192;512;1;2;2;4123328
4096;1;128;1;2;2;8037600
128;32;64;1;18;3;10792480
64;512;1;1;105;546;276189312
16;8;4;8;39;315;986499616
256;64;4;16;210;2730;796348672
128;32;32;4;14;5;12037120
4096;4096;64;1;2;1;5789696
128;32;32;16;15;5;12699264
8192;4096;128;1;2;3;4114400
4096;4096;512;1;14;13;103817056
128;32;64;1;15;5;12063648
128;32;64;1;18;5;12041056
128;32;64;1;21;3;11925984
128;32;64;2;18;5;12022976
128;32;64;2;21;5;12149376
1024;1024;4;2;26;910;78688960
1024;256;2;16;210;1638;541209760
2048;16;4;4;15;182;130285344
128;32;64;16;14;5;17035008
8192;4096;128;1;1;2;4532736
1;512;1;2;2;2;116154176
2048;8192;256;1;2;2;3913888
4096;4096;64;4;2;6;8882016
4096;4096;128;1;2;6;8349248
4096;8192;128;1;5;2;5387840
4096;1024;128;4;2;2;4544000
4096;4096;32;2;5;10;24044736
1024;4096;128;2;2;3;4820384
4096;4096;128;2;2;7;8503968
1024;4096;128;1;2;9;10790496
1;4096;1;1;2;15;170093376
8192;4096;64;1;2;2;4413472
4096;1024;64;1;2;7;8284128
4096;4096;128;1;2;7;8537696
4096;4096;128;2;2;14;15755456
4096;4096;256;1;2;10;12610912
4096;4096;64;1;5;2;5506016
2048;4096;256;1;2;9;12143936
4096;4096;128;1;2;35;39817312
4096;256;128;1;9;2;5087520
4096;512;256;1;2;6;16933920
4096;8192;128;2;2;5;6551104
4096;8192;32;1;2;2;7571040
4096;4096;64;1;2;9;10673216
512;4096;256;1;6;2;6371040
2048;4096;128;1;2;7;8977088
4096;4096;64;2;15;2;5848160
4096;4096;256;1;9;5;9077888
4096;4096;16;1;2;18;17190432
4096;1;128;1;2;1;16746464
2048;4096;128;1;9;2;5285376
1024;4096;128;2;5;2;5293056
2048;8192;128;1;7;1;7910912
4096;512;128;1;2;2;5196608
1;8192;1;1;2;2;130770464
1024;4096;64;1;7;10;25069888
4096;4096;128;1;15;13;72322592
2048;1;128;1;13;1;24096032
4096;2048;64;1;2;5;5927840
1;4096;1;1;2;6;125420800
4096;4096;16;1;2;2;11043904
4096;4096;256;2;2;1;5899168
8192;512;16;2;2;2;7102976
4096;8192;128;1;7;1;8352800
8192;1;128;1;2;2;8006208
4096;4096;512;1;1;2;4657184
8192;4096;128;1;2;9;11064320
4096;4096;128;4;2;9;11832896
4096;8192;32;1;2;1;9717024
4096;2048;128;1;2;6;9138720
4096;4096;128;2;2;6;7949312
2048;4096;128;1;2;6;8881568
4096;8192;128;1;1;9;12470048
2048;1;256;1;3;2;14240160
512;4096;128;1;2;2;4244128
8192;8192;128;1;1;2;5050432
8192;8192;64;1;2;2;5903520
256;8;16;1;1;273;294123072
1;8192;1;1024;117;6;1216506304
4096;1024;1;16;210;4095;962445824
32;512;32;2;1;1;7763168
4096;4096;32;4;2;1;5707424
4096;4096;64;1;1;2;4872832
4096;2048;128;1;7;6;17220160
4096;1;128;1;2;9;54245120
4096;4096;128;8;2;5;8841152
1;2;1;1;1638;42;26854594240
8;1;4;1;39;15;6864231456
1;128;1;1;14;910;446071456
32;8;8;4;1;2;140498880
2048;8192;128;1;9;2;5457088
4096;8192;128;1;13;2;5608832
1;32;1;2;42;910;1875769728
4;256;4;1;1;39;90727072
1;256;1;4;273;91;1860008640
4;1;1;1;1;1;9527386816
4096;4096;128;1;6;6;17472064
8192;4096;64;1;2;1;5916128
4096;64;128;1;2;2;7993888
4096;64;128;1;2;26;46073824
4096;4096;128;1;2;18;15928672
4096;2048;64;1;15;2;5852672
4096;1;16;1;2;2;14609344
1024;1024;128;1;2;2;4701216
8192;4096;128;2;2;3;4314976
1024;4096;1024;32;1;126;18446744073709551615
2048;16;2;16;18;65;63628928
4096;2;1;1;90;21;258035584
128;256;8;1;1365;1;89142272
512;8192;128;1;3;2;4627680
1024;512;128;2;2;26;27003648
4096;4096;128;1;9;1;7794592
4096;512;128;1;5;2;4806720
4096;1;128;1;2;2730;14230040800
4096;4096;128;1;90;2;6467520
4096;1;128;1;2;630;4467545856
2;1024;2;1;2;2;65801504
4096;2;2;1;2;18;118103680
128;128;4;64;1;65;189049120
8192;16;4;2;2;39;64683552
1;1;1;1;630;39;44396583648
4096;256;32;4;1;1;7389664
1024;8192;4;4;1;130;29320768
4096;4096;128;32;2;182;18446744073709551615
1024;4096;128;1;2;63;130718144
4096;4096;128;4;7;2;5486880
4096;4096;1024;1;2;2;6368928
4096;4096;1;1;2;117;266495296
1;2048;1;1;8190;3;30597902240
1;64;1;2;26;195;811204064
1;4;1;4;126;455;14205091808
4096;64;1;1;455;2;205918272
4096;4096;128;1024;1170;2;18446744073709551615
4096;4096;128;1;2;91;213221728
4096;4096;128;1;2;63;123062176
16;4096;4;1;2;2;32835232
4096;4096;1;1;819;2;252147680
512;4096;128;1;2;2730;87497664
64;512;2;32;105;546;105560864
16;1;4;1;39;315;4635564768
4;1024;1;16;210;2730;656550272
1024;1024;16;1;26;1638;100871040
1024;256;1;16;1;1638;52424864
2048;32;1;4;15;182;89583328
256;8;1;1;1;273;403448352
4;8192;1;512;117;6;315988640
4096;4096;2;32;2;2;15733248
4096;4;128;1;2;2;8718560
4096;4096;128;1;2;210;120140704
16;4096;4;1;1638;2;513532544
4096;4096;128;1;2;21;16494464
128;8192;8;1;2;2;16915744
4096;32;128;1;2;2;8417376
4096;256;128;1;2730;2;7192896
4096;4096;256;1;2;6;7768416
4096;1024;1;16;210;78;197798944
32;1;32;1;1;1;1406860480
1;2;1;1;1638;42;26422051776
8;1;1;1;39;15;5803153120
4096;1;256;1;2;1;17856096
4096;1024;128;1;2;7;12185088
4096;1;128;1;2;2;7980576
1;1;1;1;2;2;30045366624
4096;4096;128;1;2;546;62547200
4096;4096;128;256;39;2;18446744073709551615
16;4;4;1;2;2;467190336
1024;128;128;1;1;105;175362080
32;64;8;4;1;2;20147424
1;32;1;2;1;1;1219929056
256;256;128;8;2;2;5350560
4096;32;128;8;2;2;5486880
4096;4096;128;1;2;630;57939456
2048;8192;128;1;2;2;4011168
8192;2048;64;1;2;2;4135680
4096;2048;128;1;3;2;4001568
1;4096;1;2;2;2;72058720
4096;4096;128;1;14;14;78715008
4;4096;2;1;2;21;86759808
1;4096;1;1;2;2;130482912
4;256;4;1;1;7;44295136
4096;1024;128;1;2;1;5574752
4096;2048;128;1;10;2;4924608
1;256;1;1;273;91;1548956224
256;128;64;16;1;1;15131040
1;16;1;1;2;126;2385899072
2048;16;2;16;1;1;73937280
4096;4;1;1;90;21;255908800
128;256;8;1;1365;585;844424384
256;128;4;64;1;90;174637152
8192;16;2;2;1;39;78167968
4096;128;128;1;1365;2;8127488
4096;4096;128;1;1365;13;21884256
64;4096;1;16;2;2;21884128
2;4096;2;1;273;2;683289696
4096;4096;128;1;2;390;88008416
8192;4096;128;1;21;2;6165856
4096;8192;64;1;2;2;4682368
4;4096;2;1;2;2;65664576
4096;4096;128;1;2;1365;53676192
4096;4;16;2;2;2;9091776
1;4096;1;1;2;2;130515680
4096;4096;16;1;5;2;16573120
2048;2048;128;1;2;2;3972320
4096;4096;128;32;2;63;18446744073709551615
4096;4096;128;512;2;2;18446744073709551615
32;256;2;32;630;130;235120032
4096;1024;32;4;1365;1;11738304
1024;8192;4;16;1;1;6713088
128;2048;8;16;26;3;23700288
4096;4096;128;1;130;2;6760192
