GLOBAL_SIZE_0;GLOBAL_SIZE_1;LOCAL_SIZE_0;LOCAL_SIZE_1;TILE_0;TILE_1;cost
1;2048;1;64;2048;4096;316974222
256;4;2;2;8192;1024;5766121926
128;8192;1;8;4096;2;192700889
1;16;1;2;1;1;3395984297
128;4096;1;8;1;2;691685037
128;8192;2;32;4096;2;262474074
128;8192;1;2;4096;32;176571556
128;1;1;1;8192;2;29045681926
16;4096;1;1;1;8;156289482
4;32;4;4;4;128;262690074
8192;64;128;2;16;32;4521389926
16;8;4;1;1;1;906109778
16;4096;1;256;1;8;209344444
16;4096;4;2;1;8;78065482
16;4096;2;2;1;4;146737037
16;4096;4;4;1;2;251374963
16;4096;2;1;1;8;117936148
16;4096;4;2;1;4;105880148
16;1024;4;4;1;8;42099852
2;4096;1;256;1;32;51426667
16;1024;2;2;1;4;124561037
16;1024;8;8;1;8;24063259
16;1024;2;2;8192;8;364408297
16;1024;4;4;1;2;109290371
16;8192;8;8;1;8;20178815
32;1024;8;8;8192;8;116865778
16;8192;8;8;1;16;20328741
16;4096;8;8;1;32;19875852
32;4096;8;8;1;16;20128889
64;8192;8;8;1;32;19898519
64;4096;32;2;1;32;79115703
16;8192;8;8;1;32;19875704
8;8192;8;8;8192;32;11189630
4;4096;1;1;1;32;102332148
64;8192;4;4;1;32;38854075
32;1;8;1;1;32;5207409630
16;8192;8;8;8192;16;23930963
1;8192;1;256;8192;32;31795407
8;8192;8;8;8192;64;11201629
8;512;8;8;8192;32;13798667
16;2;8;1;8;4096;911001778
4096;256;256;1;64;16;4109892296
8;8192;8;4;1;32;40470223
8;1;8;1;8192;32;3693477333
8;8192;8;4;8192;8;17544445
32;8192;8;8;8192;8;99038074
8;8192;2;2;8192;32;183762666
8;8192;8;8;1;32;21076000
8;8192;8;8;8192;16;11912741
8;8192;4;4;8192;4;79849037
8;1;4;1;8192;32;6999683852
1;512;1;64;1;2048;163357037
8;128;8;2;8192;32;37759704
2;256;2;1;1;4;166345926
1;2;1;1;32;512;9237520000
4;4096;2;2;8192;32;94704889
2;8192;2;2;8192;32;46341926
16;8192;4;4;1;32;39974666
8;1;8;1;8192;128;3629866519
1;32;1;4;1;8192;7594221926
16;8192;16;16;8192;32;17848889
8;8192;1;1;8192;256;651815111
8;2048;8;8;512;32;11193926
32;8192;8;8;8192;128;44591260
8;8192;2;2;1;32;79563259
128;8192;4;4;1;32;39859704
512;128;64;1;128;64;134463852
8;8192;8;8;8192;2048;185193333
8;8192;2;1;8192;32;367037778
8;8192;8;8;8192;1;320523703
16;8192;4;4;1;8;39276741
8;1;8;1;8192;32;3665156741
16;1;8;1;1;1;5535242666
2048;1024;4;4;4096;4096;577672593
2048;1024;1;8;128;4;132628592
64;64;4;1;8;1;65406667
16;16;8;2;64;1024;120583852
1;8192;1;256;1;32;45169926
8;8192;8;2;8192;32;18866667
8;8192;4;4;4096;64;17048296
8;8192;8;4;8192;32;13741778
16;2048;8;8;8192;32;22522666
16;8192;8;8;4096;32;11320149
16;1;1;1;4;1;1446087704
8;8192;8;8;4096;32;11192296
16;1;8;1;1024;32;1789308000
8;8192;8;4;4096;32;13675555
16;64;8;4;4096;2048;144630815
256;2048;8;16;8192;32;2101145482
256;1;32;1;1;128;2576409481
16;8192;4;4;8192;32;68082371
8;8192;8;8;1;128;67948000
64;4096;16;8;8192;512;56666371
1;1;1;1;512;8;21659066518
512;8192;256;1;1024;128;144414519
128;8192;32;1;1;512;308049333
8;128;8;8;64;128;48002222
4;1;1;1;8192;32;19761253482
8;2048;8;8;8192;32;11192593
1;1;1;1;64;1;23753193778
8;4096;8;8;4096;32;11196445
16;8192;8;8;8192;64;22309185
4;8192;1;256;8192;16;624763852
8;8192;8;1;8192;32;32953185
8;4;8;1;8192;32;922864297
8;128;1;2;8192;4096;6702570371
8;32;8;8;8192;32;207710371
64;2048;64;2;2048;16;107201777
8;4096;8;8;2048;16;11939556
8;8192;1;1;4096;32;181337037
8;8192;1;1;8192;32;687855407
4096;64;1;8;4;1;134695111
16;8192;8;4;8192;32;29020889
8;4096;8;8;8192;128;12641185
8;4096;1;1;8192;32;695365037
256;2048;32;8;2048;512;38223111
1;1;1;1;4096;8192;11046295408
1;4;1;1;64;256;4622276593
32;1;4;1;1024;1;1653608889
256;128;64;2;64;16;148402814
4;1024;1;1;8192;32;487867555
8;8192;8;8;8192;8;12753333
2;8192;2;2;8192;8;46377778
32;512;32;1;512;64;40132000
16;64;8;32;64;512;89396148
64;128;32;8;128;128;18551555
16;128;8;8;512;512;23625778
8;8192;8;2;2048;256;58775112
8;8192;1;1;1;128;83751259
8;8192;8;8;64;32;11194075
8;8192;8;8;8;32;11194667
8;8192;4;4;8192;64;34183704
4;8192;1;1;8192;32;477380148
1024;128;1;16;32;1;165154814
128;1;2;1;2048;4;4130137926
1;8192;1;16;4096;64;18264741
1;64;1;1;64;2;433482666
16;512;4;64;1024;32;25226074
4;256;4;32;1024;512;50994370
8;8192;8;8;8192;128;13330667
8;8192;8;8;8192;32;11191556
8;4096;1;128;8192;1024;40672741
32;8192;8;8;4096;32;22480741
8;1;8;1;8192;64;3621510074
8;2048;4;4;8192;32;34403704
8;4096;8;8;8192;64;11170667
32;4096;8;8;1;64;20042370
2;4096;2;2;8192;32;46334666
8;4096;4;4;8192;32;34428148
1;4096;1;1;8192;32;80069333
32;4096;8;8;8192;64;44685629
8;4096;2;2;4096;64;93928148
2;8192;1;1;8192;64;194685482
8;4096;8;8;8192;16;11786075
16;4096;8;8;8192;64;22306074
1;4096;1;1;4096;4;129060592
8;4096;8;8;1;128;67834963
8;4096;8;4;8192;64;13932296
8;2048;8;4;8192;64;13902667
1;2048;1;1;1;64;145914667
16;4096;16;16;8192;64;16050370
8;2048;4;4;1;64;43721186
4;4096;1;1;8192;128;351094371
8;8192;2;2;512;64;46653333
8;4096;8;8;1;64;34972296
4;8192;1;1;8192;64;308503556
16;2048;8;8;8192;16;23865777
8;4096;1;1;8192;256;614698075
2;4096;1;1;8192;64;163987704
16;4096;8;8;4096;64;11164000
16;2048;8;8;4096;64;11160000
16;4096;8;8;4096;16;12331407
16;4096;16;16;4096;1024;1175864085
32;2048;8;4;4096;64;27229037
16;2048;16;16;1;64;39900296
16;2048;8;8;4096;8;16946667
16;4096;16;16;4096;64;15550815
4;2048;1;1;4096;64;153911852
16;2048;8;8;1024;64;11718963
16;512;8;8;2048;64;11170075
16;2048;8;8;2048;64;11168592
32;2048;8;8;1024;64;11198074
32;2048;8;8;1;64;20066370
32;2048;8;8;512;64;11194963
32;2048;8;8;4096;64;22353185
32;2048;8;8;8192;64;44678814
16;2048;8;8;4096;32;11310074
8;1024;8;8;1024;32;11139556
16;2048;8;8;4096;128;11171852
16;8192;8;8;1024;32;11263407
8;1024;4;4;1024;4;29238518
8;1024;8;8;1024;16;11176741
8;1024;4;4;4096;32;17431260
2;1024;1;1;1024;32;72695259
8;2048;1;1;1024;32;88693482
8;4096;8;8;1024;8;12839703
8;4096;8;4;1024;128;19545185
16;1024;4;4;1024;32;17072740
8;1024;8;8;512;32;11143111
64;1024;8;4;1024;32;16512148
4;2048;2;2;1024;16;45717333
2;1024;2;2;1024;64;65008296
8;1024;8;8;2048;32;11140148
8;1024;8;8;1024;64;11198370
8;1024;4;4;1024;16;17751259
32;256;8;8;1024;64;11163704
8;512;8;8;256;32;13147111
8;1024;4;4;256;32;17242518
8;512;8;8;512;32;13239111
8;1024;8;8;2048;16;11156297
8;256;8;8;512;32;25357778
16;256;8;8;1024;32;13915556
8;1024;8;8;4096;16;11155852
8;2048;8;8;1024;32;11193629
8;128;8;8;1024;32;51421186
8;256;1;128;1024;32;94559555
16;1024;8;8;1024;64;11732445
4;512;1;1;1024;32;121628000
8;512;8;8;64;32;13166666
16;1024;8;8;1024;32;11186074
8;2048;8;8;1024;16;11293778
8;1024;1;256;1024;64;33625778
8;1024;4;4;1024;32;17290667
8;4096;8;8;1024;32;11191259
8;256;1;1;1024;64;104410370
8;512;8;8;128;32;13091259
16;1024;8;8;1024;16;11488593
8;1024;8;8;256;64;11185333
2;2048;2;2;1024;32;45947555
8;512;8;8;1024;32;13299112
32;1024;8;8;1024;32;11361926
16;4096;8;4;4096;8;20484148
128;1024;2;8;1024;2048;78312444
4;2;2;2;32;2048;3822838963
1;8192;1;4;8192;8;38549629
8;512;8;8;4096;32;13679111
16;1024;16;8;2048;32;17197186
256;256;32;4;128;8;118622815
4;1024;1;1;1024;32;121301334
4;1024;1;1;1024;8;96508593
8;2048;8;8;1024;256;23351260
8;256;8;32;512;256;44628889
128;4096;8;8;1024;32;14539112
8;1024;1;1;1024;32;89079852
8;1024;8;4;1024;64;13927408
32;1024;8;8;512;16;13064592
64;1024;8;1;1;16;104438518
4;2;1;1;256;32;2539736889
256;2;64;2;1;4096;3905379111
128;128;64;4;1024;1;594747556
4;1024;2;2;1024;32;49057333
8;1024;8;2;1024;32;18817926
1;4096;1;1;1024;32;82679407
16;128;8;16;128;128;26621481
1;1024;1;1;1024;32;97939259
8;128;8;4;1024;32;37475555
8;1024;8;8;128;32;11166075
64;256;8;4;512;4;41771555
8;1024;8;8;1024;1;89857037
8;8;8;1;1024;32;466350666
8;1024;4;4;1024;32;17274963
32;256;8;8;512;16;12249185
8;8;4;1;256;1024;427656889
16;8192;1;256;4;32;94621629
512;128;128;2;256;1;238475703
8;1024;8;8;1024;256;23634962
8;1024;4;4;512;32;17295407
4;1024;1;1;1024;128;96116149
8;64;8;8;1024;32;102326666
32;64;1;16;512;64;44484148
8;1024;1;1;1024;32;88238222
32;512;16;16;512;64;16266963
8;32;8;8;1024;32;207501037
8;1024;8;4;16;32;14613186
8;1024;8;8;256;32;11156741
8;1024;8;8;1024;128;12746667
1024;8;32;8;64;8;23189185
1;1024;1;1;64;512;1211987556
512;32;32;4;8192;8;1393931111
8192;16;64;2;1;1;276396889
128;1024;8;16;8192;16;677113185
8;1024;8;2;2048;32;19790371
32;128;8;16;256;128;13980741
8;128;8;8;2048;32;51004297
64;1024;8;2;2048;32;26093481
8;256;8;8;1024;32;25258371
128;1024;8;8;1024;32;15693481
8;4;8;4;1024;32;1223181630
8;1024;8;1;1024;32;31417185
128;64;32;1;128;256;51466963
8;1024;8;4;2048;64;13923259
16;1024;16;16;1024;64;14913333
32;512;8;32;512;64;12504593
2;256;1;256;2048;4;5180496000
1;2;1;1;16;32;9580986370
2048;1024;4;4;16;4096;20677630
128;1024;8;8;512;1;137529185
8;128;1;128;1024;32;187326815
4;1024;1;1;2048;32;122762815
32;128;8;8;512;128;12974667
8;256;4;4;1024;8;25065334
8;1024;1;1;2048;128;125779704
8;1024;8;8;1024;2;46148445
2048;1024;1;1;1024;1;588089778
8;1024;8;16;1024;32;11138222
8;1024;8;16;1024;32;11135111
2048;1024;8;16;1024;32;14334222
8;4096;8;16;1024;32;11292592
8;1024;8;2;1024;2;48799556
128;1024;128;1;1024;32;109923704
8;4096;8;16;2;32;45952889
8;1024;8;16;1024;1;178758667
32;1024;2;16;1024;32;18047259
8;1024;8;16;4;32;22280592
8;1024;8;1;1024;1;151294518
8;1024;4;16;1024;32;9641037
1;1024;1;16;1024;32;41384297
8;1024;4;16;1024;8192;581670519
8;1024;1;256;1024;32;56298074
128;1024;4;16;1024;32;24713630
8;1024;4;2;1024;32;28298963
8;1024;4;4;1024;32;17229037
8;1024;4;16;1024;32;9637481
8;8192;4;16;1024;32;9681333
8;1024;1;16;1024;32;10020000
8;1024;4;16;256;32;9640000
2;64;1;16;1024;32;355688889
8;1024;2;16;1024;8;20233037
16;1024;2;16;1024;32;9511260
16;16;2;16;1024;32;196386667
1;1024;1;16;128;8;82094222
16;1024;2;4;1024;8;34148592
16;1024;2;1;1024;32;90608148
16;1024;2;16;1024;2048;42459407
16;2048;1;128;64;32;24302666
16;1024;2;128;1024;128;6431852
16;1024;4;16;1024;32;10666814
16;1024;2;32;1024;128;5648889
16;1024;1;128;1024;128;6984593
16;1024;16;4;1024;128;14771556
16;256;8;2;1024;128;19718074
16;1024;2;32;1024;4096;44932741
16;1024;4;32;1024;128;9687111
256;1024;64;4;256;128;53655555
512;1024;64;4;1024;128;99084592
2;1;1;1;1024;128;9947258666
8;1024;4;32;1024;128;9619852
16;4;2;4;1024;128;469452741
16;1024;4;32;1024;128;9703852
16;2048;2;1;1024;128;96132889
16;1024;2;2;1024;128;46854666
16;512;2;32;1024;128;7725629
1;1024;1;32;1024;128;42919407
2;1024;2;32;1024;128;23767259
16;1;2;1;1024;128;1738604444
1;8;1;2;1024;128;3640022667
16;1024;2;32;1024;512;7128740
16;1024;2;32;1024;4;88740296
16;1024;2;2;1024;128;46913185
8192;1024;64;4;1024;128;81974223
16;1024;4;32;1024;512;9679704
64;1024;64;4;1024;128;43973038
16;1024;1;128;1024;128;7049777
1;1024;1;32;4096;128;43136889
16;1024;2;2;1024;32;45356000
4096;1024;64;4;1024;128;76326222
8192;1024;32;2;1024;128;63830963
16;1024;2;32;1024;32;7032000
16;1024;16;1;1024;128;37940000
16;1024;16;1;1024;128;38177482
16;1024;2;8;1024;128;13339259
8;2;4;2;1024;128;1859461630
16;1024;2;2;4096;128;187106667
32;1024;1;32;1024;128;20649037
16;1024;1;32;1024;128;10093630
16;1024;2;32;128;128;5649630
16;1;2;1;1024;128;1736938074
4;1024;1;8;1024;128;20415556
16;1024;2;32;1024;8;50416296
16;1024;2;32;1024;1;197252148
16;1024;2;32;1024;2;174125185
16;1024;8;32;1024;8;58308593
16;1024;2;32;4096;128;22589334
16;1024;2;16;1024;512;11856148
16;1024;2;16;1024;128;8334814
16;1024;2;32;512;128;5651259
1;1024;1;32;1024;128;41474370
512;1;64;1;1024;256;129696444
16;4096;2;32;1024;8;89618371
16;1024;2;32;1024;128;5651407
16;1024;2;32;16;128;5661185
16;1024;1;32;1024;128;10084592
16;1024;2;32;1024;16;21505037
16;1024;2;64;16;128;5777334
16;1024;2;32;2;128;5787259
16;1024;2;32;1024;1024;12061778
8;1024;4;32;1024;16;19286815
16;128;2;32;1024;128;24757481
16;8;8;2;1024;128;245638518
1;64;1;32;1024;128;702051703
8;1024;4;32;1024;64;9622074
2048;1024;128;2;1024;128;169536297
16;8192;2;32;1024;2;318376444
2;1024;1;32;1024;128;21269926
16;1024;2;32;1024;2048;22616445
16;1024;2;32;4096;128;22617926
16;1024;2;32;2048;128;11322667
4;1024;2;32;1024;128;12160593
16;1024;2;32;1024;1;196246963
16;16;2;1;1024;128;133926222
256;1024;64;4;1024;128;53812444
512;1024;64;4;1024;512;68768296
16;8192;2;32;1024;128;5935852
16;1024;8;2;1024;128;20296888
16;1024;2;32;8;128;5676889
16;2;2;1;1024;16;884224000
16;2;2;1;16;64;852105482
16;1024;2;32;512;2;119380296
16;1024;2;4;1024;128;24542667
16;2048;2;32;1;128;5586667
16;1024;2;64;1024;128;5777333
16;1024;2;1;1024;128;93232741
16;2048;2;32;1024;128;5984445
16;4;2;4;1;128;939179555
16;2048;8;32;1;128;19906370
16;2048;2;32;1;1;143154815
16;2048;2;32;128;128;5844148
16;2048;2;2;1;1;638488297
16;2048;2;32;1;256;5916296
512;2048;64;4;4;128;1759348592
16;2048;2;32;1;8192;384591408
16;64;2;4;1;128;68407555
16;2048;2;32;8;64;6023111
128;2048;64;4;1;128;158286666
16;2048;2;1;4096;128;373220741
16;16;8;1;1;128;620528000
4096;2048;64;4;1;128;157490518
16;2048;2;32;1;1024;19179408
1024;2048;64;4;128;128;106517037
16;512;2;32;1;128;10443555
16;2048;1;32;1;128;5977185
16;1;2;1;1;128;2635421481
16;2048;2;128;1;128;6676000
2;2048;1;32;1;128;11394222
8192;512;64;4;1;128;154331704
16;2048;16;1;1;128;285850370
16;2048;2;16;4;128;8358518
1;1;1;1;4096;128;19981890074
16;2048;2;32;512;4;101249037
16;2048;16;1;1;128;289322815
2048;2048;64;2;1;128;158786667
16;2048;2;32;4;128;5855111
128;2048;64;4;1;128;158226666
8;2048;4;32;1;128;12003111
16;2048;4;32;1;128;10324148
16;1024;2;4;1;128;40615852
16;2048;2;32;8;256;5678223
32;2048;2;2;128;128;45750371
16;2048;2;32;2;128;5809037
16;256;2;32;1;128;19965630
16;1;2;1;1;128;2634356148
16;2048;2;32;1;2048;38571851
1;2048;1;32;1;128;19401185
1024;2048;64;4;1;128;154908888
16;2048;2;16;1;64;10567407
16;2048;1;64;1;128;5618666
16;2;2;2;1;128;1758665629
16;2048;2;16;1;128;10156148
32;1024;4;8;128;1;110266222
64;64;4;1;8192;1;2061449481
64;1;16;1;8192;512;2019344148
1;1;1;1;512;8;21628115259
16;2048;2;32;512;128;5836444
16;16;2;1;1;128;162221778
128;1;8;1;8;4096;148103259
16;2048;8;32;128;128;11202371
256;2048;64;4;256;128;53792740
32;1024;8;8;2048;32;11386519
16;32;2;32;1;128;170018815
16;2048;2;64;1;512;5865630
8;1024;1;64;8192;16;224854667
512;16;8;2;1024;32;77535259
256;8192;1;1;1;512;104755259
256;2048;1;8;2048;512;174446963
64;128;16;16;256;128;14197629
16;2048;2;32;1;8;30311852
16;2048;2;32;32;128;5835111
32;64;2;16;512;64;27125630
1;256;1;1;4096;128;291977926
1;1;1;1;1;16;19926382074
32;1;1;1;1024;1;4600782222
16;64;16;1;1;128;290645778
16;2048;2;2;1;128;79797185
16;2048;2;4;1;128;39910074
1024;128;1;16;2;1;133061333
2048;1;64;1;1;8;701773186
16;8192;8;16;4096;8;46301926
1;128;1;128;1;1;11195994815
16;2048;2;2;1;128;81170963
16;2048;2;16;1024;128;8325185
16;2048;2;64;1;128;7664000
128;1024;1;8;1024;2;145806962
4;1;1;1;32;128;4957080444
1;1;1;1;8192;8;21563928148
4;1;1;1;256;32;5084753334
16;4096;2;16;2;128;8346222
16;2048;16;1;8;128;76974074
16;2048;2;32;1;64;5295111
4;2048;1;32;1;128;6290222
16;4096;2;32;1;64;6362815
8;2048;1;32;4;64;5147407
256;2048;64;4;1;64;156060148
16;2048;16;2;2;64;140347111
8;1024;1;32;4;64;6999852
8;2048;1;4;2;128;39363852
8;2048;1;32;8;16;10150667
8;2048;8;32;4;64;22382667
2;2048;1;32;4;64;10924889
32;2048;16;1;8;64;57725926
16;2048;16;16;4;32;66140297
8;2048;1;64;4;32;6574667
8;2048;1;64;4;64;3684445
8;4096;1;32;4;64;6152148
8;4096;1;32;16;128;6254370
8;4096;1;64;4;32;9668148
8;8192;1;64;4;64;5518667
8;2048;2;64;4;64;5733037
4;2048;2;64;4;64;7132741
2;2048;1;64;4;64;11207259
4;2048;4;64;4;64;9762074
1;4096;1;64;4;64;12009629
4;2048;2;64;2;128;7443407
8;2048;1;256;4;16;49552148
8;2048;8;1;4;64;75584296
8;2048;1;256;4;32;29224000
4;2048;2;64;4;8;53562815
4;2048;2;1;4;64;90832148
8;2048;1;64;8;64;3618667
8;1024;1;64;1;512;5474815
8;2048;1;32;8;64;5125778
8;2048;2;128;8;64;11352444
8;2048;1;64;64;128;3851704
8;2048;8;1;8;64;37339260
8;2048;1;256;2;64;16180741
8;2048;1;64;2;256;4714667
2;2048;1;64;8;16;40856148
16;8192;16;2;8;512;152774519
16;8192;1;256;8;64;44633185
8;2048;2;64;16;32;11611704
4;2048;1;64;8;128;6139407
8;512;1;64;8;64;10661778
8;1024;1;64;8;64;5905334
1;1;1;1;8;32;19823505186
32;1024;16;2;8;64;39068444
4;2048;2;64;8;64;6816741
8;1024;1;64;4;64;5994222
16;2048;16;2;8;128;41769037
8;2048;1;16;8;64;10140000
32;2048;8;2;8;64;19260296
8;2048;1;64;1;32;6606371
8;2048;2;128;8;128;5665629
8;4096;1;128;8;256;6162222
64;2048;16;2;8;64;48444296
8;2048;1;64;16;64;3601185
2;4096;1;256;32;64;21999407
8;2048;8;1;16;64;34867260
8;2048;1;128;16;64;7562222
4;2048;2;128;16;32;25725185
8;512;1;64;16;64;10666667
8;256;1;64;16;64;21020000
4;2048;2;64;16;64;6641186
16;2048;8;1;16;256;64145926
8;2048;2;32;16;2;90230815
8;2048;1;64;16;128;4060593
64;1024;32;1;16;64;112500889
8;2048;8;16;32;64;11997629
8;2048;8;1;2;64;144662667
8;2048;1;64;16;256;5509037
8;1024;2;64;16;64;6453630
8;1024;8;2;16;64;20214074
8;2048;8;32;16;64;11205926
2;2048;1;64;16;64;10720741
4;2048;1;64;16;2;163374666
8;4096;1;64;8;8;36767556
8;2048;2;64;8;64;5756444
16;2048;16;2;16;64;17041037
8;8192;2;64;16;64;5793333
8;2048;1;32;16;64;5183111
8;2048;1;16;16;64;10125185
8;2048;1;64;16;8;22332445
8;8192;1;64;64;64;5108889
2;8192;1;64;16;64;3746371
8;2048;2;64;16;64;5651556
8;2048;1;32;16;4;41755852
4;2048;2;64;32;64;6553926
32;8192;16;2;16;256;21062518
16;4096;1;64;4;64;6820000
8;1024;1;64;16;32;10830222
16;2048;16;4;16;256;26046667
2;4096;1;128;16;64;12376297
8;2048;1;64;32;64;3832741
128;2048;16;2;64;64;28883852
1;8192;1;64;16;64;6268593
16;2048;8;1;4;64;61917334
8;2048;2;128;16;256;5687111
8;1024;1;64;16;128;6522074
8;512;1;64;128;64;11603704
8;4096;1;64;32;64;4493629
8;4096;2;64;8;64;6147407
8;4096;1;64;16;128;5820889
8;2048;1;256;16;128;7420148
16;2048;16;2;128;64;17029037
32;2048;2;128;16;64;16996000
8;2048;1;16;2;64;10180889
8;4096;1;32;16;64;5902222
8;2048;1;64;32;128;3838518
1;4096;1;32;16;64;10645037
1;2048;1;64;64;128;24483703
8;2048;4;64;128;64;9672741
4;2048;1;256;16;64;22476889
2;1024;1;64;16;64;20691555
8;4096;2;64;8;32;12421926
8;1024;8;16;8;128;11176444
8;4096;8;32;16;64;11199703
1;1024;1;64;16;512;42204296
8;2048;8;1;16;32;31301777
8;2048;8;2;16;64;19851704
8;2048;1;32;32;64;5099111
8;1024;2;64;16;16;24641481
1;8192;1;64;16;64;6264889
4;2048;2;128;128;64;13519407
8;2048;2;64;16;128;5694074
8;1024;2;64;16;64;6458963
8;2048;2;64;16;8;45212592
8;2048;8;1;32;32;31324889
2;1;1;1;16;256;9835673481
8;2048;2;32;16;64;5675111
8;2048;1;32;16;256;7326963
8;2048;1;64;16;32;6465926
8;1;1;1;16;128;2479212000
1;2048;1;256;16;64;86763407
8;2048;1;128;16;128;3700297
8;1024;8;1;16;64;35866815
2;2048;2;64;16;64;12602223
8;2048;1;64;128;64;4380000
4;1024;2;64;4;64;12977185
1;2048;1;64;16;64;22123408
8;1024;1;64;16;64;5906963
8;512;1;128;32;64;21529481
8;8192;1;64;16;16;26975556
16;2048;1;64;16;64;4579111
16;2048;16;16;16;64;16240889
16;2048;2;64;4;32;12055259
8;1024;1;128;16;64;12353334
8;1024;1;64;1;64;6208296
4;2048;2;64;32;256;6807111
4;2048;2;64;64;128;6818222
16;1024;16;2;8;64;34037037
8;512;1;128;16;64;21405482
8;8192;1;64;32;64;5147704
8;2048;4;64;16;64;9686371
8;2048;4;64;16;64;9689334
8;1024;1;64;16;16;21242815
32;2048;16;2;64;64;20288740
8;1024;4;64;8;64;9650963
8;2048;8;32;16;32;11232148
16;512;16;2;16;32;22734667
8;2048;1;64;2;64;3789926
2;2048;2;64;64;64;12683704
2;1;1;1;16;64;10003680149
8;2048;1;16;32;16;10641926
8;8192;1;64;8;128;5894222
8;1024;1;128;16;16;43286667
8;1024;4;32;16;64;9634519
8;2048;8;1;8;32;32244592
8;2048;2;32;512;128;5641629
16;512;8;1;16;64;31007704
4;2048;1;128;16;64;12452592
64;2048;64;1;16;32;377322666
8;1024;1;128;4;256;6681037
8;2048;1;32;64;64;5149333
8;2048;4;64;16;32;19410371
8;2048;4;64;32;64;9684445
2;4096;1;64;128;64;5936148
8;8192;8;1;16;128;66336741
8;2048;1;64;64;64;4093926
16;2048;8;1;32;64;31027852
2;2048;1;64;8;128;11630370
4;1024;2;64;16;32;23644000
8;256;1;128;16;32;81723407
8;4096;4;1;16;64;49402370
4;2048;4;64;16;64;9648296
8;512;4;32;16;64;12901037
2;4096;1;256;16;64;21738222
2;4096;1;64;8;64;5966815
8;2048;1;64;16;512;6760444
4;1;2;1;16;64;6608114667
8;512;1;128;16;128;10611408
8;8192;1;64;16;512;6851408
4;2048;2;128;8;32;26057629
8;4096;1;64;16;64;4548000
2;1024;1;64;16;64;21042370
16;2048;16;2;8;64;34890963
64;2048;16;2;16;64;26151703
8;2048;1;32;16;16;10199852
16;2048;16;4;16;64;14421185
8;2048;1;128;8;64;7543259
32;2048;32;4;16;64;63958075
8;2048;8;32;16;16;22480741
32;2048;16;2;4;256;83633777
16;256;16;4;16;16;16063852
4;2048;4;1;256;64;64903259
8;2048;1;64;128;256;5528593
8;512;1;32;16;16;20542222
8;1024;1;32;16;16;11379704
8;1;2;1;16;64;3322642815
1;2048;1;64;8;16;85224445
8;4096;1;64;4;64;4674370
32;2048;16;2;16;64;20328297
8;8192;1;64;16;256;5566815
8;2048;1;16;16;32;10414074
16;2048;16;1;4;64;112772000
4;2048;1;32;64;64;6481629
8;4096;1;64;256;64;4405037
8;1024;1;32;16;8;21994667
8;2048;1;128;64;32;14247556
8;4096;1;1;8;16;99934222
8;8192;1;64;16;64;5272000
8;2048;1;64;32;512;6751852
8;4096;1;64;64;64;4434667
8;2048;1;32;2;256;6896593
2;1;2;1;16;64;13284955852
8;1024;1;32;16;64;6728741
8;256;8;1;64;64;35357334
8;1024;1;32;8;128;6654370
16;2048;16;2;64;64;17257926
2;4096;1;64;32;64;5863111
8;2048;1;32;16;32;5134518
8;1;1;1;16;64;2500438963
4;2048;1;16;16;64;9950963
4;2048;2;1;16;64;90896889
16;2048;16;2;16;16;33909926
8;2048;1;32;8;256;7268000
8;2048;8;1;16;16;40671260
256;2;128;2;1;4096;9097804000
128;128;64;4;1024;8;145993037
8;8;4;1;256;1024;427566074
16;1;1;1;4;32;1267541037
4;2048;4;64;16;64;9665186
16;2048;1;64;8;64;4753185
8;4096;8;1;1;64;146566074
64;8192;16;2;16;64;25075556
8;2048;4;16;16;64;9658370
8;4096;2;64;16;16;24654963
8;4096;1;128;16;256;6167111
8;2048;2;64;16;256;5787852
8;2048;1;64;64;32;6715111
8;8192;1;128;16;32;25796148
8;512;2;64;16;64;11911555
8;2048;1;64;2;128;4255555
2;2048;2;64;16;64;12387704
8;2048;1;64;16;16;12761778
32;2048;16;2;8;64;39769185
8;4096;1;128;128;512;5618370
8;2048;2;16;16;64;8821185
8;8192;1;32;16;64;5663407
8;2048;2;1;16;64;92912889
16;1024;8;1;16;64;31015852
2;8192;2;64;8;64;5611704
32;2048;16;4;16;64;15547852
1;1024;1;64;16;64;42982667
8;1024;1;64;32;64;6046074
16;2048;16;2;16;512;76562815
16;4096;16;2;16;128;21040000
8;512;8;2;16;256;60038074
1;2048;1;64;8;64;22097037
8;2048;1;128;64;64;8796296
4;2048;2;128;16;128;6623556
16;2048;16;1;16;64;27507111
8;2048;1;256;16;64;13487555
8;1024;1;128;64;64;12933037
2;2048;2;64;16;16;47760297
1;1024;1;64;16;128;47281185
64;512;16;2;128;256;18117333
8;2048;2;1;8;64;92961630
16;2048;16;1;16;128;38444000
8;2048;1;32;32;128;6528593
8;1024;2;64;64;64;6886815
4;2048;1;64;8;64;6038223
8;2048;1;256;32;64;13175704
1;512;1;64;8;64;86920888
32;2048;8;2;32;64;19503556
2;1024;1;64;2;64;23729629
8;2048;8;1;16;256;112011259
8;2048;1;128;16;256;4046222
16;2048;8;1;256;64;32731260
16;1024;16;2;16;64;17108148
4;4096;2;16;32;64;8126815
8;4096;8;1;16;64;35086963
32;2048;8;1;16;64;31962370
32;2048;16;4;64;32;19151259
512;128;128;2;1;1;764116592
1024;512;1;8;64;8;72229333
1;1024;1;1;1;1024;2283204296
512;32;32;4;1;8;99983259
8;2048;1;64;16;1;134775260
8;512;1;64;1;64;11516740
8;2;1;1;16;64;1230570667
8;2048;1;64;16;64;3848000
8;2048;1;64;16;1;134862074
8;2048;1;64;8192;64;32217037
2;2048;1;1;16;64;89384444
8;2048;1;64;16;2;85743259
8192;16;64;1;1;1;184927556
2;256;2;2;2;1;168801037
1;2;1;1;32;512;9223074074
2048;1024;4;32;16;4096;10676148
8;2048;1;64;1;64;3703407
1;2048;1;64;16;64;21832000
8;4096;4;64;1024;64;9726519
32;1024;2;64;4;1;374333778
64;1;1;1;8;1;425692741
2;1;1;1;8192;512;19759878667
1;1;1;1;512;8;21621422667
8;1024;1;64;1;64;6214963
8;2048;1;64;512;64;4470815
8;4;8;1;16;64;934678667
8;2048;1;64;256;64;4474370
512;32;8;1;1024;2048;139815111
256;8192;1;1;256;1;18446744073709551615
256;2048;32;2;2048;512;42199704
128;256;8;8;4096;128;89268592
8;64;1;64;16;64;78422815
8;2048;1;8;16;64;19928592
8;2048;4;64;16;1024;19452000
8;256;1;64;1;4;340118074
1;2;1;2;64;256;15183316149
32;1;8;1;1024;1;1560178222
1024;128;1;16;2;256;33566815
512;1;64;1;1;8;2754174519
4;4096;2;32;32;512;23277778
8;1;1;1;16;32;2521165185
8;2048;8;1;32;64;35671851
2;2048;1;64;64;64;10700445
8;2048;1;64;16;4;43522963
128;2048;16;2;32;64;28826519
8;2048;8;1;16;16;40622371
8;2048;1;64;16;1024;11298074
2;8192;2;64;4;64;5667407
8;1024;1;64;32;32;11395556
16;2048;2;128;16;32;27999407
8;4096;1;128;16;8;74492445
8;1;1;1;4;64;2499722519
16;2048;16;2;2;128;166539408
8;512;1;64;32;64;10743556
8;4096;1;128;16;64;8772740
64;4096;16;2;16;64;25165333
8;8192;8;1;16;8;43870963
8;4096;8;1;64;64;34875111
16;2048;16;2;4;64;69855852
8;512;8;1;16;64;34869037
8;2048;8;1;16;128;66311260
8;8192;4;64;32;64;9694222
4;2048;2;64;16;128;6994815
2;2048;1;64;16;128;11806963
2;2048;1;64;16;256;10740148
1;1024;1;64;8;8;331551704
8;8192;1;64;2;128;5632296
8;2048;4;64;16;256;9703407
8;8;1;4;16;64;469379704
128;4096;8;16;4096;64;22674963
16;2048;16;16;16;64;15740149
8;2048;1;8;8;512;36622963
2;1024;1;128;16;64;41572000
4;64;2;1;8192;2;384013777
128;1024;2;8;1024;1;176481185
1;1;1;1;2;64;19888831852
1;8192;1;1;8192;1;18446744073709551615
16;2048;2;64;16;64;6170667
8;4096;8;2;16;32;19673334
1;1024;1;64;16;256;45136889
8;128;1;64;16;64;41926815
8192;2048;16;2;16;64;306504740
8;1;1;1;16;64;2500261778
4;1;1;1;16;64;4999653333
1;2048;1;64;16;8;167569778
8;1024;1;64;16;512;6810963
32;4096;16;2;16;64;20015259
4;2048;2;32;64;64;6706963
4;2048;1;64;16;64;5712592
8;1024;8;1;8;64;36302815
8;2048;4;64;16;128;9717926
64;2048;16;2;16;128;20825630
8;8192;2;64;16;128;6199556
8;2048;8;16;16;64;11188444
8;2048;1;16;16;256;12209037
8;2048;8;4;16;64;13932445
8;2048;1;128;16;16;25724445
32;512;16;2;16;64;20216593
32;2048;32;8;16;64;43482371
8;1024;1;8;16;64;20190074
8;2048;8;1;64;64;34399704
16;4096;16;2;16;64;17023259
4;2048;1;64;32;64;5822815
8;4096;4;64;16;32;19440149
2;2048;2;64;16;64;12335555
4;2;1;1;64;32;2478357629
256;2;1;2;1;4096;85081482
128;128;128;2;1024;1;286792000
64;8;64;1;256;128;131326074
64;2048;16;4;16;64;17563556
8;4096;1;64;8;64;4636593
8;2048;4;64;16;16;39474370
32;2048;16;2;32;32;28037481
8;2048;4;32;16;64;10477926
8;2048;1;128;16;32;14384296
64;2048;16;2;16;32;32300444
8;2048;4;64;16;16;39236297
2;4096;1;64;16;256;10724592
8;8192;1;64;16;128;872596929
8;2048;1;64;32;256;5626074
8;512;4;64;16;256;19267556
8;2048;8;2;8;64;20932297
16;512;16;2;16;64;16987111
32;8192;8;1;128;32;36394963
64;1024;16;2;4;64;94354222
2;1024;1;64;32;64;20939111
4;4096;2;64;2;128;5764740
8;256;4;64;16;128;38548741
32;2048;8;32;16;64;12624741
4;2048;2;64;4;16;26606963
4;4096;2;64;16;256;6841778
8;2048;8;8;8;128;12644444
8;4096;8;1;16;4;51595259
1;2048;1;64;16;16;83322370
8;2048;1;32;8;128;6544592
4;1024;2;64;16;64;11912889
8;2048;2;64;32;64;5648889
16;2048;8;1;16;32;34965778
8;2048;8;32;16;128;11202963
8;2048;2;64;16;4;90184296
16;8192;16;2;16;64;17008593
8;4096;1;64;16;32;8914370
16;2048;16;2;32;8;36511111
16;2048;8;1;16;64;31007111
2;1024;1;64;16;16;82100000
32;1024;16;2;64;32;28574370
8;1024;1;64;8;8;40978074
8;4096;1;64;16;256;5538519
16;8192;16;2;16;32;22788741
8;8192;1;64;32;256;5495112
8;2048;4;32;2;64;19378370
8;2048;4;64;16;256;9700445
8;4096;8;16;32;64;11201333
8;2048;1;32;16;512;11703556
8;256;2;64;16;128;28574814
8;2048;8;1;16;64;34559111
8;32;1;1;16;2;167880148
8;2048;1;128;32;16;27035407
32;4096;16;1;16;64;29854370
1;2048;1;64;16;32;41952296
16;8192;1;2;4;32;78963111
4;128;2;2;256;1;175584741
1024;8;32;8;64;256;20806371
128;1024;1;1;64;512;94279704
2;4096;1;64;8;32;10809185
8;8192;1;128;16;64;13226222
16;2048;16;2;16;32;23001926
4;2048;2;128;8;16;49333630
4;2048;2;32;16;64;7081778
8;2048;8;16;8;16;12652592
8;2048;8;2;64;64;20312592
8;512;8;1;64;64;34907259
512;32;32;4;1;1;244341333
8192;16;64;1;2;1;4666127852
16;512;4;2;1;1024;418791111
64;2;1;2;32;128;237827703
8;2048;1;32;16;128;6259556
4;4096;2;16;16;8;17295407
4;4096;4;1;16;64;63721185
4;2048;2;64;128;64;6580444
8;512;2;64;64;64;12121629
64;8192;16;2;8;128;39480000
2;1;1;1;16;16;10245548889
2;2048;2;64;16;32;25536741
8;2048;2;128;16;32;22679259
8;512;1;64;32;256;11082815
2;512;2;128;16;32;193696148
2048;1024;4;32;16;2;156173778
2048;1024;256;1;4096;16;290771259
16;64;16;1;8;1;107480148
64;4096;16;8;4;512;56835556
4;2048;2;64;16;256;6848296
1;2048;1;64;1;64;24405481
128;2048;16;2;16;64;29188445
8;1024;2;1;8;128;90473185
16;2048;1;32;16;64;7345185
8;2048;1;64;64;256;5538074
1;1;1;1;512;4;22638288297
1;16;1;2;1024;64;1811906371
256;8192;1;1;1;1;18446744073709551615
256;1;32;1;2048;512;324819703
1;8192;1;64;16;64;6263556
4;2048;4;64;16;512;19401481
8;1024;1;64;128;64;6754519
8;2048;1;64;1024;64;4438963
8;32;2;1;16;16;137717037
2048;2048;16;2;16;64;89027259
32;4096;16;8;16;64;17045482
64;256;8;8;512;128;11645926
1;32;1;8;1;256;988614074
2;1;2;1;1024;1;21336336445
16;128;1;1;1;256;83261185
8;4096;8;1;4;64;72946074
4;2048;1;64;16;64;5744000
8;2048;1;64;8;16;11787852
512;2048;256;1;16;64;1680743259
4;512;2;64;16;64;23197630
8;2048;1;64;8;32;6554222
32;2048;16;2;4;8;157303555
2048;8192;64;4;2048;8;169275852
1;1024;1;32;32;64;44594963
4;64;2;1;8192;2;389846074
128;1024;2;2;1024;2048;280536741
8;2048;4;1;16;64;49383112
16;2048;16;2;8192;1024;148675556
256;2048;16;16;16;64;27200593
4;4096;1;16;16;64;10118519
4;2;2;2;512;2048;3830469037
1;8192;1;2;1024;8;78809185
4;2;1;1;1;32;2679898223
1;2;1;1;1;4096;9111840593
8;4;1;1;16;1;818232741
8;2048;1;64;256;16;13449037
8;2048;2;64;16;64;5759556
1;2048;1;64;16;128;24216149
8;2048;1;64;4;256;5514667
8;256;4;64;16;4;614694963
8;32;1;1;32;64;113906814
8;64;1;64;16;1;2983276741
8;2048;1;64;1;64;3690223
512;2048;32;4;16;64;128406223
8;2048;2;64;1;64;6603556
8;32;4;1;16;64;126710074
8;2048;1;4;16;64;39414074
8;128;8;4;8;64;37644889
8;2048;1;64;16;8192;87869778
8;32;8;1;16;64;111754222
8;32;1;1;16;64;104900297
8;2048;1;1;512;64;99051407
8;2048;1;64;4096;64;11543704
8;1;1;1;16;64;2502731852
1024;2048;16;2;16;8192;26055488889
8;2048;1;1;16;64;105196740
8;2048;1;64;16;64;3905481
16;16;16;2;128;64;148864445
8;2048;1;64;8192;4;1751675556
8;2048;1;1;16;64;104531556
8;256;1;64;256;64;23320445
1024;2048;16;2;16;64;64513333
64;2048;16;2;16;64;25057185
8;2048;1;64;16;2048;21882815
16;128;2;4;1024;8;30115852
