GLOBAL_SIZE_0;GLOBAL_SIZE_1;GLOBAL_SIZE_2;LOCAL_SIZE_0;LOCAL_SIZE_1;LOCAL_SIZE_2;TILE_0;TILE_1;TILE_2;cost
128;4;32;2;1;1;8;8;1;10399986222
64;128;4;4;1;2;512;1;1;14437393926
256;256;8;1;1;2;4;4;4;649120445
64;128;256;64;2;2;1;16;512;30697451556
32;1;128;4;1;8;4;32;256;408659259
128;32;16;2;8;16;16;256;64;220238370
256;64;128;1;64;4;128;128;1;62435809334
4;256;32;4;1;16;1;8;1;1163825333
128;32;16;2;8;16;16;64;64;85454963
128;32;16;16;8;2;128;256;8;8646639111
128;2;16;2;1;16;16;256;64;82093334
2;8;16;2;8;16;16;256;64;1267530519
128;2;16;2;1;16;8;256;64;84137037
128;512;16;2;2;16;16;256;64;78967408
128;2;16;2;2;16;512;256;64;1893865334
128;2;16;2;1;16;16;256;8;230119556
8;256;8;8;32;1;16;1;8;5759793778
16;128;2;4;1;1;1;4;16;703063555
2;64;8;1;32;1;128;2;2;22505164889
1;512;128;1;256;1;1;1;8;193674182667
8;128;8;4;32;2;128;4;4;9599976889
32;256;16;4;16;1;512;1;512;31354150222
4;512;64;1;128;2;256;8;64;152950633482
512;1;1;8;1;1;1;1;16;1370076000
4;512;16;2;2;16;4;256;64;437850666
128;1;16;64;1;1;16;256;64;29343306519
1;512;16;1;1;16;256;256;512;2975939408
128;512;16;2;2;16;16;256;4;492535111
128;512;16;2;2;16;1;256;64;61816592
128;512;16;64;1;1;16;256;64;41449512148
128;4;16;2;1;16;16;256;64;82126815
128;512;1;8;8;1;16;256;64;778091407
128;512;16;2;2;16;1;256;1;937736593
128;512;64;2;2;4;16;256;256;979256000
8;512;64;2;2;4;256;256;64;1915025037
128;512;16;16;2;2;1;256;64;1481123407
128;512;64;2;2;4;1;256;64;857337333
128;512;8;2;2;2;4;256;128;602996000
128;512;8;2;2;1;1;256;64;1549743259
128;512;16;2;1;8;1;256;256;115539111
128;512;32;2;2;8;1;256;64;206106371
128;256;16;2;2;16;1;256;64;60745185
128;512;16;2;2;16;4;256;64;66257185
16;512;512;2;2;4;1;256;64;5758134667
128;256;16;1;1;16;1;256;64;73295704
1;256;16;1;1;16;1;256;256;3342939112
128;256;16;2;2;16;8;256;64;86097185
128;256;16;2;2;16;64;256;64;127984445
128;256;16;2;2;16;32;256;64;81336444
128;256;16;2;64;2;1;256;64;2092420296
1;256;16;1;1;16;1;256;64;3433962815
16;512;64;16;4;1;16;128;4;21520745481
4;4;2;2;2;2;1;8;8;4639111704
64;1;8;1;1;1;8;512;64;5744261778
1;32;1;1;2;1;128;256;4;20170736741
128;256;16;2;2;16;512;256;1;16152982222
128;1;16;2;1;16;1;256;64;108538519
256;256;16;128;2;1;1;256;64;19788562074
128;256;16;16;16;1;1;256;64;2486687407
512;32;512;8;32;1;128;2;64;18446744073709551615
8;512;2;2;4;2;64;2;128;260756000
128;4;16;128;1;1;2;16;64;18446457710556999876
256;8;1;32;2;1;1;2;256;457343259
128;256;16;2;2;16;1;256;64;64385185
128;256;16;2;2;16;1;1;8;61267852
128;256;16;2;2;16;1;1;64;48937482
128;16;16;2;2;16;1;256;16;81997925
128;256;16;128;2;1;1;1;64;22476017926
128;256;16;2;2;16;1;8;64;26269482
128;1;16;2;1;16;1;1;64;105535407
128;256;256;2;1;32;1;1;64;229815111
2;256;16;2;2;16;1;8;64;65608148
128;256;16;2;16;2;2;8;64;2215697481
128;256;4;2;32;1;1;8;64;4949047111
128;256;16;32;2;1;1;8;64;1852832740
64;256;16;4;8;2;1;8;64;818295111
128;256;16;128;2;1;1;8;64;7192614519
128;2;16;2;1;16;1;8;64;48217926
128;256;16;4;4;16;1;8;64;51318666
4;256;16;1;1;16;1;8;64;30197186
128;256;1;8;8;1;1;8;64;188842963
128;256;16;8;8;1;1;8;64;3449353629
128;256;16;2;1;16;1;8;64;34484000
128;256;16;2;8;16;1;8;64;74695703
128;128;16;2;1;16;1;8;512;33525925
128;256;128;2;2;4;1;4;64;1381427704
128;256;16;2;128;1;1;8;64;69216730370
128;256;16;2;2;16;1;4;64;30066223
128;256;1;2;2;1;1;8;64;176950371
128;256;16;2;2;1;1;8;64;2629237185
128;256;16;2;2;16;8;8;64;29401333
128;256;16;1;64;1;1;8;64;42792386667
128;16;16;2;16;2;1;8;64;2013084740
128;256;16;2;8;16;1;512;64;2836300000
128;256;512;2;2;4;1;8;64;5533474518
128;256;16;2;8;16;32;8;64;57140741
128;256;16;2;2;16;1;128;64;57811704
1;256;16;1;1;16;1;8;64;109749333
8;256;16;2;2;16;1;8;64;23960592
8;8;16;2;2;16;1;512;64;866385926
8;256;16;2;128;1;16;64;64;11855107111
8;1;16;2;1;16;1;8;64;1634235852
8;256;16;2;2;16;1;512;64;3659114518
16;256;16;2;2;16;128;8;64;76586518
8;512;16;2;2;16;1;1;64;27992000
8;256;16;4;4;16;1;8;1;755926667
8;256;16;2;16;2;1;8;64;1990576444
8;256;16;1;1;16;1;8;64;29325630
8;4;16;2;1;16;1;8;64;352281926
8;256;16;4;4;16;1;8;1;736698667
8;256;32;2;2;8;1;8;1;1231225334
64;256;4;2;2;2;1;8;64;174973333
8;256;16;2;4;16;128;8;64;104227556
8;256;16;2;2;4;2;8;256;180445037
8;256;16;2;2;16;64;8;64;58281481
1;256;16;1;4;16;1;8;64;39253185
8;256;16;2;2;8;64;4;64;119598667
8;256;16;2;2;16;32;8;16;73345334
8;256;16;2;2;8;1;8;64;65048444
8;2;16;2;2;16;1;4;64;886938815
8;256;256;2;2;4;1;8;64;2773873777
8;256;16;2;8;16;1;8;1;847585926
8;256;32;2;2;8;1;8;64;125282370
8;256;16;2;4;16;1;8;64;42500740
8;4;16;2;1;16;1;1;512;360478815
8;16;16;2;16;2;1;8;64;2153708000
8;256;16;2;2;16;1;8;256;23377778
8;256;16;2;2;16;1;8;128;23840000
8;1;16;2;1;16;1;8;1;11774840889
8;2;16;2;2;16;1;8;256;807394074
64;1;256;2;1;2;32;8;256;10745487703
1;256;16;1;1;16;256;8;256;108734667
8;256;16;2;2;16;32;8;256;28076000
8;256;1;2;2;1;1;8;256;154906074
8;256;16;2;128;1;1;8;256;41866042074
8;256;2;1;1;2;1;8;256;127057037
8;1;16;2;1;1;1;8;256;7040197630
8;256;16;2;2;16;1;8;1;384463407
8;256;16;2;2;16;4;8;256;20321926
8;256;256;2;2;4;1;8;256;2775578074
8;256;16;2;2;16;1;1;256;25232593
128;256;16;2;2;16;4;32;256;26620297
1;256;16;1;1;16;4;8;256;106734074
8;256;16;2;4;16;4;8;256;34880593
8;256;16;2;1;16;4;8;256;26413185
8;256;16;2;2;16;256;8;256;29884000
512;256;16;2;2;16;4;8;256;31097482
8;256;16;4;4;16;4;8;256;47481037
8;8;16;2;8;16;4;8;256;297583852
8;256;16;2;2;16;64;8;256;31371704
8;256;16;2;2;16;256;8;256;29994519
8;256;16;1;1;1;4;2;256;5481024296
1;64;1;1;1;1;8;256;1;39256348296
2;1;128;1;1;1;16;128;16;44801639851
16;16;4;2;16;2;4;128;8;326766815
8;64;64;8;2;2;1;16;128;2519543556
8;128;16;2;2;16;4;8;256;20610519
8;256;16;2;2;16;512;8;1;5844118222
8;256;16;2;2;16;16;32;256;34150518
8;256;16;1;1;1;4;1;256;4630678815
8;256;16;2;2;16;32;8;4;295267555
8;256;16;2;2;16;4;512;1;43269117926
8;256;16;2;2;16;4;16;256;24220297
8;512;16;2;2;16;2;8;512;19201926
8;256;8;1;256;1;4;8;256;53657560889
8;1;16;2;1;16;2;8;256;783902815
8;512;16;2;2;16;1;4;512;23713037
4;512;16;2;1;16;2;8;512;30473185
8;512;16;2;2;8;2;2;512;60710815
8;256;8;2;2;2;4;8;512;265507407
16;512;16;2;64;2;2;8;512;16573605482
8;1;8;1;1;2;2;8;512;4570477778
8;512;4;2;2;1;4;8;512;503189926
32;512;16;2;2;16;2;8;1;315108445
32;512;16;2;128;1;2;16;512;33570568000
16;512;16;2;2;16;2;4;512;22412148
8;512;16;1;1;16;2;4;512;30238815
16;512;16;4;4;16;2;8;512;101190370
8;512;16;2;2;16;2;2;512;20846370
8;512;16;2;2;1;2;4;32;1642428148
8;4;4;1;1;1;2;8;512;1766417778
8;512;64;2;2;4;2;8;4;1132974667
8;512;16;2;8;16;2;8;512;54819259
8;2;16;2;2;16;2;8;512;440548000
8;1;16;2;1;16;2;8;512;857561482
8;512;16;2;2;16;2;8;8;46341777
1;256;1;1;4;1;2;16;1;643197037
8;512;16;2;2;16;1;8;64;23897778
2;512;16;2;2;1;2;8;512;1391746222
8;512;16;2;2;16;2;8;64;19806963
8;512;16;8;8;1;64;8;512;4228308297
128;512;512;2;8;16;2;8;512;1242851260
64;512;16;32;2;1;2;8;512;92636608888
8;2;64;2;2;4;4;8;512;1272525185
8;128;4;2;8;4;8;8;4;69327259
4;512;16;2;1;4;2;8;1;1253659111
4;512;16;4;4;4;1;16;256;221513482
8;512;16;8;8;1;1;8;1;1415352296
8;256;16;2;2;16;2;8;128;19471259
8;64;16;2;4;16;2;8;512;22640444
8;512;16;2;2;16;2;8;128;18983556
8;512;16;2;2;4;2;8;512;180238667
8;64;32;2;4;2;2;8;128;1154272889
8;512;16;2;2;16;2;8;16;22134519
8;512;16;2;2;16;2;8;256;18941037
8;512;16;2;2;16;2;8;8;46623704
8;512;16;2;2;16;2;8;4;96577333
8;1;16;2;1;16;2;8;256;780648445
32;512;16;32;4;2;2;8;256;47128382222
8;128;16;2;2;16;2;256;256;217658074
8;512;16;2;2;4;2;8;2;582966519
8;512;16;2;2;16;1;8;1;373862815
8;512;16;2;4;16;2;8;256;33160445
8;512;2;2;2;1;2;8;16;201427259
8;64;16;2;4;8;2;512;128;715962815
128;8;1;32;2;1;256;256;256;836037037
8;512;1;2;2;1;64;32;256;293895555
1;2;16;1;2;16;2;8;256;3344470666
