GLOBAL_SIZE_0;GLOBAL_SIZE_1;GLOBAL_SIZE_2;LOCAL_SIZE_0;LOCAL_SIZE_1;LOCAL_SIZE_2;TILE_0;TILE_1;TILE_2;cost
8;4;8;4;4;1;4;1;2;22454823125
4;256;4;4;1;2;64;1;256;2914114093
64;1;1;2;1;1;256;1;16;13149164172
4;64;2;1;1;2;1;1;16;666795000
64;2;32;16;1;16;8;2;4;30071929375
1;1;16;1;1;2;256;8;128;12493543020
16;8;1;4;1;1;4;128;128;1473158142
1;128;4;1;1;1;128;32;8;4749049896
4;64;2;1;2;2;1;1;16;1934662529
8;32;2;8;1;2;1;1;16;6048343540
8;64;2;8;1;2;1;1;16;6646222164
1;64;2;1;1;2;1;1;32;451446000
1;64;256;1;2;8;1;1;32;139510938855
1;64;2;1;1;2;1;1;64;419342797
1;64;2;1;1;2;1;1;2;454247799
1;128;2;1;1;2;1;1;32;305478298
1;256;2;1;1;2;1;1;32;473891767
1;128;16;1;1;16;8;1;16;1409888517
1;128;256;1;1;8;1;1;64;66949541873
1;128;4;1;1;1;1;1;32;3275154606
32;256;1;8;8;1;4;2;8;14704028917
4;256;128;2;2;2;128;32;16;153722527238
4;2;2;4;1;1;32;16;1;4212366734
64;64;256;8;8;1;32;1;2;18446744073709551615
1;128;2;1;1;2;32;1;32;841251294
1;128;2;1;1;2;1;1;128;420049760
64;128;2;4;1;2;1;1;32;3829904723
128;128;2;1;1;2;256;1;32;160785322950
1;64;2;1;1;2;2;1;32;494873876
1;128;2;1;4;1;2;1;64;6009504377
1;128;2;1;1;1;1;256;32;52791016417
1;128;2;1;2;1;1;1;64;1470570375
1;128;2;1;1;2;1;1;16;409553210
2;128;2;1;128;2;16;1;32;103481180917
32;128;2;1;64;2;1;1;32;52470856353
1;128;1;1;1;1;1;1;32;662966799
1;128;32;1;1;8;1;1;32;7114484967
128;256;2;64;1;2;1;2;1;137972708833
1;32;2;1;1;2;1;4;32;881127345
1;128;2;1;1;2;1;1;8;386408348
2;64;1;1;64;1;8;256;8;769586048
64;32;8;1;2;4;64;16;2;10996511333
256;256;2;4;2;1;64;64;32;2997247750
8;32;16;8;2;8;16;128;64;2010429002
1;128;2;1;2;2;1;1;32;426453755
1;128;2;1;1;1;1;1;32;1227764049
1;128;1;1;1;1;2;1;32;665825653
1;128;2;1;1;1;1;1;32;1219630411
128;128;2;1;1;2;1;1;16;411991843
1;2;2;1;1;2;1;1;32;5709568125
4;128;8;1;1;8;1;8;32;995910377
64;32;32;16;16;1;32;4;2;18446744073709551615
8;1;4;2;1;2;16;64;2;2436866971
8;32;1;1;4;1;1;2;32;1497480127
2;16;64;1;1;4;16;256;256;18446744073709551615
1;128;2;1;1;2;1;2;32;205701629
128;2;2;1;1;1;1;1;32;1386875119
1;1;2;1;1;1;1;8;32;26245211427
1;128;2;1;1;2;1;256;16;84232914458
1;128;4;1;128;2;32;2;16;150003646250
1;128;2;1;1;2;1;2;256;221672171
16;128;2;1;8;2;1;2;16;6451307019
1;128;2;1;1;2;1;2;4;211597758
128;128;2;2;1;2;1;2;64;736213763
1;128;2;1;1;2;16;2;32;743261152
1;128;2;1;32;2;1;2;32;10295450911
4;128;2;1;1;2;1;8;32;465478335
4;128;2;1;1;2;64;2;32;1484702793
1;4;2;1;1;2;1;2;32;3262700177
1;16;2;1;1;2;1;2;32;873263108
1;128;2;1;1;2;1;2;2;258765718
1;64;1;1;4;1;32;1;1;2922819760
1;128;2;1;1;2;1;64;32;3301225008
1;128;2;1;1;2;1;2;128;164991507
1;128;4;1;1;1;1;4;32;2818085398
1;128;2;1;1;2;1;256;128;102477545416
1;128;2;1;1;2;1;2;2;357448929
1;128;64;1;4;8;1;2;128;32469030478
1;64;2;1;1;2;1;128;128;6606539893
256;128;2;1;2;2;1;2;64;18446744073709551615
1;128;2;1;1;2;1;2;32;214704631
1;128;1;1;1;1;1;2;128;619759680
1;128;2;1;1;2;64;2;128;581833008
1;128;2;1;1;2;1;2;256;197396671
1;128;2;1;1;2;1;256;128;73785638283
2;128;2;1;1;2;1;2;128;214800334
1;128;2;1;32;2;1;2;4;6850628923
1;64;2;1;1;2;1;2;128;414279552
1;128;2;1;1;2;1;2;128;183252006
2;128;2;1;4;2;256;2;128;6195128159
1;128;2;1;1;2;1;2;128;195244087
1;256;2;1;2;1;1;2;128;2010475333
4;64;4;2;1;4;32;4;128;1111132791
1;64;2;1;1;2;1;2;128;439465642
1;128;1;1;1;1;256;4;128;1398919341
1;128;8;1;1;8;1;2;128;461634211
1;128;2;1;1;2;2;2;128;215039591
1;128;1;1;1;1;1;2;128;577410683
128;128;2;1;1;2;1;2;128;394667008
256;4;1;128;1;1;2;4;16;92354986848
32;256;2;1;1;2;4;4;16;1165678923
1;1;2;1;1;2;8;16;16;12463504746
8;1;4;2;1;4;4;256;16;1291819075
1;128;2;1;1;2;1;8;128;935668220
1;128;2;1;1;2;1;2;128;180191460
1;1;2;1;1;2;1;2;128;12479880625
1;128;2;1;1;2;1;2;128;186253378
64;16;4;64;1;4;8;8;16;11207400175
1;256;8;1;1;8;256;4;128;523357971
1;128;2;1;1;1;256;2;128;1434344090
1;128;1;1;2;1;1;1;128;903535387
4;4;64;1;1;1;1;1;64;64133137083
1;128;2;1;1;2;1;2;128;223787880
1;128;4;1;2;2;1;2;128;1920756535
1;8;128;1;1;8;1;2;128;25197271792
32;128;2;32;8;1;16;8;16;5973451336
4;256;4;1;64;4;8;256;16;6044086829
64;128;64;1;128;1;16;32;128;18446744073709551615
1;1;128;1;1;4;8;2;2;20720201072
1;1;2;1;1;2;1;2;16;12888005005
1;1;2;1;1;2;1;64;128;12463094894
1;128;2;1;1;1;1;2;128;667426084
1;128;1;1;1;1;1;2;128;601383173
1;1;1;1;1;1;1;1;16;24944403998
1;128;2;1;1;2;128;2;128;751913760
1;128;2;1;1;2;1;2;64;222757464
1;128;2;1;1;1;1;2;256;924943682
32;256;64;2;8;4;128;4;16;62055054500
4;128;2;1;2;2;32;2;128;1368069788
1;128;2;1;1;2;1;2;128;190672462
16;8;16;8;2;8;32;4;1;30636122791
256;256;1;2;16;1;64;1;64;24367761432
128;1;32;1;1;2;1;1;1;18063429125
128;256;128;16;4;1;8;2;4;18446744073709551615
4;64;2;2;1;2;16;32;32;1506979000
4;64;4;2;1;2;16;256;32;161399450058
4;128;2;2;128;1;32;16;64;22263591303
32;128;2;2;16;1;32;128;16;4594387050
1;128;1;1;1;1;1;4;1;1588108157
4;128;2;1;1;2;1;2;128;480147427
1;128;2;1;2;2;1;2;128;408195088
1;128;2;1;1;2;1;2;128;197507834
1;128;2;1;8;2;1;2;128;3067017114
1;128;4;1;1;1;256;2;128;3568427245
1;128;2;1;1;1;1;2;128;707159930
1;1;2;1;1;2;1;32;128;12460186561
1;4;2;1;1;2;1;2;128;3205174692
1;2;2;1;1;2;1;2;128;6587730590
1;16;2;1;1;1;1;16;8;2203018108
4;64;128;1;1;32;2;1;16;14741461250
128;2;2;1;1;1;32;32;8;1819045772
1;1;4;1;1;1;256;8;256;25666592444
4;16;2;2;4;1;16;64;4;2115038737
8;128;2;8;2;2;16;64;16;782989364
16;64;4;16;16;1;32;64;4;6578017923
16;32;2;8;32;1;8;64;16;2805446301
1;128;2;1;1;2;1;32;128;1645086616
1;128;16;1;1;8;64;2;128;2780980661
1;128;2;1;1;2;1;2;128;200572758
1;1;128;1;1;8;1;2;128;3611228817
256;128;1;1;1;1;1;2;128;18446744073709551615
1;128;2;1;1;2;256;2;128;810191740
1;128;2;1;1;2;1;2;256;157928504
1;128;4;1;1;2;1;2;128;731449106
1;128;1;1;1;1;1;2;256;601564517
1;32;2;1;1;2;1;2;256;866240436
1;128;1;1;2;1;1;2;256;661187983
1;128;2;1;1;2;1;4;256;364429961
1;128;1;1;2;1;1;2;256;680448685
1;128;2;1;1;2;1;2;256;168733793
256;128;2;2;2;2;1;2;256;388240305
1;128;2;1;1;2;1;2;1;538645968
1;256;2;1;1;2;1;2;256;191504424
1;64;1;1;1;1;1;4;256;1297713554
1;256;2;1;1;1;256;2;256;1348081050
1;256;1;1;1;1;1;2;256;590792720
1;128;4;1;1;2;1;8;128;1883028971
1;128;4;1;1;1;256;1;1;6938036961
1;256;2;1;1;2;256;4;256;376636257
1;128;16;1;1;8;1;2;256;1954145430
1;256;1;1;1;1;1;2;256;592864845
1;64;2;1;1;2;1;2;256;403417840
1;128;2;1;1;2;256;2;256;204487126
1;128;2;1;1;1;1;1;128;1286715208
1;64;4;1;2;2;1;2;128;1190632964
128;64;2;4;1;2;1;2;256;2614824009
128;128;2;2;1;2;1;2;256;678417147
1;128;2;1;1;2;1;8;256;878627822
256;64;4;2;1;1;128;2;1;3411240098
1;128;2;1;2;2;1;16;256;823099133
1;32;2;1;1;2;1;2;128;965242305
1;128;2;1;1;2;1;4;256;367801970
16;128;64;4;4;2;16;64;1;117627619745
64;4;2;4;4;1;128;4;32;2256352092
2;128;128;2;8;1;8;16;128;18446744073709551615
128;32;1;128;1;1;2;8;1;55686078375
16;256;32;16;8;1;64;16;16;61064365836
1;16;2;1;1;2;1;2;256;821624687
1;128;2;1;1;2;1;2;8;171328875
1;4;2;1;4;2;1;2;256;5962175373
1;128;4;1;1;2;1;4;256;834376264
1;64;2;1;1;1;128;2;256;1314148144
256;128;4;2;4;1;1;2;256;5355962586
32;64;1;2;16;1;16;4;4;5759835918
1;256;2;1;1;2;16;64;256;3051294048
1;128;2;1;1;1;1;2;256;1101564792
32;128;2;2;1;2;1;2;256;1315836912
16;64;2;4;32;1;16;16;8;6802312417
256;256;8;128;2;1;2;1;16;18446744073709551615
1;1;32;1;1;4;32;32;8;7682092084
4;64;8;1;32;1;32;16;32;26888205203
4;128;2;4;1;2;16;128;16;1627540500
4;64;2;4;1;1;16;128;16;3206045000
4;32;2;4;2;2;16;128;8;1436854018
8;64;2;4;64;1;8;128;16;2532132052
1;128;2;1;2;2;1;2;8;324370334
1;128;2;1;1;2;1;16;8;1121322979
1;16;2;1;1;2;1;256;256;12036001832
1;128;2;1;1;2;1;2;1;541118438
256;128;2;2;1;2;1;2;128;597023598
1;128;2;1;1;2;256;1;256;471140050
1;256;1;1;1;1;1;4;256;1293566730
1;128;4;1;2;1;1;2;256;3718495810
32;1;2;1;1;1;32;16;16;3130625604
64;2;32;16;1;1;8;2;1;125808680500
1;1;16;1;1;8;64;256;4;8762899990
32;8;1;8;1;1;32;128;128;1404092884
1;1;2;1;1;2;1;2;256;12396308058
1;128;4;1;1;1;1;2;256;2681827709
1;128;2;1;1;2;1;2;128;227214299
1;128;2;1;1;2;1;2;256;196285255
8;128;2;2;32;2;16;256;16;6900626113
8;64;2;4;32;2;16;128;8;1002694500
4;128;2;4;1;1;16;64;32;2135878225
8;128;8;4;32;2;32;64;16;5693839459
1;128;2;1;1;2;1;2;128;258622214
1;128;4;1;1;1;1;2;128;2349508210
1;64;2;1;1;2;1;2;1;855684566
1;128;2;1;1;1;1;2;256;908920276
1;128;2;1;128;2;1;2;256;63019114626
1;128;32;1;1;8;1;2;256;5288519947
128;128;2;2;1;2;1;16;256;998791499
1;1;4;1;1;1;128;32;8;25876739334
64;16;1;16;16;1;32;4;2;4225931580
8;1;4;4;1;2;16;64;2;2129399542
4;32;1;1;4;1;1;2;32;1183843038
4;64;2;4;1;1;16;256;16;107147760714
1;128;2;1;1;2;1;2;64;188099966
1;128;4;1;1;1;256;4;256;2730181144
4;64;2;4;16;1;16;32;16;1972068325
1;128;2;1;1;2;256;2;256;208389835
1;128;2;1;1;1;1;2;32;733024650
4;64;2;4;32;1;16;64;16;1826233214
1;256;2;1;1;2;1;1;256;464649142
1;128;2;1;1;2;1;2;256;226475300
1;128;2;1;1;2;1;4;128;337505506
256;16;64;4;1;2;16;256;256;18446744073709551615
32;256;256;1;1;32;4;4;2;26392562600
1;1;2;1;1;2;8;16;16;12461023769
8;128;4;2;1;4;4;2;128;1127677115
1;16;2;1;8;1;16;32;16;2037248991
1;128;2;1;1;2;1;2;256;208332045
8;128;8;2;1;8;1;2;256;1589747770
2;32;2;2;2;2;16;64;16;1568806476
1;256;4;1;1;1;1;1;256;3234757738
1;64;2;1;2;2;1;2;256;417007423
1;16;1;1;8;1;4;1;16;12913398708
1;4;2;1;1;2;1;2;256;3046679755
1;128;2;1;4;2;1;4;256;341864176
1;128;2;1;1;2;1;2;16;229046922
8;128;4;4;64;1;32;128;16;5966652579
4;256;4;1;64;4;8;1;16;100018533001
64;128;64;1;128;1;256;32;32;18446744073709551615
1;1;128;1;1;4;8;2;32;15582253958
4;64;2;2;64;2;16;256;8;1319801714
4;64;2;2;1;1;16;256;8;116073942003
2;64;2;1;1;2;16;128;16;3122581026
4;128;2;2;128;1;16;256;16;2560867841
1;128;2;1;128;2;1;2;256;63925959913
1;128;2;1;1;2;1;2;2;387464511
1;128;1;1;1;1;1;2;256;597700191
1;256;2;1;1;1;1;2;256;1327951752
16;8;1;8;2;1;128;4;1;1579574259
256;8;1;2;1;1;64;1;64;763984302
128;1;1;128;1;1;1;1;1;153112933125
4;256;128;2;32;1;8;8;4;18446744073709551615
4;64;2;2;64;1;16;128;16;1984080328
4;128;2;2;128;1;16;128;16;2400177025
4;64;2;2;64;1;8;256;16;1876097130
4;64;2;2;1;1;16;256;16;114663237444
1;128;2;1;1;2;2;2;256;155337375
1;128;16;1;1;8;1;2;8;2917686518
1;128;256;1;1;8;1;2;256;53649572777
1;32;2;1;1;1;1;2;256;2891235916
128;128;2;2;1;2;2;2;256;728348727
1;128;2;1;1;1;2;2;256;961914774
64;128;2;2;1;2;2;2;256;642905935
1;128;2;1;1;2;2;2;64;227867339
1;128;2;1;1;1;4;2;256;923958097
1;128;2;1;1;2;2;2;256;240759960
1;128;2;1;2;1;4;32;2;2607992632
1;32;2;1;1;2;64;2;256;844342076
1;128;16;1;64;2;2;2;256;18446744073709551615
64;128;2;2;1;2;128;2;256;224317752
1;128;32;1;1;2;2;2;256;18849360417
256;128;2;2;1;1;2;2;256;2141026674
1;128;2;1;64;2;4;2;256;30374308349
1;128;256;1;1;2;128;2;256;165536334897
1;256;128;1;1;2;2;2;256;77769763625
1;128;16;1;1;2;2;2;256;8513226354
1;1;2;1;1;2;2;2;256;12203115800
1;128;2;1;1;2;256;2;256;219946130
1;128;2;1;1;2;2;8;256;950734162
1;128;2;1;1;2;2;2;256;212790375
1;1;2;1;1;2;2;2;256;12202470800
1;1;1;1;1;1;2;2;64;24688473445
256;128;2;2;1;2;2;2;256;709465377
1;128;2;1;1;2;32;2;256;228975253
