GLOBAL_SIZE_0;GLOBAL_SIZE_1;LOCAL_SIZE_0;LOCAL_SIZE_1;v_TP_2103;v_TP_2104;cost
8;8;1;8;682;124;2066183939
128;4;2;2;11;4;393902965
1;1024;1;256;1;1;18446744073709551615
64;64;64;32;1;11;18446744073709551615
256;4;1;2;11;4;634427638
64;4;4;2;11;4;605269477
1;1;1;1;31;186;79351203806
4096;512;256;16;66;2046;18446744073709551615
2;4096;1;256;186;11;18446744073709551615
1;1024;1;4;124;31;563748271
128;4;8;2;11;2;871349848
2;8;1;2;1;93;6791298357
128;4;2;4;11;341;387687887
128;64;2;2;11;4;406475890
128;8;64;2;11;4;1493021626
4096;2048;1;2;11;11;841129009
128;4;2;4;11;31;445454306
128;4;2;4;372;1;6260748855
128;4;2;4;11;341;387552795
2048;2;1;2;11;341;706010721
128;256;2;32;11;341;390978514
128;4;2;4;124;341;647579515
64;32;2;32;11;341;391835509
128;4;2;4;3;341;485165300
128;4;32;4;44;341;18446744073709551615
1024;4;2;4;22;341;358449753
128;4;1;2;11;3;1312309165
128;4;2;2;11;341;432953800
64;4;4;2;341;341;551903265
1024;4;32;4;22;341;18446744073709551615
1024;4;256;4;22;341;18446744073709551615
1024;4;1;4;22;341;373474424
2;4096;1;64;372;62;533185375
1;2;1;2;22;341;39049059877
4096;4;2;4;22;341;358378876
1024;4;2;1;22;341;878370549
1;4;1;2;31;341;19283490750
4096;4;2;2;22;341;426422253
512;4;1;4;22;341;374125473
4096;4;2;4;22;132;365648472
4096;4;2;4;66;341;373714541
4096;4;2;4;22;682;354411503
4096;4;2;4;11;341;386599385
4096;32;2;32;22;124;415670675
4096;4;256;4;22;132;18446744073709551615
4096;4;4;4;22;682;377469047
4096;4;2;4;22;44;378578669
4096;4;2;2;22;372;402916430
64;4;2;4;22;682;354525003
4096;4;2;4;22;2046;426050552
4096;4;2;4;3;682;484346052
1024;4;2;4;22;682;352776012
1024;64;8;32;22;66;18446744073709551615
1024;8;2;8;22;682;358272377
1024;2;2;2;22;682;437051804
4;4;2;4;22;682;4880946057
1024;4;2;4;22;33;420191930
1024;4;2;4;682;682;1850977691
1024;4;2;1;22;682;891085885
1024;4;2;4;22;124;370449583
1024;4;2;4;62;682;473007387
1024;8;1;2;22;682;790613195
1024;16;2;1;22;682;888946847
1024;4;2;4;22;1023;369225418
1024;4096;64;32;22;682;18446744073709551615
1024;64;2;32;22;682;357087509
1024;4;2;1;22;682;884975299
16;4;2;4;22;3;3043078325
1024;128;2;32;22;682;358035924
1024;4;2;4;22;62;399129667
1024;4;2;4;31;682;417380292
1024;1;4;1;22;4;614149012
1024;128;1;32;22;682;366993127
64;2;1;1;93;1;5486472582
128;512;128;1;1364;1;18446744073709551615
16;1024;8;128;372;62;18446744073709551615
128;2048;2;16;3;372;506192087
64;4;8;2;341;11;604292515
1024;4;2;4;1;1364;777374680
1024;1024;64;32;22;682;18446744073709551615
32;4;2;4;22;682;705232235
2048;4;2;4;22;682;352636887
1024;4;2;4;22;186;366623047
2048;4;2;1;22;682;888352467
2048;4;2;4;11;682;388851385
2048;256;2;32;22;682;357603425
2048;4;2;4;22;1364;362066667
256;4;2;4;22;682;352855385
2048;2;32;2;31;682;379688754
2048;4;2;4;22;66;385176177
2048;4;2;4;22;11;499962750
2048;4;2;4;372;1;6264324583
2048;4;8;4;22;682;380483466
2048;4;2;4;1;62;805536627
2048;256;2;32;22;33;777573755
2048;4;2;4;22;22;443989542
2048;4;2;1;22;682;882597576
2048;4;2;4;22;2;1144507587
1;1;1;1;1;1023;107516064958
2048;16;2;1;22;682;895743437
2;4;1;4;22;682;9841791244
2048;4;2;1;22;682;890617820
1;1;1;1;1;1;324344602584
1;1;1;1;1;1023;107539171750
16;2048;16;1;2046;1023;2378463500
1;1;1;1;1;1023;107516127791
1;1;1;1;1;1;324344415515
1;1;1;1;1;1023;107551544022
