b3f4969b5eac5ef76b04f1fa21cf514a33c5b1988304ecf6a1be8f4ed1101894.cl -> 1528444 (1024;4096;4;32;46;23;1528444)
80ea1af9dba5b07bf2b8b5a11fa1bd671981347e38bb105386661e85d778fbe4.cl -> 1097037 (256;1024;256;1;1;4094;1097037)
599404971fc64ea79b51ff34b705b8aa1550b9fb9aed1f748e919bc6b6f2dc76.cl -> 850963 (512;2048;64;4;1;2;850963)
1b1065b5a02c7918d9b5ef3d07d3e5913dc3339f05449991c8ca0c9de13c3c2f.cl -> 636000 (2048;4096;128;1;636000)
