GLOBAL_SIZE_0;GLOBAL_SIZE_1;LOCAL_SIZE_0;LOCAL_SIZE_1;v_TP_52;v_TP_53;cost
4096;4;32;1;1;2;3560512
1024;2;1;1;178;2047;3242137280
2;1024;2;128;23;4094;102487232
1;256;1;64;89;178;548616768
4096;4;32;1;1;2;3519808
4096;4;8;1;1;2;8748832
4096;256;32;1;23;46;46799904
4096;4;16;1;1;2;4669664
512;1;512;1;23;4094;10722357184
1;8;1;4;4094;46;10535063168
1;4096;1;64;89;4094;521863072
16;1;2;1;1;89;755566848
4096;4;32;1;2047;2;2944448
4096;1;32;1;1;2;6121408
4096;4;256;1;1;4094;2971188992
16;4;1;1;2047;2;324318400
4096;4;32;4;1;178;216451264
4096;4;32;2;2047;89;298788800
4;4;4;1;1;2;408349856
4096;4;32;1;2047;46;134057728
4096;1;32;1;2047;2;5580256
1;4;1;1;2047;2;4868013024
4096;4;16;1;2047;2;5568704
1;4;1;1;4094;2;9434673120
4;2;2;2;89;1;1778644128
16;32;8;1;2047;1;430609408
2048;2;8;1;2047;89;210253472
512;1;4;1;1;1;27414272
4096;4096;32;512;2047;2;18446744073709551615
256;4;32;1;2047;2;22080480
32;4;32;1;2047;2;175720672
4096;16;32;16;2047;178;487944672
1024;32;1024;16;23;2;18446744073709551615
512;4;8;1;4094;4094;10724137920
32;256;16;1;89;4094;264220992
32;1;1;1;89;178;538527744
4096;4;1;1;2047;2;52295584
32;4;2;1;2047;2;161033568
4096;8;32;2;2047;2;2934496
4096;4;32;1;2047;1;4067328
64;8;32;2;2047;2;88086816
4096;8;32;2;23;2;2124320
4;8;4;2;178;2;343118464
4096;8;2;2;2047;2;14302368
512;8;32;2;23;2;3058912
4096;8;32;2;2;2;1983040
4096;8;1;2;23;2;27960512
1;8;1;2;23;2;1312665088
4096;8;8;2;2;2;4271264
4096;8;256;2;2;1;2006496
4096;8;32;8;2;2;1471808
16;8;1;2;2;2;57840480
4096;8;32;8;2;2047;865794688
4096;8;32;8;1;2;1416960
4096;1024;32;1;2;2;1630336
4096;8;1;8;2;2;6564672
4096;8;16;2;1;2;3040768
4096;8;64;8;1;2;1393440
4096;8;32;8;89;2;1693184
4096;8;32;8;1;46;31119776
4096;8;64;8;1;89;77401792
4096;8;64;4;1;2;1746112
4096;16;256;2;1;2;1916704
4096;8;16;8;1;2;1637120
4096;8;64;8;1;1;2110912
4;8;1;8;1;2;308048480
256;8;64;8;1;2;4701536
4096;1;1;1;1;2;57471008
2048;8;64;8;1;2;1416192
4096;8;64;8;23;2;1851552
256;8;64;4;1;2;4356928
4096;8;64;8;2047;2;2947232
64;8;64;8;1;4094;1330047872
4096;8;64;2;1;1;2942208
4096;512;1024;2;1;2;18446744073709551615
4096;4;128;4;1;2047;1687516352
4096;2;64;2;1;2;3111680
4096;8;64;8;2;2;1438016
1024;8;64;8;1;2;2195776
4096;8;64;8;1;46;52141504
4096;8;64;8;1;2;1466656
4096;4;64;4;1;2;1751488
4096;8;64;2;1;2;2022176
4096;8;64;8;1;23;18056704
4096;8;64;8;1;178;122279232
4096;64;64;16;1;2;1612096
4096;32;64;32;1;2;18446744073709551615
4096;4;64;4;1;2;1743552
4096;8;1;8;1;2;9108128
1;8;1;8;1;2;1188777408
4096;8;64;8;89;2;1793440
2;8;1;8;1;2;610270496
4;8;1;8;1;2;308313248
4096;8;4;8;178;2;3076832
4096;1;64;1;1;2;6128704
4;8;1;1;1;2;227655200
4096;8;64;4;23;46;40988096
32;8;1;8;1;23;57203520
4096;1;64;1;1;2;6136032
4;8;1;8;1;1;421640640
2;2;1;1;89;2047;3058487456
64;32;16;2;1;2047;196285952
1;2;1;1;178;1;4689483968
64;2;2;1;2047;4094;6893876832
4096;8;64;1;1;2;2625728
4096;8;64;8;1;4094;1331590976
4096;512;64;2;1;2;1117664
4096;8;64;4;1;2;1775744
4096;512;64;1;46;2;1548384
4096;1;64;1;2047;2;5587296
4096;512;32;2;1;2;1311008
4096;512;64;4;1;4094;66573600
4096;512;64;2;1;2047;35203584
4096;512;8;2;1;2;4374112
4096;2;64;2;46;2;3010592
4096;512;64;2;1;2;1116608
512;512;64;2;1;2;1291104
4096;512;64;512;4094;2;18446744073709551615
256;4096;64;2;1;2;1002816
4096;32;1;2;1;2;30708320
4096;512;32;2;1;2;1312512
8;4096;4;2;23;2;9065056
256;4096;16;64;1;2;1578592
256;4096;64;2;2;2;993472
256;4096;32;2;1;2;1029440
256;4096;64;16;2;2;1227392
256;4096;256;2;178;1;2449344
256;4096;64;1;2;2;1032160
2;4096;1;2;2;2;18132160
4;4096;2;2;2;2;9160800
256;4096;64;2;2;89;52951232
256;4096;64;2;2;23;6848288
256;4;64;2;2;89;143869376
256;4096;128;2;2;2;1004160
256;4;256;2;2;2;7721344
128;1024;64;512;2;2;18446744073709551615
1;4;1;4;2;4094;3057555808
256;4096;4;2;2;2;4874880
256;4096;64;256;2;2;18446744073709551615
256;4096;64;2;89;2;1952160
512;4096;64;2;2;2;978848
512;1;64;1;4094;2;22244736
512;512;64;2;2;2;1098784
2;1;1;1;2;4094;10019792288
512;4096;64;64;2;2;18446744073709551615
512;4096;64;2;89;2;2017056
4;4096;1;2;2;1;27275968
512;4096;64;2;89;23;35966720
32;4096;1;2;2;2;17906080
512;4096;1;2;2;2;20336800
512;4096;64;32;89;2;18446744073709551615
2048;4096;1;4;2;1;20165504
8;4096;4;2;2;2;4657856
128;4096;64;2;2;2;1133376
512;4096;32;8;2;2;983840
128;4096;64;8;1;4094;65364224
512;4096;64;2;23;2;1672352
512;4096;64;32;23;2;18446744073709551615
512;4096;64;2;4094;2;22371136
512;4096;64;2;2;178;46446592
512;4096;1;2;2;2;20339744
512;4096;64;4;2;2;984192
32;4096;1;2;89;2;32048736
512;4096;32;2;46;2;1692672
512;4096;64;2;2;2047;30110912
512;128;4;2;2;2;4740896
512;4096;64;32;2;2;18446744073709551615
512;1;64;1;178;2;22369888
512;2048;64;256;2;89;18446744073709551615
512;4096;1;256;2;2;16017056
512;4096;64;2;1;2;980768
4;4096;1;2;2;2;18074400
512;4096;64;2;2;1;1424864
512;4096;64;512;2;2;18446744073709551615
512;4096;512;2;2;2;1336160
1024;4096;2;2;2;2;11778112
512;4096;4;2;23;4094;70488192
2048;4096;64;2;2;2;1022912
512;4096;64;1;2;2;1043744
512;4096;64;512;178;2;18446744073709551615
512;1;64;1;2;2;14156064
512;2;64;1;2;2;7383264
512;1;64;1;23;23;135105184
512;16;64;2;2;2;1716416
512;1024;128;8;2;2;1224320
256;4096;64;8;2;2;1078208
4096;4096;64;2;2;2;1160416
1024;4096;64;2;23;2;1562912
128;4096;64;4;2;2;1160576
512;4096;64;2;23;23;46477760
512;4096;128;2;2;2;984736
256;4096;256;2;23;2;1937344
256;1;64;1;2;2;28676064
512;2048;64;2;2;2;964192
512;2048;32;2;2;2;998688
512;2048;64;2;23;2;1677248
256;2048;64;2;2;2;999008
512;1;64;1;23;2;21988000
512;2048;128;2;2;1;1423360
1024;2048;64;2;2;2;951904
256;2048;128;1;2;2;1004640
1024;4096;64;2;2;1;1458784
4096;4096;32;2;2;23;5085376
1024;2048;32;2;2;2;1062560
1024;2048;16;2;23;2;2188736
1024;2048;32;2;23;2;1540672
256;2048;256;2;2;1;1519584
1024;2048;64;8;2;2;999392
512;1;64;1;2;2;14171840
1024;2048;32;8;2;1;1430208
2048;2048;128;1;2;2;934912
1024;1024;64;2;2;46;8052192
2048;1;128;1;2;2;3913664
4096;1;128;1;2;2;3886976
2048;4096;128;1;2;2;1026848
1;2048;1;1;2;2;32680544
2048;4096;256;1;2;2;1013824
2048;2048;64;1;2;2;1025408
2048;2048;128;1;23;2;1464320
512;512;128;1;2;1;1482720
2048;2048;32;2;2;1;1468192
2048;2048;256;1;2;2;937056
2048;4096;64;1;2;2;1215424
1024;1024;128;1;2;2;971040
2048;2048;128;2;2;2;926304
1024;2048;128;1;1;1;1486560
2048;2048;1024;1;2;2;1612352
2048;2048;64;1;46;2;1599552
4096;2048;128;2;2;2;993536
2048;2048;128;2;2;23;5204448
4096;2048;128;1;2;2;968256
512;1024;64;2;2;1;1418880
4096;2048;512;4;2;2;18446744073709551615
1024;1;128;1;2;2;7354304
1024;2048;128;2;2;2;954272
1024;2048;64;2;23;46;73120128
1024;2048;128;2;2;1;1430400
4096;2048;512;2;1;2;2069984
2048;256;128;2;2;2;1123392
2048;2048;128;1024;2;2;18446744073709551615
1;2048;1;8;2;2;10248960
2;2048;2;2;2;2;9116160
2048;2048;1024;2;2;2;18446744073709551615
1;32;1;4;2047;4094;6081649024
16;4096;2;2;2;2;9105152
2048;16;128;2;2;2;1554144
1;2048;1;2;2;2;18044960
2048;4096;128;2;2;23;5450016
2048;2048;128;2;23;46;70567296
512;4096;128;4;2;2;1030432
2048;2048;128;1;2;23;4686528
2048;2048;1;2;2;2;22834656
2048;2048;1;2;4094;2;54431968
8;2048;8;2;2;1;3932864
2048;2048;128;32;2;2;18446744073709551615
2048;2048;512;2;4094;2;6024128
2048;2048;128;512;2;1;18446744073709551615
16;2048;1;1;1;1;52460640
2048;1024;128;2;2;2;941984
1;1;1;1;2;2;6028900416
2048;8;128;2;2;2;1507552
2048;2;1;2;2;2;19372128
1;1;1;1;1;1;8439919104
8;2048;2;2;2;2;9128224
256;2048;128;2;2;2;1000800
4096;2048;128;8;2;2;1917984
2048;2048;128;2;23;2;1485248
2048;2048;64;2;2;2;931648
2048;2048;128;2;2;1;1452640
512;2048;128;128;2;2;18446744073709551615
8;1;4;1;2;4094;10019869216
2048;2048;128;2;89;2047;177570944
1;2048;1;2;178;2;463000896
512;32;128;2;46;2;1707328
32;64;8;1;2;2;7096256
1;4096;1;32;46;2047;294107072
4;512;1;2;46;4094;141618080
1;2048;1;2;2;2;18033760
2048;2048;128;4;2;2;963904
4096;512;128;2;2;2;1000768
2048;2048;128;2;2;4094;80963104
2048;2048;64;2;2;23;6101664
1;2048;1;2;2;1;27200672
2048;2048;256;2;2;2;968000
32;2048;32;256;46;4094;18446744073709551615
256;2048;128;2;23;2;2027200
2048;2048;128;1;2;89;39842688
2048;1024;128;1;2;2;935040
128;2048;128;2;2;2;1146080
4;2048;2;2;2;2;9107968
2048;2048;128;2;2;46;9468320
8;2048;4;16;178;1;74951680
32;1024;4;32;2047;1;236728704
32;4096;8;4;2047;4094;5608409856
512;1024;4;8;2047;4094;5815965632
4096;2048;128;2;23;2;1560736
2048;2048;512;2;2;2;1606432
2048;2048;128;2;23;23;42287360
1;1024;1;2;2;23;30723328
2048;2048;128;2;2;178;30434112
32;2048;2;2;2047;2;168010176
1;2048;1;2;2;2;18041824
2048;2048;256;2;2;46;18446744073709551615
1;2048;1;2;2;2;18040032
2048;64;128;2;2;2;1392256
1;2048;1;16;1;23;8262240
2048;2048;32;1;2;23;4831616
2048;2048;8;2;1;2;4227392
1;16;1;2;4094;2047;12166891392
1;128;1;2;178;2;463731552
1;1024;1;128;2;23;19065216
512;8;512;4;2047;178;18446744073709551615
2048;2048;128;16;4094;2;18446744073709551615
512;2048;128;2;2;2;961920
1024;2048;128;2;23;2;1546976
1;2048;1;2;1;2;19328672
1;256;1;2;2;2;27862496
2048;2048;128;4;23;2;1572000
2048;2048;512;2;23;2;1647744
2048;2048;128;8;2;2;1610944
2048;4096;128;2;2;2;1006112
1;1024;1;2;2;1;31773824
2048;4096;128;2;1;2;1091136
2048;4096;256;2;2;2;1045824
2048;2048;128;2;1;2;1085024
1024;2048;128;4;2;2;977728
2048;1024;128;1;2;2;939264
2048;2048;128;2;2;1;1452512
4096;2048;32;1;2;2;1914368
2048;512;128;8;2;2;1343168
2048;512;128;4;2;2;1045728
1;2048;1;2;23;2;58136512
2048;2048;128;2;1;23;14110784
1024;1024;128;1;2;1;1413184
1;4096;1;4;1;2;10543040
512;2048;128;4;2;1;1478336
4096;2048;128;8;1;2;2073184
2048;2048;128;8;1;1;1649312
4096;1;128;1;2;1;3076928
1;2048;1;2;2;1;27191392
1024;1;64;1;2;2;7357568
1024;512;128;2;2;2;1033280
1;1024;1;2;2;2;21698976
2048;2048;256;2;1;1;1546944
1024;2048;128;1;2;2;959488
2048;2048;32;2;2;23;5215808
1;2048;1;2;2;23;26096384
2048;1;128;1;2;1;8020256
4096;1024;128;2;2;2;983328
1024;1024;256;4;2;2;1304768
2048;1;64;1;2;1;7967840
2048;1;128;1;2;2;3903648
2048;1;512;1;2;2;4200736
2048;1024;64;2;2;2;946304
256;2048;128;4;2;1;1550496
512;2048;128;2;2;46;9063776
2048;1024;256;2;2;2;991104
2048;2048;256;2;2;23;5804832
4096;2048;64;2;46;46;58242432
2048;1024;128;4;1;2;1138784
2048;4096;128;2;23;2;1560672
2048;1;32;1;2;2;3904800
2048;4096;512;2;2;2;1752320
4096;2048;128;1;2;1;1413504
1024;2048;128;2;1;1;1503616
2048;512;64;8;2;2;1073600
512;2048;128;2;23;2;1650528
4096;4096;128;2;2;23;5857376
256;1024;128;2;1;2;1328000
1024;2048;128;2;1;2;1007360
2048;2048;128;2;1;2;1070272
2048;128;128;2;2;2;1312320
2048;2048;16;2;2;23;4776928
512;256;32;16;4094;1;21064352
128;128;4;1;1;1;14068832
2048;2048;64;2;1;1;1492704
512;2048;256;2;2;1;1483840
64;2048;1;2;2;46;38805792
2048;2048;512;2;2047;2;4043680
8;2048;1;2;2;2;18017536
2048;2048;1;2;2;2;22841120
1024;2048;128;2;2;46;9069216
2048;1024;256;4;2;2;1447680
1024;2048;128;2;2;23;5143904
2048;2048;128;8;2;1;2119168
2;2048;2;2;89;2;126109664
2048;128;1024;2;2047;2;18446744073709551615
1;1024;1;8;1;1;12853408
1;4096;1;2;23;2;58294272
8;4;4;2;46;2;341256320
4;2;2;2;2047;89;1896465152
32;2048;2;2;2;2;9042944
2048;2048;8;2;2;2;2959776
2048;64;128;1;2;2;1642784
2048;4096;128;1024;2;2;18446744073709551615
32;64;1;32;1;1;10887808
512;2048;128;1;2;23;5018944
32;4;1;2;1;1;82869568
2048;2048;128;2;89;2;1612640
32;128;4;1;1;1;14592832
1;2048;1;4;2;2;12073760
2048;2048;128;2;46;2;1561696
1;2048;1;8;23;2;78258368
32;256;4;4;1;1;6023872
2048;512;1;128;1;23;47716288
64;2048;16;16;2047;4094;6164280704
32;64;32;2;23;1;7939520
512;1024;128;2;1;1;1531392
4096;2048;128;2;2;1;1457568
4096;512;128;2;23;1;2409024
1024;1024;128;2;2;2;965696
2048;2048;32;4;1;2;1079968
4096;4096;128;1;23;2;1752896
256;1024;128;1;2;2;1116032
1;2048;1;8;2;2;10349280
512;2048;16;2;2;2;1447040
512;32;4;2;1;1;8215168
1;64;1;8;1;89;225461888
256;1;32;1;23;89;598578560
4096;512;1024;128;178;178;18446744073709551615
1024;4;64;1;1;1;4128640
2048;2048;512;2;1;46;9754016
4096;2048;128;2;1;2;1196736
4096;1024;64;2;2;2;968960
1;1;1;1;1;1;8439171904
1;2048;1;2;2;2;18037664
4096;1024;128;4;2;2;1062080
1;32;1;2;1;1;308962752
2048;1024;32;2;2;2;1077824
1024;2048;128;8;2;1;1878336
256;256;16;16;1;1;3960896
4096;8;64;2;1;2;1971904
1;1;1;1;46;2;8089846400
16;128;1;2;1;1;28755296
1;8;1;4;4094;46;10565521344
2048;1024;16;4;2;2;1136800
128;128;8;4;1;1;4039936
1024;1024;128;4;2;2;1012000
1;2;1;2;1;1;4850140608
1024;2048;128;1;1;2;986112
1;1;1;1;89;4094;10925173600
8;512;8;8;1;1;3327424
128;1;2;1;1;178;552850752
4;2;2;1;46;1;1126888544
2048;2048;256;4;1;2;1898048
4096;2048;64;2;2;2;974816
256;2048;128;2;2;23;5081088
1;2048;1;8;1;2;10125632
1024;1024;128;2;2;1;1428736
1;2048;1;2;1;2;19331104
256;2048;256;2;2;2;1050464
1;4096;1;2;2;1;27837120
2048;1024;128;1;46;2;1475200
2048;1;128;1;2;2;3904512
2048;2048;256;2;23;2;1559232
2048;2048;32;2;2;89;44060384
4096;512;64;2;23;1;2428576
4096;4096;128;1;2;2;1155456
2048;2048;32;2;23;2;1581888
2048;2048;256;1;1;2;1099680
2048;1024;128;2;2;1;1446272
2048;2048;32;4;2;1;1449632
1;2048;1;1;2;2;32672288
2048;512;128;2;2;2;999072
256;2048;64;2;2;23;6644672
2048;512;128;1;2;2;989824
4096;2048;256;2;46;2;1666880
2048;2048;512;1;2;1;1494144
2048;2048;256;2;1;2;1180672
2048;2048;256;2;1;23;14268320
16;4;1;1;2047;1;406439264
2048;2;1;1;2047;89;139846144
512;1;4;1;1;4094;11878642688
32;2;16;1;89;89;467327744
512;4096;128;2;23;23;40406368
512;2048;128;2;2;23;5113440
2048;64;512;1;1;1;2959360
2048;1024;128;16;1;2;18446744073709551615
1;64;1;1;1;1;144355680
4096;4096;128;2;2;1;1604864
512;2048;128;2;46;2;1834560
2048;2048;32;4;2;2;941792
2048;512;128;2;1;1;1515424
64;256;2;128;1;1;22201536
64;1;16;1;1;46;351448128
1;2;1;1;23;1;6108491008
64;1;2;1;178;1;157922240
512;64;8;4;1;1;3841664
1024;2048;128;8;1;2;1593152
2048;1024;64;8;2;2;1020608
2048;2048;512;2;2;23;18446744073709551615
1;2048;1;8;46;2;155369888
512;2048;128;8;2;1;1752736
1;32;1;32;1;1;640198016
2048;2048;64;4;2;2;945856
128;256;8;8;1;1;5106560
1024;32;128;2;1;2;2093280
32;64;8;1;23;2;10022624
1;1;1;1;46;2047;12248718144
2048;2048;128;2;46;23;43889376
2048;2048;32;1;2;2;1550336
1024;32;64;8;1;1;3143200
2048;256;128;2;2;1;1492480
2048;1;128;1;2;23;92166816
2048;1;512;1;2;2;4210208
16;1;8;1;1;1;625498016
256;1024;128;2;2;2;1121440
2048;2048;256;4;1;23;9414944
512;16;64;1;1;1;2191008
4;512;4;2;46;4094;142731456
128;16;4;1;4094;2047;6761521440
8;128;2;2;23;1;25086816
4096;2048;128;4;2;2;1110752
1024;1024;256;4;2;1;1757888
2048;2048;64;16;2;2;1612736
2048;2048;64;1;2;1;1476128
256;1024;128;2;23;2;1921440
4096;1024;16;8;2;2;1039616
4096;2048;256;2;2;2;1100480
2048;512;128;2;23;2;1445504
2048;2048;64;2;23;2;1464256
1;1024;1;2;2;2;21716064
2048;2048;128;4;2;23;6310336
1024;2048;256;2;2;2;982304
512;1024;128;2;2;2;1005280
2048;2048;512;4;2;2;18446744073709551615
1024;2048;256;2;2;1;1461504
2048;1024;128;4;2;2;987872
4096;2048;64;4;1;1;1561312
2048;2048;64;2;1;2;1049408
2048;2048;128;4;2;1;1500832
2048;128;256;2;2;2;1293536
1024;2048;256;2;2;23;6141760
1024;2048;32;4;2;2;954464
1024;1024;128;2;1;2;1067552
1;2048;1;2;2;2;18039744
256;2048;128;2;2;1;1440736
1;2048;1;2;2;2;18039264
1;2048;1;2;2;2;18039168
512;2048;256;4;23;2;1539968
1024;1024;128;2;2;23;5216928
1;2048;1;2;2;23;25927424
2048;2048;128;8;2;23;18446744073709551615
1024;16;512;1;1;1;3225696
1;1024;1;2;2;2;21685248
512;32;128;16;1;1;18446744073709551615
1024;32;256;8;1;1;18446744073709551615
1024;32;64;16;1;1;3395904
64;128;32;16;1;1;2543584
512;32;32;16;1;1;2693472
1;1024;1;1;1;23;58375648
512;32;512;16;2047;178;18446744073709551615
1;1;1;1;23;1;12252865504
8;1;2;1;46;2;1184192960
512;1024;64;2;46;2;1791968
2048;1024;128;2;46;1;1922112
1;2048;1;4;2;23;16219776
512;64;32;32;1;1;3220416
256;64;32;16;1;1;2758400
4096;1024;64;2;2;1;1384128
128;32;4;1;1;1;15577056
4;2;2;2;2047;89;1888200000
2048;512;1;2;1;23;34261472
256;32;16;32;1;1;3975776
64;8;16;1;23;4094;1367161472
2048;1024;64;4;2;1;1444832
256;32;128;4;1;1;2642048
32;16;32;8;2047;1;224753344
1;4096;1;1024;1;89;25083744
256;1;32;1;23;2047;6637528928
1;512;1;128;178;178;919575296
256;32;64;8;1;1;2780864
2048;2048;128;256;46;2;18446744073709551615
2048;2048;2;2;2;2;11515904
2048;2048;128;16;89;2;18446744073709551615
256;64;64;32;1;1;18446744073709551615
512;32;64;32;1;1;18446744073709551615
2048;2048;4;2;1;2;8308544
4096;8;16;2;1;2;3072288
2048;2048;1;32;1;2;3801664
16;2048;4;2;2;2;4628064
2048;1;128;1;2;46;210871008
1024;32;64;32;1;1;18446744073709551615
512;32;32;32;1;1;2985696
4096;2048;128;1;23;2;1559424
128;32;64;32;1;1;18446744073709551615
1;1;1;1;1;2;6209147648
1;1;1;1;4094;46;10583052896
1;4096;1;64;1;4094;7479232
2048;4;128;4;2;2;1505408
2048;2048;128;2;2;89;36417376
2048;2048;128;64;2;2;18446744073709551615
2048;512;64;2;2;2;1006048
2048;1;1024;1;2;2;5265792
256;32;64;32;1;1;18446744073709551615
1024;16;128;2;2;2;1526784
128;2048;1;2;2;2;18086784
2048;4;128;2;2;2;1470752
2048;32;64;32;1;1;18446744073709551615
1024;2048;128;2;1;2;1004384
128;4;2;4;1;178;162616832
4;2;1;1;46;1;1162610528
16;2;1;2;4094;1;574536256
2048;2;1;2;2047;1;44151200
2048;64;128;16;2;178;18446744073709551615
2048;64;128;32;2;46;18446744073709551615
2048;2048;4;2;2;2;5811488
4096;2048;128;1;2;2;969792
1024;2048;512;16;2;2;18446744073709551615
2048;2048;128;2;23;1;2432288
2048;2048;32;2;1;2;1240672
2048;2048;32;2;2;2;1039104
512;1;4;1;1;23;61721344
2048;2048;128;1;1;2;1062400
512;1;128;1;2;2;14770752
2048;4096;512;8;2;2;18446744073709551615
1;1;1;1;2;2;6028379968
1;2;1;1;89;89;5774589024
64;32;2;2;1;2047;197208544
1;2;1;2;178;1;5033658976
64;1;16;1;178;1;157810688
2048;1;128;1;2;2;3906304
2048;1024;64;2;2;1;1423040
2048;2048;128;1;46;2;1515872
1024;2048;128;8;2;23;18446744073709551615
2048;1024;256;1;1;2;1083520
1024;4096;64;2;2;2;991840
1024;4096;128;2;2;2;982560
512;2048;512;2;2;1;1773152
1024;2048;128;1;23;1;2409056
2048;512;64;8;2;1;1514752
1024;1024;32;1;2;2;1317824
512;2048;1;2;2;2;18853856
2048;1024;32;4;2;2;944480
1024;2048;64;1;2;2;1064352
2048;1024;128;2;23;1;2395200
2048;2048;64;4;23;2;1505568
2048;1024;64;1;2;2;1063424
2048;1024;128;4;2;23;6108960
1024;1;128;1;2;1;12707936
2048;2048;4;2;2;23;9084544
4;2048;2;2;2047;2;1314233280
1;2048;1;1;2;1;50793472
4096;256;128;2;2;2;1112800
4096;1;256;1;2;2;3910880
512;32;1;2;46;2;27991104
16;64;16;1;2;2;6430560
512;1;1;1;1;2047;5960330368
4;512;1;2;1;4094;50989088
2048;2048;128;1;2;2;930496
4096;4096;128;2;2;2;1143680
128;16;8;1;4094;2047;6631723424
2048;1;2;1;1;1;31252960
2048;2048;16;2;2;2;1627520
1;64;1;2;2;2;117010880
2048;2048;256;2;2;1;1498816
2048;1024;128;2;2;46;9219872
1;1024;1;128;2;178;22854112
32;8;8;4;178;178;150853824
64;4096;32;2;23;1;2568288
8;4;2;1;46;1;293724640
8;2048;8;2;2;2;3275680
2048;2048;128;128;178;2;18446744073709551615
2048;1;256;1;2;2;3914880
2048;2048;128;512;2;2;18446744073709551615
512;2048;128;2;2;178;30652608
64;2048;1;2;1;2;19267008
4;2;2;2;4094;89;3518144544
2048;512;1;8;1;1;9672800
64;8;2;1;23;4094;1599631232
32;16;32;8;23;1;32902720
128;2;2;1;1;178;276330880
256;1;1;1;23;89;259872544
64;256;2;128;178;178;49993984
1;8;1;2;1;2;936993536
16;2048;4;2;46;2;9516480
32;2048;2;256;2;2;17465600
2048;64;16;2;2;2;1794656
2048;1024;256;2;2;1;1475648
4;512;4;32;1;2;5033280
128;8;2;4;4094;46;134258336
1;128;1;64;1;4094;171872768
128;4;2;4;4094;178;617616320
1;512;1;2;2;1;41831456
2048;2048;64;2;2;1;1451648
2048;2048;1;2;4094;2;54408448
4;2;4;1;46;2047;3358081664
1024;4;1024;1;1;1;5457856
2048;1;1;1;2047;1;81735936
512;1;4;1;1;2;19262912
32;2;8;1;1;89;343411296
64;64;16;1;1;2047;109931328
1;2;1;2;178;2047;6557568096
64;1;16;1;178;178;893386656
64;2048;32;2;1;1;1672384
512;128;128;2;46;2;1874784
32;1024;32;1;2;2;1533760
8;4096;1;32;1;2047;16662944
4;512;1;1;1;2047;69937472
16;16;2;1;4094;1;598175648
8;128;2;2;23;4094;139831552
1;1024;1;128;178;23;969465216
16;8;16;2;178;2047;958854208
512;4096;256;2;2;2;1034848
32;128;2;2;2;2;9272896
2048;2048;1024;32;2;2;18446744073709551615
1;4096;1;2;23;1;81832832
8;8;2;8;46;1;225354720
64;2;64;2;4094;89;598635712
16;1;2;1;1;1;610871264
128;2048;2;2;2;2;9125856
2048;32;128;2;2;2;1475648
2048;8;128;2;2;23;14416736
2048;512;64;4;2;2;1015456
64;1;16;1;23;4094;10486123680
32;32;16;32;23;1;19785376
1;8;1;4;1;89;1582253280
256;1;2;1;2047;89;295097696
2048;2;4;2;2;2;6263232
1024;2048;64;2;2;1;1417728
1;256;1;128;178;1;789299520
4096;8;64;2;1;1;2885280
8;512;8;16;1;4094;23929536
128;1;2;1;4094;46;132053600
