GLOBAL_SIZE_0;GLOBAL_SIZE_1;LOCAL_SIZE_0;LOCAL_SIZE_1;v_TP_97;v_TP_98;cost
4;64;4;2;315;130;18446744073709551615
2;1;2;1;90;4095;18446744073709551615
8;2048;2;4;546;15;747864736
256;16;1;16;13;126;224507264
256;32;4;8;13;126;75763424
512;16;512;16;13;126;18446744073709551615
64;64;2;4;13;273;330767584
8;64;2;2;9;117;241756704
16;32;2;8;13;126;303062528
256;1;4;1;195;126;18446744073709551615
256;32;4;8;13;65;30164480
32;32;32;8;13;126;107451840
512;64;16;4;26;5;46042880
1;2;1;2;273;5;31666702496
1;1024;1;128;210;90;18446744073709551615
16;512;4;32;30;630;18446744073709551615
2048;32;1;8;13;65;72577472
256;32;4;32;13;65;31387552
2048;32;1;1;13;65;327355328
256;32;32;8;13;65;23594112
256;32;32;8;13;390;23731328
32;32;32;8;13;65;158835648
256;32;32;8;13;78;20062080
2;32;2;8;30;65;1081824512
256;32;32;8;819;78;18446744073709551615
1;32;1;8;13;78;3468523296
256;1;32;1;4095;78;18446744073709551615
8192;32;32;8;13;78;9650464
8192;32;32;8;13;3;125899488
2;32;2;8;18;78;1815471392
2;32;2;8;13;78;1818188128
8192;128;32;2;130;78;132570016
8192;128;32;2;13;78;15697792
8192;32;32;8;13;130;9946592
8192;16;64;16;13;78;18786784
1;256;1;1;42;78;1228017216
8;4096;2;32;30;18;27101472
4096;8192;32;256;2730;63;18446744073709551615
4;1024;4;16;45;1365;18446744073709551615
8;16;4;1;5;14;719053344
8192;32;1;8;13;4095;18446744073709551615
8192;512;32;512;13;78;18446744073709551615
256;32;32;32;13;78;45943776
8192;2048;32;512;13;78;18446744073709551615
1;32;1;16;13;78;4644117600
8192;32;32;8;13;39;13596544
8192;32;4;8;35;273;257641216
8192;8192;8;64;13;63;29894048
512;16;128;8;65;26;129562080
4096;8192;64;2;63;9;41588128
128;1024;2;1024;585;5;18446744073709551615
128;512;4;2;1638;42;18446744073709551615
8192;32;32;2;13;78;15823264
8192;32;32;8;182;78;18446744073709551615
8192;32;128;8;70;78;18300864
1;32;1;8;13;78;3471867040
1024;1;1024;1;9;18;7807103040
4096;1;2;1;3;65;255013376
1;64;1;8;6;546;1178793728
16;8;1;8;35;630;18446744073709551615
8192;256;32;1;13;78;27813248
8192;32;32;32;13;78;18857856
8192;32;32;8;8190;819;18446744073709551615
2048;64;32;4;13;78;10176096
8192;16;32;16;15;78;14455328
8192;32;32;16;5;78;22279648
8192;128;16;2;13;130;47713824
4096;32;4;8;13;234;75260576
8192;32;32;8;42;78;14341984
8192;32;1024;8;13;78;18446744073709551615
32;32;32;8;13;78;140092768
2048;1024;1;1;10;195;754106624
128;2;1;1;26;630;18446744073709551615
1;128;1;1;2730;10;18446744073709551615
128;1;32;1;3;105;1000823520
32;8192;1;8;39;105;308695808
4;1024;2;128;90;14;54715360
8192;32;512;8;13;78;18446744073709551615
8192;32;2;2;13;78;122556704
8192;2048;32;512;13;9;18446744073709551615
8192;32;4;8;13;78;39299168
8192;32;32;4;13;78;10302048
8192;32;32;8;13;13;29196768
1;32;1;4;13;182;1965708608
8192;8;32;8;13;78;13554688
8192;32;32;8;13;65;10328000
16;512;2;2;1;13;245673824
1;8;1;2;390;1365;18446744073709551615
8192;32;256;8;70;45;18446744073709551615
8;4096;2;2;455;105;18446744073709551615
8192;32;16;8;13;78;10071008
8192;128;16;2;13;65;27057760
1;32;1;8;13;78;3471771488
32;512;8;256;21;18;18446744073709551615
4;4096;1;1;21;234;1811887552
4096;8192;1;16;1365;15;18446744073709551615
128;4096;4;1024;390;1;18446744073709551615
128;2048;32;16;70;13;27499072
2048;512;128;4;65;14;55321312
128;512;1;32;26;39;28671488
512;8192;64;4;45;35;19250816
8192;32;32;8;13;910;18446744073709551615
8192;32;32;2;13;78;15807776
8192;32;2;8;13;234;132647040
8192;32;32;8;13;70;10011808
2048;32;32;8;14;210;11109888
8192;32;64;8;13;130;10555008
8192;32;4;8;7;78;38076672
1;8192;1;512;13;78;588853312
8192;32;32;8;65;78;19998912
8192;4;32;1;13;35;31048192
128;32;32;8;13;78;37564736
32;128;32;64;1638;35;18446744073709551615
64;64;32;64;126;8190;18446744073709551615
8192;2048;512;64;455;6;18446744073709551615
2048;1;32;1;1365;390;18446744073709551615
512;2048;256;64;130;7;18446744073709551615
512;2048;16;2;210;21;181246752
8192;2;32;2;1;78;47525728
512;2048;4;1;10;65;91467680
8192;32;16;8;13;130;17361088
8192;32;32;4;21;195;30422272
8192;256;64;1;13;91;22301056
512;2048;16;4;30;35;17509920
8192;32;32;32;13;78;18850528
8192;64;32;4;13;78;9786368
8192;32;32;8;26;78;10849792
4;512;1;1;14;26;274052640
2;256;2;32;90;4095;18446744073709551615
8;4096;2;32;130;15;33781216
1;1;1;1;13;105;49877390944
512;2048;1;16;1;21;261197088
8192;32;32;8;13;4095;18446744073709551615
8192;32;32;8;546;78;18446744073709551615
512;2048;32;4;105;21;30228000
8192;1;32;1;13;78;33643360
8192;64;32;2;13;78;15770016
32;1;16;1;42;45;2971993856
8192;32;32;8;5;78;12497216
8192;32;32;8;13;78;9692320
2;32;2;8;13;78;1816463360
1024;1024;128;8;65;18;59841760
512;64;256;4;26;5;509322656
1;2;1;2;273;182;18446744073709551615
1;1;1;1;195;90;18446744073709551615
512;4096;32;4;39;35;15582112
256;2048;32;8;45;21;15795392
256;1024;64;16;26;35;25202592
512;2048;32;4;65;26;17707168
1024;64;128;4;13;78;20258272
8192;64;32;4;35;78;18581376
1024;64;32;4;13;78;10269184
4096;32;16;8;13;42;9767360
8192;32;32;8;13;234;13011008
2048;32;32;8;13;2730;18446744073709551615
4;1;2;1;30;630;18446744073709551615
8;4096;2;64;30;90;34405376
4096;8192;32;32;21;63;12462208
128;1024;4;16;45;1;49663424
2048;4096;32;4;42;18;17492064
1024;1024;64;4;42;21;19961152
8192;8;32;2;9;78;15809728
8192;32;16;8;42;78;20264064
1;32;1;8;4095;78;18446744073709551615
1024;32;32;2;13;78;16782496
8192;32;32;8;13;26;15074784
2048;8192;8;1;78;14;115531936
8192;64;64;4;13;65;13507456
8192;16;32;16;13;78;12891008
8;64;4;8;5;9;422054176
1024;1;1024;1;10;182;766828320
1;1;1;1;3;1;158801298144
1;256;1;1;6;1;1007325824
512;2048;64;8;35;30;16554528
8192;32;32;8;6;78;11189888
8192;1;32;1;182;78;18446744073709551615
8192;32;32;8;4095;78;18446744073709551615
128;8192;8;4;42;35;41316768
8192;2;32;1;18;78;49983232
8192;32;32;16;30;78;9513504
8192;8;16;2;39;78;72570752
8192;64;64;16;30;78;13948704
4096;64;32;16;30;78;8867072
8192;32;32;16;30;70;10119552
8192;32;256;16;30;182;18446744073709551615
4096;64;16;16;30;26;11232672
1;64;1;16;13;78;2314502272
8192;64;32;16;30;10;36471648
4096;256;32;4;65;63;33806400
4096;64;64;8;30;78;11443680
4096;64;32;16;78;126;15213568
4096;64;32;8;26;78;10174208
8192;64;64;16;35;78;15636192
4096;64;32;8;30;65;10952608
512;64;32;16;30;105;10928224
4096;64;32;8;70;63;18733696
4096;64;32;16;14;78;9858720
4096;64;32;8;7;78;11085280
4096;64;32;16;30;45;11294528
4096;64;8;16;30;30;11667488
2048;32;64;16;26;78;17154336
4096;64;16;16;14;78;8553920
4096;64;16;16;91;78;28371648
4096;64;32;16;21;78;10874624
8192;64;16;16;14;78;8866944
4096;64;16;16;7;78;12221120
4096;64;16;16;35;63;11308352
4096;64;16;16;30;78;9673312
4096;256;16;4;15;45;11682816
4096;64;16;16;35;65;14542272
4096;64;16;16;5;78;16117248
4096;64;32;8;14;78;8423936
4096;128;16;8;14;78;8744800
2048;64;128;16;6;78;18446744073709551615
4096;64;32;8;10;78;10303392
8192;64;32;8;14;195;12805696
4096;8;32;8;21;78;12762656
4096;64;64;16;14;78;15196480
8192;64;8;8;14;78;18911328
2048;64;64;16;14;126;10190208
4096;64;32;8;6;130;8321696
4096;64;64;4;14;78;10851520
1024;64;32;8;13;585;29784992
8192;32;32;16;6;130;16945248
4096;16;4;2;6;273;142792224
4096;64;32;8;5;195;9362368
2048;128;32;4;15;90;10680192
4096;64;16;16;6;130;15702784
4096;64;8;16;6;78;19764960
4096;32;32;32;6;130;29767456
2048;32;64;32;6;130;18446744073709551615
4096;64;16;8;6;234;16130592
4096;32;8;16;6;90;16646432
2048;64;32;16;10;130;9570080
4096;64;32;4;6;91;7396640
8192;64;32;16;6;130;15580480
4096;64;32;8;1;130;36174944
4096;128;32;4;7;70;9482176
4096;64;8;4;5;91;25974080
4096;64;8;4;6;91;23544256
1024;64;32;4;6;91;8441856
4096;64;32;4;9;91;8516992
4096;64;64;2;6;91;9418784
4096;64;32;4;6;182;9661344
8192;64;4;4;6;91;38490336
4096;64;32;8;6;117;8310528
8192;32;32;8;5;117;9859392
4096;64;32;4;15;91;10670784
4096;32;32;16;5;91;17747296
2048;32;32;8;6;21;22160640
4096;32;32;8;6;91;9003680
1;128;1;2;6;91;434781824
4096;64;32;8;2;91;18157664
4096;64;32;1;6;91;16470720
4096;64;32;4;6;70;9108960
4096;64;128;4;6;91;16612032
4096;64;32;4;15;182;21307488
1024;64;64;4;30;91;13484832
512;64;32;4;18;182;20234208
1024;16;32;16;6;91;20185376
4096;16;64;16;6;18;79748608
4096;256;32;1;6;91;16463040
4096;16;32;16;35;126;13311776
4096;128;64;2;6;273;14054624
2048;64;32;4;6;91;7908896
4096;64;32;4;13;45;10447648
4096;64;32;4;6;126;8495136
4096;64;64;4;10;91;10292448
8192;64;32;4;6;210;11107808
8192;64;32;8;7;91;9321856
4096;64;128;4;3;91;23154080
4096;64;32;4;7;91;8601408
4096;64;32;4;1;91;18365376
4096;64;16;4;6;390;55896000
4096;64;32;4;6;105;8887616
4096;256;128;256;6;91;18446744073709551615
4096;64;32;4;5;91;8361088
4096;128;32;4;26;91;15735808
8192;64;32;4;10;91;8981568
8192;64;32;4;14;91;9302464
1;32;1;8;6;91;2376341152
4096;32;128;8;2;130;38001344
4096;64;8;8;6;91;16859776
4096;64;64;4;2;182;10396864
4096;64;32;2;2;91;12796096
8192;64;32;4;6;195;11997376
2048;32;128;8;10;70;33164256
1024;64;32;2;9;91;12937088
4096;256;32;1;6;273;44032384
4096;64;32;4;14;91;9182080
4096;256;8;1;6;91;51741088
1;64;1;4;6;78;1383746048
1024;64;4;16;6;130;26856896
4096;16;32;16;6;91;15031648
1024;64;32;8;6;210;8005056
4096;128;64;2;6;91;9070560
1;64;1;4;6;91;1075065536
4096;512;32;128;6;91;18446744073709551615
4096;512;16;512;1;65;18446744073709551615
1024;64;32;8;6;63;11312640
4096;64;16;4;6;91;12643552
4096;64;16;4;30;35;17662848
2048;64;32;4;18;91;11446272
4096;8;32;2;6;105;13049888
512;32;32;2;6;91;13843296
1024;128;32;2;13;91;16769632
8192;32;32;8;6;91;8906272
4096;64;32;2;7;91;12416000
1;128;1;2;6;117;438008480
2048;64;32;4;6;105;8841760
4096;64;32;2;6;117;12002656
2048;64;32;4;6;117;8659168
8192;32;32;8;6;105;8869056
4096;64;32;8;6;90;8433376
4096;64;32;4;3;117;10280928
4096;64;32;8;6;91;8187328
4096;128;32;2;6;91;9381088
4096;64;32;4;6;39;12710592
512;2048;64;4;42;26;16096704
8192;64;64;8;6;130;11684672
1;512;1;512;6;91;9513660192
512;2048;32;4;18;26;12571232
4096;64;64;8;1;91;52020032
2048;128;32;128;6;78;18446744073709551615
4096;32;32;2;6;91;9680832
512;2048;32;4;7;26;14203264
1;512;1;8;35;1;308313088
1;1024;1;1;10;195;767807168
128;2;1;1;26;630;18446744073709551615
512;2048;128;4;42;14;56152448
4096;64;32;64;6;91;18446744073709551615
1;64;1;8;6;91;1202070560
4096;64;32;4;6;26;14140192
4096;64;32;4;6;195;11854048
4096;64;32;4;21;78;13391648
1024;64;32;4;2;91;11900128
512;64;64;8;2;91;39898304
512;2048;32;4;35;30;11596064
4096;64;32;2;6;195;18499488
4096;128;32;2;5;91;11104000
4096;64;32;4;6;78;8757984
32;512;32;4;30;42;20136960
4096;64;2;4;6;91;51007872
4096;64;32;16;6;91;13826080
4096;64;32;4;6;2730;18446744073709551615
64;128;2;4;70;10;63615552
128;8;32;1;3;105;130526368
1;8;1;2;390;1;18210302048
1;32;1;8;70;45;1998366720
1024;2048;32;4;42;21;15385056
4096;64;8;1;6;91;52152032
512;2048;8;1;45;18;86864896
256;64;32;4;1170;91;18446744073709551615
4096;2048;32;512;6;91;18446744073709551615
4096;4096;32;1;6;91;17265312
512;2048;64;8;35;26;19746688
4096;16;32;16;13;91;9829280
1024;64;32;4;13;91;10244352
512;2048;32;4;26;26;12552096
512;2048;32;4;39;26;13374912
512;2048;32;4;35;35;15689472
512;2048;32;8;42;26;12839104
8;1;2;1;455;105;18446744073709551615
4096;64;8;16;21;234;52335680
16;1;2;1;1365;15;18446744073709551615
32;4096;4;1024;390;1;18446744073709551615
4096;64;128;4;5;234;11722976
4096;64;32;4;30;91;15596160
4096;64;32;4;21;63;10901344
4096;64;32;4;13;91;9723200
4096;128;32;8;6;91;8150912
4096;256;1;1;6;91;263784448
4096;64;1;4;6;91;91362720
2048;64;64;8;6;91;12897728
4096;64;32;4;6;35;14083680
512;2048;64;4;39;26;16933440
32;128;8;16;126;273;18446744073709551615
64;64;32;1;126;8190;18446744073709551615
8192;512;512;64;2730;6;18446744073709551615
512;2048;8;4;26;39;28571744
4096;64;32;2;6;91;9546560
4096;64;32;4;6;45;11284960
4096;64;1024;4;6;91;18446744073709551615
2048;64;16;2;6;63;21193792
4096;8;32;2;3;26;26690592
4096;16;8;16;6;91;26749024
1;64;1;4;6;195;1065049312
512;2048;64;4;35;26;16424768
1024;64;32;4;21;91;13873632
4096;64;32;1;9;91;20594784
4096;64;32;4;14;182;15191552
512;2048;8;1;35;30;80937792
8;64;8;8;15;1;2245011296
4;64;4;64;14;26;1503990432
128;64;128;8;90;45;75126048
4096;64;32;4;6;18;20193600
4096;64;32;4;105;91;57734464
4096;64;32;4;182;91;18446744073709551615
4096;4;2;1;6;7;232214624
1;64;1;8;6;91;1197277344
8192;64;32;4;6;91;7688576
8;1;2;1;13;15;8532052256
256;16;32;16;13;126;35936704
512;1;16;1;26;1;3481550976
4;2;2;2;70;5;12150694528
4096;32;16;8;15;117;16430112
1;64;1;4;10;91;973045056
2;64;2;4;6;91;577274432
8;64;2;4;26;91;239162112
4096;8;16;8;6;105;15824064
4096;64;32;4;10;315;19580672
512;64;32;4;6;91;9695744
8192;256;32;1;5;91;17300256
256;32;1;2;210;90;18446744073709551615
32;8192;1;32;30;630;18446744073709551615
1;8192;1;16;21;18;45548672
1024;8192;32;512;21;210;18446744073709551615
4096;64;32;64;273;91;18446744073709551615
4096;512;32;512;6;91;18446744073709551615
4096;2;32;2;26;91;32915104
4096;4096;32;512;6;91;18446744073709551615
4096;64;32;4;6;273;14674464
64;1024;4;16;45;42;21801344
8;64;8;8;105;9;366723328
1024;1;1;1;10;1;822677856
4096;2048;1;4;3;65;130315808
4096;64;64;4;6;42;17821120
4096;8;8;2;6;210;70178784
4096;64;16;4;6;90;12827264
4096;8192;32;512;6;91;18446744073709551615
4096;64;32;4;1638;91;18446744073709551615
4096;64;8;4;6;63;26151232
4096;64;32;16;14;91;8235904
4096;64;64;16;6;91;21303936
2048;256;1;1;6;1;778766208
8;2;2;2;35;65;3746603872
32;1024;1;1;10;1;717510304
1;2;1;1;26;630;18446744073709551615
4096;128;1;2;6;10;171185984
128;64;8;4;63;63;155818208
2048;128;32;2;6;390;36597760
8192;64;64;4;6;91;10715840
4096;16;32;16;5;91;17719104
1024;64;32;4;1;63;26485792
1024;32;32;8;6;91;10297664
8192;64;32;2;2;91;13152480
4096;128;2;4;45;10;47484064
128;256;32;128;3;10;18446744073709551615
1;8;1;8;3;78;25888847520
4096;16;32;16;10;91;10941088
4096;64;32;4;6;65;9671936
1;32;1;8;70;45;1998319712
2;1;2;1;455;70;18446744073709551615
4096;64;8;8;819;234;18446744073709551615
4096;8192;16;1;1365;15;18446744073709551615
4096;64;32;4;1;210;16687904
4096;128;32;2;6;70;11745984
128;512;4;128;390;1;113850240
32;128;32;64;117;234;18446744073709551615
64;16;32;1;126;1;3905141888
8192;256;512;64;455;6;18446744073709551615
8;64;1;8;15;1;408104416
4;512;1;1;14;26;273891904
2048;64;128;8;90;45;30708224
128;4096;32;32;130;9;45711040
4096;32;32;8;6;126;8227488
4096;128;32;8;13;91;7289920
1;4;1;1;6;91;12817325632
512;128;32;8;13;117;9039616
4096;128;8;8;13;91;22185120
2048;128;16;8;13;78;8476064
4096;256;32;4;13;91;9646176
1;128;1;8;13;105;554661824
4096;256;32;4;14;315;26473472
8192;64;64;16;13;70;18386784
4096;1024;32;1024;9;105;18446744073709551615
4096;128;16;8;1;90;32571360
2048;128;16;8;13;91;11332608
4096;128;32;8;15;91;7893472
8192;128;16;4;13;91;20021440
4096;128;64;8;10;130;11870080
4096;32;256;32;13;65;18446744073709551615
4096;512;128;2;10;117;11617504
4096;64;128;16;30;91;18446744073709551615
4096;128;32;8;13;65;9792384
4096;256;16;4;13;105;21568288
4096;64;4;16;9;45;19554944
4096;128;16;8;21;91;16260032
4096;128;16;8;13;195;20169280
4096;128;64;8;45;91;14650432
4096;128;16;8;10;91;12469344
4096;256;16;4;13;91;19722112
1024;128;32;8;13;126;8025856
1;128;1;8;13;91;552315552
4096;128;32;8;6;91;8117088
4096;256;32;1;13;91;29499360
4096;256;32;4;13;78;9501888
4096;128;64;4;7;70;14188256
2048;128;32;8;13;91;7515040
4096;128;32;8;13;182;9455552
1;128;1;8;2;91;1468437792
4096;128;32;8;5;182;7971040
4096;128;32;4;13;91;9696064
4096;8;32;8;13;91;7903904
4096;128;32;8;8190;819;18446744073709551615
4096;128;32;8;70;91;29785568
4096;128;32;128;13;91;18446744073709551615
256;16;32;16;13;15;126104064
512;64;16;4;26;15;20371808
4;2;2;2;70;210;18446744073709551615
256;32;8;32;210;390;18446744073709551615
4096;128;32;2;1638;91;18446744073709551615
8192;128;32;16;13;91;8800192
4096;128;32;1;13;91;29548352
4096;128;32;8;13;45;11251136
4096;128;32;8;63;91;16327712
4096;1024;32;1;13;91;29553472
1024;512;32;2;13;91;16395136
16;1;4;1;30;1;25116944512
1;4096;1;32;210;18;224087488
4096;8192;2;32;21;63;27678048
64;16;4;16;45;42;87585312
4096;128;32;4;13;91;9692224
4096;128;32;8;78;91;29608512
4096;128;32;8;14;91;6953344
4096;32;32;32;14;1;524469408
1;1;1;1;14;91;46250546944
256;128;32;8;14;5;89494272
16;128;1;2;14;91;257542016
4096;128;32;8;14;117;7888544
1;128;1;8;14;1170;18446744073709551615
4;128;4;8;14;91;213993152
4096;128;32;8;14;35;13522208
2;128;2;128;14;91;3381129664
4096;128;512;8;14;91;18446744073709551615
4096;128;512;32;14;91;18446744073709551615
4096;128;32;32;14;91;13444896
4096;128;2;64;14;91;38940832
4096;128;32;8;273;39;48930208
4096;128;256;8;14;91;18446744073709551615
4096;8192;32;1;14;5;127085344
4096;1;32;1;14;910;18446744073709551615
4096;128;32;8;819;91;18446744073709551615
4096;8;4;4;14;26;35728288
32;128;32;8;14;91;29591744
4096;4096;32;1;14;2730;18446744073709551615
512;128;32;8;182;91;18446744073709551615
4096;32;32;32;14;91;15118432
4096;128;2;8;14;91;45480192
4096;4;32;4;14;1;293941952
4096;32;32;32;14;90;14791040
4096;128;32;8;210;91;18446744073709551615
1;128;1;8;14;91;533350464
4096;128;32;8;14;10;34684128
4096;128;1;8;14;91;83106048
4096;128;32;8;8190;91;18446744073709551615
4096;128;32;128;315;91;18446744073709551615
4096;128;32;128;14;91;18446744073709551615
4096;128;128;8;35;91;16790976
256;128;32;8;90;91;30738944
4096;128;2;8;390;91;18446744073709551615
4096;1;32;1;14;91;33471808
4096;128;128;8;14;91;17808928
4096;128;64;8;210;91;18446744073709551615
128;128;32;8;14;91;9255712
8;128;2;8;455;91;18446744073709551615
1024;128;32;8;455;91;18446744073709551615
64;128;32;8;14;91;15680800
4096;128;32;8;14;1365;18446744073709551615
4096;128;32;8;14;91;6977152
4096;128;8;8;14;91;20773440
4096;128;32;8;14;210;11116480
4096;1;32;1;14;91;33521248
4096;128;32;8;2;91;18019776
4096;128;32;8;130;455;18446744073709551615
4096;128;32;8;39;91;12198080
4096;128;4;8;91;91;242160800
1;1;1;1;14;9;54782877824
1024;1;1024;1;1;9;33217896544
512;2048;2;4;3;65;68489056
4096;512;32;256;14;910;18446744073709551615
4096;128;32;2;14;91;15584448
512;128;32;8;14;91;7959424
1;128;1;8;14;91;533968480
2048;256;1;1;1170;1;3228161856
1;512;1;32;35;1;550562496
32;8;32;8;10;455;479055008
1;128;1;64;26;630;18446744073709551615
4096;256;32;4;14;91;9113664
4096;128;32;128;30;91;18446744073709551615
4096;128;32;128;35;91;18446744073709551615
4096;8;2;4;6;10;64246144
128;2;32;1;3;105;500232960
1;1;1;1;18;1;123749803616
1;32;1;8;70;45;1998401952
4096;128;32;8;1;91;34463392
4;128;4;8;315;91;18446744073709551615
4096;512;32;2;14;91;15463200
8;1;4;1;455;105;18446744073709551615
1;1;1;1;21;234;48937695136
128;8192;8;16;1365;15;18446744073709551615
128;128;4;128;390;105;18446744073709551615
4096;1024;2;1024;14;91;18446744073709551615
4096;128;32;8;14;130;9002176
4096;128;512;8;42;91;18446744073709551615
4096;16;32;2;2;91;14524320
32;128;32;64;1;35;18446744073709551615
1;16;1;1;130;1;8117498496
32;2048;8;64;455;6;23641056
64;64;1;1;15;1;746594400
4096;1;32;1;14;630;182884224
4;128;4;8;14;42;171487744
4096;2048;32;1;14;91;29844864
4;512;1;512;819;26;18446744073709551615
2048;64;128;8;90;585;18446744073709551615
8;2048;2;1;130;15;506711264
256;64;32;4;13;126;13829248
8;128;2;8;14;585;506609984
4096;128;32;16;14;91;8141728
4096;128;32;64;14;91;18446744073709551615
4096;128;32;4;14;91;9127168
512;8;16;8;26;15;58762528
4;8;2;2;70;35;1914392864
1;1024;1;128;210;1;210057728
128;1;128;1;546;1;99243949632
4096;512;1024;2;182;91;18446744073709551615
4096;8192;32;16;14;6;65614624
8192;128;32;8;14;91;7105312
4096;128;32;8;14;6;56663712
8;4096;1;32;30;21;35235616
128;128;32;128;21;63;18446744073709551615
1;128;1;8;14;105;532997632
1024;64;32;16;13;91;9392320
4096;128;64;4;14;70;11798560
4096;128;32;4;18;91;11278304
2048;128;32;8;21;91;8661536
4096;16;32;2;14;91;15775744
4096;128;32;8;10;91;8428896
1024;128;64;8;14;91;10775840
4096;512;256;1;10;91;16835648
4096;128;16;8;7;65;10634848
512;128;64;8;14;91;12317312
1;1;1;1;90;42;49468889440
8192;128;8;8;14;91;21191040
4096;128;32;8;14;182;8987168
4096;128;32;2;14;91;15581824
2048;128;32;8;14;91;7192864
1;128;1;8;6;91;607489952
4096;128;32;128;39;91;18446744073709551615
8192;512;32;512;14;91;18446744073709551615
8192;1024;32;1;14;42;23749632
512;32;64;32;10;91;18446744073709551615
8;64;2;8;105;21;198985952
1024;1;1024;1;10;18;7752949504
512;2048;2;4;21;3;87714816
2048;1;1;1;1;1;1562764416
1;128;1;2;14;91;445031072
4096;128;32;4;14;126;12274656
1024;128;16;8;14;91;11363904
4096;128;64;8;14;91;10703904
2048;128;32;8;14;182;8873152
2048;128;32;8;5;35;17771584
4096;128;32;8;18;35;14131168
4096;128;16;8;3;78;12917824
4096;32;32;32;35;91;12923104
1;128;1;8;14;273;525475104
4096;128;32;4;14;91;9125920
512;128;32;4;8190;91;18446744073709551615
4096;64;32;16;14;91;8261056
4096;1024;32;1;9;91;20548928
4096;128;32;8;14;78;8086528
4096;64;32;16;13;91;8622016
4096;512;128;1;14;105;15004416
1;1;1;1;35;1;120690226880
4096;128;16;8;14;91;10862560
4096;128;256;1;14;78;19179040
4096;512;32;2;13;126;19741888
32;256;32;4;10;455;32968736
128;2;1;1;26;21;410259136
4096;8192;2;1024;45;10;18446744073709551615
64;1;1;1;3;105;1436727328
4096;128;32;8;35;91;12330656
2048;128;32;4;14;78;9920576
2048;4096;128;1;14;65;16619104
4096;128;64;8;14;182;7460640
4096;64;32;8;14;91;7094432
512;256;32;4;14;91;9408160
4096;128;32;8;14;7;49182656
8;128;2;8;14;91;73775904
8;8;2;2;390;1;4503953984
1;32;1;2;70;26;1741367136
8;8;2;2;455;105;18446744073709551615
4096;64;1;16;21;234;302700128
2;1;2;1;90;15;32284668928
4096;128;32;8;14;126;7785344
1024;32;32;32;26;91;12994816
4096;128;32;8;6;90;8204096
2048;256;32;4;14;91;9131136
4096;128;1024;8;910;91;18446744073709551615
128;512;16;128;390;130;18446744073709551615
32;1;1;1;1638;35;18446744073709551615
64;1;16;1;126;1;25841220000
32;1;1;1;455;6;1802751264
4096;64;64;2;14;65;13561088
4096;128;16;8;70;91;68191232
64;64;1;16;15;65;50606464
4;512;1;256;630;546;18446744073709551615
2048;2048;128;1024;90;315;18446744073709551615
8;4096;2;1;15;15;171094528
256;64;32;4;105;126;18446744073709551615
512;512;16;4;26;15;15819168
4;8;2;4;70;35;2021414720
1;1024;1;128;39;1;607133248
4096;256;8;4;14;210;88736928
4096;128;16;8;14;195;25315616
4096;128;32;8;18;195;13471776
4096;128;32;8;14;105;7821696
16;1;4;1;30;1;25168286496
512;4096;4;32;30;18;10444416
256;1024;256;32;21;1;18446744073709551615
4096;1024;4;16;45;42;21745024
4096;256;32;2;14;91;15642144
8192;128;32;8;14;2730;18446744073709551615
4096;8192;32;1;14;91;32446656
1;1024;1;4;105;45;534582432
1024;1;1024;1;35;182;712281376
64;1;16;1;3;65;1851866016
2048;256;1;1;1;1;1639760736
1;128;1;8;14;91;530905440
4096;128;16;8;42;91;25113344
4096;128;32;4;42;91;19853696
4096;128;32;8;6;546;18581984
1;512;1;1;35;1;1128417664
32;256;1;4;10;455;589157344
1;4;1;1;26;1;30714605184
4096;32;2;16;45;10;21996608
128;8;32;1;63;105;292426752
1;8;1;2;390;1;17762992288
1;32;1;1;70;26;1756578688
8;4096;8;2;455;4095;18446744073709551615
4096;128;32;8;14;5;68753792
4096;128;32;8;126;630;18446744073709551615
1;128;1;8;14;78;820178560
4096;128;32;1;14;91;29326304
2048;64;64;8;14;39;19811840
4096;64;8;16;2730;234;18446744073709551615
2;512;2;16;90;15;117904704
64;512;4;128;390;1;131456544
32;128;32;4;1;1;3951483616
512;1;32;1;126;1;6699504480
32;2048;32;32;455;6;85130816
64;64;16;16;15;42;47739808
1;64;1;8;14;78;1627974368
2048;32;16;32;14;105;15305184
4096;128;64;8;6;117;10358240
16;512;2;512;63;195;18446744073709551615
2048;64;64;8;90;455;18446744073709551615
512;1;32;1;35;15;532108768
4096;64;32;1;14;126;42571840
4096;2;32;2;14;91;17673312
4096;128;32;8;3;91;12927904
4096;1;32;1;14;91;33465568
512;512;16;1;26;7;87875360
2;8;2;2;70;35;3823753088
1;1024;1;128;5;1;3722211552
1024;1;1024;1;1;1;249596837088
1;128;1;8;14;315;527775104
4096;128;32;8;14;45;10682624
512;4096;2;32;1;18;168001568
4096;8192;1;1;42;63;1130136384
4096;1024;2;1;45;42;413548992
4;512;1;1;105;21;1017193856
2048;1;64;1;35;182;130636864
512;2048;2;1;3;65;159519456
128;256;8;1;6;1;616804128
1;256;1;8;35;1;615180224
4096;4096;16;1;1365;91;18446744073709551615
2;128;2;8;14;91;284290400
8192;128;32;8;585;91;18446744073709551615
1;256;1;4;1;65;733243040
128;512;1;256;26;21;43654528
1;32;1;4;45;10;2019133152
128;8;8;1;65;105;724392256
4096;32;32;32;14;130;15279008
1;8;1;2;390;78;18446744073709551615
8192;32;256;4;70;26;61987520
1;2048;1;2;455;1;3856487232
4096;64;64;16;21;234;10044992
2;512;2;16;39;15;126049824
128;512;4;128;1;1;3507996192
32;1;32;1;1;1;208005333600
64;512;32;1;126;1;830099968
2048;2048;512;64;455;6;18446744073709551615
64;64;1;16;15;42;61830368
4;512;1;32;1;26;789613504
1;1;1;1;90;45;48275898208
8;4096;8;32;130;15;23534784
16;64;16;16;13;1;2427025088
2;512;1;4;26;13;106831840
4096;8;32;8;14;91;7737952
1;64;1;16;14;91;1233416608
4096;512;128;2;3;91;16665856
4096;128;32;2;14;70;15941760
8192;128;64;8;39;91;11671392
4096;128;32;4;35;91;20605408
4096;256;8;4;14;91;37111872
1;128;1;4;14;130;484521696
4096;128;64;4;14;91;9282464
2048;512;32;2;14;91;15365664
8192;64;32;16;39;455;18446744073709551615
8192;128;64;8;39;105;13763296
4096;128;32;8;14;195;12256224
4096;32;32;16;14;91;9203936
4096;1024;32;1;14;91;29402304
1;32;1;32;9;91;6660268960
8192;128;32;8;14;130;8971328
4096;128;32;8;5;91;9237472
1024;128;32;8;35;90;12738656
8192;128;32;1;14;130;48401952
1024;256;32;4;14;91;9207072
8192;512;32;2;7;91;12189536
4096;128;16;4;14;91;19262240
4096;512;32;1;14;195;72413664
4096;32;16;32;14;91;13973632
4096;128;32;8;14;65;9341824
4096;128;16;4;9;91;14831520
1024;64;32;4;14;91;9730912
8192;64;64;16;14;91;13403776
8192;256;16;4;14;195;48065408
4096;128;32;2;13;91;16599200
4096;128;32;8;7;91;9109696
1;512;1;2;14;90;305559552
4096;128;32;8;14;234;11568256
8192;128;32;8;18;91;8667360
1;128;1;8;26;91;562141568
1;128;1;2;13;91;440402400
4096;128;32;4;14;70;10051264
4096;16;32;2;14;195;38883232
4096;64;64;4;14;91;9580608
4096;128;16;8;14;45;8223968
4096;128;32;8;21;91;8704832
1024;128;32;2;14;91;15762528
4096;64;32;16;14;105;8498688
2048;64;32;16;14;91;8237408
1;128;1;8;13;182;772429728
2048;128;32;8;70;42;17672608
2048;128;32;8;14;234;11466560
4096;256;8;4;14;105;39613824
1024;512;256;2;14;91;17948064
1;128;1;1;14;91;679169312
1024;128;32;8;14;195;12195104
8192;128;32;8;9;78;10727296
4096;256;32;4;14;195;20720320
2048;128;32;2;7;91;12072160
2048;256;32;4;1;91;18168992
4096;128;64;4;39;63;15334592
4096;128;16;8;6;45;9674112
4096;128;8;8;7;91;20342432
4096;128;32;2;14;182;27064352
1;128;1;4;14;91;483295008
4096;1024;32;1;18;195;71986144
8192;128;32;8;14;117;7913952
4096;128;16;8;14;90;10965152
1024;128;32;4;14;91;9428768
4096;128;32;8;65;90;31819776
4096;32;64;32;30;91;18446744073709551615
4096;256;16;4;14;91;19216608
4096;8;32;8;26;91;11746880
4096;128;32;8;14;90;7047680
2048;128;32;8;6;91;8299680
1024;128;32;8;14;91;7246208
4096;128;32;8;9;91;9011840
4096;128;32;4;14;273;27973088
2048;32;64;32;14;91;18446744073709551615
4096;128;32;8;18;91;8577664
8192;128;128;8;21;91;17711136
4096;32;16;32;14;130;18976736
4096;16;16;2;14;91;34944032
4096;16;32;2;35;91;39456672
4096;512;32;1;14;63;25211648
4096;128;32;8;14;42;11442048
4096;128;32;4;14;195;20850624
4096;64;32;16;9;70;12946624
4096;64;32;16;14;210;8004512
2048;128;16;8;14;78;8644096
4096;64;32;16;14;117;8301472
8192;512;32;2;14;91;15672032
4096;128;64;8;30;91;9691392
4096;4096;32;1;14;91;30695712
4096;128;32;8;26;91;10254272
1024;128;16;8;7;91;10836512
4096;16;128;2;14;91;14014112
4096;128;32;8;13;39;12772224
8192;128;32;16;14;91;8411200
4096;128;32;1;14;6;103558720
4096;512;2;2;10;91;115853248
4096;64;2;16;14;91;38861984
4096;256;32;4;14;390;53902528
1;128;1;8;14;1365;18446744073709551615
4096;128;32;8;15;390;34020544
8192;128;32;128;7;91;18446744073709551615
4096;128;16;8;14;126;15182656
1;32;1;16;14;105;2461491584
4096;1;256;1;14;91;97765792
4096;128;32;64;42;91;18446744073709551615
4096;128;32;8;14;39;12115456
4096;128;32;8;2;70;22612896
4096;1024;32;1024;14;91;18446744073709551615
4096;128;32;8;14;63;8280800
4096;128;8;8;14;130;29686912
8192;128;128;8;18;91;19098912
4096;128;32;8;30;63;9616544
4096;64;32;16;35;63;9743904
4096;128;64;8;26;91;10742144
4096;32;64;8;10;78;16385824
1;128;1;8;14;91;534048160
8192;128;16;8;14;91;11135840
8192;128;32;8;14;126;7976224
4096;32;32;32;14;126;13426944
4096;64;16;8;5;91;10846752
4096;64;32;16;14;70;10327488
1024;128;32;8;14;90;7305600
4096;64;32;16;26;91;7910304
4096;128;8;4;14;182;54305056
512;128;32;4;45;91;29526496
4096;128;8;8;18;78;23808032
8192;128;128;4;14;91;14068928
2048;128;32;2;14;91;15643616
4096;256;32;4;14;117;11386112
4096;128;32;8;210;390;18446744073709551615
4096;128;1024;8;8190;91;18446744073709551615
4096;128;32;1;78;91;221121632
4096;128;32;8;14;630;26808928
4096;128;1024;8;14;91;18446744073709551615
4096;128;32;8;2730;91;18446744073709551615
128;4096;2;1;14;91;253484672
4096;32;32;8;14;91;7709376
512;128;32;4;14;91;9631008
8192;256;32;4;14;91;9253312
2048;128;8;2;14;42;28916160
4096;128;1;8;14;91;83178560
4096;32;32;8;14;78;9054528
4096;128;32;8;6;105;8493824
4096;128;64;8;18;91;11477248
4096;1;32;1;14;91;33505120
4096;128;64;8;14;117;8914176
4096;64;64;16;14;91;13368608
1;256;1;4;14;78;340674720
4096;128;32;8;14;910;18446744073709551615
1024;128;32;8;14;1638;18446744073709551615
4096;1024;16;1;14;91;50766848
8192;128;128;8;13;91;19514080
8192;128;32;8;63;91;16448544
4096;128;32;8;15;42;11990688
4096;128;16;8;1;91;31716320
4096;256;32;4;14;39;10880576
8192;128;512;1;14;91;31611392
4096;128;32;8;14;455;28760544
4096;8192;32;8;14;910;18446744073709551615
1024;128;128;8;14;91;17917024
4096;64;32;16;14;126;7395328
4096;64;32;16;14;234;8385056
2048;128;32;4;14;234;19646592
4;8;2;1;70;2;3981502752
1;1024;1;1;210;1;3528103840
1;1;1;1;30;5;63042737376
512;128;4;32;117;1;115712128
4096;128;4;8;3;42;31875776
4096;128;64;8;15;210;9693600
4096;8192;8;32;21;455;53430144
1;128;1;16;105;1;1292388608
8;64;2;8;105;1;584384000
1;1;1;1;35;182;44505590400
4096;128;32;8;315;91;18446744073709551615
4096;256;32;4;7;91;8302976
4096;32;16;8;14;91;12173600
512;2048;2;4;6;70;46728352
128;128;8;2;6;1;324079200
1;512;1;16;819;1;1043977440
1024;256;32;4;10;455;27846208
4096;128;8;8;14;14;13895488
4096;128;32;8;14;8190;18446744073709551615
4096;128;32;8;14;1170;18446744073709551615
128;512;1;256;2730;21;18446744073709551615
4096;32;2;32;45;10;22269376
128;4;32;2;3;105;313996128
8;8;2;2;390;30;18446744073709551615
8192;32;256;4;10;26;77283136
8192;2048;128;2;455;1;591140160
32;64;1;16;21;234;297201824
2;512;2;64;14;15;414108544
128;256;4;32;210;1;134338336
32;64;32;8;1;195;342882656
64;512;32;1;90;1;595498784
4096;1;512;1;1;6;5555606912
64;64;4;16;130;42;62560672
4;512;1;8;14;35;69781472
2048;64;128;16;90;45;18446744073709551615
1;4096;1;32;39;15;45788256
4096;128;32;4;39;91;20417344
2048;128;32;1;14;1638;18446744073709551615
4096;128;64;8;13;91;11424256
4096;128;4;8;14;91;33571520
4;512;4;512;30;126;18446744073709551615
512;512;16;128;26;15;18446744073709551615
4;2048;2;32;130;35;72293056
1024;1024;8;256;210;30;18446744073709551615
2048;128;512;8;14;91;18446744073709551615
4096;128;32;8;14;2730;18446744073709551615
16;1;4;1;315;1;25743884448
512;1024;4;32;30;18;11493248
64;2048;32;32;21;63;12677472
1024;1024;4;16;45;1;46014400
2;128;1;8;2730;91;18446744073709551615
4096;128;32;8;14;26;13707904
4096;128;64;8;70;210;18446744073709551615
8;64;2;8;315;455;18446744073709551615
2048;1;64;1;1;182;106411072
512;2048;8;4;6;1;193486752
128;128;16;2;63;15;45154464
1;1;1;1;35;1;114877928544
1024;1024;1;1;10;70;301798112
128;1024;1;256;455;21;38356800
4096;32;2;16;45;1;54353792
