GLOBAL_SIZE_0;GLOBAL_SIZE_1;LOCAL_SIZE_0;LOCAL_SIZE_1;v_TP_46;v_TP_47;cost
4096;2048;512;128;126;78;18446744073709551615
512;128;128;2;585;30;47255744
1024;512;1024;1;90;70;143441728
512;256;256;4;70;1170;13709952
16;256;8;2;195;1170;100703680
512;256;256;4;70;105;31398432
512;256;32;4;70;1170;10051360
512;256;256;4;70;455;15613600
128;1024;32;1;26;4095;24953312
128;512;32;2;21;1170;13136864
512;128;32;8;105;1170;11694816
512;64;32;16;90;1170;11419296
32;256;32;64;26;78;18446744073709551615
2048;8;32;1;14;39;38894528
1;8192;1;1;210;105;2231867264
256;2;64;2;1638;45;381743680
512;256;32;2;195;1170;15067200
512;256;32;2;70;1170;11467008
512;256;32;4;35;1170;9796608
512;8;32;8;70;1170;65748192
128;1;32;1;35;1170;974563968
512;256;32;4;35;9;61087712
512;256;16;4;117;1170;14973056
1;256;1;4;35;1;417228672
8192;2048;256;1;546;2;695268704
8192;256;32;4;35;1170;10263520
512;1;32;1;35;1170;487801920
512;256;32;128;182;1170;18446744073709551615
1;256;1;8;1;10;2358623680
1024;4;128;2;273;8190;159999168
32;256;4;2;3;39;89960608
32;1;32;1;234;1365;3322640192
4096;256;16;16;585;21;18420832
512;512;32;2;35;1170;11592544
512;512;32;512;39;1170;18446744073709551615
512;1024;32;1;30;546;20790336
512;256;64;4;35;1170;13369952
512;256;32;4;42;1170;10285632
1;256;1;4;35;234;420734752
512;256;32;4;35;117;11594912
512;4;1;2;1170;2;285687552
16;256;1;2;35;1170;235394432
512;8;32;1;35;1170;66216864
512;256;32;16;14;1170;9287360
512;256;32;32;14;1170;23332800
512;256;32;16;210;1170;9418272
512;128;32;16;14;1170;12227584
32;256;16;16;14;390;19611776
64;256;32;16;14;1170;11693344
512;256;2;16;14;1170;43721344
32;256;2;16;14;1170;42051744
1024;32;8;8;546;13;22439072
512;512;32;64;14;1170;18446744073709551615
1;256;1;16;546;1170;489671552
512;256;2;1;7;1170;245684192
32;1;32;1;546;1;93283900992
512;256;32;16;14;546;9942464
512;256;32;16;15;546;10083680
512;64;32;16;14;1170;12715584
8192;1024;8;256;234;63;18446744073709551615
512;256;16;16;8190;1170;65512544
512;256;128;16;14;1170;18446744073709551615
512;256;32;16;14;21;27296736
8192;1024;64;256;30;1170;18446744073709551615
1;1;1;1;2730;70;74884275552
32;32;8;8;7;105;140692864
256;1;256;1;78;910;515998304
2048;128;16;16;585;15;18310496
2048;64;32;4;90;30;18597248
2048;128;64;128;585;26;18446744073709551615
1024;16;32;1;910;35;50913632
512;256;32;2;126;1170;14095392
512;256;512;16;14;1170;18446744073709551615
512;256;32;64;45;8190;18446744073709551615
512;256;32;16;14;4095;10976000
512;64;16;16;14;1170;20857344
512;256;32;16;7;546;14782400
512;256;1;16;14;1170;75529152
2048;2;32;1;14;1170;246706176
512;256;32;4;14;1170;10697344
512;1024;32;16;14;1170;9132032
512;2;32;1;130;1170;242805472
512;8;32;1;14;1170;64751200
1;512;1;16;14;1170;261047776
2;1024;2;16;14;35;72334304
512;8192;32;16;14;1170;8825056
512;64;32;64;14;1170;18446744073709551615
8;1024;2;16;14;1170;36327232
512;1024;256;16;14;2730;18446744073709551615
512;8192;2;16;819;1170;60494304
512;8192;32;16;4095;1170;18636384
512;8192;32;64;14;1170;18446744073709551615
512;8192;32;16;14;9;57298496
512;8192;32;16;105;1170;8511968
512;8192;32;16;6;1170;13028800
512;8192;32;4;14;42;16994336
512;4096;32;16;14;1170;8723872
512;8192;16;16;585;1170;14584480
512;4;64;2;3;1170;92408480
512;1;32;1;105;1170;496523776
512;8192;32;16;5;1170;13514880
512;8;32;1;105;1170;66056192
512;8192;64;16;105;1170;11292352
256;8192;32;16;105;585;9053888
512;8192;32;16;105;30;18133856
512;8192;32;16;2;910;20212000
512;8192;32;16;3;1170;15650816
512;8192;16;16;105;1170;10892160
512;8192;32;8;105;1170;8753952
2;8192;2;16;182;1170;85881504
512;16;32;16;35;1170;45194368
512;2;32;1;105;14;303339520
512;8192;32;32;21;1170;14747936
512;1;32;1;105;70;320809664
512;8192;128;16;105;1170;18446744073709551615
512;8192;32;16;2;1170;19670080
512;8192;32;512;105;1170;18446744073709551615
1024;8192;32;32;182;455;11504160
16;8192;1;16;105;1170;47887104
512;8192;32;16;63;1170;8405632
512;8192;32;64;105;1170;18446744073709551615
8;8192;2;16;105;1170;38682848
512;8192;32;16;630;1170;10244000
512;8192;2;16;63;1170;31172192
512;8192;32;16;70;1170;8911616
512;8192;32;16;63;78;13012288
512;8192;32;16;21;1170;10493760
512;32;256;16;63;1170;18446744073709551615
512;8192;16;16;63;1170;10730560
512;8;4;1;63;1170;455306176
512;8192;32;16;1638;1170;8949792
512;8192;32;16;585;1170;9512928
512;8192;256;16;63;1170;18446744073709551615
512;1;32;1;63;1170;496689440
512;8192;32;256;63;1170;18446744073709551615
512;8192;1;16;63;1170;47584256
2048;8192;32;16;63;1170;8525440
512;8192;32;128;63;1170;18446744073709551615
512;8192;8;256;63;1170;18446744073709551615
512;4;256;1;1638;91;298385664
1;2;1;1;195;91;37206447584
32;2;4;1;42;819;2315702464
8192;8192;256;64;78;1;18446744073709551615
8192;512;64;4;585;9;60881600
8192;2048;8;256;390;45;18446744073709551615
512;8192;32;512;63;1170;18446744073709551615
512;1;32;1;63;1170;477080224
512;2;32;2;63;126;139562272
512;8192;128;16;63;819;18446744073709551615
512;8192;32;16;26;1170;9311616
512;8192;2;64;63;1170;98953536
512;8192;32;8;63;1170;8510208
512;8192;32;16;63;5;108379488
512;8192;128;16;63;1170;18446744073709551615
512;8192;512;128;63;1170;18446744073709551615
512;8192;64;16;63;1170;10852320
32;2048;32;16;63;1170;9882048
32;8192;32;16;63;234;11536128
512;8192;32;16;13;1170;9166752
512;8192;64;128;63;1170;18446744073709551615
8;2;2;1;63;1170;6790663552
1;8192;1;16;63;1170;57069824
512;8192;32;16;63;630;8490016
512;8192;32;64;63;1170;18446744073709551615
512;8192;32;16;45;1170;8592352
512;8192;32;16;63;30;18245952
512;8192;32;16;546;1170;9042944
512;128;32;16;63;1170;10964704
1024;1;512;1;585;5;12837340832
16;8192;1;16;63;1170;45650368
512;1024;32;16;63;1170;8506432
512;8192;16;32;63;1170;10415040
512;8192;16;16;63;630;10521504
512;8192;32;64;45;1170;18446744073709551615
512;8192;32;16;63;546;8748128
2048;16;128;8;546;13;188268608
512;1;32;1;63;1170;488691392
512;8192;32;1;63;1170;22190464
4096;8192;32;32;63;1170;11767296
32;32;2;2;1365;910;464370336
2048;2048;4;2;130;1638;91152992
256;128;8;32;15;42;22885664
8192;4;4;2;18;3;129872096
2048;16;8;1;234;10;121343232
512;8192;32;128;10;1170;18446744073709551615
2;256;2;16;63;1170;256019808
2048;32;16;4;315;14;21135168
1024;8192;32;16;6;1170;13225600
8192;8192;128;16;63;1170;18446744073709551615
512;128;32;16;63;210;10651680
2048;1024;2;8;315;42;36747296
256;8192;32;16;63;1170;8404160
512;8192;32;16;2730;1170;14055936
2;512;2;16;63;1170;143317248
256;8192;32;16;63;195;10258240
256;8192;32;16;42;90;11848416
256;8192;8;16;63;234;19514624
1024;8192;32;16;63;1170;8444928
256;8192;32;16;63;15;36046304
256;8192;32;16;63;585;8813120
256;1024;32;16;63;1170;8456416
256;8192;32;16;26;1170;9258048
256;8192;1;16;63;1170;47230816
256;8192;32;8;63;1170;8512192
256;8192;32;512;63;1170;18446744073709551615
256;8192;32;16;18;1170;11522016
256;8192;128;16;63;1;18446744073709551615
256;8192;8;16;63;1170;21178368
16;8192;1;16;63;630;44238560
256;8192;32;512;546;1170;18446744073709551615
256;4096;32;32;63;1170;10471968
256;8192;32;16;63;390;9184576
256;8192;32;32;63;1170;10496448
256;8192;32;16;130;315;9514688
256;8192;2;16;63;5;26716320
256;4;32;2;63;1170;121524640
256;8192;32;64;273;1170;18446744073709551615
2;8192;2;16;45;1170;31477856
256;2048;32;16;63;546;8976960
256;1;2;1;210;1170;6742546112
2;8192;2;16;63;1170;34776448
256;8192;16;16;70;1170;11333728
256;8192;32;16;30;1170;8494048
256;8192;32;16;15;1170;8508320
256;8192;16;8;63;1170;11475872
4;8192;4;16;63;1170;24432320
256;8192;1;16;63;13;37402272
256;8192;4;16;63;1170;25666976
8192;8192;32;16;63;1170;9456032
256;256;32;16;63;1170;8755872
256;8192;32;16;7;1170;11459232
256;256;16;8;63;1170;13192672
256;8192;32;1;63;1170;22253568
4096;8192;32;16;63;1170;8838080
256;512;32;16;63;1170;8754752
64;8192;1;16;63;1170;46261248
256;8192;32;16;585;1170;9518208
8;8192;2;16;63;1170;34783264
256;8192;256;16;63;1170;18446744073709551615
256;8192;32;16;63;2730;8134400
256;8192;32;16;63;35;21898400
128;8192;32;16;63;1170;8502048
256;8192;32;16;910;1170;9751680
4;8192;2;16;63;2730;40048832
256;8192;32;16;910;2730;10927360
256;8192;32;1024;63;5;18446744073709551615
256;4096;32;16;63;2730;8185280
256;8192;32;16;63;1;400015168
256;8192;64;16;63;2730;10390560
256;8192;32;16;18;2730;11662336
256;8192;32;16;63;45;17166336
256;128;32;16;63;2730;12668320
8192;8192;128;16;63;2730;18446744073709551615
256;8192;32;8;315;2730;8419680
256;8192;32;16;63;18;30410912
256;8192;32;16;315;234;10336000
256;8192;32;2;63;2730;12208256
256;8192;128;16;63;2730;18446744073709551615
2;8192;1;16;63;2730;64769536
256;8192;8;16;63;2730;21520928
256;8192;32;16;117;2730;9328800
256;8192;32;16;819;2730;10051296
512;8192;1;16;63;2730;50133568
256;512;32;16;63;2730;9551296
16;8192;1;16;63;2730;47894144
256;1;32;1;63;2730;1115562944
256;256;2;16;7;2730;157994080
256;8192;256;16;63;2730;18446744073709551615
2;8192;2;16;63;2730;35182944
64;8192;32;16;63;2730;8753920
256;8192;32;16;65;2730;9552096
256;1;32;1;91;1638;696057440
512;8192;32;16;26;819;9293280
2048;256;8;8;390;30;14483840
256;64;32;16;819;2730;24770496
4096;8192;32;16;63;2730;8742752
256;2;2;1;63;2730;7485385984
1024;2;8;1;585;546;431243488
8192;1024;1;4;585;14;124608864
16;2048;8;2;390;182;172587712
256;8;128;4;126;630;65123168
256;64;32;16;63;2730;21497632
256;8192;32;64;63;2730;18446744073709551615
256;8192;32;16;63;182;9836032
1;8192;1;16;63;5;73053184
128;8;1;2;182;70;286429280
2;2048;2;16;63;2730;64525408
256;2;32;1;4095;2730;600518592
1;8192;1;16;63;2730;58415136
4096;256;32;8;546;14;38499008
256;8192;32;16;63;455;8975456
256;8192;2;16;63;2730;33071712
256;1;4;1;63;2730;7704097280
8192;8192;4;1;90;9;223748608
8192;8192;8;16;63;2730;21098912
256;8192;32;16;63;4095;8202368
256;8192;32;4;63;2730;10010368
4;8192;4;16;63;2730;24769152
64;8192;32;16;63;26;21985728
256;8192;32;16;1170;2730;13879200
256;8192;32;16;63;210;9727552
128;8192;32;16;63;2730;8175648
1024;8192;32;64;21;2730;18446744073709551615
2048;64;32;16;585;26;21714720
64;2048;4;128;315;126;31337824
1;8;1;2;91;630;11932955616
32;64;8;4;273;546;69924864
256;8192;128;4;63;2730;11696000
256;8192;32;16;21;2730;10584128
256;8192;4;16;455;70;24648864
512;32;4;8;210;45;26452320
256;8192;32;2;15;2730;12136928
256;2048;32;16;63;2730;8153952
256;8192;32;1;63;91;21674336
1024;64;8;8;273;35;16523360
1;8192;1;2;63;2730;361389056
64;8192;32;16;117;2730;9284320
256;8192;32;8;63;455;9361600
2048;512;4;2;117;15;73689344
2;2;1;1;630;1;23324325568
2048;64;128;16;15;45;18446744073709551615
1;1;1;1;63;1638;74518963072
32;16;32;8;63;2730;221793024
256;8192;64;1;315;2730;27187872
256;8192;32;1024;63;2730;18446744073709551615
256;8192;32;8;63;1;398335392
128;8192;128;16;63;1638;18446744073709551615
256;1;32;1;39;2730;1107773280
2048;128;32;16;455;26;20888576
256;8192;32;16;63;5;109306240
256;8192;32;16;1638;2730;17364288
256;64;256;16;63;26;18446744073709551615
2048;2048;16;32;315;45;11885888
1;8192;1;16;63;2730;58488640
256;8192;32;32;63;2730;10362464
8;256;2;64;30;117;128349344
1;4;1;2;39;26;22349085120
512;128;2;1;45;1365;266213856
32;4;2;1;390;30;826671712
2048;1;16;1;315;91;81412640
256;8192;32;16;63;13;42007648
64;1;32;1;63;2730;2273835584
2048;1024;4;16;195;39;17736064
256;8192;32;128;63;2730;18446744073709551615
512;256;32;16;63;819;9400224
256;2;32;1;1170;2730;655390880
256;1;32;1;70;8190;2561476000
256;8192;8;16;63;1365;18174144
2048;2048;32;16;63;2730;8269408
256;8192;32;64;14;2730;18446744073709551615
256;8192;32;16;6;2730;12776544
4;8192;4;16;63;126;25543104
256;8192;32;16;210;2730;8482656
2048;512;8;16;234;35;13818560
256;8192;32;1;63;2730;21513152
256;32;32;2;63;2730;44328128
256;8192;32;16;315;390;9859776
2048;4096;4;256;1;30;1602970048
1024;16;1024;1;90;70;220951936
1;4;1;2;130;8190;15040013408
32;256;8;2;3;39;58897216
2048;128;32;8;130;30;18262208
256;8192;32;16;10;2730;10640256
256;8192;32;32;63;78;15015648
512;256;16;16;117;45;13324800
256;8192;32;4;1;2730;13719008
8;8192;2;16;63;2730;31832192
256;8192;32;16;2730;2730;26050208
256;8192;16;16;63;2730;10830944
256;8192;32;16;65;4095;9628960
128;8192;8;16;63;2730;21343488
2048;1024;16;16;65;105;11094816
256;8192;32;16;8190;2730;77072032
8;2048;2;16;63;2730;31754336
256;8;1;1;63;2730;4170049952
32;1;32;1;234;1365;3334940384
8192;2;1;1;30;1170;6241146240
8;1;8;1;315;70;13062230400
32;32;8;8;1;105;726088704
2048;4096;16;16;13;390;10708544
256;8192;32;16;63;26;21056448
256;8192;32;16;30;2730;8428864
256;8192;32;32;63;117;12971520
2048;8192;4;64;130;117;25151456
64;8192;1;16;63;2730;49739552
256;8192;32;4;26;2730;9887616
256;8192;32;16;26;2730;9337600
2048;256;32;16;130;39;19993024
256;8192;32;16;63;630;8605504
256;8192;32;32;63;585;10918304
128;1;16;1;63;2730;2177582336
256;8192;32;16;63;1;400380384
2048;2048;16;32;70;117;12149696
1024;1024;16;16;42;117;11063296
2048;2048;16;16;65;105;10727808
2048;1024;16;16;78;105;10407520
256;128;32;16;63;42;22155296
256;4;32;2;63;2730;292581536
256;1;256;1;90;910;516431168
512;128;256;4;9;91;48900576
1;2;1;2;195;91;45697773472
32;1;32;1;42;819;3237846848
256;32;32;16;105;2730;41120416
32;8192;8;16;210;2730;23397024
2;8192;2;16;585;2730;280825664
512;8192;32;16;63;2730;8182816
4;1;4;1;63;2730;22625878912
1;512;1;16;63;2730;294353088
256;8192;16;16;63;630;10539296
256;8192;32;8;35;2730;8986944
512;8192;16;16;78;2730;12350688
256;1;32;1;63;4095;1708745696
2048;512;16;16;70;105;11080896
2048;512;32;16;45;105;12095680
8192;2;1024;2;78;1;18446744073709551615
16;32;4;2;1365;910;696984288
256;8192;32;16;63;30;18141344
2048;8192;256;16;63;2730;18446744073709551615
2048;256;16;4;21;182;14703744
2048;2048;4;2;130;42;68567840
256;64;8;32;15;42;23740192
8192;4;256;2;78;3;718416224
256;8192;32;16;14;1;363420768
256;1024;32;16;63;819;8748672
256;8192;32;16;63;1638;8319424
2048;2048;16;32;65;117;12408544
512;8192;32;4;63;2730;9886944
32;8192;32;16;78;2730;9066912
2048;8192;32;16;91;8190;9704800
256;8192;32;16;63;126;10140992
256;8192;16;16;35;2730;12561696
2048;2048;16;16;35;195;11159200
2048;2048;16;16;70;105;10501664
2048;1024;16;16;65;117;11219744
2048;512;16;16;78;105;10629376
1024;2;32;1;585;546;119752512
8192;1024;1;4;585;105;131881152
16;2048;1;2;390;182;289002080
256;8;128;4;126;455;71113792
256;256;8;64;63;2730;22828736
4;512;4;16;63;126;73436448
256;4096;32;16;63;4095;8195840
512;8192;128;16;45;2730;18446744073709551615
256;8192;128;16;70;630;18446744073709551615
256;8192;32;512;9;2730;18446744073709551615
256;8192;2;16;18;35;32082816
2048;512;32;16;65;105;12788960
2048;2048;16;32;78;117;11483168
256;8192;32;16;70;2730;8809952
8192;8192;32;16;63;2730;9378560
64;32;4;2;117;126;101411488
1;1;1;1;91;630;74070049632
32;64;1;2;273;546;308009696
1;2;1;1;195;1;42884379488
256;8192;16;256;63;15;18446744073709551615
256;8192;256;4;63;2730;12664768
32;8192;32;16;63;2730;9644416
256;1;32;1;42;1170;482105920
512;8192;32;16;91;2730;8395584
128;8192;32;16;30;910;8781312
2048;4096;4;16;65;130;22536128
128;64;128;8;15;45;77779104
2048;1;16;1;63;1638;1350308160
256;2048;8;16;30;546;20570560
2048;512;32;16;65;117;11713664
256;8192;32;16;18;910;11824800
512;4096;32;32;63;1;401030400
2048;4096;4;16;65;117;21886240
8;256;2;1;90;117;259869472
1;4;1;2;585;2;25865942880
512;128;2;1;65;1365;262387808
256;8192;32;16;390;2730;9775136
32;4;2;2;390;1638;2657281280
256;8192;32;32;35;2730;17160096
256;8192;32;8;63;2730;8336992
512;8192;32;16;63;1365;8100704
512;8192;32;4;35;1365;8772160
512;4096;32;8;63;1365;8185280
512;8192;8;8;42;1365;19449632
256;8192;32;16;63;1365;8053344
512;8192;64;16;63;910;11025088
512;2048;32;32;63;1365;10487904
512;1;64;1;63;585;261262496
256;8192;32;8;63;1365;8194912
1024;8192;32;16;30;1365;8467936
256;8192;32;8;63;910;8822112
256;8192;32;16;39;1365;9191328
256;1;32;1;63;1365;575470688
256;4096;32;16;63;1365;8070080
256;1;32;1;30;1365;564931136
256;8192;16;16;63;1365;9676544
512;4096;32;16;35;1365;9917920
256;8192;16;16;63;1170;10680544
64;8192;1;16;63;1365;45414048
256;4096;32;16;65;1365;9477184
512;8192;64;16;63;546;11409248
256;8192;64;16;63;1365;10892512
256;8192;16;8;63;1365;10524192
128;8192;16;8;63;1365;10410272
256;8192;32;64;63;315;18446744073709551615
256;4096;64;16;63;1365;10886112
128;8192;128;16;63;1365;18446744073709551615
512;8192;32;16;117;910;8925792
256;2048;32;16;63;1365;8069440
256;8192;4;16;63;1365;24362624
256;8192;64;4;63;1365;12569024
256;1;32;1;70;455;583818976
256;1;32;1;63;1365;575335136
256;8192;32;16;42;1365;8647008
256;4096;32;64;45;8190;18446744073709551615
256;2048;32;8;45;819;8923392
256;8192;128;16;91;1365;18446744073709551615
256;8192;32;16;78;1;407343008
512;8192;8;16;18;1365;20092800
512;8192;128;64;39;1365;18446744073709551615
256;8192;32;16;45;630;8868992
256;8192;32;32;35;1365;16713632
256;2048;32;4;15;1365;8973248
256;8192;32;8;15;1365;8486496
256;1;64;1;42;1365;571881280
256;8192;32;16;91;1365;8292832
256;8192;32;16;30;1365;8385920
512;8192;32;16;78;1365;8375136
256;8192;16;16;39;1365;10753472
256;8192;64;32;63;910;18446744073709551615
256;1;32;1;63;546;477408096
256;8192;16;32;63;546;10223808
64;4096;32;16;63;8190;8713632
128;8192;64;16;63;2730;10667744
512;8192;64;4;63;315;10225504
256;8192;32;16;26;1365;9172576
64;4096;32;4;63;1365;10388384
256;2048;32;16;63;210;9685952
256;8192;16;8;117;1365;10977920
256;8192;16;16;35;1365;11471392
256;8192;32;32;70;1365;13194656
512;1;32;1;63;1365;560778656
1024;1;32;1;91;1365;559448160
64;8192;32;16;130;1365;10568704
256;8192;32;16;63;819;8407968
256;4096;32;8;21;1170;8955872
512;8192;32;16;21;910;10470048
1024;8192;32;8;63;130;11437280
256;8192;64;16;35;1365;13710752
256;8192;32;4;63;1638;9921440
256;8192;32;16;63;546;8932896
512;8192;32;16;63;455;8887872
256;8192;32;64;63;1365;18446744073709551615
256;1;8;1;63;1365;2224089248
128;4096;32;16;35;1365;10090656
64;8192;4;16;63;1365;24147232
256;8192;16;16;63;585;9992096
256;8192;32;16;78;630;8737056
128;8192;64;16;26;1365;12552544
256;8192;32;32;63;1365;10469216
256;1;64;1;63;1365;581537152
512;8192;32;16;21;1365;10438752
256;8192;32;32;63;819;10623264
256;2048;32;16;63;1638;8336384
256;4096;32;64;45;1365;18446744073709551615
256;8192;32;64;63;4095;18446744073709551615
2048;8192;8;16;63;1365;18437696
256;1;32;1;63;1638;695949952
128;8192;16;16;63;1365;9625344
256;8192;32;16;70;1365;8695040
256;8192;64;16;39;1365;12602560
256;8192;64;2;63;1638;13129760
256;8192;32;4;65;1365;8898432
256;1;16;1;63;1365;1143999552
256;8192;128;16;63;1365;18446744073709551615
256;8192;128;16;63;1170;18446744073709551615
256;4096;64;16;42;1365;11840864
256;2048;16;16;45;8190;14080352
256;8192;64;64;126;1365;18446744073709551615
128;8192;64;16;45;1365;11357792
512;8192;64;16;63;1365;10731648
256;1;32;1;15;1365;561441536
32;8192;32;16;78;8190;8194176
1024;1;32;1;63;1365;561415264
256;8192;32;8;63;4095;9198720
256;2048;32;16;9;1365;11305408
512;8192;32;16;63;4095;8193504
1024;4096;16;16;63;1365;9808800
64;8192;32;16;63;1365;8589376
512;8192;16;16;63;819;9832448
256;4096;16;16;91;1365;9882464
128;8192;64;16;63;8190;9380160
256;1;32;1;63;1365;559925504
256;512;64;16;63;1365;12138560
256;8192;64;16;63;910;11299808
256;8192;256;16;45;1365;18446744073709551615
64;8192;32;16;78;1365;9112384
128;8192;32;16;21;1638;10796320
128;8192;32;8;63;819;8985184
256;1;32;1;39;1365;559252352
512;8192;32;8;78;1365;8802080
512;8192;64;16;21;1365;14326400
256;1;32;1;63;8190;2587902880
1024;1;32;1;63;630;263412256
256;2048;16;16;63;1365;9650176
128;1;32;1;63;1365;1109532192
256;8192;16;32;91;1365;9617216
256;4096;16;32;63;1638;10527424
256;8192;8;32;63;1365;17226240
256;1024;32;32;91;1365;10801792
2048;1;32;1;63;1365;575388672
256;1024;32;16;45;1365;8520672
256;8192;32;16;26;910;9451072
2048;8192;32;16;63;546;8971808
256;8192;32;16;35;910;10225152
256;4096;16;16;91;1638;11008576
32;8192;32;8;63;2730;9799808
1024;512;4;2;91;70;66508288
1;4;1;4;273;8190;16459614112
32;128;2;64;1;39;1196330656
128;1;8;1;234;1365;2223685408
64;8192;32;32;45;4095;13839040
256;8192;64;4;63;2730;9313472
256;4096;64;16;63;819;10796032
2048;1;64;1;63;1365;290949632
128;4096;8;16;63;1365;17829216
256;8192;32;2;63;1365;11820032
256;8192;32;16;78;8190;8280576
256;2;1;1;30;78;804721664
256;256;128;64;315;70;18446744073709551615
32;256;8;1;7;105;72751136
1;1;1;1;63;910;85085076768
256;8192;64;16;65;1365;12715200
256;1;16;1;26;1365;1094986112
256;4096;32;16;63;819;8418912
1024;1;32;1;63;1;3186040736
256;8192;64;8;63;819;9091616
1024;4096;32;16;65;1365;9471168
512;8192;32;16;63;910;8413024
1;1;1;1;70;91;85475247200
32;2;4;1;195;91;1571062240
1;2;1;1;42;819;42282275776
8192;8192;256;16;78;1;18446744073709551615
1024;4096;32;16;63;630;8515296
2048;8192;32;16;63;1365;8366720
128;8192;32;16;63;1365;8413248
256;8192;256;16;63;546;18446744073709551615
32;1;2;1;1365;910;5292529696
2048;2048;4;64;130;42;24635712
256;128;8;32;35;42;25566528
8192;4096;4;1024;18;3;18446744073709551615
128;2048;32;16;63;1365;8447104
256;4096;32;32;63;546;11027040
256;8192;32;4;63;8190;9757824
256;1;64;1;63;1365;571405152
128;8192;8;16;63;1365;17766720
256;8192;32;16;90;1365;8297984
1024;2;1;1;1;546;2843366496
8192;32;1024;4;585;14;18446744073709551615
16;2048;1;2;390;182;288186624
256;8;128;4;26;65;167892672
64;8192;32;16;45;1365;8931648
512;8192;32;16;78;2730;8822336
128;2048;8;16;63;1365;17795424
256;4096;32;16;78;1365;8449152
64;2048;1;128;315;126;203921344
1;8;1;2;91;1638;11635832192
32;64;1;2;273;546;308046432
2;2;2;2;630;273;21771252288
128;1;128;1;15;195;1209540032
1;1;1;1;182;546;85423122944
4;256;1;64;30;117;290686816
1;1;1;1;39;26;86613439584
256;8192;32;16;117;1365;8611264
256;8192;64;32;63;1365;18446744073709551615
1024;4096;32;16;117;1365;8628224
256;8192;32;64;65;1365;18446744073709551615
1024;8192;32;16;63;1365;8187200
1024;4096;64;16;63;4095;10459168
512;8192;32;16;90;1365;8350528
128;1;32;1;63;1365;1111190624
256;8192;64;8;42;1365;10293952
1024;8192;32;8;63;195;10193536
16;8192;1;16;63;1365;45249056
256;1;64;1;63;8190;1282119424
16;8192;16;16;65;1170;14241440
512;1;16;1;63;8190;4989413536
128;8192;32;32;45;1;418050368
512;8192;32;32;26;819;12608672
256;8192;16;8;63;1;203246816
256;1;128;1;63;1365;438879040
256;4096;32;32;78;1365;12148096
256;1;32;1;63;1170;487603808
64;8192;4;16;63;1365;24097536
512;1;64;1;65;1365;290907904
64;8192;32;8;35;1;415751744
512;8192;32;128;63;1365;18446744073709551615
256;8192;32;16;63;910;8566176
256;8192;32;16;21;1365;10445312
256;2048;32;16;42;1365;8707072
256;8192;32;16;63;315;8954496
256;8192;32;16;65;1638;9719616
256;8192;32;64;63;8190;18446744073709551615
256;8192;32;128;63;1365;18446744073709551615
512;1;32;1;63;1365;575409696
256;8192;128;16;63;819;18446744073709551615
512;1;2;1;273;126;717160672
32;4;2;2;390;30;834884768
2048;4;4;4;91;70;63184512
1024;4;128;2;45;70;72078656
1;256;1;8;3;39;950139808
128;1;8;1;234;910;1407509024
256;2;1;1;117;910;4812159712
256;1;8;1;315;70;449734016
256;8192;64;64;63;1365;18446744073709551615
32;256;1;1;7;105;420867360
128;1;1;1;78;2730;31591552960
256;64;32;16;63;1365;12654752
256;32;2;16;63;1365;324375776
256;8192;32;256;7;1365;18446744073709551615
256;8192;32;16;546;1365;9895168
256;8192;32;16;63;6;90491776
256;8192;4;32;63;1365;34348832
8;8192;2;16;63;1365;34609888
256;8192;32;256;63;1365;18446744073709551615
1024;8192;32;512;63;1365;18446744073709551615
512;128;256;128;9;91;18446744073709551615
1024;2;4;1;78;130;201924128
32;2;32;1;42;819;1659133216
8192;16;4;2;78;1;269648352
256;8192;32;1;63;1365;21324352
256;4;32;2;26;1365;144764704
4096;8192;32;1;63;1365;21660704
256;8192;2;16;63;1365;29723456
256;128;32;128;63;1365;18446744073709551615
8192;8192;16;16;63;1365;10970336
256;8192;32;4;546;1365;12047200
256;8192;4;16;63;1365;24404736
32;32;2;1;1365;910;888966720
2048;2048;4;64;117;42;28908320
64;128;8;32;30;42;23401088
1;8192;1;16;1638;1365;1569605568
256;256;32;16;63;1365;9226240
256;4;32;2;63;585;127228512
256;8192;1;16;63;1365;46667264
4096;8192;32;16;546;1365;9918496
8192;4;4;2;91;3;129185184
1024;64;32;1;585;546;35659456
8192;1024;1;4;630;14;124401344
16;32;8;2;390;210;348430304
2;8192;2;16;63;1365;34202080
64;8192;32;64;63;1365;18446744073709551615
256;8192;32;32;78;1365;12152480
16;2048;1;16;63;1365;45331040
4;8192;4;16;63;1365;24186464
4;8192;4;16;63;1365;24202464
256;4096;2;1;63;1365;256797504
256;8192;8;512;63;1365;18446744073709551615
256;8;2;4;1;630;1347277248
64;64;4;1;1;126;120264256
1;4;1;2;91;210;23086113344
32;64;8;4;78;546;70718560
1;2;1;2;630;273;45597726016
2048;8192;1;16;63;1365;48050080
256;8192;1;16;63;8190;76869472
128;32;128;8;15;45;154390656
2048;1;16;1;63;182;155335104
128;1;2;1;117;117;1212950720
1;1;1;1;39;26;75241660288
256;8192;32;16;4095;1365;21439552
256;8192;2;16;63;1365;29959584
256;8192;32;16;1;1365;17923200
4;8192;4;16;63;26;28378336
512;128;2;1;1;1365;227379904
32;4;32;1;39;30;1147730592
4096;4;4;4;91;70;63033376
1024;4;128;4;45;70;83255680
256;8192;32;4;63;1365;8601856
4096;8192;32;256;39;1365;18446744073709551615
32;256;8;128;3;39;652656832
256;4;32;2;63;65;161848416
256;8192;32;16;9;1365;11286944
128;4;16;2;3;1365;376311712
256;8192;32;16;63;39;19638656
256;8192;8;8;35;1365;19149856
128;1;8;1;39;10;1424183904
64;2;1;1;45;78;816304480
128;16;8;2;315;70;79679488
32;256;8;1;2730;105;1140546784
1;8192;1;16;63;1365;58540704
256;256;4;16;63;1365;27294848
256;8192;1;16;63;1365;46028128
256;8192;32;16;63;70;14399360
4096;1;256;1;78;1;6317092736
1;128;1;16;9;91;1419300096
1024;8;512;1;910;130;123643072
32;128;32;16;1;39;657313216
2;16;1;2;78;1;2926389600
256;32;32;16;42;1365;23658720
256;1;32;1;117;1365;575144672
32;32;16;2;1365;910;341754080
2048;1;4;1;130;3;294385664
32;128;8;32;15;39;64819872
1024;4;32;2;91;3;389656032
1024;64;1;1;585;546;788326592
256;8192;32;16;273;1365;8844448
64;8192;32;32;63;1365;10385888
256;8192;32;16;63;90;11412640
64;32;1;4;630;14;128777664
16;2048;8;1;390;91;315419776
256;64;128;4;5;630;17841280
1;2048;1;1;315;126;3329032928
256;8192;16;1024;63;1365;18446744073709551615
256;8192;1;256;63;1365;226012320
256;8192;1;512;63;1365;106328544
1;8;1;2;91;105;11770005152
32;64;1;4;273;90;141344544
2;2;2;2;630;315;21987615968
8;16;8;8;15;1170;978379584
256;8192;1;64;63;1365;183453824
16;8192;16;16;315;1365;20266144
256;8192;32;16;630;1365;8115872
1;1;1;1;315;182;85383787808
8;1;2;1;585;117;10920970528
1;64;1;8;39;26;1675670080
512;128;2;1;1;18;220282976
256;4;32;2;70;1365;145014368
128;8192;32;16;234;1365;9023392
1;8192;1;16;63;1365;58402208
512;4;128;1;819;21;477337472
4096;256;4;1;42;70;123420480
1024;4;1;2;45;315;916690432
32;32;4;16;3;39;581964864
256;8192;32;256;234;1365;18446744073709551615
128;4;8;1;234;910;376984960
1;2;1;1;30;78;42742628000
128;1;8;1;315;273;866080992
32;8;8;8;2730;105;502635712
256;8192;32;16;105;1;399157472
256;8192;32;16;45;1;405022176
256;8192;16;8;63;455;10793280
256;8192;32;16;910;45;18327008
256;64;32;2;63;1365;15199136
256;8192;2;16;63;8190;32534464
256;8192;256;16;63;1365;18446744073709551615
256;2048;32;8;63;1365;8189248
128;4096;16;16;30;1365;10036064
128;8192;16;16;70;4095;10426592
256;8192;64;4;39;1365;12006752
128;8192;32;32;117;1365;11238528
512;1024;32;16;105;8190;8313440
512;8192;32;32;65;1365;14473344
256;8192;16;16;63;910;10566240
256;8192;256;16;63;4095;18446744073709551615
64;8192;32;16;117;1365;9506720
256;8192;128;8;39;1365;11706624
512;1;32;1;14;1365;575224096
256;8192;16;32;63;1365;9445568
256;8192;16;16;63;546;10454496
256;8192;32;64;63;819;18446744073709551615
256;8192;32;64;63;630;18446744073709551615
256;8192;32;16;65;455;10126816
256;8192;32;16;91;546;9247456
256;8192;128;32;63;1365;18446744073709551615
1024;8192;32;16;65;1365;9484448
128;8192;128;32;63;1365;18446744073709551615
256;8192;32;16;70;819;9092672
1024;8192;32;16;63;8190;8897856
256;8192;8;16;91;8190;21219104
128;2048;32;64;39;1365;18446744073709551615
64;8192;32;16;63;819;8772544
256;8192;32;32;63;1;401675808
1024;1;32;1;63;1365;559915808
256;8192;256;32;63;1365;18446744073709551615
256;8192;8;16;35;1365;19063008
256;2048;64;64;63;1365;18446744073709551615
128;4096;32;8;21;1365;9087360
64;1;32;1;63;1365;1676625248
256;8192;32;64;63;1;18446744073709551615
2048;8192;32;16;63;4095;8332256
256;8192;256;4;45;585;16502720
256;8192;32;8;63;1638;8722880
256;8192;32;16;78;1365;8458080
256;4096;32;16;63;1638;8343712
256;1;32;1;65;1365;561967072
128;8192;32;32;39;1170;15434624
2048;8192;32;32;91;455;12004736
128;8192;32;128;63;1638;18446744073709551615
256;8192;32;16;65;1365;9460992
256;8192;16;16;45;1365;9914176
256;8192;64;32;63;1170;18446744073709551615
256;8192;32;4;63;819;9865600
64;8192;64;16;63;630;10981088
256;8192;32;16;45;1365;8331328
256;8192;16;16;35;910;11636288
256;8192;16;4;63;1365;12729152
512;8192;64;32;63;1365;18446744073709551615
256;8192;16;16;117;1365;10688992
256;8192;32;128;39;1365;18446744073709551615
512;8192;32;8;90;1365;8526368
256;8192;16;16;63;1638;11162816
256;2048;32;16;105;1365;8311680
2048;8192;32;16;42;1365;8971424
256;8192;32;16;63;8190;8338464
256;1;16;1;63;630;514504064
512;2048;32;16;35;1170;10164096
256;8192;32;16;18;315;12161344
1024;8192;64;16;63;1365;10864640
64;8192;32;64;63;585;18446744073709551615
256;8192;16;32;65;1365;11985696
1024;1;64;1;10;1365;291050336
256;8192;128;64;63;1365;18446744073709551615
512;8192;32;4;26;1365;9230720
512;8192;32;4;78;1638;9949376
2048;8192;32;16;90;1365;8577888
256;8192;16;32;130;1365;10976992
256;4096;32;16;42;1638;8835776
256;8192;32;16;35;4095;9906720
256;2048;8;16;63;1638;21998080
256;8192;32;8;39;1170;8526240
256;8192;128;16;63;1;18446744073709551615
256;2048;32;32;70;1638;13356896
256;8192;32;16;30;630;8758432
1024;8192;16;16;63;1365;9810720
256;1;32;1;63;8190;2549517184
256;8192;16;16;63;1;204986496
64;1;16;1;15;1365;2168385056
256;4096;32;16;91;1365;8304288
256;2048;64;16;30;1365;11301984
256;1;32;1;63;1365;561946560
256;8192;64;32;39;1365;18446744073709551615
256;8192;16;16;39;2730;12331552
256;8192;32;64;78;2730;18446744073709551615
256;1;32;1;63;585;487168704
256;1;32;1;63;390;499968064
256;8192;32;4;45;585;9885152
512;8192;32;64;63;630;18446744073709551615
256;1;32;1;42;1365;559760128
2048;8192;32;32;65;234;16210592
32;8192;32;16;70;1365;9095104
512;4096;32;16;18;1365;11679552
512;8192;32;16;65;2730;9585472
256;1024;32;16;63;1365;8372704
256;1;32;1;63;1365;555875680
256;4096;32;16;63;8190;8365184
256;2048;16;16;63;4095;11020480
256;1;16;1;45;910;746281952
64;8192;64;16;70;273;16001536
256;8192;32;16;126;1365;8075808
512;8192;32;32;63;1365;10513408
512;8192;32;32;130;1365;12326432
256;8192;32;16;70;1170;8941408
128;8192;32;32;63;630;10810208
512;4096;32;16;42;819;8861888
256;2048;32;16;182;1365;8365696
1024;8192;16;16;39;1170;11371872
256;1;32;1;63;1365;564437280
256;8192;32;16;21;1170;10535200
256;8192;8;16;39;1365;18463200
128;1;16;1;63;1365;1089179264
256;8192;16;32;21;1170;11266144
256;4096;16;16;63;1365;9680928
256;8192;16;16;65;1365;10824800
256;8192;32;8;91;546;9437888
256;8192;32;32;126;315;10892416
256;1;16;1;63;1365;1143879616
128;512;32;16;63;210;11374208
128;1;32;1;182;1365;1139639808
256;1;16;1;42;1;6399075840
256;1;32;1;63;819;671078176
256;8192;16;16;21;1365;11654464
128;8192;32;16;63;585;9000288
128;8192;16;16;63;455;10654592
256;8192;64;16;105;4095;10789152
256;8192;64;8;63;1365;10375872
512;8192;8;64;126;1365;17297760
256;1;32;1;26;1;12654869728
128;8192;32;16;39;1365;9324736
256;1;64;1;90;8190;1284801600
128;8192;32;16;195;1365;9825536
1024;1;32;1;45;1365;555830976
2048;8192;32;4;63;1365;9176160
256;8192;32;16;130;1365;8780128
128;1;16;1;63;1365;1139536224
