GLOBAL_SIZE_0;GLOBAL_SIZE_1;LOCAL_SIZE_0;LOCAL_SIZE_1;TILE_0;TILE_1;cost
1024;1;1;1;32;64;90695111
8;16;8;2;1;32;579560593
2048;1024;1;128;512;16;28625630
2;128;1;128;1;1;3265908000
2048;1024;1;64;512;16;14155112
2;1024;2;128;512;16;68872444
2048;1024;256;1;512;128;99475555
32;1024;8;2;512;16;9231407
32;1024;8;2;4096;32;30005778
32;1024;8;4;512;16;6109482
32;1024;8;32;512;16;15134963
32;1024;8;2;4096;16;32652148
32;1024;8;4;16;128;5412741
32;1024;1;256;4096;16;1491349185
32;128;8;4;512;16;5430222
1;1024;1;256;512;16;202828741
16;1024;16;4;16;128;8798519
32;1;8;1;16;128;274841185
32;1024;8;4;2;512;42545778
32;1024;8;2;16;256;12207555
32;2;8;1;16;128;140484000
32;256;8;32;16;32;4424889
32;1024;2;1;16;128;36627259
32;128;8;4;16;1024;21993185
4096;256;1;32;16;32;8746518
32;16;8;1;16;8;23181778
32;4096;16;1;128;32;13154222
4;256;1;32;16;32;12167407
32;256;4;32;16;1;118987852
512;256;1;32;16;32;8759852
32;256;8;32;16;4;34446815
8;256;2;32;16;32;6754222
32;256;8;16;16;32;4521037
32;256;4;16;16;16;3837778
16;256;8;32;128;32;8733334
32;256;1;8;4;16;7809482
32;256;4;32;16;16;7542222
32;256;4;16;8;32;3792148
32;256;4;16;32;16;3902963
32;256;4;16;8;8;7473630
8;256;1;16;4;32;6243111
32;256;4;16;16;32;3837037
32;256;4;16;16;4;14820741
32;256;8;8;8;16;4444593
32;64;8;8;8;32;7728296
32;128;2;16;2;64;3946222
16;256;4;16;8;8;11560593
4096;2048;4;16;256;1;84783704
4;16;1;1;1;32;126895704
64;2048;2;2;512;128;61886074
8;1024;4;4;2;4;14089482
128;256;1;16;8;128;10112444
4;256;4;16;8;32;16086666
32;256;4;4;16;32;6648148
32;256;4;16;4;32;3840889
32;256;1;16;8;32;4226815
32;256;8;16;8;32;4533926
32;1024;4;16;1;32;4485926
32;256;4;16;1024;1;117160444
16;32;1;32;4;1;509078518
1;1;1;1;512;2048;7754825185
2;2;1;2;1;1;3297252296
2048;1;1;1;2;1;39842074
32;512;4;16;8;32;3833185
32;256;1;8;32;32;8028889
32;128;4;16;8;32;5895704
32;2048;2;16;8;32;5260000
32;4;4;2;8;32;73816593
32;256;32;8;8;32;34336593
32;512;2;16;8;32;3370963
32;32;4;16;8;32;16850222
32;512;2;2;8;32;17722370
32;512;2;16;4096;32;53262223
32;512;2;8;8;128;5551259
32;512;1;16;8;32;4137630
32;512;2;2;8;32;17731704
32;512;2;16;8;1024;7291111
2048;512;128;1;8;32;1953888445
32;512;2;1;8;32;35237481
32;512;1;16;8;32;4128148
32;1;2;1;8;32;274048593
32;512;2;8;8;32;5492000
32;512;2;4;8;32;9508445
128;256;1;8;8;32;18816592
32;256;2;16;8;32;3592889
32;64;1;16;8;32;6553185
4;2;4;1;64;1024;1096917185
1;8;1;8;4;16;1443491555
16;1;2;1;32;32;547697037
8;4096;1;1;4;8;52542963
32;512;2;32;8;32;2552296
64;512;1;16;8;32;7274222
32;512;2;16;1024;32;13238074
32;2048;16;16;8;32;13354666
32;512;2;32;8;256;2567111
32;512;4;32;8;32;3979704
32;1;2;1;8;32;274023556
8;4;8;4;8;32;355599556
32;32;2;32;8;1;294103704
32;512;2;32;512;32;5050371
32;512;2;32;256;32;4557482
32;16;2;1;8;32;34883555
32;512;2;32;4;32;2413630
32;4096;2;32;8;32;4759556
4096;512;128;2;4;32;6653874519
32;16;2;1;4;32;35358370
32;512;2;32;4;1;68815852
32;512;2;32;4;512;2439555
32;512;2;32;4;1;68838222
32;4;2;4;4;32;76297926
32;512;2;1;4;32;35193185
32;2048;2;32;4;32;2564000
2;512;2;32;4;32;14258518
32;512;8;32;4;64;8710518
4096;32;128;2;4;32;3521857777
2048;512;128;2;4;32;3949105926
32;512;2;32;4;1024;4376444
32;512;2;64;4;32;4915408
256;512;128;2;4;32;1072549629
512;512;128;2;512;32;57064296
32;1024;32;2;4;32;77799704
32;64;2;1;4;2;35274519
256;8;128;2;4;32;1590432297
32;512;1;32;4;32;2502371
32;512;8;32;4;1;274886963
32;512;2;128;4;32;8919704
1024;256;128;2;4;32;2411359259
64;512;1;32;4;32;4245037
32;512;32;2;4;32;77376593
32;512;2;32;1;32;2144741
8;512;1;32;1;32;3445778
32;512;2;32;1;32;2154519
32;512;2;2;1;32;30340592
32;512;16;1;64;32;13334371
32;512;2;4;1;32;15373481
32;8;2;2;1;32;71776296
32;512;2;64;1;32;4892888
32;512;8;32;1;32;7835259
2;1;2;1;1;32;8254193778
32;512;2;32;1;32;2276148
32;512;2;16;128;256;3340296
32;256;2;32;1;64;3337185
64;512;1;32;1;32;7247704
32;2048;2;32;1;16;7145778
32;512;2;16;1;32;4174814
32;128;2;32;1;1;135944148
32;512;2;128;1;16;18332296
32;2048;2;32;1;32;2603111
512;8;32;1;128;128;21857186
8;512;4;32;1;32;13115703
1;512;1;32;1;32;25605778
32;512;2;8;1;32;7738963
1;4096;1;8;1;1;56626519
32;512;2;32;1024;32;8932592
32;512;8;2;1;32;30419555
32;512;32;2;1;32;41468297
32;128;4;32;1;32;12826814
32;512;2;16;1;128;4293481
8;512;8;32;1;32;25400000
32;512;4;32;1;32;4191111
8;256;1;16;8;4;25344592
4;512;4;2;16;4096;2711274667
128;2;2;1;4096;64;2595961777
1;8;1;8;32;8;1290745333
1;4;1;4;1;32;2508113778
32;512;2;32;128;32;4153778
32;512;16;1;1;32;47043112
32;512;2;32;2;32;2442074
1;1;1;1;1;64;8084847259
4;512;1;32;1;32;6722519
32;256;2;16;1;32;4056889
32;1024;2;32;1;32;2334223
32;512;2;32;4096;128;34683704
128;512;64;4;1;128;60381629
32;256;2;32;1;32;3814666
32;1;2;1;1;32;523873926
32;512;2;32;2048;32;17383704
32;512;2;32;1;1024;6086814
8;8;4;8;512;2;18446744073709551615
64;1024;1;4;16;1024;15233926
32;1024;4;4;2;256;13241481
1;4;1;2;16;2;2292541037
64;64;32;1;32;32;15219111
1024;4;8;4;16;16;11726074
256;128;8;2;256;128;12875555
128;16;32;2;32;16;9386519
32;512;2;8;1;1024;20111259
32;512;2;32;1;2048;11675407
32;16;2;8;1;32;42250666
256;512;64;4;1;64;59869926
32;512;1;32;1;32;3490815
32;1024;2;32;1;16;6409926
32;2;2;2;1;32;294869481
32;64;2;32;1;32;12768148
32;4;2;4;1;32;155322074
32;512;4;2;1;32;29862518
32;4096;32;2;1;32;44136740
32;64;2;1;1;32;48013037
32;512;4;32;1;32;4228593
32;1;2;1;512;64;553649926
1;32;1;32;256;8;1446372741
4;1024;2;4;8;128;19713777
64;16;64;1;16;1;169014667
2048;2048;256;1;512;64;98359407
32;512;2;32;1;64;2348296
32;1024;4;32;1;32;4706371
16;1024;8;32;1;32;7814667
32;32;1;1;16;16;52247852
32;4;8;1;1024;16;71739260
4;512;2;32;1;256;11877334
1024;512;2;1;1;32;340034371
32;512;2;64;32;32;5219259
32;512;8;32;1;1;204635704
2048;256;64;1;1;128;46460741
32;1024;2;32;4096;32;34629037
32;512;2;8;1;128;7780593
64;512;1;32;64;32;7708889
1;512;1;32;1;32;25893482
32;1;2;1;1;4;545955407
32;2;4;1;16;2048;140109630
512;64;32;8;8;64;60571555
8;1;4;1;1;8;4125436593
32;4;32;4;256;4096;216822963
512;8;16;2;32;16;8228444
256;64;16;2;128;64;10402667
128;32;32;2;32;32;7346666
256;16;32;2;64;64;7679111
32;512;2;32;1;4096;30662074
64;512;1;16;1;32;8365778
32;512;4;64;1;32;8036593
2048;8;128;1;1;32;94975703
32;512;8;32;1;32;7802074
32;512;16;1;512;32;13101481
2048;2;1;1;8;32;97746963
256;8;256;1;2048;128;64686815
2;64;2;4;128;2048;590225925
16;4;16;2;128;256;190273037
32;512;2;2;2;32;17689778
32;4096;2;32;2;32;7181333
32;512;2;32;32;32;2750519
32;512;2;32;16;32;2489333
32;512;8;32;1;8;30535555
64;32;64;1;32;16;23721334
64;8;16;1;256;16;19914963
32;512;2;32;1;8;8167111
512;4;8;1;256;128;25163851
2048;1;64;1;128;64;41583556
128;2;2;2;4;8;40583259
64;32;64;4;64;4096;320120741
64;2048;2;1;1;256;41786074
32;512;2;32;1024;64;8804889
2;512;2;1;16;32;41341038
32;1;2;1;64;1024;279709185
32;512;2;64;8;32;4872444
16;512;4;32;1;32;7064000
32;512;2;32;1;128;2246814
2;512;2;4;1;32;20913778
32;16;2;1;1;32;52560296
32;512;2;32;256;16;10666370
256;512;128;1;1;32;69829481
32;4096;2;32;1;8;26672296
4096;512;2;32;1;4;23677482
512;512;128;2;1;16;117707556
512;512;64;4;1;32;58977481
8;512;8;8;1;32;21421037
32;64;2;32;1;2;18446744073709551615
32;128;2;32;1;512;5980444
32;512;2;1;1;32;57348148
32;512;2;32;1;4;16288296
32;512;8;32;1;128;7883407
32;512;2;16;1;32;4110370
32;512;2;32;1;1;55740741
32;512;2;32;1;512;3166370
32;2048;8;32;1;256;7792592
32;512;1;32;1;32;3320296
32;256;8;32;1;32;12748741
32;2;2;2;1;32;294561926
32;512;2;1;128;32;35201185
256;512;16;16;1;32;19880297
1;512;1;32;1;32;25816741
1024;512;128;2;1;1024;156801778
32;512;2;4;1;32;15358667
32;512;32;4;1;32;31293630
512;512;128;2;1;32;118315407
32;512;1;32;1;32;3505037
1;512;1;32;1;64;24146074
32;512;2;1;1;32;50030222
32;512;4;64;1;32;7918074
32;512;2;4;32;8;11489482
2048;128;128;2;1;32;117567260
32;512;2;4;1;1;97612296
2048;512;64;2;1;32;58844889
32;512;1;32;64;32;4152297
32;64;32;2;16;32;18790518
1024;512;1;64;1;32;11973186
128;512;128;2;1;32;121337629
32;128;2;32;1;32;6613333
256;512;128;2;1;32;119358371
32;512;4;16;2;32;7815259
256;512;128;2;1;32;119339407
128;512;128;2;16;32;195757777
32;4096;2;32;1;32;6279259
64;512;1;32;1;8;14022074
32;1;2;1;1;4096;410530963
32;512;16;16;1;32;15262222
1024;512;128;2;1;32;117660000
32;512;16;2;1;1;60928296
16;512;4;32;1;4096;115354370
32;8;2;2;256;32;39357334
32;512;2;1;256;32;35728741
2;512;1;64;4;32;25295555
1;512;1;1;1;32;60303852
2;512;2;32;1;32;25805333
32;512;2;32;64;32;3304148
4;512;4;32;1;32;25866518
32;512;2;128;1;2;18446744073709551615
32;16;2;1;1;4096;698890666
1;512;1;8;1;32;21476889
32;1024;2;32;1;1024;6081185
32;1;2;1;2;32;273187852
2;512;2;2;1;32;40987852
32;512;2;128;8;32;8829333
1024;64;128;1;1;32;95899259
32;512;8;32;64;32;4622963
32;4;1;4;1;32;77936592
1;512;1;4;1;32;21358963
32;512;2;128;1;32;8819259
8;512;8;32;4096;32;585277497
32;512;2;128;64;32;10846222
32;4;2;1;1;32;140065778
32;512;2;32;256;32;4433926
32;512;2;32;1024;1;296156000
32;512;2;32;1;1;55604000
32;512;16;1;1;512;470750371
32;2048;2;32;1;32;2860593
512;512;128;2;1;32;118177481
4;512;2;32;1;32;13048296
32;512;2;1;1;128;44655111
32;2;2;2;1;32;294710666
32;1;2;1;1;32;525423704
2048;512;128;2;1;32;117374074
16;512;4;32;1;32;6896000
1024;512;128;2;512;32;94910075
32;1;8;1;1;32;2052433037
32;512;4;1;1;32;49009926
32;512;1;32;128;32;6049037
32;2;4;2;1;32;589063852
32;128;2;2;1;32;29939556
32;2048;2;32;1;256;2068148
4;512;1;32;1;32;6787408
32;64;2;16;1;256;11482222
32;2048;2;32;4096;256;34685334
32;2048;2;32;1;2;18446744073709551615
512;2048;128;2;1;256;120277778
128;2048;1;32;1;256;6075555
32;1;2;1;1;256;490779852
32;2048;2;32;1;4;36114963
32;2048;2;4;4;256;9205185
32;2048;2;32;128;256;2525334
8;2048;8;32;32;256;8740741
32;2048;4;1;1;1024;268298075
32;2048;1;32;1;256;2438222
32;2048;2;32;1;256;2193482
32;2048;8;32;1;256;7789333
32;2048;2;32;1;512;3519259
16;2048;4;2;512;256;21020740
32;1;2;1;1;256;497265185
32;16;2;1;1;256;48239703
64;2048;1;32;1;256;2792000
8;2;8;2;1;256;4608123555
128;2048;128;2;1;256;316215852
2;2048;2;32;128;256;12853037
32;2048;8;8;1;256;20125777
32;2048;2;64;1;256;2694963
1024;2048;128;2;128;256;53892889
128;2048;8;32;1;256;7733037
32;2048;2;32;1;128;2507260
32;1;4;1;1;256;969532444
32;256;2;32;1;256;3126518
32;2048;2;32;4;256;2320889
32;2048;2;32;512;256;4804444
32;2048;2;2;1;256;31241482
32;32;2;32;1;256;24171852
32;2048;2;32;8;256;2422963
32;2048;2;4;1;256;15108889
16;2048;4;32;1;1024;23365629
32;16;2;8;1;256;39144444
32;16;2;1;4;256;34833630
1024;2048;128;2;1;256;121341333
32;8;2;2;1;256;72235852
128;32;64;1;64;32;13677926
32;4096;32;2;1;256;278629334
32;16;2;1;1;1;56035852
512;64;128;2;4;128;877854370
32;8;8;2;1;256;276454519
16;2048;4;2;1;256;72620000
32;2048;2;32;64;256;2588296
1;256;1;128;2;64;58154666
128;16;32;2;128;32;9421778
2048;4096;32;1;512;16;40812444
8;1;8;1;1;32;8245314815
32;4;2;2;1;128;138078371
4;2048;2;32;1;1;142564445
32;2048;2;2;1;256;30192296
32;2048;2;32;1;1;79507260
1024;4;8;1;64;32;37767852
32;2048;32;2;1;256;278481926
32;2048;2;32;1;256;2110074
256;32;64;1;64;32;32548296
32;2048;2;64;1;256;2760740
32;2048;1;32;1;256;2188593
4096;2048;4;1;256;1;254657185
4;256;1;1;1;32;57592297
256;32;32;2;64;64;10856297
8;1024;4;1;2;1;133875259
32;2048;2;32;1;4096;133002815
32;2048;4;32;1024;256;7856297
32;128;2;8;1;256;7822223
256;16;32;2;32;32;7488000
128;32;32;2;64;32;7468148
256;64;32;4;64;64;12967852
4;2;1;1;64;256;928114667
1;1;1;1;4;256;7680205185
16;1;2;1;32;32;547914222
2048;4096;1;1;4;8;1437238371
16;2048;4;32;1;256;6591407
32;2048;2;8;1;256;7834222
32;2048;2;32;2;256;2542963
32;2048;2;1;1;256;53180149
32;2048;1;32;1;1024;3489926
32;2048;2;2;128;256;17472000
1;2048;1;32;1;4096;389945778
128;32;8;8;64;32;7179112
32;128;2;32;1;256;6143703
8;2048;2;32;1;256;6204889
32;2048;2;16;1;256;3930963
128;32;2;2;64;32;20483555
4;512;4;1;1024;4096;10117857185
128;2;2;2;4096;512;2368461037
1;1;1;1;32;8;8009778518
32;8;32;8;64;8;223497037
32;2048;2;32;256;1024;3668741
32;2048;8;32;1;2048;46462815
32;2048;4;32;1;256;4122666
32;1;2;1;1;256;488428000
8;512;8;2;1;256;278650519
32;2048;2;32;1;2048;11662963
32;1024;2;16;1;256;3955556
1024;2048;128;2;1;256;121313185
32;256;16;1;1;128;117778074
32;2048;2;32;1;64;2689926
64;1024;1;16;16;1024;4174815
8;128;4;32;1;256;47749185
1;1;1;1;16;2;6849120000
1;32;1;2;256;1;714580592
4;1024;2;4;16;1;38477926
64;1;64;1;16;1;1384284889
2048;2048;8;2;512;64;12897630
32;2;8;1;16;2048;139743852
32;2048;2;1;1;2048;269238519
256;2048;128;2;2;256;1621115111
32;2048;2;1;1024;256;140982815
32;2048;2;32;32;256;2545481
32;2048;1;32;1;256;2168445
32;1024;1;32;1;256;2200296
32;1;4;1;1;256;969525481
8;1024;8;32;1;128;14660148
32;2048;2;128;1;256;2628888
4;2048;2;8;1;256;40009037
32;2048;1;1;1;256;41333630
8;1;2;1;1024;8;1183485926
32;4;32;4;256;32;218516593
2048;2;1;1;8;32;96230222
256;8;256;1;1;128;980777037
32;2048;4;32;1;1024;11878370
32;2048;8;4;1;256;37407704
128;1;128;1;1;2;6027126667
32;4;2;4;64;256;79016889
16;2048;4;64;1;256;4097333
16;2048;4;32;1;64;4176741
16;2048;4;32;4096;256;15096444
1;2048;1;32;1;256;23325481
2;1;2;1;128;2048;4510465037
128;1;2;1;128;256;143533629
2048;2048;64;4;128;4096;8345777630
32;64;2;32;16;256;6755111
32;2048;2;32;512;1;141937482
16;1024;4;32;1;256;6650518
32;2048;4;64;1;256;4082222
32;512;4;8;1;256;11821778
128;4;32;1;4;8;215428000
64;1;64;1;64;4096;346617037
1;256;1;128;2;1;2947203556
1;4096;1;256;512;16;50043111
64;2048;1;8;4096;256;479528741
4;4096;2;32;1;16;4327408
64;256;1;32;2048;128;33318222
16;2048;4;32;1;512;12010519
32;4096;2;32;1;256;2149333
128;2048;128;2;4096;256;34468741
256;2048;128;2;1;256;158625037
4;2048;1;32;1;256;6239704
8;16;8;2;1;128;575147555
4096;2048;4;16;256;128;6561186
4;256;1;1;1;32;58026814
8;1024;4;4;2;256;37474222
1;1;1;1;64;256;7601809185
1;1;1;1;4;1;7451859555
32;1024;8;32;512;256;4461926
32;2;2;2;16;2048;143998371
64;2048;64;4;1;256;160374074
8;2048;8;32;1;256;23793185
32;2048;2;32;1024;256;9382963
64;256;1;32;4096;256;206612000
32;2048;2;32;256;256;2393777
512;1;2;1;32;16;49540148
2048;4096;1;1;4;4096;197768533926
4;2048;2;1;32;4096;73803018963
32;2048;32;2;1;1;78697185
128;1;2;1;4096;512;4572992889
32;512;2;64;1;256;2315556
64;4096;1;16;1;128;5898963
32;2048;2;16;1;512;6486074
32;2048;2;32;4096;512;34641334
32;4096;2;32;1;512;3516148
32;512;2;8;1;256;7854074
32;512;2;32;1;256;2115555
1;1;1;1;4;2;6124570666
64;1024;1;16;1;1024;4012445
1;8;1;2;2;256;1117761926
512;4;1;4;16;64;26441185
8;1024;2;128;256;32;8997481
4;1024;2;64;8;128;4663704
1;16;1;1;16;128;491708000
2048;2048;8;2;1;64;52334075
32;1024;2;64;1;256;2791851
64;2048;2;16;1;256;4295111
32;2048;1;8;1;256;8283852
32;4096;2;16;1;256;4029630
32;8;8;1;16;2048;139807408
8;1;2;1;1024;2048;1121709629
32;4;32;1;256;4096;392781482
256;512;4;4;8;32;17965334
256;8;256;1;2048;128;56469482
2;64;2;1;2;2048;2181275112
128;1;2;1;256;256;285672000
16;2048;8;32;1;256;11770666
32;1024;2;32;1;512;3146815
4;1;1;1;128;64;1943654519
128;2;1;2;4;8;43224444
64;32;64;1;1;4096;7415188741
16;256;2;1;2;512;72896889
1;512;1;256;512;16;405267555
8;16;2;2;256;128;71576889
32;2048;4;32;1;32;4700593
128;4096;32;2;1;256;74621037
4096;1;64;1;256;1;92204889
512;1;128;1;1;1;1621136148
1024;1024;32;2;2;4;1692371259
1;2;1;1;16;256;3821334222
1;512;1;128;4;1024;25132741
512;16;256;1;1024;16;58720000
32;4096;1;32;1;32;11781629
128;256;128;2;1;2048;2543436741
16;4096;2;32;1;128;2225629
128;2048;128;1;1;512;922193778
32;1024;2;32;1;256;2107112
1;4096;1;128;4;256;7049778
4;1;4;1;16;16;2223704148
1;2;1;2;4096;512;4787576296
1;8;1;4;128;8;1445811259
32;512;2;64;1;128;2357778
64;2048;1;16;512;1024;25274667
32;1024;4;4;1;256;22919259
512;128;1;4;16;4;17457630
8;1;1;1;1024;32;1978848593
4;1;2;1;8;32;2190766815
32;2048;1;16;1;64;6834518
64;1;1;1;1;512;124526223
64;1;64;1;16;4096;1383382519
4;8;2;2;512;64;289616296
32;2048;8;8;4;2048;58573037
1;1;1;1;2;2048;8404440148
32;2048;1;32;1;128;2829185
32;4096;2;128;1;64;12163556
32;1;8;1;1;256;1942579260
1;32;1;4;1;512;290884593
256;4;4;4;1;128;38549037
2;1;1;1;2048;128;3873300889
2;64;2;4;128;32;77445926
256;256;128;2;1;128;120522074
16;512;4;8;1;256;20177333
128;1;2;1;128;256;143544593
2048;1;64;1;1;64;268512296
64;2;4;2;4;8;74030518
1024;32;64;4;64;4096;171341334
32;1024;4;64;1;128;4152148
32;4096;2;8;1;1024;22599556
32;64;2;32;1;256;11466815
32;2048;2;2;1;256;30200000
32;2;8;2;1;256;1169975112
1;256;1;128;2;32;113370667
2048;1;32;1;32;16;40442074
128;16;32;4;256;1;72592889
4096;512;1;8;256;128;14542667
32;512;1;32;1;256;2181630
32;2048;4;32;4096;128;30115556
1;32;1;4;1;32;308163111
8;1024;1;1;2;4;74508741
4;32;1;1;64;256;122213630
1;16;1;1;32;1024;1913109185
32;512;2;64;4096;256;38486370
8;2048;8;32;1;1024;113936148
512;1;2;1;32;16;45572000
1;1;1;1;4;256;7678150815
64;1;32;1;16;16;402995408
128;2;2;2;2048;512;1172146963
32;2048;2;64;1;1024;3527852
32;1024;2;32;2048;256;17423704
1;8;1;8;8;8;1356119555
8;1024;1;16;2;64;4025926
32;1024;2;128;2;256;2344592
512;128;1;1;16;4;344239259
32;2048;2;32;2048;128;17431407
256;2048;128;2;2048;256;33770963
8;512;2;64;256;1;249026815
2048;1024;128;1;2;128;6141997037
64;16;64;1;8;1;338817185
2048;2048;8;2;128;2;129553481
256;2048;64;4;1;256;60171703
32;4096;2;1;1;64;47094667
32;2048;8;1;256;2048;139411852
8;1;1;1;1024;2048;2006975704
4;64;4;4;64;64;37974074
256;8;4;4;8;32;7276889
4;2048;2;32;1;128;6147408
1024;8;256;1;2048;128;53368889
2;1;2;1;32;32;4394790667
128;1;2;1;128;256;143531555
2048;1;1;1;128;128;253699111
32;2048;2;16;64;256;3318814
4;2048;2;32;4096;256;12933778
32;2048;32;1;1;256;466810666
8;2048;8;1;1;256;466308592
64;2048;2;32;1;256;2152593
128;2;2;2;4;512;39570963
1024;32;64;1;64;128;92742075
1;256;1;1;128;256;479100741
2048;2048;32;1;64;4;628780000
32;2048;2;64;64;64;3265778
16;2048;4;32;1;128;4261038
16;2048;4;16;1;256;11470074
16;1024;1;32;1;256;2089185
16;4096;4;32;1;256;6681926
8;256;4;64;256;128;14812741
2048;2048;4;4;1;128;36677926
4;256;1;1;1;16;63713481
8;1024;1;1;2;4;73873926
128;4096;1;32;1;128;12032149
32;4096;2;32;4096;256;36804296
32;2048;2;128;1;128;2766815
32;1;2;1;1;256;498897481
4096;2048;8;32;1;256;10148741
32;2048;8;32;1;2;18446744073709551615
2048;64;128;2;1;256;119290074
32;16;2;2;1;16;47354815
32;2048;2;32;16;4;21471704
4096;2048;16;1;1;256;48407555
32;2048;16;1;1;256;236592741
32;128;2;32;1;1;135067111
2;2048;2;32;1;256;23353630
32;2048;2;32;4;1024;4456000
4096;2048;128;2;1;256;120116741
32;2;2;2;1;256;292758222
32;2048;2;32;1;1;80172889
32;2048;2;32;16;256;2388888
32;128;2;32;1;4096;23687111
32;2048;2;32;1;1024;6063555
32;2048;4;8;1;256;10510963
32;1;2;1;1;256;496534222
2;2048;2;32;4;256;13088593
1;2048;1;32;1;256;23323259
1;2048;1;32;1;256;23356297
32;1;2;1;1;2;441159259
32;2;2;2;2048;256;1176576740
1;32;1;8;64;4;755261777
1;512;1;128;4;32;99434222
32;1024;4;32;1;256;4090371
32;2048;16;1;64;64;8901482
4;8;2;2;1;256;580923260
32;1;2;1;32;16;276410370
1;8;1;8;4096;1024;1334960000
64;16;32;1;16;16;26252444
128;2;2;2;16;8;40354223
1;8;1;8;16;128;1288380889
32;2048;1;32;1024;256;15821185
1;8;1;2;1;256;1145554519
32;64;2;4;1;256;15178371
64;8;2;1;512;128;138862075
32;256;2;128;2;2048;2372297
512;1;1;1;16;4;87710815
8;128;2;128;256;512;17417629
2048;2048;128;2;1;256;119380000
32;128;2;32;1;2048;11696593
1024;2048;128;2;1;4096;119907546222
32;2048;2;32;1;8;26011852
4;1;2;1;64;128;2175209630
64;16;64;2;1024;1;145272148
2048;2048;8;8;512;64;7735407
4096;2048;128;2;1;256;120196445
32;2048;2;32;64;8;18469333
32;2048;8;32;1;16;15716593
64;2048;1;8;1;512;8305481
128;4096;128;2;1;256;316728592
32;1024;4;32;1;512;6610074
32;8;8;2;4;256;72630074
8;1;1;1;1024;2048;2006231703
1;64;1;4;64;64;152228000
256;32;4;16;512;8;55121630
1;1;1;1;4;128;7690667704
1;64;1;4;128;32;153961926
2;1;2;1;128;256;4568973778
8;1;4;1;2;64;2212494519
32;64;2;8;1;256;10482815
32;64;1;32;1;256;6337037
32;2048;1;32;1;64;5361037
1024;8;128;2;1;256;163321778
64;2048;1;32;1;1;76572889
1;2;1;2;4;512;4701209185
1024;32;64;1;64;128;94548000
1;256;1;128;1;64;100690815
2048;1;2;1;1;128;48452445
64;2048;4;32;1;256;4399408
32;1;4;1;1;256;969840593
32;2048;32;2;1;2;31426222
1;256;1;64;256;128;52135556
1;2048;1;4;256;128;73914223
8;2048;8;16;1;256;46251259
256;16;1;4;1;16;15192445
8;1;1;1;2;4;1069109333
4;32;1;1;2;1024;479276889
128;1;128;1;4;1024;9087393482
64;2048;1;32;1;128;5665926
8;2048;8;1;1;64;115816296
32;4096;4;1;1;256;78654074
32;2048;4;32;1;64;5068000
32;128;2;32;1;1024;6066222
16;2048;16;1;1;256;467810667
4;2048;2;32;1;256;11918963
32;1;1;1;2048;256;3702466519
4;1;2;1;32;16;2207803703
1;4096;1;128;32;256;6888889
64;16;8;1;512;16;14298371
16;2;1;2;16;8;296062667
2;8;1;8;16;128;643196593
4096;1024;1;1;1;1;307141630
32;128;2;16;1;256;5948889
16;2048;4;32;4096;512;15463555
32;1;2;1;2;256;275741926
64;128;4;4;16;4;7023556
32;1024;32;1;256;32;15064000
4;1024;2;64;4;128;4772297
32;2048;2;16;1;1024;11507408
32;32;16;1;1;256;235494963
32;1;2;1;4096;128;4386371852
32;4096;4;32;1;256;4113778
128;4096;1;32;1;256;6335704
32;512;4;32;4096;256;30884444
16;2048;4;16;1;128;6573037
4;2048;4;32;1;256;23232000
64;16;64;2;1;1;7950726450
2048;2048;1;8;2048;1;153240593
32;2048;8;8;4;32;8783407
8;1;2;1;1024;2048;1121845037
4096;64;32;4;64;256;30049630
256;8;4;2;8;32;11719259
1;8;1;2;2048;128;1149990074
2;64;2;4;16;32;76298962
32;2048;2;32;2048;256;17434666
128;1;2;1;128;512;143981778
32;2048;2;64;1;16;28766370
32;2048;2;64;1;128;3129481
2048;1;64;1;128;1024;48499407
1;2;1;2;1024;512;4710584149
1024;32;64;1;4;128;803268148
1;1;1;1;8;64;7636557630
2048;1;32;1;32;1024;38634518
8;256;4;64;256;64;14779259
32;4096;2;32;2048;256;18483556
128;2048;128;1;1;256;458350370
64;2048;1;64;2048;128;12794963
64;4096;1;32;1;256;2945037
4096;32;4;16;512;128;16819704
1;16;1;4;1;2048;1163595555
8;1024;4;32;512;4;35266371
32;32;1;1;64;256;44585185
512;64;128;2;1;4;125302371
2048;1;2;1;512;128;548602222
1;4096;1;64;32;256;12738074
64;16;1;1;512;16;179850074
64;1024;32;1;1;64;63204000
32;128;2;32;1;128;6015556
32;2048;2;64;2048;128;15322074
128;256;2;2;16;8;39162074
2;8;1;1;16;128;474928444
64;512;4;16;1;1024;11497185
32;1024;2;128;2;4;68639556
64;128;4;4;512;4;22803259
8;1024;8;1;256;1024;274660148
32;2048;2;64;4096;256;36132740
32;2048;4;32;4096;256;30860740
4;1024;2;64;1;128;7030963
64;16;64;1;1024;1;68157481
512;2048;1;8;512;512;54370962
1;2048;1;1;4;32;61984445
64;1024;1;32;1;256;3024593
32;512;1;32;1;512;2146667
1;1;1;1;1024;2048;7790310222
2048;16;32;2;64;256;40758223
256;32;1;4;32;32;23621482
1024;8;4;2;4;32;14044000
2;64;1;4;16;2048;583286963
1;1;1;1;128;512;7605674667
2048;1;64;1;128;8;63315111
4096;2;1;2;512;512;585786074
32;2048;8;32;4096;512;17348741
128;2048;128;2;1;128;160233481
1;32;1;8;64;128;329556000
1;256;1;128;4;64;100364000
2048;1;32;1;32;1024;38575703
2048;256;64;1;256;64;98998371
32;512;2;16;1;256;3962963
32;4096;2;16;1;4096;959122518
32;1;2;1;2048;512;2292867259
32;128;2;64;1;256;6260000
1;2048;1;16;1024;128;22540000
256;16;1;4;1;4;16191408
4096;1024;64;1;2;4;24008335704
1024;32;1;1;64;64;51851111
32;2048;2;64;1;512;2265778
64;1024;1;32;4096;256;127257185
32;256;2;8;1;256;7866666
32;2048;2;32;1024;16;15643112
1;16;1;4;4;1024;586508297
512;1;2;1;32;16;48296000
128;4096;1;4;32;256;15961778
64;16;32;2;512;16;19316148
128;256;2;2;16;16;31257185
