GLOBAL_SIZE_0;GLOBAL_SIZE_1;LOCAL_SIZE_0;LOCAL_SIZE_1;cost
64;16;4;1;977113972
2;8;2;4;1809212766
128;4096;1;128;442588131
128;1;32;1;372740514
64;1;32;1;748029877
128;1;16;1;415328419
128;4096;128;2;78454499
128;1;128;1;898791474
4096;4096;16;4;100204004
2048;2048;1;1;285368882
128;16;4;8;1440102120
4096;256;256;16;18446744073709551615
128;4096;8;1;79060335
1;4096;1;2;513141424
2048;4096;128;2;89208039
32;4096;2;2;86484834
1;8;1;4;3684807060
1;1;1;1;30872552537
16;2;2;2;1313542128
128;4096;32;2;77209082
256;4096;32;1;77679292
32;4096;32;2;88517125
128;4096;16;2;76586710
64;4096;16;2;82354626
128;4096;16;4;76656835
128;1024;16;2;96555252
128;1;64;1;379097638
256;4096;16;4;74278375
64;4096;32;2;81021960
1024;4096;16;4;77329878
32;1;16;1;1396313332
256;2048;16;4;79722586
256;4096;32;4;75772957
256;64;2;32;1402849167
4096;256;64;2;93320461
2;64;2;8;625988089
1024;512;16;128;18446744073709551615
256;4096;8;4;74968959
256;1;16;1;209865542
256;4096;64;4;78044166
256;4096;16;32;18446744073709551615
256;4096;16;8;74744878
256;4096;1;4;80359627
4096;64;1;1;426063463
256;4096;16;2;76161084
1;1;1;1;30872841620
1024;512;64;8;18446744073709551615
64;1024;8;4;111848127
256;4096;1;4;80402875
256;32;16;4;1296069497
64;4096;16;4;82913167
8;2;1;2;1867713709
64;1;2;1;707809931
4096;512;128;2;93743795
64;64;16;64;18446744073709551615
256;4096;4;4;78495919
128;4096;32;4;77323378
32;4096;8;4;90744542
64;4096;32;4;81063749
4096;512;256;16;18446744073709551615
4096;4096;16;1;101013877
64;512;1;128;1143266768
2;1024;1;16;573443338
512;256;128;2;107310379
256;128;32;8;153017834
1;4096;1;2;512677213
1;1024;1;4;1078582131
256;2048;8;4;80868627
256;1024;32;4;87320003
1;4096;1;1;365093128
64;4096;4;4;82533504
128;4096;16;256;18446744073709551615
256;4096;256;4;18446744073709551615
2048;1024;64;4;81219377
256;2048;32;4;79261545
1;1;1;1;30872689828
1024;2048;32;64;18446744073709551615
1;8;1;4;3684466722
512;1;1;1;335711793
512;256;64;8;18446744073709551615
256;2048;16;2;79637292
256;1024;16;8;93283961
4096;1024;128;4;18446744073709551615
4096;2048;32;4;92141753
1024;512;128;4;18446744073709551615
32;4096;16;4;90113835
512;4096;16;4;74674001
128;4;64;1;1174226422
2048;1;4;1;1552841727
128;512;128;4;18446744073709551615
1;8;1;2;3684070086
256;1;16;1;216701587
256;4096;16;1;77694253
1;4096;1;1;364668376
256;1;8;1;213794506
4096;2048;64;2;95167458
1024;2048;32;4;75042254
256;4096;128;8;18446744073709551615
32;1;4;1;1379299297
1;4096;1;4;1044012951
2048;4096;16;64;18446744073709551615
256;2;16;1;1044815869
256;1024;16;4;91754296
4096;1;16;1;1599018000
1024;4096;16;2;79339709
4096;4096;32;4;98432128
2;1;2;1;15263087136
128;32;16;16;1369718434
64;16;16;4;1175204130
4096;512;32;4;89090419
512;4096;64;4;76906917
256;4096;2;4;79955292
4096;256;8;16;282078759
512;2048;32;4;79035420
64;2048;16;2;93727711
256;4096;32;2;76561420
128;4096;16;16;79640586
256;4096;8;8;81590586
256;4096;64;8;18446744073709551615
256;2048;16;8;79725212
32;2048;16;4;100361294
256;1;32;1;215850713
4096;2048;64;4;93561001
1024;64;8;2;724648188
64;128;8;8;626927013
2;1024;2;128;457238470
4096;256;8;4;268631176
256;4096;16;64;18446744073709551615
8;4096;1;1;242440671
2048;4096;16;4;84881460
256;4096;16;16;75440336
512;2048;16;4;76453752
128;4096;16;8;78439880
128;4096;8;4;77179543
512;4096;16;1;77473421
256;1;64;1;213210377
128;1;16;1;402462048
512;4096;16;2;75359375
512;4096;32;4;75780083
128;2048;8;4;86303168
512;4096;16;8;74025001
1024;4096;16;8;74014831
512;1;16;1;940461034
512;256;16;8;209309045
1024;1;16;1;1363097614
512;4096;8;8;83056000
1024;4096;8;8;83302958
512;4096;32;8;75806462
1024;1024;16;8;77231460
1024;4096;32;8;75173670
1024;4096;16;32;18446744073709551615
1024;2048;64;8;18446744073709551615
4096;4096;16;8;98232708
1024;4096;64;8;18446744073709551615
512;2048;32;8;78635251
2048;4096;16;8;79725378
1024;1;8;1;1371164547
1024;4096;4;8;91752126
1024;4096;16;16;73264919
2048;4096;16;16;78353211
1024;1;16;1;1315368925
512;4096;16;16;73749876
1024;4096;8;16;81974335
1024;4096;32;16;18446744073709551615
2048;4096;32;16;18446744073709551615
1024;1024;8;16;98540878
1024;2048;8;8;84195835
2048;4096;8;16;87533667
4096;4096;8;32;99186005
256;2048;16;16;80982334
1024;4096;8;32;78639751
1024;1024;64;16;18446744073709551615
1024;1;32;1;1239905578
256;1;16;1;206916050
1024;2048;16;8;74512833
1024;1024;16;16;77905378
512;4096;4;16;104097129
4096;4096;16;16;94604835
2048;4096;32;32;18446744073709551615
1024;2048;4;4;82152627
1024;2048;32;16;18446744073709551615
1024;4096;64;32;18446744073709551615
1024;2048;16;16;74200749
1024;512;16;16;129460584
1024;1024;4;32;183874962
4096;1;32;1;1609741518
512;4096;32;16;18446744073709551615
256;2048;128;32;18446744073709551615
2048;1;16;1;1484539169
512;4096;16;32;18446744073709551615
512;2048;16;16;76852296
512;1024;16;16;82999127
1024;4096;64;16;18446744073709551615
2048;2048;16;16;77670169
2048;4096;16;32;18446744073709551615
4096;4096;8;16;101084542
1;4096;1;8;1043806078
1024;4096;4;16;108816624
1024;2048;8;16;86223041
1024;4096;32;32;18446744073709551615
256;1;16;1;219291085
1024;4096;16;64;18446744073709551615
512;1;16;1;887594388
4096;1;16;1;1579534544
4096;4096;2;16;137473583
1024;4096;16;128;18446744073709551615
1;4096;1;16;1039299895
4096;1;16;1;1564641969
512;1;16;1;1100654496
1024;1;32;1;1279372593
64;4096;16;32;18446744073709551615
512;2048;32;16;18446744073709551615
2048;1024;16;32;18446744073709551615
128;1024;16;16;105110752
1024;1;8;1;1191856799
1024;1;32;1;1343496987
512;4096;8;16;81751753
4096;2048;16;8;92513293
4096;4096;16;128;18446744073709551615
1024;4096;4;32;134788667
64;4096;16;16;89250417
2048;2048;16;32;18446744073709551615
256;4096;4;32;172138462
1024;1;4;1;1280298295
2048;4096;64;16;18446744073709551615
1024;2048;16;32;18446744073709551615
1024;1;16;1;1349649282
1024;512;32;16;18446744073709551615
512;2048;16;8;77038585
1024;4096;32;4;76288793
1024;4096;8;64;18446744073709551615
1024;1;64;1;1312786711
1024;2048;16;64;18446744073709551615
2048;4096;8;32;84450918
2048;4096;4;8;97933128
512;4096;64;16;18446744073709551615
256;2048;16;64;18446744073709551615
512;2048;8;16;90386958
256;4096;8;16;83617501
1024;1024;16;32;18446744073709551615
512;1;8;1;1031481249
1024;2048;16;4;75833169
1024;512;16;32;18446744073709551615
4096;4096;32;16;18446744073709551615
1024;4096;32;64;18446744073709551615
1;4096;1;128;1029684648
2048;2048;1;4;86960793
128;16;4;8;1442338181
1;1024;1;16;1078199503
16;4096;16;16;85175542
1024;4096;16;1;80790168
1024;4096;64;4;79830754
1024;4096;2;16;125797668
1024;64;16;16;1121881488
256;1;4;1;211504926
4096;1;64;1;1621078675
2;64;2;8;597303502
1024;1;16;1;1111761824
1024;1;64;1;1296013086
512;2048;8;32;89507750
512;2048;16;32;18446744073709551615
1024;4;16;2;1904992609
2048;4096;16;128;18446744073709551615
4096;4096;64;32;18446744073709551615
8;2;1;1;1866385869
32;1;4;1;1381402424
4096;512;32;16;18446744073709551615
4096;4096;16;2;98757126
1024;256;16;16;269254053
1024;1;16;1;1344486756
4096;2048;32;16;18446744073709551615
1024;512;32;4;83212796
4096;1;8;1;1592957335
1024;512;8;16;166709548
512;4096;8;32;80664500
256;4096;64;16;18446744073709551615
1024;1;64;1;1267462875
1;4096;1;16;1039472021
4096;4096;16;32;18446744073709551615
512;1;8;1;1081742670
2048;1;32;1;1501099146
1;4096;1;16;1039048876
1024;1024;32;16;18446744073709551615
1024;1;16;1;1331087389
2048;4096;32;8;82426249
2048;1024;16;16;79712252
1;4096;1;8;1040257730
1024;1;4;1;1332048430
1024;2048;32;8;74908666
256;1024;32;16;18446744073709551615
256;4096;32;16;18446744073709551615
1;4096;1;32;1039226775
4096;2048;16;16;91028959
1024;2048;64;16;18446744073709551615
512;1;32;1;1009215998
2048;4096;4;16;127348209
1;4096;1;32;1037374703
256;4096;32;8;77312502
1024;2048;16;2;78919585
256;1;8;1;209967423
1;4096;1;16;1038041297
2048;2048;128;16;18446744073709551615
256;1;32;1;211588049
1024;256;8;16;323492257
4096;512;16;16;93905750
1024;1;16;1;1361010734
256;512;16;16;127943710
2048;2048;16;8;77831878
1024;1;8;1;1298474259
1024;1024;32;4;81459002
64;16;16;16;1094227247
1024;4096;256;1;80495378
1024;8;16;1;616063557
64;512;2;128;713752542
2;1;1;1;15264735344
1;2048;1;64;1063332831
1;8;1;4;3684637252
512;4096;2;16;129059878
1024;4096;2;8;109932001
512;1;1;1;335739879
128;64;64;64;18446744073709551615
1;1;1;1;30872606078
1;512;1;4;1110861750
2048;512;64;16;18446744073709551615
1024;4096;8;256;18446744073709551615
1024;4096;128;16;18446744073709551615
1024;1;16;1;1316293476
256;1;8;1;203761839
1;128;1;32;638900552
1024;1;32;1;1297044798
1024;4096;128;8;18446744073709551615
1;1;1;1;30872354542
2;16;2;16;926731100
1024;512;1;16;320256086
128;2048;64;16;18446744073709551615
1;16;1;4;1858895584
4096;1;8;1;1566898412
2048;2048;8;16;89341587
1024;16;16;16;1779473231
8;4096;1;16;383256803
4;4096;2;16;247209376
512;4096;64;64;18446744073709551615
2048;16;4;2;1483686795
1;128;1;8;641727469
64;1024;32;128;18446744073709551615
128;512;1;128;1179575916
1024;2048;128;16;18446744073709551615
1;4096;1;16;1040283305
512;1024;4;16;193959709
512;4096;128;8;18446744073709551615
512;1;64;1;1028036913
1024;1024;4;16;192963382
2048;4096;8;8;90183834
4096;1024;8;16;102482753
256;1024;16;16;96167003
512;4096;16;64;18446744073709551615
1024;4096;128;64;18446744073709551615
256;4096;8;64;18446744073709551615
512;512;16;16;126181295
4096;1;16;1;1573330715
2;4096;1;16;528215547
256;1024;16;64;18446744073709551615
256;4096;2;64;267132507
256;1;4;1;207042291
1024;4096;128;32;18446744073709551615
1024;1024;16;2;79046792
256;4096;8;32;84438833
2048;1;1;1;294600086
128;16;2;8;1322131821
1;1024;1;256;1065883495
256;1;128;1;817540359
32;4096;16;16;93569169
512;1;16;1;912969518
2048;512;16;32;18446744073709551615
256;1;16;1;210687091
512;4096;4;8;91558957
128;4096;16;32;18446744073709551615
256;1;4;1;211981092
1024;512;4;16;216906379
1024;4096;64;64;18446744073709551615
4096;4096;8;4;97284419
256;4096;32;32;18446744073709551615
1;4096;1;64;1041276987
1;2048;1;16;1056907560
256;4096;4;8;90923667
1024;512;16;8;113039546
2048;1;16;1;1443347264
512;4096;8;4;76255461
1;4096;1;8;1037083485
4096;32;64;2;902210841
1024;4096;1;256;494806590
1024;1;16;1;1169571536
2;8;1;8;1808079189
4096;1024;16;16;90869458
1024;1;16;1;1361366165
8;2;1;2;1869247267
64;1;2;1;710271903
64;512;2;1;134836375
4096;1;16;1;1508508649
1;512;1;128;1102423823
2;1024;1;1;235848295
512;1024;8;8;109809295
1;1;1;1;30872684578
4096;4096;16;64;18446744073709551615
512;256;16;64;18446744073709551615
1024;1;2;1;348613847
1024;2048;64;32;18446744073709551615
128;4096;8;64;18446744073709551615
1024;512;8;8;178079088
512;1;4;1;968240565
8;4096;2;2;110008085
128;2048;16;16;89733544
512;1024;8;16;105261129
1;1;1;1;30872787328
512;1;32;1;1108499389
4096;1;32;1;1569375981
1024;1024;16;4;78465086
1024;4096;8;4;79633586
512;1;32;1;1071500598
256;2048;4;16;160023208
4096;2048;16;64;18446744073709551615
1024;2;16;1;1455055841
1024;4096;2;32;185427294
1;4096;1;1;364050678
1024;4096;16;1;80840003
8;64;1;16;1040905012
1024;4096;16;256;18446744073709551615
1024;4096;1;16;145761500
1024;4096;1;16;145541212
64;4096;8;8;89737751
256;4096;128;16;18446744073709551615
1024;4096;32;128;18446744073709551615
128;1;32;1;375857599
4096;2048;32;64;18446744073709551615
1;1;1;1;30872814494
4;1;2;1;7248311167
128;4;64;4;1173354484
2048;4096;2;16;133155463
2048;1;8;1;1344945668
128;2048;16;32;18446744073709551615
1024;512;32;8;83400878
32;2048;4;64;178468211
1;64;1;4;1180518414
1;256;1;256;813920798
1024;128;32;4;300719338
256;4096;2;8;99286750
64;1;16;1;692391465
128;512;16;8;130478751
256;4;128;1;1389423780
1;1;1;1;30872700578
2;16;2;16;926812631
16;32;2;1;172481292
128;4096;8;16;87996918
2048;4096;64;8;18446744073709551615
128;1;8;1;403302583
1024;2048;4;16;147189294
128;512;16;16;132861418
1024;1;8;1;1327591182
1024;1024;64;32;18446744073709551615
1024;256;4;16;385490056
1024;1024;16;64;18446744073709551615
512;1;8;1;970984394
512;1024;32;32;18446744073709551615
2048;1;16;1;1512513337
4096;2048;16;32;18446744073709551615
2048;4096;256;16;18446744073709551615
256;1024;8;16;113658547
4096;4096;64;16;18446744073709551615
256;4096;4;16;104067503
1;4096;1;4;1042040924
1024;512;16;4;135154544
1;512;1;16;1108612620
1024;4096;256;16;18446744073709551615
2048;32;2;16;1496539834
8;4096;2;16;230791792
1;1;1;1;30872781119
128;2048;4;16;154734794
1;2048;1;8;1056864528
2048;1;32;1;1487451686
2048;4096;8;4;85889668
2048;512;16;16;85177378
4096;4096;4;16;131901837
64;4;16;2;196815917
1024;1;8;1;1316163336
1;2;1;2;15226725333
2;1024;2;16;459255711
4096;2048;16;128;18446744073709551615
128;4096;1;128;444954639
1;2048;1;4;1062949234
128;256;2;256;18446744073709551615
4;1024;2;256;18446744073709551615
1;1;1;1;30872718828
4096;256;256;2;18446744073709551615
2;1;2;1;15262623781
1;4096;1;128;1033464445
2048;2048;32;16;18446744073709551615
512;1;2;1;208502462
1;2048;1;4;1063498604
512;2048;4;16;158938336
128;2048;16;8;88165961
4096;1;8;1;1549963840
4096;4096;32;64;18446744073709551615
1024;2048;32;32;18446744073709551615
8;2;2;1;1871735853
64;1;4;1;713837845
64;8;2;2;1126583120
4096;4096;4;2;100975168
256;256;16;16;159962378
1024;2;128;1;1579891840
4096;1024;32;16;18446744073709551615
64;1;2;1;750784146
2;4096;1;1;233605961
1024;256;16;4;232189211
1024;1;32;1;1318967757
1024;256;16;8;226618213
128;1;16;1;402631755
512;2048;64;32;18446744073709551615
512;2048;8;4;77412624
1024;4096;1;128;310208839
1024;1024;32;8;78635838
1024;2048;8;4;78146003
1024;2048;8;64;18446744073709551615
2048;2048;8;8;87624835
1024;4096;4;4;81232964
1;1024;1;16;1081005377
1;2048;1;16;1063863432
1;2048;1;32;1058324047
1;1;1;1;30872989036
1;1;1;1;30873050875
128;4;64;1;1173000542
4096;1024;16;8;92157586
128;2048;4;64;169321212
1;512;1;8;1115574958
2048;4096;128;16;18446744073709551615
32;1024;16;8;111428879
512;1024;16;8;81514252
1;128;1;32;636840186
1024;2048;1;4;82927752
1024;1;128;1;1356817438
1;4096;1;4;1045732954
1024;256;16;2;216068005
1024;32;16;16;1502135145
2;32;2;2;1136624814
16;32;2;16;1212755417
64;512;16;8;131993960
1024;2;4;2;1592579852
2048;1;64;1;1512053522
1;4096;1;16;1045069826
1024;1024;32;64;18446744073709551615
1;1024;1;8;1081823859
2048;4096;1;16;146510835
64;32;8;8;1119344877
1;1;1;1;30872395209
128;4096;1;1;265307004
256;1;1;1;389789594
1024;1;8;1;1134137045
128;4096;16;64;18446744073709551615
4096;4096;32;8;95939628
4096;1024;64;16;18446744073709551615
2048;1;4;1;1446228703
1024;4096;2;1;139602379
128;16;128;8;18446744073709551615
1;1024;1;1;407664009
256;1;4;1;220330504
64;256;64;2;122792834
128;4096;4;16;103914501
1024;2048;128;32;18446744073709551615
256;128;16;8;578880053
1;4096;1;16;1041178913
2;256;2;128;578803500
1;4096;1;128;1030664697
256;512;1;1;314495634
64;1;2;1;704332020
4;4096;2;8;220199672
128;4;2;1;141126296
1024;1024;32;32;18446744073709551615
2048;1;16;1;1494481331
1024;2048;16;128;18446744073709551615
1024;1;32;1;1180777587
64;1024;2;1;134932671
32;4096;16;2;92230208
8;1;1;1;3794839875
4;1;1;1;7237437728
1;1024;1;32;1080528902
1;1;1;1;30872394453
512;1;1;1;339821626
128;4;64;4;1094620113
2048;1024;8;16;96379586
128;1;16;1;391821968
1024;2048;8;32;84743087
128;4096;8;32;89161461
256;1024;64;16;18446744073709551615
1024;64;16;4;819085841
1024;128;16;16;642757753
4096;4096;32;32;18446744073709551615
256;4096;32;64;18446744073709551615
1024;512;16;64;18446744073709551615
1024;512;8;32;156658001
256;2048;32;16;18446744073709551615
1024;2048;2;16;185216333
2048;4096;4;4;85465167
1024;4096;4;64;137941251
1024;1;4;1;1316642404
2048;4096;64;32;18446744073709551615
2048;1024;16;8;80316251
512;4096;4;32;160863379
4096;2048;4;16;138033959
128;8;4;4;1271639132
1;1;1;1;30872696953
1;128;1;32;637947176
4;1;4;1;7242375074
1024;4;16;2;1886618157
1024;2048;16;1;85602336
128;4096;32;16;18446744073709551615
1024;8;1;1;364119921
1024;4096;128;1;80358670
1;128;1;1;710570307
2;16;2;4;926783180
16;2048;2;1;138362297
2048;2048;8;32;86181001
8;512;1;16;741503885
32;1024;16;16;118480380
1;4096;1;256;1033812629
256;1;16;1;208659087
64;512;32;8;123112628
512;64;8;1;249249834
1;128;1;8;640595298
2;4096;1;128;544645182
512;256;256;64;18446744073709551615
512;2048;1;4;83589666
128;1;2;1;404776428
1;2048;1;1;381929926
2048;4096;64;4;86487000
2048;2048;64;16;18446744073709551615
512;4096;128;16;18446744073709551615
1024;4096;32;2;79521544
1024;1;128;1;1316466470
2048;4096;32;4;84251086
1;2048;1;8;1059009689
1024;256;32;16;18446744073709551615
1024;1024;8;32;99144709
2048;512;16;64;18446744073709551615
1024;1;32;1;1371850373
4096;4096;128;32;18446744073709551615
512;1;8;1;995960457
1024;256;32;32;18446744073709551615
1024;256;16;128;18446744073709551615
1024;512;64;32;18446744073709551615
512;1;16;1;1076543269
1024;1;16;1;1331820917
8;4096;1;16;382192517
1024;4;16;1;111800876
1;32;1;16;1477729197
512;16;16;16;1769935298
64;4096;4;16;115579501
256;1;32;1;210997259
64;512;64;2;109618169
16;256;4;128;18446744073709551615
