GLOBAL_SIZE_0;GLOBAL_SIZE_1;LOCAL_SIZE_0;LOCAL_SIZE_1;v_TP_127;v_TP_128;cost
4;256;4;64;2047;1;249301088
1;8;1;2;2;1;5994015616
2048;128;4;64;178;2;9096992
32;1;4;1;1;2;3403049536
2048;256;16;64;178;2;20108256
2048;128;4;1;178;1;125305344
2048;128;8;64;178;2;10631168
2048;128;4;4;178;2;17551616
4;16;1;16;178;2047;18446744073709551615
64;1024;8;256;89;1;18446744073709551615
16;8;8;2;2;2047;224115456
2;1;1;1;1;1;33527525184
4;8;1;8;2;46;1647788224
4096;32;256;2;1;2047;12276832
2048;64;4;64;89;2;8272032
128;512;16;2;1;23;15668064
2048;64;16;64;89;2;25528896
2048;128;4;64;89;2;7164608
512;64;4;64;178;2;14333472
1;64;1;64;89;2;826354048
1;512;1;64;89;1;123160576
2048;128;2;64;89;2;4426336
2048;512;2;64;46;2;3615168
1024;128;16;64;89;2;25639520
2048;512;16;512;46;2;18446744073709551615
4096;512;4;64;46;2;5560800
2048;1024;1;128;46;2;5589824
2048;512;2;64;46;23;3226432
1;2048;1;64;46;46;34188704
2048;512;1;64;46;89;20445248
2048;512;4;64;46;23;2440256
2048;2048;2;64;46;23;3128576
512;512;2;64;46;46;6205152
2048;1024;4;64;46;23;2446688
1024;1024;4;128;46;23;3432832
2048;512;4;64;46;2;5744704
4096;512;2;16;46;23;6514464
1024;2048;2;64;89;2;3362080
2048;512;1;128;23;23;6255808
2048;512;4;16;46;23;3417376
2048;512;8;64;46;23;2519232
2048;256;4;64;46;23;2404256
2048;1024;4;128;23;23;6301856
2048;1024;2;64;46;23;3166656
2048;256;1;64;46;23;5823072
2048;256;32;32;46;23;4946336
512;256;4;64;46;23;2427584
1;2;1;1;89;1;13651015136
4096;256;4;64;46;23;2451072
2048;256;4;32;46;23;2703040
1;128;1;64;46;46;497294528
2048;256;8;64;46;23;2605568
2048;256;4;64;23;23;3464384
2048;256;4;64;46;2;7159200
4096;256;4;32;46;23;2759968
4;16;2;8;89;2047;18446744073709551615
512;256;4;256;46;23;6264608
4096;256;8;64;46;23;2639680
4096;256;1;64;2;46;45790784
256;32;8;4;46;89;31200384
128;256;32;64;2047;178;18446744073709551615
128;32;64;2;46;23;22411520
64;1024;32;256;4094;2;18446744073709551615
2048;256;4;16;178;23;15273984
2048;256;4;8;2047;23;18446744073709551615
2048;16;4;2;46;2;34309568
2048;128;4;64;89;23;2944320
2048;256;4;64;89;23;2797056
2048;256;1;64;2;23;39359744
2048;64;4;64;46;23;2391392
2048;16;4;2;46;23;17196224
2048;64;4;2;46;23;17070304
2048;64;4;1;46;23;32518592
2048;64;4;64;46;2;8670080
2048;64;8;64;46;23;2948352
1;64;1;64;46;2;844892192
512;8;4;4;46;23;10390368
2048;64;2;64;23;23;4059232
2048;64;4;32;46;23;2911136
2048;32;4;32;46;2;8307808
2048;64;8;64;23;23;4482496
2048;64;8;64;46;2;13339872
512;64;4;64;23;23;3790592
2048;32;1;1;23;23;60115136
16;2048;16;8;178;46;15212160
64;512;32;16;2047;2047;18446744073709551615
1;1;1;1;2047;23;18446744073709551615
16;16;8;1;2047;23;18446744073709551615
4096;512;4;64;46;23;2505184
2048;16;4;4;89;23;18069536
2048;32;4;2;178;23;79612768
128;64;2;2;178;89;18446744073709551615
512;512;8;128;178;2;14185472
2048;64;8;64;89;46;3786016
1;64;1;64;46;23;499136128
4096;32;4;1;46;46;55279200
4096;64;4;64;46;23;2405344
256;64;4;64;46;23;2931936
1;64;1;64;46;23;499172576
2048;64;4;64;1;2047;1640217408
1024;512;1024;32;178;2;18446744073709551615
2048;64;4;64;178;2;10052480
2048;32;4;1;46;23;32471392
2048;64;4;64;46;46;4076608
512;256;128;64;178;23;18446744073709551615
1024;512;4;64;46;23;2404576
2048;64;16;64;46;23;3911648
512;64;4;64;89;23;3013888
1;2;1;1;178;2;11631499488
256;64;64;4;23;2;74082496
32;16;32;1;46;23;88899136
256;32;2;4;1;1;200250272
64;32;1;8;178;23;73642112
1024;64;4;64;23;23;3745216
2048;128;8;64;46;89;3423552
128;64;4;2;178;23;80864608
2048;64;4;1;23;23;21528992
1024;64;8;64;46;23;2966304
2048;64;512;64;46;23;18446744073709551615
2048;64;4;64;4094;23;18446744073709551615
2048;64;128;64;46;23;18446744073709551615
2048;64;4;64;2047;23;18446744073709551615
1024;256;8;128;178;2;14313984
512;64;16;1;89;23;28933472
1024;64;8;1;89;46;85480416
512;256;16;64;2047;46;18446744073709551615
1024;64;4;64;46;23;2471648
2048;64;2;32;46;23;5168864
2048;64;16;1;46;23;14821696
2;2048;2;64;23;46;23000256
2048;512;64;128;2047;89;18446744073709551615
4096;2048;16;1024;2;1;18446744073709551615
32;32;8;32;46;2;184139904
2048;64;2;1;46;46;91859520
2048;64;4;64;1;23;54166816
2048;32;4;16;23;23;3618784
2048;32;8;1;46;46;35026368
2048;64;2;2;46;23;28073536
512;512;16;64;46;23;3866720
2048;16;4;4;46;2;18369920
1024;64;2;2;46;23;27985728
2048;128;4;8;46;2;9996352
256;64;16;32;46;23;4707648
2048;32;4;16;46;23;3722208
2048;64;4;32;46;2;7128544
256;128;8;128;46;23;5527936
4096;64;1;64;89;2;5630080
2048;64;4;64;89;23;3051360
2048;64;8;32;46;23;2677920
1;256;1;32;46;23;116114752
2048;64;2;64;46;23;4065024
2048;256;4;128;46;46;4042656
256;64;4;64;23;23;5056896
2;64;1;64;46;23;250259168
2048;64;128;8;46;23;11039200
2048;512;4;8;46;23;6131008
512;64;4;16;46;23;3672480
2048;64;4;64;2;23;28538688
256;64;16;64;46;23;6078048
32;32;4;1;46;46;58801888
2048;64;4;4;46;23;9325120
2048;64;1024;1;46;23;57917280
2048;1024;512;64;46;23;18446744073709551615
2048;64;4;8;46;23;6202592
2048;64;4;16;46;2047;18446744073709551615
2048;64;32;64;46;23;18446744073709551615
2048;2048;4;64;46;23;2415712
1024;8;4;4;46;23;10210080
2048;4;4;1;46;23;35196416
2048;2;4;1;46;23;35410048
32;64;4;64;46;23;18240576
2048;4096;4;64;46;23;2400768
2048;256;1024;64;46;23;18446744073709551615
2048;64;1;64;2;23;38577856
2048;64;4;2;46;178;132567296
512;512;16;128;2047;2;18446744073709551615
1024;256;32;64;178;23;18446744073709551615
1;64;1;64;89;23;485564320
2048;64;4;1;89;46;134288384
2048;16;4;4;46;46;22230688
2;256;1;4;89;1;95087904
1024;2;1;2;2;2047;4126305376
1024;64;16;4;1;1;172312896
1;1;1;1;4094;89;18446744073709551615
1024;32;4;8;178;23;29728224
2048;64;4;4;178;89;18446744073709551615
2048;2048;4;8;46;23;6361728
1024;64;8;2;178;23;58303520
2048;16;64;2;46;23;5972160
2048;256;8;128;178;2;13762944
1024;128;8;128;178;23;2711744
2048;128;8;128;178;23;2682720
1024;256;8;64;2047;23;18446744073709551615
2048;64;4;64;23;23;3675360
2;16;1;16;46;89;535380320
2048;64;4;1;46;23;32479072
2048;64;4;8;2;23;12646304
16;16;8;4;89;1;834475584
8;512;4;2;1;4094;18446744073709551615
512;4;256;1;89;89;43703040
512;1;64;1;23;46;89444992
2048;64;4;2;46;46;29255232
4096;64;4;64;23;23;3796768
1024;256;8;128;2047;2;13309536
2048;256;16;64;178;23;2986208
2048;32;4;1;23;23;21689664
2048;512;512;64;46;23;18446744073709551615
2048;64;4;64;46;178;8392576
64;64;4;64;46;23;10005056
2048;64;1;64;46;23;7191040
2048;64;1;64;46;46;23109856
1024;64;8;1;46;23;21567200
1024;512;512;512;1;89;18446744073709551615
4096;2;512;2;4094;2;18446744073709551615
512;4096;8;256;178;2;18446744073709551615
8;64;4;4;46;178;87908448
1;256;1;1;46;23;132375488
2048;16;4;2;23;23;12007552
2048;64;4;32;89;23;3843648
2048;64;16;8;46;46;3023328
4096;256;8;256;89;23;18446744073709551615
2048;64;1024;16;46;23;18446744073709551615
2048;32;128;1;46;23;10883648
2048;256;16;128;178;23;18446744073709551615
2048;256;8;128;2047;23;18446744073709551615
2048;256;8;128;178;23;2707584
2048;64;4;64;23;89;5577088
1;32;1;8;178;4094;18446744073709551615
1;1;1;1;4094;23;18446744073709551615
1;32;1;2;2;178;480191328
32;1;4;1;178;2047;18446744073709551615
2048;64;4;32;46;46;5145664
2048;256;8;64;89;23;2547488
2048;128;4;64;178;23;4487520
2048;64;64;64;46;23;18446744073709551615
2048;64;4;16;46;23;3687424
2048;64;128;64;46;89;18446744073709551615
2048;64;4;64;46;1;14873472
2048;64;256;64;46;23;18446744073709551615
2048;2;4;1;46;23;35447232
2048;64;4;4;1;23;24721664
2048;1024;4;16;46;23;3406304
2048;64;4;64;46;89;5510112
2048;64;4;2;2;23;18231648
2;64;1;64;46;23;250542112
4;64;4;64;46;23;135984160
2048;64;1;64;46;23;7402528
2048;64;4;16;46;1;10835424
2048;128;4;4;46;23;9325760
128;64;4;64;46;23;5361472
4096;64;4;16;46;89;15216032
2048;64;64;2;46;23;5549952
4096;64;4;64;46;89;5512544
4;64;4;64;46;23;135286464
2048;64;64;4;46;23;4572736
2048;64;4;64;1;23;54202624
2048;64;4;64;46;1;14767392
256;64;128;64;46;23;18446744073709551615
2048;64;4;64;46;2047;18446744073709551615
2048;64;64;64;4094;23;18446744073709551615
2048;2048;4;32;46;23;2580640
8;64;4;64;46;23;69138880
2048;64;4;4;46;23;9353824
2048;8;4;4;46;23;10214240
2048;1;4;1;46;23;46599424
1;32;1;1;89;23;501865568
2048;64;4;32;46;89;10238880
2048;64;4;16;46;23;3694080
2048;2;4;2;46;23;24488448
2048;2;4;1;46;1;129852896
2048;64;512;64;1;23;18446744073709551615
4096;64;512;64;46;23;18446744073709551615
1024;64;256;64;46;23;18446744073709551615
2048;16;4;4;46;23;10126432
2048;64;256;64;4094;23;18446744073709551615
64;64;4;1;46;23;32897952
1;64;1;2;46;1;501954848
2048;64;1;64;46;2047;18446744073709551615
2048;64;4;2;46;23;17059872
64;8;4;4;46;23;39789024
2048;64;4;8;46;23;6174720
2048;64;2;64;46;1;9115872
2048;64;4;2;46;4094;18446744073709551615
2;64;1;8;46;23;126862688
2048;64;4;64;178;1;18433504
2048;4096;256;64;2047;23;18446744073709551615
16;64;4;64;46;23;34513568
512;64;4;64;46;23;2507264
2048;8;4;1;46;23;32721472
2048;128;4;64;46;23;2557152
16;64;2;64;46;23;34353088
2048;64;4;16;1;23;28323392
2048;64;4;64;178;23;4498368
2048;1024;4;2;46;23;17561696
2048;1024;4;512;46;23;18446744073709551615
1;2048;1;128;46;2047;18446744073709551615
8;64;4;64;46;23;69085056
2048;64;32;64;46;4094;18446744073709551615
2048;64;4;64;46;4094;18446744073709551615
2048;64;4;32;46;4094;18446744073709551615
64;2;4;1;46;23;140054016
2048;64;8;64;46;2047;18446744073709551615
8;64;4;64;1;23;2133269632
256;64;4;64;2;23;38936320
1;256;1;64;46;23;128496640
2048;1;4;1;46;23;46252160
2048;64;1;64;46;89;21086368
2048;64;512;64;46;46;18446744073709551615
8;64;8;64;46;23;87147136
2048;64;4;16;46;46;7182528
2048;64;1024;64;46;23;18446744073709551615
2048;4;4;1;2047;23;18446744073709551615
512;4096;4;64;46;23;2300288
512;4096;4;64;46;4094;18446744073709551615
512;4096;4;8;46;2047;18446744073709551615
512;4096;2;32;46;23;4376000
512;4096;4;2;46;23;17669856
4;4096;4;64;46;23;4952224
512;4096;4;1;46;23;33711936
64;16;4;2;46;23;20186784
512;4096;4;64;2;23;24356448
512;4096;32;64;46;23;18446744073709551615
1024;4096;4;64;89;23;2646624
512;4096;64;512;46;23;18446744073709551615
512;4096;4;64;1;23;47086624
512;4096;4;8;46;23;6168320
512;4096;4;64;46;1;10553120
32;32;4;1;46;23;35506464
512;4096;4;64;23;1;17127744
1;4096;1;64;46;2;20114624
512;4096;128;64;1;89;18446744073709551615
512;4096;16;64;46;23;3673728
2;4096;1;4;46;23;38322016
1;4096;1;64;178;23;17188448
512;16;4;2;46;23;17243872
1;4096;1;64;46;23;12397952
16;4096;16;64;46;23;4271552
512;1;4;1;89;1;205382208
16;4096;1;64;46;23;5531392
512;4096;4;1;46;23;33673568
1024;4096;4;64;46;23;2292000
512;4096;64;64;46;2047;18446744073709551615
512;4096;4;1024;46;23;18446744073709551615
1;4096;1;4;46;23;38922336
1024;4096;4;64;46;178;8247776
2;4096;1;64;46;23;8141632
1024;4096;1024;64;46;23;18446744073709551615
1;4096;1;64;46;23;12382016
1024;4096;32;64;46;2;18446744073709551615
1;4096;1;64;46;4094;18446744073709551615
1024;4096;4;64;46;46;3023008
1024;4096;4;64;2047;23;18446744073709551615
1024;1;4;1;46;178;278199200
1024;4096;4;4;46;23;10060032
1024;4096;4;1;46;23;35330464
16;4096;4;64;46;23;3295840
1024;4096;4;64;46;2;5360768
1024;256;4;64;46;23;2340416
1024;4096;8;512;46;23;18446744073709551615
8;4096;4;64;46;23;3897216
1024;4096;16;1;46;23;15480576
1024;32;4;1;46;23;32447168
1024;4096;4;64;46;1;10385024
1024;4096;4;1;46;23;35371904
1024;4096;4;64;2;23;24801888
1024;4096;4;64;23;23;3372672
1024;4096;4;64;178;23;4503680
1024;4096;4;64;46;2047;18446744073709551615
4096;32;256;2;1;1;1013363328
128;128;16;8;1;23;17769696
32;2048;16;256;178;46;18446744073709551615
1;512;1;64;2047;2047;18446744073709551615
1024;4096;64;64;23;23;18446744073709551615
1024;4096;1;64;1;23;69963104
1024;4096;512;64;46;23;18446744073709551615
2048;256;8;128;46;23;4178880
1;1;1;1;2047;1;30307894304
1;16;1;1;2047;23;18446744073709551615
1;2;1;2;1;46;14395802400
1024;128;1;64;46;23;5946816
1024;16;1;2;46;1;82161408
1024;16;128;1;46;23;11524000
2048;256;8;128;89;23;2881568
1024;4096;4;512;2;23;18446744073709551615
16;4096;4;1;46;23;35745312
2048;256;2;128;178;23;5810592
1024;2;4;1;46;23;35460864
2048;256;4;128;178;23;3458240
32;64;1;4;4094;2;18446744073709551615
32;16;32;8;46;23;93855328
1;16;1;1;1;1;4240908448
1024;4;256;1;46;23;84614528
8;512;4;64;46;23;9767488
1024;2048;4;64;46;23;2397152
1024;4096;16;64;46;23;3675200
2048;256;32;128;178;23;18446744073709551615
1024;1;32;1;46;23;45358016
1024;4096;4;32;178;23;8313984
128;4096;4;1024;46;23;18446744073709551615
2048;256;8;128;4094;23;18446744073709551615
1;1024;1;64;23;46;107962112
2048;256;64;4;2047;178;18446744073709551615
4096;1024;1;1024;46;1;50571520
1024;1;4;1;1;23;44007392
8;4096;4;1024;46;23;18446744073709551615
1024;128;4;64;46;23;2472448
1024;1;4;1;46;23;46144896
1024;4096;1;256;46;23;5900736
1024;4096;4;512;46;2047;18446744073709551615
32;32;8;16;4094;2;18446744073709551615
1;1;1;1;89;1;26786575136
1024;256;1;32;2;46;38303840
1;1;1;1;1;1;65705369088
1024;8;4;4;46;1;42435552
1024;4096;4;1024;46;23;18446744073709551615
1024;4096;4;512;46;23;18446744073709551615
1024;4096;4;128;46;23;3428864
1024;4096;1;64;46;23;4950528
1024;4096;4;2;46;23;18292480
1024;4096;4;32;46;23;2475488
1024;4096;4;64;1;2047;279980768
1024;4096;4;64;4094;23;18446744073709551615
1024;4096;4;512;46;46;18446744073709551615
1;1024;1;16;4094;89;18446744073709551615
16;16;8;4;46;1;844988704
32;512;16;2;1;23;18871040
512;4;256;1;23;89;43678176
512;1;256;1;23;89;172899936
1024;512;16;1;2047;89;18446744073709551615
4096;2;512;2;4094;2;18446744073709551615
4096;4096;2;256;23;2;22289376
1024;4096;256;64;46;23;18446744073709551615
2048;4096;4;256;46;23;6506592
16;256;4;4;1;23;35483872
512;4096;4;64;23;1;17123200
2;4096;1;64;46;23;8181568
1024;1024;4;64;4094;23;18446744073709551615
1024;1;4;1;46;1;206944288
2;4096;2;64;46;46;8451296
1024;1;4;1;46;23;46462688
1024;4096;32;64;46;23;18446744073709551615
1024;4096;4;128;46;2047;18446744073709551615
1024;4096;2;64;46;23;2949184
8;4096;8;64;46;4094;18446744073709551615
1024;16;4;16;46;23;4749472
1024;2048;256;64;46;23;18446744073709551615
1024;4096;64;64;46;23;18446744073709551615
1;4096;1;256;46;23;33769568
1024;256;4;4;46;23;9352992
1024;128;4;64;46;178;8381120
1024;4096;16;4;2047;46;18446744073709551615
4;4096;4;1024;89;23;18446744073709551615
32;4096;4;64;46;23;2674144
1;4096;1;64;46;23;12394240
8;64;4;64;46;178;49161856
1;32;1;8;4094;4094;18446744073709551615
1;1;1;1;4094;23;18446744073709551615
1;1;1;1;2;178;13353755872
1024;16;4;2;46;23;17183712
32;1;32;1;2;2;18699326208
4096;32;1;2;1;2047;1556522784
128;16;16;2;1;23;49245184
1;2048;1;32;178;46;125994336
1024;4096;1;64;89;23;8497440
1024;4096;4;64;1;23;47947552
256;1;4;1;46;23;71239232
2048;4096;8;64;46;23;2517024
1024;4096;4;64;89;1;9934592
1024;1;4;1;89;23;67966112
1024;4096;1;512;46;23;11097472
256;4096;4;64;46;23;2417312
256;2048;2;64;46;23;2997600
1024;4096;4;64;23;2;8923072
1024;4096;4;32;178;46;17217376
1024;4096;4;32;89;23;3580640
1024;1;16;1;46;23;31063872
256;4096;4;128;46;89;4926912
1024;4096;4;128;89;23;2449792
1024;2048;4;16;46;23;3324352
512;4096;4;64;46;46;2941664
1024;2048;4;64;89;23;2688096
256;4096;4;64;46;2;5764448
512;4096;4;64;89;2;5207712
1024;4096;4;32;23;1;10704832
1024;4096;8;64;46;23;2380704
512;4096;2;128;46;23;3406272
1024;4096;2;64;89;23;4703040
1024;1;4;1;89;2;106303552
1024;1024;4;512;46;2;18446744073709551615
256;4096;4;64;46;46;2958656
1024;1;2;1;46;23;75904672
1024;1024;4;16;46;23;3327712
1024;4096;1;64;23;23;5885376
1024;1;4;1;46;46;79176256
1024;4096;4;64;23;46;3511296
1024;4096;4;128;46;2;9190176
1024;2048;16;128;23;46;18446744073709551615
512;1024;16;64;46;23;3761760
1024;1024;4;256;46;23;6253504
2048;1;4;1;89;23;67655328
2048;4096;4;64;89;23;2842784
1024;1024;4;64;46;23;2402816
1024;1;2;1;46;23;75381056
2048;2048;4;64;46;46;3132576
512;256;1;64;89;23;8114048
512;2048;4;64;89;23;2664000
2048;4096;8;64;89;23;2372448
1024;512;8;64;23;23;3918944
1024;4096;16;64;23;23;5445760
4096;4096;4;64;46;23;2591008
1024;512;8;64;46;23;2537696
2048;4096;16;64;46;2;25041408
1024;512;4;32;89;2;4632128
64;4096;4;16;46;23;3443968
1024;4096;4;256;46;23;6227584
1024;4096;8;128;46;1;36126816
1024;4096;16;64;46;2;24804736
4096;2048;8;64;46;1;21277312
1;4096;1;64;23;23;15210336
1024;4096;4;16;46;23;3419040
2048;4096;2;64;89;2;3224352
2048;1024;4;64;89;23;2751328
1024;2048;4;64;23;23;3405152
1024;4096;4;64;46;89;5229088
1024;4096;8;64;2;23;35008096
1024;512;4;64;46;1;13192352
1024;4096;4;64;178;46;8978912
128;4096;4;64;23;23;3378528
1024;4096;1;128;46;46;16567872
1024;1;4;1;46;2;107810592
512;512;4;64;46;23;2410368
1;512;1;16;2047;2;989492960
1;1;1;1;2047;2;22210957984
16;1;8;1;2047;23;18446744073709551615
1;1;1;1;178;1;29731289728
2048;4096;4;64;23;23;3466752
256;64;16;4;23;4094;18446744073709551615
32;16;32;1;2047;23;18446744073709551615
8;32;2;1;1;89;90454784
2048;2048;512;64;23;46;18446744073709551615
1024;1;4;1;23;23;24863520
1024;4096;16;64;89;23;3493504
512;4096;8;64;46;23;2415936
2048;1;64;1;2047;89;18446744073709551615
1;1024;1;1024;46;1;1028738336
1;32;1;32;46;2;1409710336
2;256;1;4;178;1;186304992
1024;4096;4;16;178;23;15988640
1024;1;1;1;2;46;164675136
16;64;16;4;1;46;88991776
1;1;1;1;2047;46;18446744073709551615
1;16;1;4;2047;1;4286356512
2048;4096;1;64;46;23;5340736
1;4096;1;32;46;46;35050464
1024;2048;16;32;89;2;17900512
32;64;32;64;1;23;18446744073709551615
1;4;1;1;23;23;2883326944
4;1;4;1;178;46;3436755264
1024;512;512;512;1;1;18446744073709551615
2048;2048;4;64;89;23;2771744
1024;4096;8;128;23;23;7373088
1024;4096;4;64;46;4094;18446744073709551615
1024;4096;128;64;46;23;18446744073709551615
256;4096;4;64;46;1;10812032
1;128;1;2;4094;2;18446744073709551615
16;4096;1;1;23;2;112287072
8;64;4;8;46;178;66622240
1;32;1;8;46;4094;18446744073709551615
256;4096;8;64;46;23;2384960
1024;2048;4;64;23;46;3572384
1024;256;4;128;46;23;3428640
1024;4096;32;1;46;4094;18446744073709551615
512;4096;4;64;46;1;10547136
1024;1024;8;64;46;23;2458816
1024;4096;8;32;46;2;9602080
2048;1;32;1;4094;1;18446744073709551615
1;32;1;1;2;178;457999488
256;128;256;8;1;178;18446744073709551615
4096;1;4;1;1;2047;2876027584
1024;4096;4;64;46;1;10402656
32;4;4;1;46;23;136219968
1024;1;4;1;46;23;46336288
256;4096;2;64;46;23;2946208
64;2;16;2;1;23;758362272
1;2;1;2;178;1;15042665408
1;512;1;16;2047;4094;18446744073709551615
1;1;1;1;2047;1;30353824096
1024;4096;128;128;46;23;18446744073709551615
1024;4096;4;8;46;23;6373152
4096;4096;32;64;46;23;18446744073709551615
1024;4096;4;512;23;23;18446744073709551615
2;1024;1;64;23;23;30102528
8;4096;2;64;46;23;4491232
1024;4096;16;8;46;23;2708800
16;16;8;1;178;23;116445152
4;2;1;1;178;2;2908628896
128;64;64;4;23;2;134158464
32;16;32;1;46;23;88962080
256;4096;4;32;46;23;2580224
8;1024;8;64;46;23;6554560
1;32;1;8;1;89;2457727136
2;2048;2;256;23;89;61797728
1024;512;64;128;2047;89;18446744073709551615
4096;1;1;1;89;2;107353824
2048;4096;4;8;89;23;13433248
32;32;8;4;1;2;570394208
2;2;2;2;89;1;13443573792
1;256;1;32;2;46;814703392
16;64;16;4;1;23;138229120
128;4096;4;32;46;23;2602912
2048;4096;4;64;46;2;5407264
1024;256;4;64;46;2;7483168
1024;4096;4;4;178;23;46988704
1;1;1;1;4094;89;18446744073709551615
16;16;1;2;89;1;160315136
1;512;1;2;1;23;129860416
1;4096;1;64;23;89;14735328
1024;4096;4;32;46;46;4678432
512;4096;4;64;46;2;5403424
4096;1;4;1;46;2;66520800
1024;1;2;1;89;23;110304800
2048;1;64;1;1;2;948685760
1024;1024;512;256;1;46;18446744073709551615
4096;2;16;2;4094;46;18446744073709551615
4096;4096;2;256;23;1;39372864
128;4096;4;64;46;23;2513248
1;256;1;64;46;23;128531840
1024;4096;4;64;89;2;5102272
1024;4096;2;64;46;46;6208320
1024;4096;16;16;89;23;2927744
1024;4096;4;32;46;2;4708544
256;4096;4;128;46;2;9291168
1024;4096;2;16;46;23;6485664
1024;2048;4;64;46;89;5097536
1024;4096;2;128;46;23;3481440
1024;1;4;1;89;46;154888224
1024;4096;8;64;89;2;10859168
2048;4096;4;128;46;23;3581408
1024;1;4;1;2;2;156742880
1024;1;4;1;23;2;110086848
512;4096;4;128;46;46;3562976
2048;2048;4;64;23;23;3498560
128;512;4;64;23;23;3905120
2048;1;4;1;23;23;25098816
1024;2048;4;32;46;23;2529536
64;1;4;1;46;23;265534464
1024;1024;4;32;46;2;4838400
256;4096;2;32;46;23;4354656
1024;4096;1;64;46;46;17240736
1024;1024;2;64;46;46;6247328
4096;4096;4;64;89;23;3174240
1024;1;2;1;46;2;98495264
1024;2048;2;128;46;46;6357472
1024;4096;4;128;23;23;6118208
2048;1024;16;64;46;23;3751936
1024;4096;4;512;46;2;18446744073709551615
2048;4096;2;64;46;2;3560288
512;4096;4;8;23;23;4552288
512;512;4;128;46;23;3414208
1024;2048;4;16;46;1;10675776
2048;1;8;1;46;23;30451808
64;4096;4;32;89;23;3754816
1024;4096;4;128;46;1;17538912
512;4096;4;64;23;23;3345504
1024;2048;2;64;46;23;3048800
1024;4096;2;32;46;23;4516736
512;4096;16;64;23;2;38439968
256;1024;4;64;46;23;2534144
1024;2048;1;64;46;23;4935232
1024;1;8;1;23;23;32340672
4096;1024;4;64;46;23;2477696
1024;1;4;1;46;23;46497600
1024;4096;64;32;46;23;18446744073709551615
1024;4096;8;64;46;46;2144896
512;1024;4;64;23;23;3389600
1;1024;1;64;46;2;57328960
512;1;8;1;46;23;49663072
4096;2048;8;64;46;46;2335104
4096;4096;8;64;23;46;3780288
1024;2048;16;64;46;46;2394944
1024;4096;8;64;2;46;27788000
1024;4096;2;128;46;46;6254208
1024;4096;16;32;46;46;1971104
1024;4096;16;32;89;46;2597440
4096;4096;64;1024;46;46;18446744073709551615
1;4096;1;32;46;46;35047424
1024;4096;64;64;46;178;18446744073709551615
4096;2048;16;16;46;46;2146912
1024;4096;16;128;46;46;18446744073709551615
256;512;32;32;46;46;3406080
1024;1;16;1;46;46;29224416
256;1024;16;32;46;46;2069216
4096;2048;16;8;46;46;3322912
1024;2048;32;32;46;23;4853248
1024;4096;16;64;89;46;2310944
1024;4096;64;32;46;46;18446744073709551615
1024;4096;16;32;89;89;4705216
1024;4096;16;16;46;46;1967232
512;4096;16;16;46;46;1962144
512;2048;64;32;46;46;18446744073709551615
1024;1024;8;16;46;46;3334496
1024;4096;8;16;46;46;3429344
128;4096;16;16;46;89;4278976
512;4096;8;16;46;46;3348384
256;4096;16;16;46;46;2002720
64;4096;32;32;23;46;3691616
512;4096;16;16;46;178;7590176
256;4096;16;16;178;46;7349952
512;4096;32;16;89;46;3564832
256;4096;2;16;46;46;15378464
512;4096;16;8;46;46;3034176
512;1;16;1;46;89;51858208
512;4096;32;16;46;46;2605792
512;4096;16;16;89;46;4022240
256;4096;8;8;46;46;6254784
512;4096;16;16;23;178;5182976
128;1;16;1;46;46;172793088
512;4096;16;16;23;46;1852640
512;1024;16;16;46;23;2495840
512;4096;4;32;46;46;4593568
512;4096;16;8;23;46;2009312
512;1;8;1;2;46;66252064
512;4096;32;16;23;23;4386752
512;1;128;1;23;89;91189984
512;4096;16;8;23;89;3706976
512;2048;16;16;23;46;1862656
512;4096;16;16;23;89;2407040
512;4096;4;16;2;46;11488000
512;1024;16;16;2;46;7912896
512;4096;32;8;23;23;3719584
512;4096;32;16;23;46;2977312
256;4096;16;32;23;46;2090944
512;1024;8;16;46;46;3302304
512;4096;8;16;23;46;2375168
512;4096;64;16;23;46;4887712
512;4096;64;32;23;46;18446744073709551615
2048;4096;16;32;23;46;2194784
512;1;16;1;2;46;56176352
512;4096;16;16;89;89;8334560
512;256;8;16;23;89;4431520
512;4096;4;16;23;46;4621632
128;4096;32;16;23;46;3017312
512;4096;16;4;23;23;3237248
512;1;16;1;23;46;44384896
512;1;16;1;23;46;44326528
256;4096;16;16;23;46;1848192
512;4096;16;16;23;2;19325312
256;2048;16;16;23;46;1865888
256;1024;16;4;23;46;3197600
128;4096;16;16;1;46;15266944
256;4096;16;16;89;46;3956384
256;4096;16;16;2;23;12132448
256;1024;4;16;23;46;4677952
256;4096;32;64;23;89;18446744073709551615
64;4096;16;16;23;46;1979968
1024;2048;16;16;23;46;1843040
512;4096;16;32;23;46;2056288
256;4096;16;16;23;23;2832512
1024;2048;4;4;23;23;6726400
1024;1;16;1;23;46;29594560
256;2048;16;16;2;46;7817600
4096;2048;16;64;23;46;3878624
1024;4096;8;8;2;46;7291712
256;2048;16;16;23;23;2864000
256;2048;32;16;23;46;2990112
1024;2048;16;4;23;46;3194432
1024;2048;16;8;23;46;1971424
1024;2048;16;32;23;46;2097856
1;2048;1;32;23;46;27873248
1024;2048;16;8;23;89;3694464
1024;256;16;32;23;46;2210688
1024;2048;16;4;23;89;6658368
4096;2048;32;16;23;46;3044736
512;2048;8;16;2;23;9075872
1024;2048;16;32;46;23;3010400
256;2048;32;16;23;89;2000672
1024;2048;4;8;23;46;7214944
1024;1;32;1;23;46;33618752
1024;2048;4;16;23;46;4719488
2048;2048;16;16;2;46;8143296
1024;1024;32;16;46;46;2594880
1024;512;8;32;23;46;2109824
1024;1024;16;16;23;46;1855520
1024;2048;4;16;23;89;7450336
512;2048;16;16;23;89;2403904
1024;2048;16;64;23;2;38468416
1024;4096;16;16;23;46;1876416
1024;2048;8;8;23;89;7071936
32;4096;32;16;23;46;3421312
2048;2048;32;16;23;46;2973632
1024;2048;8;16;2;46;7149376
1024;2048;16;16;46;2;16398176
1024;512;16;8;23;46;2066496
1024;2048;32;16;46;46;2585280
1024;2048;64;8;46;46;3684640
2048;4096;16;16;23;46;1948448
1024;2048;16;8;89;2;15624288
2048;2048;2;16;23;46;9811648
1024;2048;8;32;2;46;13995488
1024;4096;32;16;23;46;2957856
1024;512;16;16;23;46;1905568
1024;2048;16;64;23;46;3498176
1024;512;32;16;2;23;17329024
1024;2048;16;16;2;46;7906144
512;4096;4;16;23;89;7366304
1024;2048;8;16;46;46;3330496
1024;2048;4;16;2;46;11622816
1024;1024;16;32;23;89;2002464
128;2048;32;16;23;46;3037184
1024;2048;8;8;23;46;3728512
1024;2048;128;16;23;46;18446744073709551615
1024;2048;32;16;23;2;40565152
1024;2048;8;32;46;46;2473088
1024;1024;16;16;23;89;2457792
1024;2048;16;32;2;46;15610272
1024;2048;16;32;23;23;3248000
256;2048;16;64;89;2;24403392
512;2048;16;32;23;46;2079808
1024;512;64;16;2;46;17640832
1024;2048;16;16;23;2;19260384
2048;2048;16;16;23;23;2791904
256;2048;16;4;23;46;3199232
4096;2048;16;16;23;89;2655808
1024;2048;16;32;46;46;1983200
1024;4096;16;8;23;46;2022368
512;2048;16;16;46;46;1941920
1024;2048;2;16;23;46;9520640
1;4096;1;16;23;23;9290368
128;4096;16;8;1;46;7898080
4096;2048;16;16;23;46;2037248
512;2048;32;16;23;46;2986656
1024;2048;16;16;23;89;2421760
1024;2048;16;8;46;46;3005312
1024;2048;4;16;23;23;2960800
512;512;32;16;23;46;3096928
1024;1024;16;8;23;23;2450944
1024;1024;8;16;23;46;2463392
1024;4096;4;16;23;46;4747200
2048;2048;16;16;23;89;2507168
4096;512;16;16;23;46;1913984
1024;1024;4;16;23;23;3002528
1024;4096;16;8;23;23;2472576
2048;2048;16;16;23;46;1889280
1024;1024;16;16;23;2;19383328
4096;2048;32;16;46;46;2670336
2048;4096;16;16;23;23;2830784
4096;1024;8;16;23;46;2611008
2048;1024;16;16;2;23;12543776
512;2048;16;4;23;46;3162528
2048;2048;16;8;23;46;2032544
2048;128;16;16;23;46;1987328
256;4096;16;16;46;89;4213344
256;2048;16;16;46;89;4193120
1024;2048;16;32;1;23;47166208
1;2048;1;16;23;2;26819520
1024;128;16;16;23;46;2138112
1024;2048;8;16;23;23;2065888
1024;512;4;16;23;46;4755776
1024;2048;32;8;23;46;2456256
1024;2048;32;16;23;46;2983936
1024;2048;16;8;2;46;4042624
1024;1;16;1;2;46;38785024
1024;2048;16;64;2;46;32218752
128;2048;8;8;23;46;3775744
1024;2048;4;4;2;46;10873728
1024;2048;16;16;1;89;13990208
2048;2048;16;32;23;46;2141504
512;2048;8;16;23;46;2400768
1024;4096;16;16;23;89;2412928
2048;2048;16;16;46;46;1952064
512;2048;16;16;2;46;7825472
1024;1024;32;32;2;46;25066976
1024;2048;16;16;46;46;1925600
1024;1;16;1;46;46;29160768
1;1024;1;8;23;46;33426464
4096;2048;8;32;23;89;2826304
64;2048;16;16;23;46;2002592
1;2048;1;16;23;46;25213408
256;2048;16;16;23;178;5087520
2048;1024;16;16;23;46;1865824
1024;1;64;1;46;46;44820608
4096;2048;16;4;23;46;3516800
1024;2048;4;4;23;46;11322112
256;1024;16;16;23;46;1942080
512;512;1;512;46;178;54035008
4;32;2;8;178;4094;18446744073709551615
1;1;1;1;4094;2;18446744073709551615
1;32;1;1;2047;2047;18446744073709551615
1024;1;2;1;23;46;69545664
1024;4096;32;2;23;89;6094688
1024;4096;8;16;23;46;2398304
4096;1024;16;16;23;46;1915072
128;1;4;1;1;2;846777568
4096;32;1024;8;1;2047;18446744073709551615
128;512;16;2;1;2;118671008
16;128;16;8;1;46;89601824
1;512;1;2;2047;2;5441779584
1;1;1;1;1;2;41865290176
4096;32;1;16;178;23;45091424
1;2;1;1;178;2;11061636224
1024;4096;512;16;23;46;18446744073709551615
1024;2048;16;1;23;46;10649280
1024;2048;512;64;4094;46;18446744073709551615
1024;4096;512;128;23;46;18446744073709551615
256;64;8;4;89;2;23767424
2048;16;32;1;23;23;7271424
8;32;1;2;1;2;311447872
2;4;2;1;23;1;6574900224
64;1024;16;16;23;46;2156448
32;2048;16;16;23;46;2220768
2;2048;1;64;23;4094;18446744073709551615
1024;32;16;16;23;46;2197856
1024;2048;32;64;23;46;18446744073709551615
1024;2048;16;16;23;1;37490784
1024;2048;16;16;2;89;8072896
1024;1024;16;16;1;46;15706528
1024;2048;16;16;23;2047;18446744073709551615
1024;2048;16;16;23;4094;18446744073709551615
2048;512;64;128;1;2;18446744073709551615
1;1024;1;1024;46;46;981371232
32;512;8;2;46;46;19961248
1024;4096;16;32;23;46;2076736
256;2048;16;16;23;89;2436480
1024;2048;8;16;46;89;7801056
1024;2048;8;16;23;46;2416288
1024;2048;16;256;23;46;18446744073709551615
2;2048;1;16;23;46;19270656
8;2048;1;16;23;46;17889216
1;256;1;4;89;1;167650848
1;256;1;32;1;2;3067485440
16;64;2;4;2;46;29986272
4;1;4;1;1;89;6115247072
1024;2048;1024;16;23;46;18446744073709551615
1024;2048;16;16;2047;46;18446744073709551615
64;2048;4;16;2;46;11419264
512;2;16;1;23;46;22614240
16;16;1;2;46;1;155557600
32;64;16;16;1;23;279237472
8;4096;1;16;23;89;20471776
512;1024;64;1;23;46;5503040
1024;2048;16;16;1;46;15628800
1024;2048;16;16;178;2;16012064
1024;8;512;2;1;2;3018892960
4096;2;8;2;1;2;133718560
512;128;2;1;23;2;77445216
512;1;1;1;46;178;946767040
1024;2048;64;128;23;46;18446744073709551615
256;2048;16;16;2;2;88340096
1;32;1;8;178;23;486181664
128;1;32;1;1;23;676712256
1024;32;512;1;46;178;13473888
4096;1;4;1;1;2;121933280
1024;2048;16;16;23;1;37403008
1024;2048;16;16;23;23;2780064
1024;2048;32;16;1;46;23605600
1024;1;16;1;23;46;29581728
512;64;256;16;23;46;18446744073709551615
4096;4096;256;128;1;2047;18446744073709551615
128;512;8;2;89;23;24838784
16;128;16;8;178;178;18446744073709551615
1;4096;1;16;23;46;24767840
1024;2048;16;64;23;23;5457664
2048;2048;4;16;23;23;3037248
1024;1024;256;1;23;46;7353792
1024;2048;1;16;23;46;17916736
1024;2048;16;16;23;178;5212672
1024;2048;64;512;23;46;18446744073709551615
2;512;2;16;2;2;269970240
1;512;1;512;1;2;22269150080
8;128;1;4;178;46;342084608
4;1;1;1;178;2;5535775136
1024;2048;64;16;23;89;3230304
2048;2048;8;32;23;46;2140000
1024;2048;4;16;1;46;22463808
4;2048;2;16;23;46;10324000
256;64;8;4;1;1;198823168
16;16;2;1;23;2;150895840
8;32;8;1;1;89;128108288
2;2048;2;64;23;23;17646400
1024;2048;128;16;46;46;18446744073709551615
2048;2048;8;16;23;178;10254112
1024;1;4;1;23;46;42031904
1024;1;16;1;23;178;49500576
32;2048;16;16;1;46;17845408
1024;256;16;16;23;178;5339136
2048;16;64;4;2;89;5495136
4096;128;1;4;46;46;67351712
32;512;16;2;46;89;30879584
4;256;1;1;89;1;194595456
1024;1;16;1;23;89;26043520
128;2048;16;16;2;89;8082144
64;1;16;1;23;46;331608480
1024;16;1;16;23;46;25138368
1024;256;1;128;2;46;42353696
1024;64;1;4;2;1;95724768
4;4;4;2;1;89;2353583200
1;16;1;2;46;1;1995390016
1024;2048;16;2;2;46;5242304
4096;1;16;1;23;46;14952800
2048;2048;8;16;23;46;2492192
1024;2048;16;64;4094;46;18446744073709551615
2;2048;1;16;1;46;97769952
1024;2048;16;16;4094;46;18446744073709551615
32;512;16;8;1;23;17801536
1;4096;1;1;23;178;414982912
1;1024;1;1;23;46;126748832
1024;8;512;2;1;1;5609403520
1;2048;1;16;23;46;25193600
256;2048;2;16;23;46;9350336
4096;2;8;2;1;4094;18446744073709551615
4096;4096;2;256;1;2;411545536
8;1;4;1;4094;178;18446744073709551615
1;1;1;1;178;23;10864052320
1024;2048;1;16;23;1;17750240
16;1;1;1;1;1;5266790304
1;8;1;1;46;178;1422758400
4096;1;4;1;1;2;122007200
4096;64;256;1;1;2047;13705632
1024;2048;16;1024;23;46;18446744073709551615
128;512;8;16;1;23;20198176
16;16;16;8;178;46;91411584
2;4;2;2;2;2;5505361920
1;32;1;8;2047;2;1584198752
16;2048;1;16;23;46;17721664
4096;256;1;2;178;23;232470528
4;1;1;1;46;46;2672564928
512;64;8;1;89;178;18446744073709551615
2048;16;32;16;23;23;6033824
1024;2048;64;16;23;46;4846880
8;128;1;1;1;89;103521504
2;2048;1;64;2047;23;18446744073709551615
2048;16;4;4;2;89;11943488
4096;1024;1;1024;1;1;1794791488
2;4;1;1;23;46;1421156128
32;512;8;64;46;46;3292800
64;256;8;4;46;2;22069120
1024;256;1;2;2;46;42434208
16;64;2;4;4094;46;18446744073709551615
1024;64;16;16;23;46;2202848
1024;256;16;1;178;46;95805568
4;4;4;1;1;2047;1435559968
16;16;1;2;46;46;98522528
32;512;1;8;1;46;65964640
1;32;1;1;89;89;899320000
1024;2048;128;8;23;46;8256224
512;1;64;1;23;46;89592128
1;8;1;4;1;89;5051094912
4096;2;2;2;89;2;39575296
4096;4096;1;1;23;2;157797824
1024;2048;16;16;178;46;7421824
32;2048;16;512;23;46;18446744073709551615
512;2048;1;16;23;46;17655872
8;64;1;64;46;178;81126816
1;32;1;8;178;46;685826048
128;1;2;1;1;1;1209080800
2048;32;512;4;46;178;18446744073709551615
1024;1;16;1;178;46;97339136
1024;2048;16;16;89;46;4007776
4096;1;64;1;1;2;449315808
4096;32;256;2;1;23;49570176
128;512;16;2;1;89;9939776
16;2048;16;8;178;89;18446744073709551615
1024;2048;16;16;1;46;15620448
2;512;2;16;2;89;99336480
1;32;1;8;1;2;6140402784
4096;32;1;16;178;23;45056864
4;1;2;1;46;46;2910322368
4096;2048;16;16;1;46;16902400
1024;2048;16;32;178;46;4280608
256;64;64;1;89;2;83806656
1;16;1;16;23;23;1354599328
128;32;2;1;1;4094;18446744073709551615
8;2048;2;2;23;23;22420352
2048;16;8;2;2;89;12207328
32;1024;1;1024;46;23;29686848
32;32;8;1;4094;46;18446744073709551615
64;256;1;4;46;2;30205888
1024;2048;512;16;23;46;18446744073709551615
1024;2048;32;1;23;46;7943008
1024;2048;2;16;89;46;39219744
1024;256;256;32;2;89;18446744073709551615
16;64;2;16;2047;46;18446744073709551615
128;4;2;1;1;23;94696864
1;16;1;1;4094;46;18446744073709551615
1024;1;16;1;2047;1;2053566752
4096;2048;16;16;23;1;37163872
32;512;16;8;4094;23;18446744073709551615
1;4096;1;1;23;89;181377216
1024;8;64;1;23;23;12082720
1024;8;64;1;1;2;229763616
4;2048;2;16;23;178;32056576
1024;2048;1;16;23;46;17901888
4096;1;2;1;2047;2;1105308032
4096;4096;32;256;23;23;18446744073709551615
8;32;8;4;46;178;97300448
1;64;1;4;178;23;286650464
8;2048;4;16;23;46;5406208
128;1;2;1;1;23;195522752
1024;32;512;1;89;23;30626592
1;1;1;1;1;2;41864629632
4096;32;512;2;1;1;2207141120
1024;2048;64;8;23;46;3942560
128;2048;16;16;23;46;1935904
2048;2048;4;16;46;46;6901824
1024;2048;16;4;46;46;5614336
512;2048;16;16;2;89;8037504
2048;1;16;1;23;46;14929184
256;2048;16;8;2;46;4009664
1024;2048;32;32;23;46;3601408
512;2048;16;2;89;46;26080672
1024;2048;8;16;23;89;4269536
512;1024;16;16;23;46;1877248
1024;1024;16;16;2;46;7963840
128;2048;16;16;2;2;88243968
1024;2048;16;8;23;2;16823040
1024;4096;16;16;2;46;7856512
1024;1024;32;16;23;46;2991520
1024;1024;16;32;23;46;2130880
512;2048;4;16;46;46;6548512
1024;1024;16;16;2;89;8180416
1024;2048;16;16;46;89;4265344
128;4096;16;16;23;46;1893920
1024;2048;16;8;1;46;8016928
2048;2048;4;16;2;46;12070272
1024;4096;32;16;46;89;2562304
1024;4096;32;2;1;46;8228096
4096;2048;16;16;89;46;4361472
256;2048;8;16;23;46;2447168
2048;512;16;16;23;46;1871264
1024;2048;8;16;1;46;13959616
4096;1;16;1;23;46;14930240
2048;4096;64;32;23;46;18446744073709551615
2048;2048;64;16;23;89;3276864
512;1024;16;16;23;23;2871232
1;512;1;2;1;89;119813376
16;2048;16;128;1;178;18446744073709551615
32;512;32;16;1;89;23434304
1;32;1;8;2047;46;18446744073709551615
1024;2048;32;16;23;23;4367008
1024;512;16;4;23;46;3161952
4096;4096;1;1024;2047;1;10887040
1;1;1;1;89;46;10824724896
16;64;8;4;1;2;528334080
2048;2;32;2;23;23;12087296
8;32;2;32;1;2;4647439712
2;2048;2;64;23;23;17660704
2048;16;64;2;2;89;4163872
32;1024;1;1;1;89;96451008
1024;16;16;16;23;46;3383296
1024;2048;64;1;23;46;5474816
2;512;1;64;46;46;67159680
1024;1;16;1;23;2;239870688
64;256;8;4;23;2;24179392
1024;256;32;4;2;46;3654112
16;64;2;16;2;46;118851456
128;8;2;1;1;1;475160896
1024;8;16;1;23;46;11316736
1024;2048;512;16;2;46;18446744073709551615
1024;2048;16;16;46;4094;18446744073709551615
1024;2048;16;64;23;178;3115456
8;2048;8;16;23;46;4556512
512;2048;256;16;23;46;18446744073709551615
1024;256;16;2;178;178;18446744073709551615
1024;32;16;16;23;2047;18446744073709551615
16;16;1;2;1;46;134003680
32;512;32;8;1;23;24309696
1;128;1;64;23;89;413155712
512;1;64;1;1;46;163321632
2048;2048;16;16;89;46;4106176
1024;512;16;16;2047;46;18446744073709551615
1024;512;16;16;23;1;38544896
1024;2;16;1;2;46;21624896
1024;256;16;8;23;46;2105344
1024;1;64;1;46;2;910027360
4096;2;1;2;89;2;56227616
4096;4096;2;256;23;1;39380768
1024;2048;16;1;23;46;10656480
1024;2048;16;2;23;2;38095552
1;64;1;64;46;4094;18446744073709551615
8;512;1;512;178;23;18152992
128;1;2;1;1;23;195176672
1024;32;8;1;23;178;82210336
1024;2048;16;512;23;46;18446744073709551615
8;256;1;16;23;46;20788544
512;2048;16;16;4094;46;18446744073709551615
1;1;1;1;1;2;41864447296
1;32;1;2;1;2047;1757807424
512;4;1;4;1;178;454149952
16;1;16;1;178;46;1229421312
512;4096;8;32;23;46;2059424
1024;4096;32;32;23;46;3540128
32;512;16;16;4094;89;18446744073709551615
32;32;8;1;2047;2;1776784096
4096;4096;1;1024;1;89;624822432
4;1;1;1;46;2;5755957632
1024;16;16;16;23;1;51802816
1024;2048;1;1024;4094;46;18446744073709551615
1024;2048;4;16;23;4094;18446744073709551615
256;64;8;4;89;23;13732096
256;512;32;1;23;23;6861600
32;512;16;1;1;89;12522112
512;2048;8;8;23;46;3694336
8;2048;1;16;4094;46;18446744073709551615
1;2048;1;16;46;23;13181472
32;2048;8;64;23;178;5351072
2048;16;16;2;2;2;58849152
1;1024;1;1;46;23;132557728
32;8;8;8;46;46;104046560
1024;1024;32;16;23;23;4409792
1024;2048;16;32;23;89;1994528
1024;2048;16;2;23;46;5804224
1;2048;1;16;23;2047;18446744073709551615
64;256;8;4;46;23;7556544
1024;256;1;4;2;46;34051040
16;64;1;4;2;46;50896160
128;4;8;2;1;23;155813568
2048;1024;32;16;23;46;3004224
1024;2048;64;16;1;46;34407872
1;2048;1;16;23;46;25192032
16;16;1;2;46;178;447897824
1024;1;1024;1;1;23;3191468352
8;4096;1;1;23;89;167669184
512;256;64;1;4094;46;18446744073709551615
512;2048;8;16;46;46;3297568
1024;2048;32;32;23;2;50507584
1024;1024;16;1;23;46;10479584
1;64;1;2;1;89;463302080
4;2;2;2;23;2;3791735104
4096;4096;2;1;23;2;101180544
8;1;4;1;46;178;1679909728
1024;2048;8;32;23;46;2107456
8;512;4;512;178;23;18446744073709551615
1024;1024;256;1;1;178;5095392
1024;32;512;1;46;1;679505696
64;1;4;1;1;2;1694992992
4096;256;256;128;4094;2047;18446744073709551615
1;512;1;256;1;89;5069213344
16;128;16;16;1;178;143345504
32;512;32;16;1;2;494659552
4096;2048;16;16;1;46;16903168
1;1;1;1;1;2;41865427104
4096;1;1;1;46;1;160033792
4;1;1;1;1;23;5232215584
256;1;8;1;89;2;453363712
1024;2048;16;16;89;2047;18446744073709551615
2048;16;256;16;23;46;18446744073709551615
32;512;16;1;178;89;18446744073709551615
32;32;8;1;2;178;25744800
128;16;64;8;2;1;3448166272
1024;2048;16;16;89;2;16078016
8;2048;1;16;89;46;76103936
2048;1024;1;1024;89;2;21482400
1024;1024;512;64;46;46;18446744073709551615
32;256;8;4;46;23;7744320
64;256;32;32;2;1;1057929440
