GLOBAL_SIZE_0;GLOBAL_SIZE_1;LOCAL_SIZE_0;LOCAL_SIZE_1;v_TP_410;v_TP_411;cost
4;4;1;4;1;46;1842092125
4096;256;32;64;2;89;18446744073709551615
128;16;8;2;178;4094;1731881141
1;256;1;4;89;2047;14967915542
64;512;8;8;1;89;1175969123
64;32;2;8;89;4094;777794325
4;8;4;8;1;1;1162051648
32;128;8;64;4094;2047;18446744073709551615
64;32;2;8;23;4094;652878255
64;32;2;8;178;4094;1246948946
64;32;2;16;46;4094;790749186
64;32;1;8;89;4094;778226671
1024;32;2;8;23;4094;912659198
64;32;2;16;89;4094;720331447
8;32;2;8;23;4094;3703553468
64;1;2;1;23;4094;1416309465
64;64;2;1;46;2047;850996604
256;4;8;1;4094;178;7698920333
256;8;1;1;2047;178;1941040439
1;2;1;2;2047;89;14891906667
16;16;2;2;46;4094;2267981870
4096;4096;2;2;89;89;963044691
32;32;2;2;23;1;1116197705
64;32;2;16;23;4094;645737887
64;64;4;16;23;4094;647018262
16;32;2;16;23;4094;1939133843
128;64;1;16;23;4094;644000715
64;32;1;16;23;4094;645980673
64;64;1;16;23;2047;430695751
512;32;1;16;46;4094;818578087
128;32;4;16;23;4094;644650600
64;128;1;16;23;2047;430612142
32;64;1;32;2;2047;484899977
256;32;1;8;23;2047;728031727
64;128;1;16;2;2047;362680803
256;256;2;16;23;2047;453432970
64;128;1;8;23;4094;653069052
32;128;1;16;2;2047;475296642
64;128;1;32;2;4094;886271890
64;256;1;16;2;4094;531830309
128;128;1;16;2;2047;330847553
128;128;4;16;1;2047;297533302
128;128;1;32;2;2047;478728884
32;128;1;64;23;2047;1006227959
256;128;1;16;2;2047;315580961
128;128;2;16;1;2047;301409920
128;64;16;16;1;2047;562618174
128;128;1;16;1;4094;467317215
128;128;1;8;1;2047;527213418
64;128;4;8;1;2047;312921916
128;128;4;16;1;178;445349002
128;128;2;8;1;2047;494714963
128;128;4;16;1;4094;465565636
128;128;4;16;2;2047;324272466
128;128;32;16;1;2047;18446744073709551615
64;512;4;16;1;1;488926468
128;128;4;32;1;178;567224505
256;256;4;16;2;178;317970590
128;64;4;8;1;2047;523803052
64;256;8;16;1;2047;315172635
256;2;1;2;2;2047;475399726
32;128;4;32;1;2047;445171881
64;128;4;16;2;2047;354443875
1024;128;4;32;1;2047;248514086
128;128;4;8;1;2047;518836042
128;32;4;4;2;178;950616333
1024;128;4;16;1;2047;252721547
1024;128;4;32;1;4094;448318083
512;128;4;16;1;2047;254814711
1024;256;4;16;1;2047;251377501
512;512;8;128;1;4094;18446744073709551615
4096;128;4;32;1;2047;242448210
1024;128;2;128;1;4094;875073792
4096;128;4;32;2;2047;308240754
4096;128;2;32;1;4094;876144240
4096;64;4;32;1;2047;240742967
4096;32;8;1;2;2047;1547881291
4096;64;1;16;1;2047;240546005
4096;64;16;32;1;2047;18446744073709551615
2048;64;4;64;1;2047;249543000
4096;64;4;32;1;4094;446970142
1;64;1;16;2;2047;14985189832
4096;64;1;16;1;178;257652380
4096;64;1;8;1;2047;214374628
1;16;1;8;1;2047;14311216150
4096;32;1;16;1;2047;241577755
4096;16;1;4;1;178;221118377
4096;256;1;8;1;2047;211821959
2048;64;1;8;1;2047;219376542
1024;128;2;4;1;2047;476548127
4096;256;1;4;1;2047;215397752
4096;256;1;16;1;2047;245077051
1;256;1;8;1;2047;14311451680
4096;256;1;8;1;4094;298369300
4096;256;2;4;1;2047;388538843
4096;512;1;8;1;2047;211916341
1;256;1;8;1;2047;14312335179
1;64;1;8;1;2047;14311590054
4096;256;1;8;23;2047;733870822
1;256;1;8;1;4094;28976320541
128;128;1;1;178;2047;893402171
2048;256;1;8;1;2047;216155626
2048;2048;32;8;1;2047;498094626
1024;256;1;8;23;2047;764752255
1024;1;1;1;1;2047;349068466
1024;128;4;8;1;4094;310943926
4096;1024;1;8;1;2047;210464502
1;1024;1;8;1;2047;14312206737
4096;512;1;8;1;178;232001335
4096;1024;1;2;2;2047;443250337
1;4096;1;8;1;89;956729931
4096;1024;2;8;1;2047;209876712
2048;1024;1;8;1;2047;218444090
4096;1024;2;8;2;2047;425151971
1024;1024;2;8;1;2047;224003924
4096;512;2;4;2;4094;883101541
4096;512;2;4;1;2047;390715264
1;1024;1;8;1;2047;14312809292
1024;4096;2;8;1;178;262444590
4096;1;2;1;1;89;454292917
4096;1024;2;8;1;178;212382419
4096;1024;4;8;1;2047;213861007
1;1024;1;8;2;2047;14986914667
4096;512;1;8;1;1;109079001
4096;1024;1;2;1;178;211311087
1024;1024;4;32;1;2047;251387170
2048;512;1;8;1;1;109182376
4096;512;1;8;23;1;944608079
1;512;1;8;1;1;126362959
4096;512;1;2;2;4094;542078264
1;2048;1;8;1;1;558223388
4096;256;1;4;1;1;185366293
2048;128;1;8;1;1;112471545
4096;512;1;2;1;1;375011261
32;256;8;1;1;1;973297952
1;512;1;16;1;1;134121460
4096;512;2;8;1;1;108867752
2048;512;2;8;1;1;110393712
4096;512;2;4;1;1;189184507
4096;1024;2;8;1;1;113827334
4096;512;1;8;2;1;135900753
4096;256;2;8;1;1;107580920
4096;512;2;2;1;1;429431381
4096;256;2;8;1;4094;298129505
4096;256;2;4;1;1;192204631
1024;256;2;8;1;1;121223795
2048;256;2;8;1;1;112587961
4096;256;4;8;1;1;110950089
4096;64;2;8;1;1;115965296
4096;256;2;32;2;1;122502795
2048;128;2;8;2;1;165183585
4096;256;1;8;2;1;136750958
2048;256;2;4;1;1;201690838
1;64;1;8;1;1;631673316
4096;256;2;8;2;1;148880416
4;32;4;1;23;2047;3742095385
128;128;1;2;4094;2;1455069424
4096;4;1;1;1;2;368456631
64;16;1;4;4094;23;2047815212
1;256;1;8;1;1;210092417
1;256;1;8;1;1;216402459
2048;256;8;8;1;1;122010337
4096;128;2;8;1;1;109919041
2048;256;2;8;2;1;149915416
4096;256;2;8;1;2047;215092336
1024;64;2;8;1;1;200015042
1;256;1;8;2;1;259532174
4096;128;2;8;46;1;1346923673
4096;256;2;8;2;4094;536694143
4096;128;2;8;2;4094;535970430
4096;256;4;8;1;4094;301650220
1;1024;1;8;1;1;525760306
1024;256;4;8;1;1;128151420
1024;256;2;8;2;1;166434173
4096;128;4;8;1;1;115522378
4096;128;2;8;2;1;165025254
4096;256;2;16;1;4094;450766463
64;64;8;4;23;4094;655326010
4096;256;1;2;1;1;387851670
2048;128;2;4;2;1;369739964
4096;256;1;4;1;4094;301867217
2048;32;2;16;1;1;78889336
1;256;1;16;1;1;218559217
2048;64;8;8;1;1;162219255
1;32;1;16;1;1;1264453921
1024;32;2;16;1;1;159911127
2048;32;2;16;1;4094;446142094
2048;32;4;16;1;1;78313458
128;32;2;16;1;1;416595799
1024;128;2;16;1;1;86176878
2048;64;2;32;1;1;70854835
2048;64;2;64;1;1;119940170
2048;256;2;32;1;1;71307333
2048;512;2;32;1;1;73515086
2048;128;2;32;1;1;70585710
2048;16;2;1;1;1;1058004777
2048;128;2;32;23;1;361978965
2048;128;2;8;1;1;117308836
2048;128;2;64;1;1;75025501
1;256;1;32;1;1;218940842
2048;128;2;1;1;4094;466376467
2048;128;4;32;1;1;218652378
4096;128;2;32;2;1;122113255
2048;128;1;32;1;1;70664377
4096;128;2;64;1;1;69508253
2048;32;2;32;1;1;68107043
4096;128;2;64;1;4094;875087666
1;128;1;64;1;1;414005679
4096;128;4;64;1;4094;447827632
2048;32;2;32;23;1;128544211
2048;32;2;2;2;1;765643433
1024;32;1;32;1;1;68385713
4096;32;4;1;1;4094;866560089
2048;32;8;32;1;1;322447547
1;32;1;32;1;1;1264482496
2048;32;2;32;1;4094;876112797
2048;32;1;32;1;1;68053044
2048;128;2;32;1;4094;876178844
4096;32;2;32;1;4094;876140255
2048;64;1;16;1;1;81159294
2048;32;1;32;1;4094;876028657
2048;32;1;32;1;2047;438846560
1024;32;1;1;1;1;648184184
2048;32;1;16;1;2047;241177669
4096;4;1;1;1;1;473045475
2048;128;1;64;1;1;70488542
2048;32;1;32;23;1;128447171
2048;64;1;32;1;1;71037253
2048;16;1;1;1;1;614023398
1024;32;1;16;1;1;152328876
1;16;1;1;1;1;2536344942
2048;16;2;1;2;1;961528422
256;16;1;1;1;1;867380553
2048;32;1;2;1;1;461784853
4096;32;2;32;1;1;67957961
128;16;2;1;1;1;1061039835
4096;128;8;32;1;1;223369089
1;64;1;32;1;1;631711764
4096;8;4;4;1;1;254574673
4096;16;2;4;2;1;417800139
1;32;1;32;2;1;1587912804
4096;32;4;16;1;1;72941084
4096;128;2;32;1;1;70299751
4096;32;2;1;2;1;916364240
1024;64;2;32;1;1;72778837
4096;16;2;1;2;1;951191505
4096;32;4;1;1;1;1199701625
1;4;1;4;1;4094;28976195292
4096;32;2;32;2;1;117740875
4096;64;4;16;1;1;75590710
4096;32;4;32;1;1;187500002
4096;32;2;16;1;1;73260126
1;4;1;4;1;1;9399054792
4096;256;2;32;1;1;71874045
4096;32;4;32;2;4094;513723601
4096;32;2;1;1;4094;454309542
4096;256;1;32;1;1;72574834
1024;16;2;1;1;1;1114141952
4096;8;1;2;1;1;408201386
4096;64;2;32;1;1;69948375
4096;32;2;4;1;1;220372964
1;128;1;32;1;1;414114714
4096;8;2;2;1;1;554698434
4096;32;1;32;1;1;68091171
4;512;1;1;1;1;208094668
4096;32;2;1;1;1;971325700
2048;32;2;32;2;1;116009336
2048;64;2;16;1;2047;250366209
4096;32;2;4;1;1;220721216
4096;4;2;4;1;1;230667465
4096;64;1;64;1;1;68626586
4096;512;1;32;1;1;76541082
4096;32;2;32;1;1;67971293
1;32;1;2;1;1;1264324393
4096;2048;2;32;1;4094;881308781
4096;8;2;1;1;1;958433865
4096;32;1;16;1;1;73556375
4096;16;2;1;1;1;1018855626
4096;32;2;16;1;4094;451192300
1;1;1;1;1;1;36733714280
4096;32;2;32;2;4094;886811402
4096;256;2;128;1;1;69786044
4096;32;1;32;1;4094;876117683
4096;16;1;1;1;1;581861133
4096;8;2;2;2;1;768048605
4096;32;2;8;1;1;112956211
2048;32;2;8;1;1;132456838
1;32;1;8;2;1;1588664958
4096;8;4;2;1;4094;853428840
2048;8;2;2;1;4094;467923875
4096;4;1;4;1;1;217792342
4096;128;2;128;1;4094;874980682
4096;128;2;1;1;4094;454317390
1024;32;2;1;1;1;1067564633
1;16;1;1;1;1;2534782600
1;32;1;32;1;4094;28976266250
4096;32;2;32;2;2047;478166967
1024;32;2;32;1;1;68496752
1024;8;2;2;1;1;637345102
4096;128;4;32;1;1;99945879
4096;64;2;32;2;1;122241335
4096;16;2;16;1;1;68574792
4096;32;1;8;1;1;108485960
4096;64;1;32;1;1;70055501
1;64;1;32;1;2047;14311913804
4096;32;2;8;2;1;190290338
4096;32;8;32;2;4094;534148509
4096;16;2;2;1;1;588622711
1;32;1;1;1;1;1264513171
4096;32;8;32;2;1;321740218
2048;32;2;1;1;1;1024920504
8;1;1;1;1;1;4510975875
4096;8;2;8;1;1;110115004
4096;16;8;1;1;1;1291999469
4096;8;1;1;1;1;505037458
2048;64;1;1;46;178;948179362
64;1;32;1;1;46;1030405713
4096;2048;256;4;178;2047;18446744073709551615
1;2048;1;64;1;89;965947897
2048;32;4;32;1;4094;446933142
4096;16;4;1;1;1;1297576990
4096;32;2;32;23;1;128424006
1;8;1;1;1;4094;28976456124
4096;8;2;2;2;4094;894501845
1;32;1;32;1;4094;28976604291
2048;32;4;1;2;1;1540745732
4096;16;1;16;1;1;68698835
4096;32;2;2;1;1;523397305
4096;256;4;32;1;1;76694376
1;32;1;32;1;1;1263364642
4096;64;4;1;1;1;1208489261
1;16;1;2;1;1;2542242878
1024;32;4;32;1;1;332794750
1;16;1;1;2;1;3115248598
4096;2;4;2;1;1;510285094
1;8;1;2;1;1;4860499822
4096;32;8;8;1;1;119695126
4096;32;4;32;2;1;127651793
4096;512;2;32;1;1;75467210
1024;128;4;32;1;1;384004343
2048;8;2;8;2;1;170111588
4096;32;2;32;1;2047;440109880
1024;128;1;32;1;1;71883128
4096;8;2;2;1;4094;454874637
4096;32;2;32;2;178;281991292
1;32;1;8;1;1;1264021421
4096;64;2;32;1;4094;876054887
2048;16;2;2;1;1;629562437
2048;256;2;128;1;1;70775294
1024;32;2;32;2;1;122872793
1024;64;2;16;1;1;101219252
4096;8;8;4;1;1;253992501
2048;32;2;32;46;1;130882587
4096;16;2;1;1;4094;454377678
4096;4;1;1;1;1;472812638
512;32;2;32;1;1;69196166
4096;32;1;32;2;1;116531503
4096;2;2;2;2;1;729302690
1;32;1;1;1;4094;28976361584
4096;32;8;32;1;1;286104136
4096;32;8;32;1;4094;300446375
256;32;2;2;23;2047;1019751204
4096;128;32;32;1;1;18446744073709551615
1024;32;2;32;1;1;68455545
4096;2048;2;128;1;1;79279960
4096;32;2;32;46;1;130678088
2048;16;8;1;1;1;1323343289
1;64;1;16;1;1;631458392
4096;256;2;16;1;2047;247937384
4096;128;2;32;23;1;321232049
4096;64;2;64;1;1;69288167
2048;32;2;32;2;4094;887096562
2048;8;2;2;1;1;588715341
16;4;4;2;1;1;600042716
2;2048;1;16;89;1;677609720
128;16;2;1;2;1;736465427
8;1024;8;16;89;2047;1995318794
4096;1;2;1;1;1;876112062
2;32;2;32;89;1;819804094
4096;4;16;4;1;1;263471089
4096;32;2;1;1;1;973536811
8;32;1;1;1;1;225824424
64;32;1;2;1;4094;611801270
16;256;4;2;2;1;1507038023
16;128;2;4;23;1;916065087
1;16;1;1;1;2047;14314666125
1;32;1;32;1;1;1263911476
1;16;1;1;1;4094;28976654167
2048;32;8;1;1;4094;891251741
4096;128;2;32;1;2047;439996920
4096;32;1;1;1;1;550810147
1;32;1;32;1;2047;14311616750
4096;64;2;16;1;1;75318461
2048;16;4;1;1;1;1322577562
1024;64;1;64;1;1;68782879
4096;4;2;4;1;4094;429328137
1;32;1;32;2;1;1589116354
1;32;1;2;1;4094;28976310541
2048;4;2;4;1;1;237859918
4096;16;2;16;1;2047;250446625
1;32;1;1;1;1;1263867316
4096;64;2;16;1;4094;450605501
4096;32;1;16;1;4094;447386419
4096;8;4;2;2;1;863181319
1;32;1;16;1;4094;28976328833
4096;256;2;32;1;4094;876304640
256;1024;64;1;89;89;1519302807
128;2;2;2;23;2;761641258
32;1;2;1;1;46;1273196594
256;4096;4;16;2047;4094;14426355267
1;128;1;32;1;1;413769764
1024;4;2;4;1;1;257755176
1;16;1;1;2;1;3114450222
2048;32;4;32;1;1;264036173
4096;32;2;16;2;1;131898375
4096;32;2;16;23;4094;649855629
512;64;2;32;1;1;76254126
4096;8;2;2;23;1;1523700880
16;256;2;1;23;4094;2298423842
4;64;2;16;1;1;215327962
4096;16;4;1;2;1;1594701210
2048;32;4;1;1;1;1256987626
512;32;4;32;1;1;380708760
2048;128;2;32;1;2047;440180292
4096;32;4;32;1;2047;246293968
1;32;1;2;1;4094;28976234667
4096;32;4;32;23;1;129151460
4096;16;1;8;2;1;129927126
2048;8;4;4;1;1;266895837
2048;128;2;32;2;1;121969547
2048;16;2;16;1;1;69077083
16;32;2;8;1;1;90036212
1024;64;4;8;2047;89;555917643
4096;32;2;32;1;46;198234834
1;32;1;32;1;1;1264487779
16;8;2;2;1;1;321667136
64;2048;64;1;46;4094;1506217959
4;2;2;1;23;23;3836703153
128;1024;8;128;23;1;18446744073709551615
1;64;1;32;1;1;631793026
4096;16;2;1;1;2047;459202550
4096;32;4;8;23;1;957901476
2048;64;2;16;2;1;133476459
1;64;1;32;1;1;631315309
512;32;2;16;1;4094;460005678
2048;64;1;16;23;1;508201380
1;8;1;1;1;1;4864535244
2048;8;2;8;1;1;133858463
4096;32;2;8;1;4094;298686092
8;32;2;32;1;1;161318088
4096;32;2;32;1;89;203278049
32;2;2;2;1;1;925683417
2048;64;4;32;2;1;125559172
4096;16;4;1;1;4094;868475796
1;32;1;16;1;1;1264029842
4096;32;2;8;1;2047;211824673
512;16;1;1;1;1;762142881
4096;8;2;1;23;1;1512427504
1;32;1;16;2;4094;28890805459
1024;32;2;8;1;1;191236250
1024;2;2;1;23;1;1669853902
4096;64;4;32;1;1;183283295
1024;16;2;8;1;1;153816586
4096;32;4;32;1;4094;446630717
4096;32;4;4;1;1;239894880
1024;256;2;32;1;1;71588042
1;64;1;64;1;1;631606752
1;32;1;32;2;4094;28890516584
4096;16;1;2;1;1;450205338
2048;32;4;8;1;1;153776129
1;32;1;8;1;1;1264528405
2048;8;2;4;2;1;390399964
4096;8;1;2;2;1;303388588
2048;32;2;16;2;1;131845294
16;4;1;2;1;1;611668880
4096;128;2;16;1;1;74479459
4096;128;1;32;2;1;121739458
4096;8;4;2;1;1;571025964
512;32;2;32;1;2047;439176048
4096;32;8;16;1;1;251893800
1024;64;8;32;2;1;450303764
1;32;1;4;1;1;1264423478
4096;32;1;16;2;1;132478170
1024;32;2;1;1;4094;476940142
1;64;1;32;2;1;803704093
1;32;1;16;1;1;1262802490
4096;32;1;1;1;4094;326137835
4096;8;2;8;1;1;111781876
2048;32;2;16;23;1;655697808
4096;16;2;4;1;1;242079294
2048;64;2;16;1;1;82320252
1024;32;4;32;23;1;137732126
1;64;1;1;1;1;698412759
2048;32;1;32;23;4094;966886654
1024;32;1;2;1;1;519790295
4096;32;4;16;2;1;272097468
1024;4;2;4;1;4094;459726181
1;32;1;32;1;4094;28976176249
2048;8;4;2;1;1;605295772
16;16;2;8;1;1;167117174
1024;32;4;1;1;1;1298740846
1024;16;2;16;2;1;123931876
1;32;1;1;1;1;1264494193
256;64;128;4;2;23;18446744073709551615
1024;256;32;4;2;4094;1572343363
1;512;1;4;1;4094;28976583707
32;16;8;1;178;1;1677089343
4096;4096;2;32;1;1;110889421
4096;32;1;32;2;46;295915168
16;16;2;4;1;1;178229459
16;32;2;4;1;1;169548048
1;256;1;16;1;1;208311502
2048;128;2;16;1;1;76814499
4;128;4;8;1;1;128662380
1;16;1;1;2;1;3114344560
8;256;8;64;1;1;18446744073709551615
4096;1024;2;32;1;1;81754631
4096;8;1;1;2;1;558347476
4096;32;1;8;1;2047;213121216
1024;128;2;32;2;1;124852666
64;1024;8;4;178;46;1272643257
4;4;2;4;1;1;2259300032
4096;1024;32;64;2;89;18446744073709551615
1;256;1;4;89;2047;14969420375
1024;32;2;1;2;1;984850155
4096;32;4;8;1;1;115743838
4096;64;4;32;2;1;125411837
2048;32;2;32;1;2047;439062720
1024;256;2;32;2;1;123926171
1024;32;2;16;2;1;137093087
1;32;1;32;23;1;1535326308
4096;64;8;64;1;1;18446744073709551615
1024;32;2;32;2;4094;886728947
4096;8;2;4;1;4094;429543546
4096;32;2;16;23;1;675245835
512;64;2;16;1;4094;454291428
8;64;2;2;1;1;404483344
4096;128;2;128;1;1;69333543
4096;32;2;2;1;4094;454489174
2048;256;2;32;2;1;122458001
8;64;4;8;1;1;439843004
8;128;2;4;1;1;583009764
8;64;2;16;1;1;121110504
512;32;1;16;1;1;231395509
1;4;1;4;2047;89;7720537405
4096;32;2;32;1;2;81378376
16;512;2;2;1;89;818304353
128;2048;1;256;178;23;421021208
2048;16;4;1;2;1;1595241866
64;16;2;1;1;1;1081701620
4;16;4;2;89;2047;3861211935
128;128;4;1;4094;2;2989030500
4096;4;1;1;1;2;368816919
1;64;1;8;1;1;631289338
1;128;1;32;2;1;503831602
1;8;1;2;1;4094;28976194542
