GLOBAL_SIZE_0;GLOBAL_SIZE_1;GLOBAL_SIZE_2;LOCAL_SIZE_0;LOCAL_SIZE_1;LOCAL_SIZE_2;TILE_0;TILE_1;TILE_2;cost
1;64;32;1;2;16;16;128;1;14268286397
1;32;1;1;2;1;32;32;1;4710256589
128;32;1;16;1;1;128;8;16;2397201491
8;32;1;1;2;1;16;2;128;1479994719
8;32;1;1;8;1;16;2;128;7407982917
1;1;64;1;1;4;4;32;16;10793332467
1;32;256;1;2;8;64;2;4;18446744073709551615
8;32;64;1;2;4;16;2;128;35150375339
8;64;1;1;2;1;64;1;128;2622849177
8;32;1;1;2;1;16;1;128;1071552199
8;32;1;1;2;1;16;2;1;2122488213
128;4;128;64;2;2;256;1;256;18446744073709551615
64;128;16;16;2;2;1;2;4;18446744073709551615
256;2;8;32;1;1;256;1;64;18446744073709551615
32;1;4;8;1;4;32;64;1;2495934811
2;2;4;2;2;2;16;1;1;23943829581
8;128;1;1;1;1;16;1;128;1443600097
8;8;1;1;2;1;8;1;128;3410642417
8;16;1;1;2;1;16;1;256;2073761398
8;8;1;1;2;1;16;1;128;3449444421
8;32;1;1;2;1;8;1;256;2568477142
8;32;1;1;2;1;32;1;128;3011974669
8;32;256;1;1;1;16;1;128;18446744073709551615
16;32;1;8;2;1;16;1;64;2991726667
64;256;32;4;4;8;256;1;128;18446744073709551615
64;8;64;32;2;2;2;1;16;18446744073709551615
32;1;4;16;1;2;1;1;256;30824612909
16;128;8;8;1;2;16;1;64;9408731774
2;64;1;1;2;1;16;1;128;1841593064
8;32;256;1;2;2;16;1;128;18446744073709551615
16;16;1;4;2;1;16;1;128;2781296921
8;32;1;1;2;1;16;1;128;1104113226
8;32;1;1;32;1;16;1;128;5653463332
16;256;2;8;2;2;1;64;128;1458191757
64;128;32;4;1;1;256;8;1;18446744073709551615
2;32;2;1;1;1;256;32;32;6326600070
2;8;64;2;8;16;32;1;128;8684285570
256;2;256;16;2;2;128;1;1;18446744073709551615
1;32;128;1;32;8;128;128;2;18446744073709551615
8;32;256;1;2;2;64;1;128;18446744073709551615
4;32;256;4;2;8;16;1;128;11814238917
8;32;1;1;2;1;128;1;128;1437529705
64;32;256;64;2;2;16;1;128;18446744073709551615
1;4;16;1;4;2;256;32;1;13411701750
8;32;1;1;2;1;16;1;1;4175115654
256;64;16;1;8;16;8;32;4;4865433031
64;4;256;2;1;1;16;16;1;18446744073709551615
16;64;8;1;8;4;2;64;16;2814363143
8;256;1;1;64;1;64;1;64;150563228792
16;8;256;8;1;32;32;1;1;18446744073709551615
2;64;1;1;64;1;64;16;8;6795846649
32;2;8;8;1;2;1;1;16;50434769268
256;256;128;128;2;1;1;128;128;18446744073709551615
4;1;64;1;1;1;8;128;4;60191029750
16;128;256;8;2;16;16;1;128;88628434333
8;16;1;8;2;1;16;1;128;1757943668
8;32;1;2;4;1;16;1;128;6203416308
8;32;1;2;2;1;16;1;128;2555646167
8;32;1;1;2;1;16;64;128;2168456715
128;32;1;1;2;1;4;1;128;2718159017
8;32;1;1;8;1;16;256;128;8284060524
8;256;1;1;2;1;64;16;128;1003130958
8;256;1;1;2;1;64;16;32;1444729824
8;1;1;1;1;1;64;16;128;10259453250
8;256;1;1;2;1;64;8;128;981252747
8;256;16;1;2;8;64;16;128;443961251
8;256;16;1;2;8;64;16;64;471494303
64;256;16;2;2;16;64;16;128;240219342
8;256;16;1;2;8;128;16;128;391343433
8;256;16;8;2;8;64;128;128;4357584000
64;256;16;2;2;16;256;16;128;36302767804
64;256;16;2;2;16;8;32;64;278882001
64;256;16;2;2;16;32;16;128;203049834
1;256;16;1;2;16;16;16;128;210200049
64;256;16;2;2;16;32;2;128;205804214
64;256;8;2;2;2;32;16;1;31087923834
64;2;1;2;2;1;32;16;128;2377822104
4;256;16;4;1;16;32;16;128;207539837
64;256;2;2;2;2;32;16;128;1256407668
64;256;16;2;64;2;2;16;128;31961991957
64;256;16;2;2;16;32;8;64;301005175
8;256;16;1;2;16;256;16;128;1779559555
64;64;16;2;2;16;32;16;128;205340378
64;256;16;2;16;2;32;16;128;8850979196
32;256;16;4;2;16;32;128;128;1580106612
64;256;16;2;2;8;32;16;128;1221450625
64;256;16;2;2;16;32;1;128;451902670
64;256;8;2;2;2;16;16;64;6288816471
1;2;16;1;2;16;32;16;128;1414609370
128;256;16;1;2;16;32;64;128;258969212
64;256;2;2;2;2;32;16;128;1522504335
8;256;16;4;2;16;32;16;128;1614216094
64;256;16;4;2;16;32;16;128;1432587293
64;256;16;16;2;1;32;16;128;29187791250
64;256;16;4;2;16;32;16;128;1240878866
64;256;16;1;2;16;32;16;128;221089338
64;256;16;4;2;16;1;16;128;889594592
64;256;16;2;2;4;32;16;128;5576188167
64;16;16;2;16;2;32;8;128;38266106583
64;256;16;2;2;4;32;16;128;6070644256
64;16;16;2;2;16;32;16;128;217561751
64;256;16;2;2;8;1;16;128;809663465
64;256;16;2;16;2;32;16;128;8268726500
64;256;16;1;2;16;32;16;4;8600298617
64;16;16;2;2;16;1;16;128;404455086
64;256;16;1;2;8;32;16;128;412226388
64;256;16;2;4;2;2;16;128;6880610235
64;256;16;16;2;2;32;16;128;13391038115
64;256;16;2;2;16;32;16;32;226759458
64;256;16;1;2;16;32;8;128;214493465
64;1;16;2;1;16;32;16;32;259679544
64;256;16;2;2;16;32;8;128;196015005
1;256;16;1;8;16;32;16;128;1404295641
64;256;16;2;2;8;1;16;128;793828854
64;256;16;2;1;16;32;16;128;213027084
64;256;16;2;2;16;2;8;128;203294507
64;256;16;2;2;16;32;1;128;451432171
128;2;16;1;1;16;32;8;128;232265210
64;256;16;2;2;16;32;8;128;202116631
64;256;4;2;2;2;2;8;128;1592061866
64;256;16;4;2;16;32;8;128;864102384
64;64;16;64;2;2;32;4;128;30675611625
64;256;16;64;2;2;32;8;128;23880177953
64;256;16;2;8;16;1;8;128;1009166959
64;256;128;2;2;4;64;8;128;51696079250
64;256;16;16;2;2;32;8;128;12329640208
64;2;16;2;2;8;32;8;128;775900614
64;64;16;2;2;16;32;8;128;222063916
128;16;32;16;1;4;8;8;4;39792573283
4;256;16;4;2;16;32;8;128;1901258521
64;256;16;2;2;16;256;8;128;7545700898
64;256;16;2;2;16;32;64;128;216796963
16;1;1;2;1;1;32;1;1;5199937383
64;256;16;2;2;4;32;8;128;5120028593
64;256;32;2;2;4;32;8;64;11214704759
64;128;16;2;2;16;32;8;128;207798296
2;1;2;1;1;1;8;1;2;24774769709
64;8;16;32;4;1;128;128;1;66623297375
1;128;256;1;128;2;16;128;16;18446744073709551615
128;1;4;1;1;2;4;16;4;2357736764
64;256;256;4;2;8;32;8;128;43091632750
8;256;16;8;2;16;32;8;128;2050767746
64;256;16;2;2;1;32;8;128;24766552333
64;256;4;4;2;1;32;4;128;6666445000
16;128;8;1;8;8;32;8;8;1916455326
64;256;128;2;2;4;32;1;128;64199511508
1;256;1;1;2;1;32;8;128;2275313955
1;1;1;1;1;1;128;16;1;60151241500
64;256;16;1;2;16;128;8;64;276587048
64;256;16;2;1;8;32;8;128;415395708
64;256;2;2;4;2;32;8;128;1233303090
4;256;8;2;32;2;64;16;8;17002946000
64;256;2;2;2;2;8;8;128;990779543
64;256;16;2;128;1;32;1;128;18446744073709551615
8;256;16;1;2;4;1;8;128;5664469125
1;16;4;1;1;1;1;64;1;15135889583
32;1;128;4;1;64;64;16;128;506741460
1;8;256;1;2;1;2;64;64;18446744073709551615
128;8;1;4;4;1;256;64;8;83552894148
64;256;2;2;2;1;32;8;128;3104813875
32;64;16;4;2;16;1;8;128;793849256
64;256;64;4;2;8;32;8;128;10344532931
4;32;8;1;4;4;8;32;8;3435434839
64;1;4;2;1;1;32;16;128;4242050458
64;256;16;1;2;16;32;8;128;210425926
64;256;32;2;2;8;32;8;128;4520085273
1;256;1;1;1;1;8;1;256;860261971
32;256;16;4;8;2;32;8;128;10002291917
64;256;16;2;2;16;32;8;1;27182416507
1;1;1;1;1;1;2;1;1;49587492191
8;64;128;2;1;64;256;2;16;71777811532
256;4;32;128;1;2;32;1;256;18446744073709551615
64;16;1;64;1;1;8;64;32;15187462716
64;256;16;2;8;16;32;8;128;1167755625
64;256;16;2;64;2;32;8;128;98829845125
64;256;64;2;2;1;32;8;128;102385114683
32;256;16;4;2;16;32;8;2;12961123207
1;1;1;1;1;1;64;1;1;61443554352
64;256;16;2;2;16;16;8;128;197071170
64;256;16;2;2;8;64;8;128;1250836532
64;256;16;2;2;8;32;16;128;867380395
64;32;16;16;4;1;16;16;16;38757164042
64;16;16;2;8;16;32;8;128;1894154752
64;256;16;2;128;1;32;8;128;18446744073709551615
64;256;1;2;2;1;64;8;128;1540985323
1;256;2;1;32;1;16;128;128;4716380471
128;4;32;1;2;8;32;256;64;18051209627
1;64;32;1;2;16;16;1;1;18446744073709551615
8;128;1;4;2;1;16;2;128;1885903115
4;128;4;4;16;4;16;64;64;1834324952
64;256;8;1;2;2;16;8;128;4839958500
128;256;64;1;2;4;32;2;128;19758908448
64;1;16;2;1;16;32;8;128;210419086
64;256;16;2;16;2;32;8;128;23124416880
64;256;16;64;2;2;4;8;128;18446744073709551615
8;128;16;1;2;16;32;8;128;209616837
256;32;8;1;4;2;1;128;1;18446744073709551615
128;4;128;2;2;1;256;8;16;18446744073709551615
64;128;256;16;2;2;1;1;4;18446744073709551615
64;4;8;32;1;1;256;1;1;47379349516
8;256;8;2;32;1;32;32;16;12487964792
64;256;16;2;2;16;32;8;32;225206714
32;256;16;4;2;16;128;8;128;626920729
64;256;128;2;2;4;2;1;128;64987357125
1;1;2;1;1;2;1;32;1;54588255524
64;256;16;4;4;16;32;8;256;1762419306
64;256;16;2;8;16;32;16;128;1218589225
4;32;16;4;32;2;64;32;128;21282906584
64;256;16;2;2;16;32;128;128;282577593
128;256;2;16;2;1;64;256;256;18446744073709551615
64;256;2;2;4;1;16;256;128;18446744073709551615
128;256;4;8;4;4;16;64;64;1165851291
128;128;4;1;4;2;4;256;64;161277960303
32;1;8;8;1;2;32;64;32;5044253786
2;2;32;2;2;2;2;1;1;64215488750
1;256;32;1;4;4;256;1;128;99220826218
64;8;64;32;2;2;2;1;128;18446744073709551615
64;256;16;2;16;2;32;8;16;28727446447
64;256;16;2;2;8;32;8;128;1137747795
64;256;1;2;2;1;32;8;128;1602414724
16;256;8;8;2;2;32;8;128;7771696334
64;256;16;2;2;16;32;8;256;1484403811
64;64;16;4;2;16;32;8;128;1375878547
64;256;16;2;2;16;128;8;128;213482005
64;256;16;2;2;4;32;8;128;5070991458
64;256;16;2;2;16;32;8;16;1538619404
64;128;4;4;2;2;8;128;64;3617856474
1;128;4;1;4;4;8;128;32;1942317045
32;1;8;8;1;1;8;128;64;9736209489
64;256;4;8;8;1;16;128;64;8106987913
32;1;4;16;1;2;1;1;256;34396233933
