GLOBAL_SIZE_0;GLOBAL_SIZE_1;LOCAL_SIZE_0;LOCAL_SIZE_1;v_TP_2116;v_TP_2117;cost
256;2;32;2;4092;33;909085530
2;32;2;8;2046;4;22807462825
2048;1;128;1;4092;1364;25823047992
16;4096;4;128;4;4;18446744073709551615
8;64;1;32;12;93;1473629209
2048;128;256;2;4;2046;18446744073709551615
32;64;8;32;1;12;1112193070
256;32;2;4;1;341;805845768
4;1;1;1;1;62;21626485969
16;128;4;16;186;682;1956886625
1024;512;2;1;12;44;725598194
8;128;4;128;132;341;18446744073709551615
2048;32;128;4;4092;1364;18446744073709551615
1024;1;128;1;4;1364;25798507625
2048;1;128;1;4092;2;612599939
2048;1;128;1;12;1364;25809131950
1024;1;128;1;1023;1364;25872232667
1024;2;128;1;4;1364;12936885872
1024;1;128;1;11;132;2953732573
1024;1;128;1;4;372;6990710999
2048;1;128;1;2;1364;25797299617
128;4;128;4;4;682;18446744073709551615
1024;1;256;1;6;1364;25806135541
1024;1;128;1;4;186;3810406534
2048;1;128;1;2;372;6995823750
2048;1;1;1;2;1364;25835334417
2048;4;128;4;2;1364;18446744073709551615
2048;1;64;1;2;4092;82074468253
8;1;8;1;2;66;10037828373
2048;512;128;256;2;1364;18446744073709551615
2048;128;128;8;2;1364;18446744073709551615
2048;1;128;1;2;22;1092946054
1;8;1;8;44;62;10767840208
128;1;4;1;132;1;1755268646
2048;2;256;1;2;1364;12893505620
1024;1;128;1;2;1364;25783875533
2048;2;256;1;1;1023;10091391424
1024;2;256;1;2;1364;12913857917
2048;2;256;2;1;132;18446744073709551615
2048;4;256;2;1;1364;18446744073709551615
1024;2;256;1;2;682;6393943708
2048;2;256;1;1;1364;13499412208
1;2;1;1;2;4092;40709190280
2048;2;256;2;2;1364;18446744073709551615
2048;2;256;1;1;2046;20878046292
2048;2;1;1;6;1364;12984952417
4096;2;256;2;2;1364;18446744073709551615
1024;2;128;1;2;1364;12913276709
512;1024;1;1;372;1;1083893507
1;2;1;1;2;1364;39330871333
2048;1024;256;256;2;1364;18446744073709551615
2048;2;256;1;124;682;6624622927
128;512;4;4;341;11;1413044470
4;2;1;2;186;682;12841898535
64;512;4;2;11;12;459200518
64;256;2;256;186;33;18446744073709551615
64;2048;2;32;132;62;1255107170
32;128;8;4;1;44;676158555
32;1;2;1;1023;11;3644600473
8;1024;1;8;1023;132;3570757541
2048;2;256;2;2;1364;18446744073709551615
1024;2;128;1;2;372;3503177188
2048;1;1;1;1;1364;27020663084
2048;1;256;1;2;1364;25787906125
2048;2;2;1;2;124;2673911486
2048;32;1;4;2;1364;1305374788
2048;2;64;1;2;62;1205805160
2048;2;256;1;93;1364;13016172500
4;1;2;1;11;4;23000395542
256;64;1;4;66;93;1244391280
1;4096;1;128;124;12;3806337649
1;8;1;1;66;372;10553721375
2048;4;256;4;44;4092;18446744073709551615
4096;2;256;1;2;682;6433441971
4096;2;256;1;1;1364;13521041314
2048;2;256;1;2;186;2611069098
128;2;1;1;2;1364;12959821663
2048;2;64;1;2;1364;12891556370
2048;32;256;4;2;1364;18446744073709551615
2048;2048;64;256;2;124;18446744073709551615
2048;2;64;1;2;4092;41064478625
2048;2;1;1;2;93;2901271946
2048;2;64;1;2;12;1572077708
2048;2;64;1;62;1364;12984195959
2;2;1;1;62;1364;25869026661
2048;2;64;1;4;1364;12922149744
2048;2;64;1;2;341;3222853195
2048;2;8;1;2;124;1596336891
2048;2;64;1;2;4;1716100334
2048;2;32;1;2;1364;12897766292
2048;8;64;1;2;1364;3222477129
2048;2;64;1;2;372;3519457646
2;2;2;1;2;1364;26021414084
4096;2;64;1;2;1364;12890891959
2048;32;64;8;2;1364;18446744073709551615
4096;1024;64;1;4092;1364;25855043952
4096;2;64;1;4;1;3964092910
4096;2;64;1;2;6;1540742517
4096;2;64;1;31;1364;12984841250
128;2;64;1;2;1364;12908045754
4096;2;1;1;3;1364;12963855668
1;2;1;1;2;1364;39332102083
4096;4;64;1;2;1364;6446833018
1;2;1;1;2;1364;39329377292
4096;2;64;1;2;1364;12895260704
4;2;1;1;2;31;10035389543
4096;2;64;1;2;11;1561572635
4096;2;64;1;2;1364;12900907204
4096;2;256;1;2;1364;12893798829
4096;2;64;1;2;93;1369087430
64;2;1;1;2;1364;12944746873
4096;2;32;1;2;1364;12894061662
32;2;32;1;2;1364;12840830709
4096;2;64;1;372;1364;14150934465
2;256;1;16;341;62;4017354668
8;1024;8;16;1023;124;3959616074
2;2;1;1;186;1364;25882437833
4096;2;2;1;2;12;1229670269
8;2;4;1;2;1364;12841689709
4096;8;64;1;132;1364;3357673291
4096;2;16;1;2;1364;12895783463
2;2;1;1;2;1364;26009572375
