06cec1425929ffa1528e0dfb51d6bf7b0ae826c77cfe2d7911c5d2cdc261e86a.cl -> 25567968 (8;8192;8;128;356;8188;25567968)
87d266939edd240dccde5cff86cf5a5c77e2ec456b00e03a6097670736707603.cl -> 11492320 (8192;8192;8;16;11492320)
9f6f6c64373c1b47bb1b00c340d4f9f147e4d04c094f43c29825d778261ac25e.cl -> 9297888 (1024;8192;32;4;4;89;9297888)
a69c9864ce394d6d6ce7fa3f03df00c1723a7fbd06a2b66b0a47105afc25e858.cl -> 7092000 (2048;8192;32;4;1;2;7092000)
