884e6702324e0ceb3048bc8458d0de9ef14e4d65d0941c2dc11074b82e701205.cl -> 5553481 (1024;2048;16;16;63;234;5553481)
f2e1aac1d7a8a8fa83d88e12c0b3164cbc1fdb46b6c2b6d52a10faad1fd5e123.cl -> 5226815 (2048;2048;8;16;30;42;5226815)
c727117d85ddb6df814c270724c4bd5cd8868618ce39f0a2185de24b2145e58c.cl -> 3915703 (4096;128;64;1;45;3;3915703)
8a64e1a76d2c9193165c47608d2997de73bb1fc01e1170322079dec986818019.cl -> 2353038 (4096;8192;64;4;2353038)
