GLOBAL_SIZE_0;GLOBAL_SIZE_1;LOCAL_SIZE_0;LOCAL_SIZE_1;v_TP_41;v_TP_42;cost
1;16;1;16;910;630;3959748741
256;1;128;1;45;273;605338518
2048;128;256;16;4095;546;18446744073709551615
1;512;1;256;1;90;30504476889
4;4096;2;64;9;70;33090074
1;4;1;1;90;13;17195835111
1;16;1;8;35;819;4445572149
512;2;64;2;65;390;117210222
4096;4096;2;64;9;182;32543556
16;4096;2;64;9;182;25169926
4;2;2;1;9;70;8294949185
4;4096;2;64;9;45;33676444
16;4096;2;16;273;117;27501482
16;4096;1;64;9;182;50105334
8;4096;2;32;9;182;28637926
16;4096;4;64;9;182;17208444
16;4096;4;256;13;182;18446744073709551615
16;4096;2;64;9;117;27086074
8;1024;4;64;9;65;67980889
2;2048;1;64;5;182;223123111
16;4096;4;64;15;182;20184444
16;4096;4;64;9;7;25269482
16;4096;2;64;1;182;213495555
16;4096;4;64;35;182;21012296
16;512;4;64;9;182;62530518
16;8192;4;64;9;273;20098074
32;4096;4;64;3;182;41962222
16;1;1;1;9;182;4118132889
32;8192;4;64;9;182;17729185
16;4096;4;64;14;182;18097926
4;512;4;64;9;182;233419111
1;512;1;32;546;9;208371408
8192;8;128;2;18;195;18402370
8;64;1;16;26;546;165778666
2;4096;2;1;273;65;1125737778
16;1;4;1;6;182;4408480593
16;2048;4;64;9;130;16347556
16;4096;4;64;9;390;13662815
16;4096;4;64;1;182;105363704
32;4096;4;64;2;390;60871111
16;2048;4;128;6;105;18446744073709551615
16;4096;4;32;21;390;20895852
16;4096;4;64;15;390;18303704
16;4096;4;64;2;819;57249333
16;4096;4;64;13;117;13749630
16;4096;4;128;1;455;18446744073709551615
4;4096;4;64;9;455;32184148
4;4096;4;64;9;273;32062518
128;4096;4;128;9;234;18446744073709551615
16;4096;4;64;10;390;13180444
16;2048;4;128;9;819;18446744073709551615
16;4096;4;64;7;390;16760149
32;4096;4;64;10;390;17189334
8;4096;4;64;10;390;21329778
4;4096;4;256;26;390;18446744073709551615
16;4096;2;128;18;390;30213630
16;1;4;1;10;182;4393389777
4;4096;4;64;10;390;27355852
16;4096;4;64;10;1638;17819555
16;4096;8;64;13;390;18446744073709551615
16;8192;4;64;10;390;18426963
16;4096;8;32;7;315;11020297
16;4096;8;64;10;1365;18446744073709551615
16;4096;8;32;9;315;11288444
16;4096;8;32;21;195;12568444
16;4096;16;32;7;273;18446744073709551615
16;4096;4;32;9;315;17370370
16;4096;8;16;7;315;11297630
16;8192;16;32;5;315;18446744073709551615
16;1024;4;32;7;210;20475111
16;4096;8;32;7;117;9522370
128;4096;8;128;7;455;18446744073709551615
64;4096;8;32;6;117;13306223
4;1;4;1;9;126;16831476296
16;4096;8;32;7;126;11751555
16;4096;16;32;13;126;18446744073709551615
16;4096;8;32;7;39;10957334
8;4096;2;32;7;195;32984741
16;4096;4;8;7;117;20027704
16;1024;8;32;7;117;23394815
16;4096;8;16;7;117;12077037
16;4096;8;64;7;117;18446744073709551615
16;1;8;1;7;117;4792148444
4096;1024;1;4;105;26;79016296
1;128;1;128;13;2;7874335704
32;128;4;4;78;195;29832296
128;16;16;16;65;2730;123617185
16;4096;8;32;7;105;9849482
2;2048;1;32;7;117;79932000
32;4096;8;32;7;26;16488740
64;4096;16;32;35;117;18446744073709551615
4;4096;1;32;7;117;62293185
16;4096;2;32;7;63;25709926
16;2048;8;16;7;117;11890222
16;4096;8;32;7;195;9145482
16;2048;16;16;6;117;12061037
16;4096;4;32;7;90;15393926
16;4096;4;32;6;195;16120593
16;4096;16;64;7;195;18446744073709551615
16;4096;8;16;7;195;11506963
8;4096;8;16;7;195;11031111
32;8192;16;32;7;195;18446744073709551615
16;4096;8;32;6;70;11499259
8;1024;8;32;6;195;48832148
8;4096;8;64;7;195;18446744073709551615
16;4096;8;32;2;91;28948444
4;4096;1;16;7;90;53624888
16;4096;8;16;9;210;12665777
32;4096;8;32;7;105;11949926
128;1;8;1;7;195;647828889
32;4096;8;32;10;195;12781630
16;4096;16;32;2;910;18446744073709551615
16;2048;16;32;7;195;18446744073709551615
16;512;8;32;15;182;20813778
16;1024;8;32;9;195;24160444
32;4096;8;8;7;195;12272741
16;4096;8;32;26;126;12612000
8;8192;4;32;7;819;18152000
16;4096;8;32;10;315;10596889
4;4096;1;32;7;195;63758074
16;4096;8;32;7;91;12587408
32;4096;8;32;3;195;23043111
1;8192;1;64;4095;18;745664444
256;512;1;1;1170;455;2175955556
256;32;16;16;130;819;17702963
16;1;2;1;1;5;6853775704
16;4096;8;32;7;455;9080889
4;4096;1;32;14;195;63359112
16;8192;8;32;7;195;12369630
16;4096;8;32;6;195;12357482
16;1024;8;32;7;455;21400593
16;4096;4;32;7;455;16874963
16;4096;8;8;9;455;14466815
16;4096;4;32;3;390;32515111
16;4096;8;16;7;455;11783112
128;4096;8;32;7;455;10880593
16;4096;8;32;15;390;12292000
16;2048;8;32;2;210;36593481
8;8192;8;32;7;455;10608000
16;4096;8;32;21;455;12592445
16;8192;8;64;7;455;18446744073709551615
16;4096;8;32;7;1;135954963
16;4096;8;32;7;546;9508148
16;4096;8;32;26;455;12995111
8;2048;8;32;7;455;21673037
16;1024;4;32;5;910;35742518
16;2048;16;32;7;455;18446744073709551615
32;4096;8;32;7;90;12228148
512;4096;8;32;7;455;10219555
16;4;4;4;7;455;1386679259
16;8192;8;32;7;455;12808593
16;4096;8;32;3;455;17821037
16;4096;8;64;7;273;18446744073709551615
16;2048;4;4;10;195;25608296
64;1;8;1;7;455;1457595704
64;4096;8;32;5;910;17507407
16;1024;8;64;14;1170;18446744073709551615
16;8192;8;32;14;455;13281926
16;8192;8;32;7;546;12906222
16;1;8;1;5;390;4549253926
16;4096;8;32;5;630;15377037
256;1024;1;128;1;6;595491111
4;4096;2;32;7;819;38908889
128;1024;8;32;7;390;12879556
4;4096;1;32;14;455;67100000
4;256;1;1;5;70;328006371
128;1;32;1;1170;13;3464060000
4096;2048;2;128;10;455;58980444
32;256;8;16;273;2;152183111
512;512;4;64;26;35;19904444
16;512;8;32;7;130;46539111
64;4096;8;32;1;455;83551111
32;4096;4;128;7;455;18446744073709551615
16;4096;8;32;1;234;69283111
16;4096;8;32;1638;455;30500889
16;4096;8;32;7;78;9919703
16;4096;8;4;7;455;13421630
16;8192;8;64;1;315;18446744073709551615
16;4096;8;64;7;455;18446744073709551615
128;4096;16;64;7;585;18446744073709551615
16;2048;16;32;2;455;18446744073709551615
1;64;1;1;1;65;981210074
32;4096;8;32;10;455;12696149
16;2048;8;32;2;455;35772740
16;4096;8;32;9;455;11074815
16;128;8;8;15;70;44912297
8;4096;1;32;1;455;406827556
16;4096;16;32;7;1170;18446744073709551615
16;4096;8;128;7;585;18446744073709551615
1;1024;1;1;182;1;3144453629
16;4096;4;64;7;455;21210370
64;4096;8;32;7;455;12551852
16;8192;8;16;7;455;12981334
16;512;2;4;78;390;48981629
8;4096;4;32;14;630;20056296
16;1;8;1;7;210;4673155703
16;4096;8;32;2;455;25228296
256;8;1;2;30;182;468537481
4;1024;2;256;10;315;18446744073709551615
1024;2;128;1;819;14;816706370
16;512;16;256;6;42;18446744073709551615
16;4096;4;32;7;455;16330667
1024;1;8;1;7;910;953784741
16;4096;8;1;26;455;43198519
16;4096;4;32;7;63;14752889
8;4096;2;16;7;455;32627704
64;2048;16;32;7;130;18446744073709551615
16;4096;8;32;1;455;68209037
16;1;2;1;18;1;15729115703
16;4096;8;32;1;546;54881333
64;1;8;1;6;210;1156321186
16;4096;2;32;1;455;227267111
128;64;16;1;63;455;33043259
16;2048;8;16;7;1365;10556148
1;16;1;1;2;1;7009923852
8;2048;2;32;7;455;31363259
32;4096;16;32;13;195;18446744073709551615
512;512;4;8;70;65;10895111
256;4096;128;128;819;910;18446744073709551615
8;64;2;2;819;1170;473976296
1;4096;1;16;126;455;66874963
128;4096;8;16;7;455;10948593
16;4096;8;32;13;455;11299111
16;4096;8;32;15;182;12120593
32;4096;8;64;7;455;18446744073709551615
8;1;1;1;7;1365;10050036741
1024;64;1;2;6;18;157426815
8;4096;8;32;1;455;100844000
8;4096;8;16;3;455;22937037
16;512;8;32;7;273;42302666
32;512;32;8;63;210;12228148
16;1024;8;32;9;455;23266815
8;4096;8;32;3;234;25351851
64;1024;8;4;21;455;13521629
1024;1024;64;64;130;455;18446744073709551615
4;8192;1;1;21;4095;630189778
64;4096;1;2;1365;585;783258963
16;8192;1;1;70;1;771431407
32;128;16;16;26;90;31483556
16;8192;8;32;39;455;13438519
128;4096;32;32;14;455;18446744073709551615
16;4096;8;32;8190;455;144261185
16;4096;8;256;7;8190;18446744073709551615
16;128;8;32;7;455;164518963
16;4096;16;1;15;9;135246963
16;4096;8;32;7;234;11497630
8;4096;8;16;7;455;11675852
16;4096;8;256;7;546;18446744073709551615
16;4096;8;32;7;390;9263704
16;4096;8;32;14;455;11595556
256;8192;8;16;7;455;10030074
8;8192;8;32;7;315;10638815
16;1;8;1;7;1365;4229320741
16;4096;8;32;10;455;10756592
16;1024;8;32;7;910;22697482
16;4096;8;32;7;630;9647556
32;4096;16;64;10;455;18446744073709551615
32;4096;8;64;26;585;18446744073709551615
8;512;8;64;2;455;18446744073709551615
16;4096;16;32;7;390;18446744073709551615
16;4096;16;32;7;455;18446744073709551615
32;4096;2;16;7;455;26328148
16;4096;8;64;7;1170;18446744073709551615
16;512;8;16;7;455;21334222
16;4096;8;8;7;315;13099852
16;4096;8;64;2;315;18446744073709551615
16;8192;8;32;5;455;13679556
8;1;8;1;7;585;8670557482
16;2048;16;32;9;455;18446744073709551615
16;4096;1;16;15;273;56977926
1;4096;1;32;7;390;82858222
128;128;16;64;45;210;18446744073709551615
4;1024;1;32;7;819;91366370
16;8192;16;32;2;455;18446744073709551615
256;64;64;1;39;6;181979407
16;64;4;2;15;9;141120888
1024;64;32;16;910;13;18446744073709551615
8192;16;1;16;130;91;53005334
128;512;16;8;65;117;9595852
512;512;4;32;42;45;21119556
128;1024;32;8;30;105;9267112
128;256;4;8;78;105;21364741
8;4096;8;32;7;390;15923111
16;4096;4;32;1;390;115875260
16;4096;4;32;35;455;23551408
16;4096;16;16;7;455;8594518
16;4096;8;64;7;390;18446744073709551615
32;2048;8;64;2;455;18446744073709551615
16;4096;16;16;2;390;13765925
128;4096;16;16;14;630;7067704
256;4096;16;16;7;455;14571259
128;4096;16;64;7;210;18446744073709551615
128;4096;16;16;14;390;14265185
128;1;8;1;14;630;671646667
128;4096;32;16;5;2730;18446744073709551615
128;1024;16;8;14;630;8733334
128;8192;16;16;14;819;6847408
128;4096;16;8;5;546;9162222
128;8192;8;32;39;819;10116148
256;4096;16;16;14;630;6642222
512;4096;16;128;14;630;18446744073709551615
256;4096;8;16;14;630;8863555
256;4096;8;16;21;819;9514963
256;1024;16;16;14;630;6765630
256;4096;16;32;14;630;18446744073709551615
128;4096;16;64;15;630;18446744073709551615
256;8192;16;16;14;630;6624296
512;4096;16;16;14;1365;7257185
1024;8192;4;16;39;630;18046666
2048;8192;16;16;5;630;9981926
256;8192;4;16;14;819;17859259
512;8192;16;16;13;630;7183259
512;8192;16;16;10;630;7218075
512;1;16;1;14;585;342253185
256;8192;32;16;13;630;18446744073709551615
256;8192;16;16;14;91;7472296
256;8192;16;16;14;585;6214815
64;1;8;1;14;585;1223845482
64;8192;4;16;14;630;14140000
256;8192;16;32;5;630;18446744073709551615
128;8192;16;16;14;585;6483259
1024;8192;16;16;10;585;6966074
256;1;16;1;9;585;344755259
512;8192;16;16;13;585;6751852
256;8192;16;16;21;585;6370666
256;4096;8;16;6;390;11908740
256;4096;16;16;9;585;7423408
256;8192;16;64;14;585;18446744073709551615
256;8192;16;16;42;585;6758222
256;1;8;1;30;585;614479704
256;4096;16;16;5;585;9137333
256;8192;16;16;14;195;6470815
256;8192;16;32;21;585;18446744073709551615
512;1;16;1;35;585;345805037
128;2048;16;16;10;585;7643703
256;8192;16;8;14;585;6829333
256;8192;16;16;14;1365;7204000
256;8192;16;16;5;585;8963111
256;4096;8;16;7;585;10908297
256;8192;16;16;15;585;5873185
256;8192;16;32;14;315;18446744073709551615
256;8192;16;16;14;546;5889926
256;8192;16;16;30;585;5876444
256;1;16;1;13;585;358713926
256;8192;16;8;10;585;8135407
256;8192;16;16;26;210;6908445
256;1;16;1;15;585;346977037
256;8192;16;16;15;819;6142222
128;8192;16;16;15;585;6136889
256;8192;16;16;15;234;5855704
256;8192;16;32;35;585;18446744073709551615
128;8192;16;16;15;234;6353333
256;8192;16;16;21;234;6460889
256;8192;32;16;7;210;18446744073709551615
256;8192;8;4;15;234;11048593
256;8192;16;16;15;1638;7850074
256;1;16;1;15;234;443628741
256;8192;16;16;15;210;6130222
256;8192;16;16;15;130;6673629
256;256;16;16;35;585;7524740
256;1;16;1;14;234;436561926
256;8192;16;8;15;234;6920889
128;4096;16;16;15;210;6911111
512;8192;16;16;6;210;7615555
4096;1024;16;16;15;105;6992593
256;8192;16;16;105;234;7597926
1024;8192;16;32;9;630;18446744073709551615
64;4096;16;16;15;234;7593630
256;1;16;1;15;126;418760593
256;8192;32;16;15;234;18446744073709551615
256;1;16;1;13;234;445126370
2048;4096;16;8;15;117;7476444
256;8192;8;16;15;234;7957037
256;8192;4;8;15;234;13239852
256;8192;16;16;35;234;7002074
128;8192;8;16;15;234;8977630
64;4096;16;8;15;234;8252297
256;4096;8;16;18;234;8694815
128;8192;8;8;15;234;10925926
256;2048;16;16;30;234;6981778
64;8192;16;16;15;234;7159408
256;1;4;1;15;234;477440889
128;8192;16;32;35;585;18446744073709551615
256;1;64;1;15;210;486796296
256;8192;16;16;45;70;8363408
256;8192;64;16;15;130;18446744073709551615
1024;2048;16;32;15;234;18446744073709551615
256;8192;16;64;15;234;18446744073709551615
256;8192;32;16;13;234;18446744073709551615
512;8192;64;16;15;234;18446744073709551615
256;4096;16;16;15;234;5945185
256;1;16;1;15;195;386530815
32;8192;16;16;18;234;8806815
256;8192;8;32;15;234;8820000
256;1024;16;32;15;546;18446744073709551615
128;8192;16;16;18;126;7077926
256;8192;64;16;13;234;18446744073709551615
512;8192;16;32;15;234;18446744073709551615
128;8192;8;16;15;195;9286371
256;8192;8;16;1;234;71053186
256;2048;8;32;15;234;11037333
256;8192;16;16;26;182;6705185
64;8192;32;16;13;234;18446744073709551615
256;8192;16;16;15;105;6985037
32;8192;16;8;15;315;9057926
1024;8192;16;32;15;234;18446744073709551615
256;1;16;1;15;234;444184592
256;1;16;1;15;234;446228593
256;8192;16;32;15;390;18446744073709551615
256;1;8;1;15;234;514349482
256;8192;16;16;15;195;6188000
1024;4096;16;16;15;234;5813630
128;1;16;1;15;234;744470222
256;8192;16;8;18;105;8536888
512;2048;16;16;15;8190;19493334
1024;4096;16;16;2;630;18721334
1024;2048;16;16;42;234;6459704
1024;2048;16;16;21;234;6379111
1024;4096;4;16;15;234;18590074
1024;1024;16;32;15;315;18446744073709551615
1024;1024;8;16;6;210;11971407
1024;1;16;1;15;234;147561777
8192;4096;16;16;15;234;5979556
1024;1024;16;16;78;234;6357185
1024;1024;16;8;15;234;6715704
1024;512;8;16;2;234;35814963
1024;2048;16;16;5;273;9597926
1024;1024;16;32;18;234;18446744073709551615
512;4096;8;16;26;234;8677926
512;8192;16;16;14;273;6373778
1024;1;16;1;13;234;147335408
512;4096;32;16;21;234;18446744073709551615
1024;4096;16;16;13;234;6751556
1024;4096;16;16;35;210;5918222
2048;4096;16;16;15;234;5917333
1024;4096;64;32;15;105;18446744073709551615
512;4096;16;32;15;234;18446744073709551615
2048;1024;16;8;9;819;20232000
4096;4096;16;8;6;182;17663703
1024;8192;16;16;7;273;13904889
1024;4096;16;16;70;234;13193186
1024;2048;16;16;10;234;13987407
1024;2048;16;8;15;234;13148740
1024;1;64;1;21;234;160272148
1024;4096;16;16;15;105;7034815
1024;8192;16;16;65;234;6663407
8192;8192;8;16;15;234;8294519
512;2048;16;16;15;234;5941630
1024;4096;32;16;9;234;18446744073709551615
1024;4096;64;16;21;390;18446744073709551615
1024;4096;8;16;15;234;9053482
1024;4096;16;16;21;630;6883408
4096;4096;16;16;26;234;6063555
1024;1;16;1;5;234;147768445
1024;4096;16;16;15;819;6258371
1024;4096;16;16;39;234;5657926
512;4096;16;16;15;234;5818963
1024;4096;16;32;15;234;18446744073709551615
1024;4096;8;16;15;1365;10120593
1024;2048;64;16;39;234;18446744073709551615
1024;1;16;1;39;195;126898815
1024;4096;16;16;39;546;6806963
1024;1024;16;16;39;195;6780149
1024;2048;16;16;39;273;6429037
1024;8192;16;16;39;234;5834666
4096;4096;16;16;39;234;5915408
1024;4096;8;64;39;234;18446744073709551615
256;4096;16;16;35;234;7035112
1024;4096;16;16;39;45;8745186
2048;1024;16;64;65;234;18446744073709551615
1024;4096;8;8;35;234;10809482
2048;2048;16;32;65;546;18446744073709551615
1024;4096;32;16;21;117;18446744073709551615
512;4096;64;16;39;182;18446744073709551615
1024;4096;16;16;14;234;12864889
1024;4096;16;16;18;234;12697333
1024;4096;16;8;13;234;14992741
1024;4096;16;16;39;273;12250815
256;4096;16;8;39;390;15097777
256;4096;8;16;39;315;19004592
512;4096;16;16;78;182;13083704
1024;1;16;1;39;234;160160297
1024;4096;8;16;39;234;8885333
1024;4096;16;32;26;210;18446744073709551615
1024;1;4;1;70;182;371059111
1024;4096;16;16;7;234;6407259
1024;4096;64;16;45;273;18446744073709551615
1024;4096;8;4;39;234;10599852
1024;1024;8;16;39;117;9652148
1024;4096;16;32;39;630;18446744073709551615
1024;4096;16;16;35;390;6060592
1024;2048;16;16;63;234;5553481
2048;4096;32;32;39;234;18446744073709551615
1024;1;16;1;65;234;149003555
1024;2048;8;16;63;234;9589926
1024;2048;16;32;63;234;18446744073709551615
1024;1024;16;32;63;234;18446744073709551615
1024;4096;16;16;65;234;6446371
1024;512;16;16;63;90;6972148
1024;2048;16;16;70;234;6320000
1024;2048;8;32;78;234;10019703
4096;2048;32;32;63;182;18446744073709551615
512;2048;8;16;42;234;9675259
2048;4096;16;16;78;130;6549629
1024;2048;16;16;63;273;5729333
4096;2048;16;32;63;234;18446744073709551615
1024;4096;16;4;63;234;7457037
512;2048;16;16;42;234;13413037
1024;2048;32;32;63;315;18446744073709551615
1024;2048;16;64;63;819;18446744073709551615
1024;1;16;1;63;105;167788889
1024;2048;4;16;63;315;20119555
1024;256;64;16;63;234;18446744073709551615
1024;1024;16;16;30;390;6522222
16;4096;2;64;9;70;28985037
1024;4;64;1;90;1;2171841926
1;1;1;1;35;819;60235685777
2;512;1;8;65;390;76828740
1024;2048;8;16;63;117;8534222
1024;2048;32;4;63;90;9326519
1024;1024;8;16;63;234;10608000
1024;2048;16;8;63;585;7285185
1024;2048;32;16;63;234;18446744073709551615
1024;2048;16;64;63;195;18446744073709551615
1024;2048;16;16;30;195;5999259
4096;2048;32;16;42;234;18446744073709551615
1024;1024;8;8;45;234;11102370
64;2048;16;4;42;126;12645185
1024;256;4;16;63;234;20767556
1024;2048;16;16;63;2730;7919852
1024;2048;16;16;14;234;6160741
1;2048;1;16;63;14;136098074
1024;2048;16;32;105;234;18446744073709551615
1024;2048;16;4;21;234;6937333
1024;2048;16;16;63;117;6577629
1024;2048;64;16;63;234;18446744073709551615
128;256;8;16;42;78;11200741
256;128;8;32;65;130;9260444
1024;1024;16;16;70;234;6699407
1;512;1;64;78;9;303446074
1;8;1;2;105;195;8179678223
128;64;16;4;105;546;11488297
2048;4096;128;4;273;65;18446744073709551615
1024;2048;8;32;90;234;9832593
256;2048;8;16;70;234;10494518
512;4096;16;64;63;390;18446744073709551615
1024;2048;16;8;42;234;6654370
256;2048;16;16;63;234;7045629
1024;2048;8;32;63;234;9919556
2048;2048;16;16;42;234;6280148
1024;2048;16;16;90;234;6605185
32;2048;16;64;63;234;18446744073709551615
1024;2048;8;16;63;390;9349630
1024;2048;16;16;39;234;6242370
1024;2048;32;16;63;65;18446744073709551615
1024;2048;32;64;26;63;18446744073709551615
1024;2048;16;16;63;390;5931111
128;512;8;16;70;91;12484889
4;2048;2;16;63;234;65367260
1024;2048;16;16;1365;234;7861037
1024;16;16;16;9;234;23556741
64;512;32;4;90;273;12246963
1024;2048;8;8;63;234;11160000
1024;1024;64;16;63;234;18446744073709551615
1024;1024;16;16;63;234;6484592
128;512;16;8;70;130;9229185
1024;2048;16;16;65;234;13333630
1024;2048;32;16;63;210;18446744073709551615
512;1024;16;16;63;234;13953037
128;512;8;16;35;126;23295111
1;8192;1;64;90;18;182631703
256;512;1;1;1;455;317296000
64;32;16;4;130;819;47900296
128;512;8;16;65;105;12024296
256;1;16;1;63;234;441693334
4096;2048;8;32;18;234;10181778
1024;4096;64;16;63;455;18446744073709551615
128;512;8;16;42;105;12025185
1024;8;16;1;63;234;54833629
1024;2048;16;16;63;90;6838815
1;2048;1;16;63;234;127445481
1024;2048;64;32;78;234;18446744073709551615
1024;256;8;8;63;234;11422370
256;2048;16;8;63;234;7992297
1024;4096;8;64;63;234;18446744073709551615
512;512;16;16;63;234;6827259
1024;4096;16;16;30;234;5689926
4096;2048;16;16;63;126;6065333
8;1;4;1;1;5;21340536592
4;1;1;1;1;3;21767626222
128;1;32;1;3;1;31665890518
4096;2048;2;16;10;455;29977630
32;64;8;2;273;2;527169185
256;8;128;4;182;1;18446744073709551615
4;8;2;1;455;315;2610902222
1024;2;1;1;819;182;1080640296
1024;2048;8;64;63;234;18446744073709551615
4096;8192;16;32;63;234;18446744073709551615
256;2048;4;16;63;234;20225630
1024;2048;8;16;39;234;9604148
1024;2048;4;16;63;234;20489482
16;2;16;1;1365;234;2633293481
1024;32;16;16;63;234;11486222
1024;1;16;1;63;234;147055852
2048;2048;16;16;30;234;5796296
512;4096;16;16;63;234;6282963
1024;4096;32;16;63;234;18446744073709551615
1024;2048;8;16;105;234;10740148
1024;1024;16;16;63;130;6320445
1024;1;32;1;91;234;169903852
1024;8192;16;16;63;234;5938666
1024;2048;16;256;63;234;18446744073709551615
1024;2048;16;16;455;105;6870371
1024;2048;16;16;63;42;9089630
1024;2048;16;128;63;130;18446744073709551615
2048;1;8;1;35;234;264341926
16;512;1;8;6;1;121767259
256;2;4;2;819;910;900035852
8;64;2;32;10;1170;452523408
128;1024;16;32;63;585;18446744073709551615
1024;2048;64;16;117;234;18446744073709551615
1024;512;16;16;63;273;6856741
1024;2048;16;16;91;455;6914963
1;4096;1;16;1;455;499383556
1024;256;8;1;21;4095;124484297
64;4;1;1;1365;585;1514228444
2;8192;1;1;1;1;641628444
8;64;4;1;1365;65;1596400593
16;64;4;2;7;9;144187111
64;2048;16;16;63;234;8370666
2;2048;1;16;14;234;57078074
1024;2;16;1;5;234;74035111
4096;2048;16;16;63;234;5875407
1024;2048;16;1;63;910;27553926
8192;2048;16;16;63;234;5799259
1024;2048;128;16;63;234;18446744073709551615
1024;8192;32;8;63;234;6806222
512;512;16;16;63;315;6971704
1024;4096;16;16;63;455;6448148
1;64;1;16;910;195;1328872000
2048;1;64;1;130;91;97009334
16;4096;2;64;1;70;212259408
512;4;64;1;90;1;4238042074
1024;512;32;16;63;455;18446744073709551615
1024;2048;16;32;35;234;18446744073709551615
1024;2048;16;16;91;234;6696741
1024;2048;8;16;78;234;10231851
1024;2048;16;16;130;234;6760593
1024;2048;16;128;390;234;18446744073709551615
1024;2048;16;8;63;234;6789481
1;16;1;16;126;819;4024688000
1;512;1;8;126;390;248309481
32;512;8;4;546;1;582107555
8192;8;128;1;18;195;20496444
512;4096;2;128;63;234;41369481
1024;2048;16;16;63;910;6616889
1024;2048;16;64;63;234;18446744073709551615
2048;2048;64;32;63;234;18446744073709551615
1024;2048;16;16;35;234;6468297
1024;2048;8;16;63;585;10369629
128;64;16;4;63;546;14946518
2;4096;2;1;1;65;151124592
1;8192;1;1;90;18;733547111
256;8192;16;1;1;455;21168000
256;1;16;1;130;819;481996889
128;2048;16;16;63;234;7607851
2048;2048;2;16;63;234;34363704
1024;1;16;1;63;18;230969630
1024;2048;16;32;1365;234;18446744073709551615
1024;2048;16;4;63;234;7470370
1024;2048;4;16;5;234;16001926
16;1;2;1;1;5;6851638518
4;256;1;32;5;70;414436889
128;1;32;1;1170;546;708942074
4096;2048;1;16;14;455;59425778
32;256;8;16;15;2;133916444
128;2048;16;16;91;315;7878519
2;1024;2;1;30;210;240993630
1024;2048;16;16;6;234;7468296
1024;2048;1;16;63;18;49515703
1024;1;16;1;63;234;146979555
1024;2048;16;16;455;234;6933926
1024;2048;32;16;91;234;18446744073709551615
4;8;2;4;1365;315;2042230223
1024;2;1;1;819;14;381304000
16;8;1;8;6;1;1391940889
256;2;1;2;182;910;3414152888
1024;256;16;16;63;42;9663408
2048;2048;16;16;63;234;5593778
1024;2048;8;8;78;234;11152593
8;64;2;64;819;1170;174490075
1;4096;1;16;126;455;67035704
1024;128;16;16;63;234;6603111
2048;2048;1;16;63;234;61847408
16;2048;16;16;15;234;8276445
32;256;8;1;21;4095;85138666
1;4096;1;2;1;585;294581777
256;8192;1;1;1;1;639549185
256;64;2;1;39;6;232926370
256;64;8;2;15;9;76558371
1;64;1;16;14;195;1158582963
8192;16;1;16;130;91;53163111
16;4096;2;64;39;70;41206815
2;4;1;1;315;1;17600567408
1;16;1;16;1;13;65375318074
2;1024;1;8;65;390;62543112
2048;4096;32;16;63;234;18446744073709551615
1024;2048;16;256;63;65;18446744073709551615
16;2048;16;32;63;21;18446744073709551615
1;512;1;1;546;1;9001322815
8192;8;1;2;18;195;394699852
1;64;1;4;105;273;1044136741
1;4096;1;1;1;65;291026667
1024;2048;32;16;585;117;18446744073709551615
1024;2048;16;16;1638;234;9345778
1024;2048;16;16;6;182;8118370
64;2048;16;16;63;9;29611555
1;8192;1;64;819;1365;136075852
256;256;16;16;1;455;63496741
256;32;32;1;1;819;21342371
16;1;2;1;1;5;6851150666
1;2048;1;16;63;234;171687704
1024;2048;256;16;63;234;18446744073709551615
1024;2048;16;16;63;105;6671704
2048;1;1;1;117;70;834344296
128;1;32;1;1;546;707858667
1;2048;1;16;78;1;265285926
32;256;4;64;15;2;180892149
1;1;1;1;63;234;60589757334
1024;2048;8;16;273;234;11369630
2;1;1;1;63;234;31177625333
1024;512;16;16;63;234;6802370
2;1024;2;1;30;63;248092148
4;64;1;4;1365;315;696720148
1;8192;1;16;63;234;163217037
1024;2048;16;128;63;234;18446744073709551615
512;2048;16;16;63;8190;18845629
1024;2048;64;16;63;45;18446744073709551615
64;32;4;1;819;14;254231111
4;512;2;1;6;1;694630963
256;2;4;1;819;117;253939111
8;64;8;64;819;1;18446744073709551615
1024;2048;16;16;63;546;6771407
8192;512;8;16;90;234;11280741
1024;2048;32;16;90;234;18446744073709551615
2;1;1;1;63;234;31177010667
1024;2048;16;16;63;8190;18810519
1024;64;16;4;63;234;11901778
1;4096;1;16;4095;455;2026420148
32;64;8;4;21;4095;87951852
1;4096;1;2;1;390;295444297
1;8192;1;1;1;1;644473037
1024;1;32;1;63;234;170985333
2048;1024;16;8;63;210;6947260
1024;2048;16;32;91;234;18446744073709551615
1024;2048;16;16;91;546;7155852
1024;2048;16;16;63;182;6042518
1024;1;16;1;45;234;146130815
1024;1024;16;8;63;234;6865481
512;1;16;1;63;234;296766518
1024;2048;16;16;63;315;6164000
256;8192;64;128;39;6;18446744073709551615
256;32;8;1;15;9;160242222
256;64;2;16;14;195;36837926
8192;1024;1;16;130;91;63337333
2048;1024;8;16;63;630;10560000
1024;2048;16;16;5;234;9170963
1024;2048;16;16;315;234;7093482
1024;256;16;16;63;234;6743111
32;4096;2;64;1;819;383964296
1024;4;1;1;90;7;401512296
1;16;1;16;63;819;4006441481
4096;1024;4;8;1;1;639968148
1024;2048;16;1;42;234;22125333
1024;2048;16;16;63;18;17156296
1024;4096;16;16;63;234;5554074
1;64;1;32;546;9;1502344889
8192;8;128;2;1;195;19390815
128;4096;16;128;105;546;18446744073709551615
256;4096;128;1;1;1;1112493926
512;2048;16;16;63;234;6362222
1024;128;16;16;14;234;7295259
1;8192;1;64;1;1365;721209926
256;8192;16;1;21;455;23004741
8192;32;2;16;130;390;80622519
1024;2048;32;16;42;234;18446744073709551615
8;1;1;1;63;234;8651919703
1;256;1;4;63;234;384817482
1024;2048;1;16;9;234;34457778
1024;512;16;16;45;234;6906815
256;1024;16;8;63;234;8006814
16;32;2;2;1;5;683997185
256;1;256;1;5;45;3993086370
128;1;32;1;1;546;707694222
256;2048;1;16;1;13;322548445
1024;2048;16;16;4095;234;11289037
1024;2048;64;256;63;234;18446744073709551615
8192;8;16;1;63;2730;266438667
1;256;1;1;15;2;653827111
2;1024;2;2;30;210;121233482
4;64;4;4;1365;315;697490963
64;2048;4;256;1;1;18446744073709551615
1024;2048;1;16;63;234;62486667
1024;4;16;2;63;234;52967704
16;512;8;8;6;1;165616889
256;2;4;1;819;117;255622518
1;64;1;64;819;1170;1353268296
2048;32;2;16;126;455;85796000
1024;2048;2;256;63;234;18446744073709551615
1024;2048;16;1;63;234;22710223
1024;256;8;1;21;1;761615259
1;4096;1;2;45;585;271595852
256;8192;1;1;1;45;297826074
256;64;32;64;42;6;18446744073709551615
32;2048;16;16;63;1638;9722074
1024;2;16;2;63;234;75723703
8;2048;1;16;63;234;69248593
1024;2048;1;16;63;234;62251259
512;64;4;2;15;9;93187556
256;64;1;4;14;195;150097630
8192;1;1;1;130;91;748394518
16;4096;2;64;1;26;220982815
1024;2048;16;16;63;455;6485037
256;2048;8;16;63;234;10226074
1;2048;1;16;63;234;182120444
1024;16;16;16;63;234;13440148
1;1;1;1;90;7;75830645926
32;16;2;2;63;819;307413778
8192;1024;4;8;65;21;15353037
1;512;1;32;546;9;206522963
1024;2048;16;16;63;65;8161926
8;8192;1;16;63;234;69852593
128;4;16;2;117;234;191213629
1024;2048;8;16;70;273;9685482
1024;8192;16;16;63;126;6188000
2048;2048;64;16;63;234;18446744073709551615
1024;2048;16;64;63;585;18446744073709551615
1024;2048;16;16;26;234;6510963
8192;2048;16;16;35;273;6706074
1024;1024;16;16;14;234;6242963
2048;512;16;16;63;130;6311556
1024;2048;64;8;63;234;18446744073709551615
1024;4096;16;32;63;234;18446744073709551615
1024;2048;8;8;63;910;10908593
512;512;16;32;63;195;18446744073709551615
8192;2048;32;16;90;234;18446744073709551615
8192;1;128;1;5;1;2207460296
128;64;16;4;105;1365;18327555
2;64;2;4;1;70;2038994074
1;8192;1;64;2730;1365;447786667
1024;2048;8;16;42;234;10018074
256;1;16;1;63;234;443243407
512;1024;16;16;39;234;7105333
1024;2048;16;32;21;91;18446744073709551615
2048;2048;16;16;105;234;6658222
256;2048;16;8;63;126;7844297
1024;2048;16;128;90;234;18446744073709551615
2048;2048;16;16;13;234;6763852
1024;2048;16;1;13;234;21879852
64;2048;16;16;63;15;18019852
1024;16;32;16;63;234;18446744073709551615
1024;2048;16;1;13;234;21875704
1024;2048;16;8;91;910;8075556
2048;2048;8;16;117;315;10534370
1024;4096;8;16;91;234;10500889
1024;2048;16;32;63;91;18446744073709551615
256;8192;16;16;78;15;16282815
256;512;1;128;130;819;93400889
16;32;2;2;1;1;1585058815
4;1;1;1;5;70;16132806074
128;128;64;64;70;546;18446744073709551615
64;2048;2;16;21;182;33586370
1024;2048;16;16;78;130;6352741
256;2048;16;16;63;273;6961630
512;2048;16;16;63;5;47680000
1024;128;16;16;63;13;18967407
1024;2048;16;16;2;234;16170074
4096;512;16;16;63;234;6870519
512;2048;16;32;15;234;18446744073709551615
256;2048;16;16;117;455;7831852
2048;2048;16;8;63;210;6980444
1024;2048;16;8;63;273;6877926
2048;2048;32;16;63;234;18446744073709551615
1024;2048;128;8;26;234;18446744073709551615
1024;2048;4;16;91;105;19884000
512;2048;16;32;63;234;18446744073709551615
1;256;1;16;30;2;397653778
2;1024;2;32;210;1;426866074
4;8192;1;4;1365;315;696143111
64;32;4;1;6;14;136073481
1;1024;1;16;63;130;114602963
1024;2048;2;16;63;234;34023260
1024;512;256;16;63;117;18446744073709551615
2;2048;1;16;63;234;105310370
512;4096;8;16;63;234;9908148
1024;2048;16;16;65;182;6261037
2048;8192;16;16;63;234;6005778
8192;2048;8;16;182;390;11557185
2048;2048;16;32;63;234;18446744073709551615
512;512;1;128;6;1;183869334
256;2048;128;64;819;117;18446744073709551615
8;64;2;64;819;70;165130370
2;4096;1;16;126;1;317766519
32;32;8;4;21;4095;170810518
1;32;1;2;90;585;2029951852
1024;2048;16;32;21;234;18446744073709551615
512;2048;8;16;15;234;9442667
1024;2048;8;16;90;234;10436444
1024;2048;16;8;63;105;7233037
1024;512;16;16;63;819;7736888
512;8192;16;16;65;234;6546371
1024;2048;64;16;39;455;18446744073709551615
2048;2048;4;16;105;91;20194074
1024;2048;16;16;45;234;5838370
1024;1024;8;64;78;234;18446744073709551615
1024;2048;8;16;63;273;9475408
1024;2048;32;16;35;234;18446744073709551615
1024;2048;16;16;63;130;6255852
1024;2048;16;8;30;234;6293778
1024;2048;32;16;26;234;18446744073709551615
1024;2048;16;16;78;546;6914222
1024;8192;16;64;63;234;18446744073709551615
1024;2048;32;4;63;315;6459556
1024;2048;16;16;39;182;6183111
2048;1;16;1;63;234;146949926
4096;2048;16;16;63;117;6662222
8192;2048;8;16;63;315;10358223
1024;256;16;32;63;234;18446744073709551615
1024;2048;16;16;90;315;6681778
1024;2048;16;16;63;126;12534371
2048;2048;16;16;63;195;12179556
1024;1024;16;16;63;455;14271555
512;4096;32;16;45;234;18446744073709551615
1024;2048;16;16;63;70;16231259
1024;2048;32;8;105;234;14272444
512;1024;16;32;63;234;18446744073709551615
1024;2048;32;16;210;234;18446744073709551615
512;2048;4;16;90;234;33321926
1024;2048;128;16;78;455;18446744073709551615
128;2048;16;16;65;234;7997629
1024;2048;8;8;91;234;11448297
2048;1024;16;32;63;819;18446744073709551615
1024;2048;32;16;65;234;18446744073709551615
1024;2048;8;16;210;78;10871704
512;2048;32;16;63;585;18446744073709551615
128;8192;16;16;63;78;7831556
1024;4096;16;32;63;390;18446744073709551615
2048;2048;16;16;42;117;6738666
1024;2048;16;8;78;455;7341926
256;2048;16;16;63;126;6787259
2048;2048;16;16;63;546;6756889
256;2048;16;64;63;390;18446744073709551615
1024;2048;16;32;45;90;18446744073709551615
64;2048;16;32;63;234;18446744073709551615
1024;2048;16;16;39;105;6661037
4096;2048;16;16;63;585;6759852
1024;512;16;32;42;234;18446744073709551615
1024;1024;16;16;90;234;6784741
512;2048;16;32;63;1170;18446744073709551615
1024;128;16;16;1;14;84859408
8192;2;16;1;546;234;101697186
1024;512;16;16;63;195;6835852
1024;8192;16;32;65;315;18446744073709551615
1024;2048;16;16;63;10;23794223
256;1024;8;16;63;1638;11786814
1024;2048;16;16;65;6;38793926
1;1024;1;128;1;1;15403023555
256;256;64;128;39;6;18446744073709551615
256;128;1;2;15;9;189493629
256;64;2;16;210;195;33949185
8192;16;1;16;1;91;726966075
8;4096;2;64;9;70;31484297
1024;4;1;1;2;7;372417333
8;16;8;1;63;819;599327407
1024;2048;16;2;63;10;48051704
8192;4096;16;16;63;234;5925037
1024;2048;8;16;63;2;54044593
1024;2;16;1;63;234;104138371
8192;8;1;8;65;455;478325185
8;512;2;32;1;9;672337482
1024;2048;16;16;1;234;35889926
1024;2048;16;1;63;234;22712741
1;2048;1;16;1638;234;818588148
8192;8;128;4;546;105;18446744073709551615
128;64;16;4;105;1;283993037
1;16;1;16;1;65;61174259111
1;8192;1;64;819;1;511043555
4;2048;2;16;63;8190;41935852
4;2048;2;16;130;234;53894519
2;2048;1;16;63;234;92356296
1024;2048;256;64;63;234;18446744073709551615
