epoch;GLOBAL_SIZE_0;GLOBAL_SIZE_1;GLOBAL_SIZE_2;LOCAL_SIZE_0;LOCAL_SIZE_1;LOCAL_SIZE_2;cost
1505192818;1;2;1;1;2;1;27547539852
1505192819;8;256;8;1;32;2;250274815
1505192819;4;8;32;1;1;8;108051704
1505192819;512;128;64;64;4;2;18446744073709551615
1505192820;8;32;64;2;1;16;158655111
1505192821;4;8;32;2;8;8;145360000
1505192821;4;8;16;1;1;16;151492296
1505192822;2;8;8;1;2;2;425427259
1505192823;256;32;512;1;8;8;269698518
1505192823;64;32;64;1;32;1;203359704
1505192824;16;2;64;2;2;2;70165630
1505192824;16;4;8;4;4;2;173874074
1505192826;1;1;64;1;1;1;884480592
1505192826;16;2;64;2;2;1;141360296
1505192827;32;2;8;2;2;2;163479259
1505192827;16;2;512;2;2;2;147064741
1505192827;8;4;64;4;1;4;41020148
1505192828;16;2;32;2;2;2;82766075
1505192828;32;4;256;8;2;16;37672889
1505192829;32;4;16;32;1;1;40528148
1505192829;1;512;128;1;1;1;208684296
1505192830;4;4;8;1;2;1;472332148
1505192831;1;128;256;1;128;2;416486222
1505192884;1;1;1;1;1;1;52723023852
1505192885;2;64;1;1;4;1;426772445
1505192885;8;128;32;8;16;1;38130963
1505192886;16;32;16;16;8;2;12041334
1505192886;256;8;256;16;4;16;18446744073709551615
1505192886;2;1;256;2;1;2;134398519
1505192887;2;4;64;2;2;64;599442815
1505192888;4;128;2;2;1;1;112938963
1505192888;16;4;64;4;2;4;42511260
1505192889;8;8;64;2;8;64;18446744073709551615
1505192889;32;16;64;32;2;2;16782519
1505192889;8;32;32;2;1;4;107361630
1505192890;64;16;256;2;8;8;120109926
1505192890;128;4;256;16;2;16;18446744073709551615
1505192891;512;4;1;1;1;1;440952444
1505192892;2;8;4;1;4;4;963255408
1505192893;1;32;4;1;16;2;657038963
1505192894;16;256;16;1;4;2;216476741
1505192894;512;8;4;64;2;4;18446744073709551615
1505192895;128;16;256;1;2;4;210203555
1505192895;4;16;16;4;1;4;68431556
1505192903;4;2;1;2;1;1;7112425629
1505192903;64;512;2;2;64;1;132890518
1505192904;8;64;4;1;32;2;127647407
1505192904;64;8;64;1;2;1;295277630
1505192905;128;1;4;1;1;1;264887704
1505192905;2;16;32;1;2;4;77196148
1505192906;1;512;64;1;1;32;465855852
1505192906;32;8;64;32;8;4;18446744073709551615
1505192907;16;32;16;8;8;2;29913482
1505192907;16;64;8;16;8;4;18446744073709551615
1505192907;32;32;16;8;8;2;36299556
1505192908;16;8;64;16;4;4;13409630
1505192908;32;8;64;16;2;4;21054222
1505192909;16;16;32;16;2;4;14780296
1505192909;16;32;64;1;1;4;300292592
1505192910;64;16;128;8;4;4;34569778
1505192910;16;16;64;8;1;16;42162666
1505192910;8;8;256;4;8;128;18446744073709551615
1505192911;8;64;8;8;8;1;20723260
1505192911;128;4;64;4;1;4;79646963
1505192912;16;32;8;16;8;4;18446744073709551615
1505192912;16;32;32;16;4;2;17814223
1505192912;64;8;64;8;4;4;34290666
1505192913;256;4;1;32;1;1;94013037
1505192914;512;8;1;1;2;1;491998963
1505192914;1;32;128;1;1;4;119641630
1505192915;128;16;64;64;8;1;18446744073709551615
1505192915;16;32;16;2;8;2;122716000
1505192916;256;32;16;1;8;8;388514815
1505192916;4;32;16;2;8;2;45811408
1505192917;32;16;64;16;2;8;20985926
1505192917;512;512;8;4;32;8;18446744073709551615
1505192918;8;32;64;2;1;1;105726666
1505192918;16;4;8;4;2;2;160197037
1505192918;8;16;16;4;16;4;78628593
1505192919;16;32;16;16;4;2;14464148
1505192919;16;32;16;16;16;4;18446744073709551615
1505192919;16;32;64;16;8;64;18446744073709551615
1505192920;64;16;128;16;4;4;22549630
1505192920;8;32;8;2;8;4;58998963
1505192921;16;32;1;16;16;1;167586074
1505192921;16;32;16;1;8;2;216512444
1505192922;8;64;64;4;64;4;18446744073709551615
1505192922;32;1;256;4;1;16;62113777
1505192923;4;4;16;4;1;1;257157926
1505192923;1;512;1;1;32;1;184704445
1505192924;64;16;64;16;2;4;22936445
1505192924;16;32;8;8;8;4;25815408
1505192924;16;128;16;16;4;2;21175112
1505192925;16;32;16;16;16;2;18446744073709551615
1505192925;8;16;64;1;2;4;174346815
1505192926;16;32;16;8;8;2;29250963
1505192926;16;32;16;16;1;2;17373334
1505192927;4;32;8;1;2;1;148543408
1505192927;4;8;256;2;8;8;92501037
1505192954;2;1;1;1;1;1;26699225926
1505192955;8;128;32;8;8;1;37144592
1505192955;16;128;16;8;8;4;37605037
1505192956;16;16;16;8;8;2;22378371
1505192956;16;8;16;16;8;2;41908000
1505192956;16;32;8;16;8;4;18446744073709551615
1505192957;16;32;1;16;8;1;167894222
1505192957;1;1;256;1;1;4;234146963
1505192958;16;4;64;1;2;64;217423407
1505192958;4;128;2;2;1;1;114946222
1505192959;16;32;32;16;8;1;18455555
1505192959;16;32;16;16;8;4;18446744073709551615
1505192960;16;32;2;8;8;2;85149926
1505192960;2;32;16;2;8;2;83594518
1505192960;16;256;16;16;8;2;22010075
1505192961;512;4;1;1;1;1;438358074
1505192962;2;8;4;1;2;2;861126815
1505192963;64;256;16;1;4;2;240057778
1505192964;512;8;1;1;2;1;494193333
1505192964;4;32;16;1;8;2;145006074
1505192965;16;64;16;16;8;16;18446744073709551615
1505192965;32;32;16;8;8;1;35865777
1505192965;16;128;32;16;4;1;21735407
1505192966;16;4;16;16;1;4;83544148
1505192967;2;4;16;2;1;2;429509630
1505192967;16;32;16;16;4;8;18446744073709551615
1505192967;16;1;16;16;1;2;315767852
1505192968;128;16;256;1;2;1;173023407
1505192996;1;2;1;1;1;1;26847775852
1505192996;64;32;2;2;1;1;197594519
1505192997;8;64;4;1;64;2;195763407
1505192997;8;64;16;2;8;2;94641481
1505192998;16;32;4;16;8;1;41483556
1505192998;16;64;16;16;8;2;16420148
1505192998;16;32;32;2;8;2;123105481
1505192999;16;16;16;16;8;2;21718667
1505192999;16;32;16;16;8;4;18446744073709551615
1505192999;16;128;16;16;8;2;20664148
1505193000;16;32;1;16;8;1;167737037
1505193001;128;16;4;1;8;1;243720296
1505193001;8;16;1;1;4;1;508326370
1505193003;1;2;64;1;1;32;789397185
1505193003;8;8;256;8;8;128;18446744073709551615
1505193003;8;32;16;2;8;4;48422370
1505193004;8;32;16;2;8;1;89238222
1505193004;16;32;16;16;8;2;12217778
1505193004;16;32;16;16;8;16;18446744073709551615
1505193005;16;32;16;16;4;2;13987259
1505193005;8;64;1;8;8;1;138019555
1505193006;256;4;1;1;1;1;415795556
1505193007;512;16;32;1;2;4;289886222
1505193007;1;32;128;1;4;4;153467112
1505193008;16;32;4;8;8;4;44316889
1505193008;32;32;8;4;2;4;56243704
1505193008;16;32;16;16;8;1;14783260
1505193009;16;32;64;4;8;64;18446744073709551615
1505193009;16;512;16;16;1;16;25594370
1505193009;1;32;16;1;8;2;137778963
1505193010;16;32;16;16;8;8;18446744073709551615
1505193010;1;512;8;1;64;8;18446744073709551615
1505193011;512;32;1;2;1;1;258992296
1505193011;16;4;8;4;1;2;154274074
1505193012;32;4;256;8;2;1;47785482
1505193012;16;32;16;16;8;2;12655556
1505193012;16;32;16;16;8;16;18446744073709551615
1505193013;32;4;16;1;2;1;276923852
1505193014;1;512;1;1;128;1;527842815
1505193014;64;32;8;8;2;1;46046222
1505193015;4;8;256;4;8;8;46533926
1505193015;16;128;16;16;32;2;18446744073709551615
1505193015;16;16;32;16;8;1;14346815
1505193016;16;32;16;4;8;2;52197926
1505193016;16;32;128;16;8;64;18446744073709551615
1505193017;2;64;1;1;4;1;441880889
1505193017;8;64;32;8;8;8;18446744073709551615
1505193018;16;32;16;16;8;1;14597630
1505193018;2;1;256;2;1;32;235726222
1505193019;8;8;16;2;8;2;84018223
1505193019;8;32;16;2;8;2;73325186
1505193019;16;32;16;16;2;2;14308296
1505193020;16;32;16;16;2;2;13951259
1505193020;16;32;256;2;4;64;18446744073709551615
1505193021;8;32;8;2;32;4;180542815
1505193021;32;32;16;8;4;4;30393333
1505193021;16;32;64;16;8;32;18446744073709551615
1505193022;16;4;64;1;2;32;243439556
1505193022;64;128;2;4;1;1;115791408
1505193023;4;512;1;1;1;1;229766222
1505193024;8;8;4;1;2;2;266491704
1505193024;16;32;16;16;8;8;18446744073709551615
1505193024;16;32;16;16;4;4;12501333
1505193025;16;16;16;16;8;16;18446744073709551615
1505193025;1;256;16;1;4;2;119594222
1505193025;1;8;256;1;2;256;18446744073709551615
1505193026;64;16;256;2;2;1;139013037
1505193041;4;1;1;2;1;1;14332697185
1505193042;16;32;16;2;8;8;62753334
1505193042;16;32;16;16;1;2;17920296
1505193042;16;32;2;16;4;1;81513926
1505193043;16;128;16;16;2;4;19510074
1505193043;64;512;1;2;64;1;127155111
1505193045;8;8;1;2;2;1;1007645926
1505193045;128;16;32;1;8;1;246674074
1505193049;2;1;8;1;1;4;3407871703
1505193050;1;32;16;1;8;16;471853629
1505193050;1;512;64;1;64;32;18446744073709551615
1505193050;1;8;256;1;8;64;18446744073709551615
1505193051;256;64;8;16;4;1;23628297
1505193051;256;4;1;32;1;1;95367852
1505193052;512;32;16;128;8;2;18446744073709551615
1505193052;16;256;16;16;8;1;22246222
1505193052;8;32;16;1;4;2;156225926
1505193053;16;16;16;8;16;2;24931556
1505193053;16;16;16;16;16;2;18446744073709551615
1505193054;16;16;32;16;2;8;13706815
1505193054;1;2;128;1;1;4;230523556
1505193054;8;512;8;4;32;8;18446744073709551615
1505193055;8;256;2;2;1;1;110757926
1505193055;16;32;32;8;8;1;36772148
1505193056;16;32;32;16;1;4;19410074
1505193056;16;32;16;4;16;1;50240592
1505193056;32;32;16;8;8;4;35184889
1505193057;16;32;8;16;16;4;18446744073709551615
1505193058;16;4;512;4;1;2;78823259
1505193058;32;4;256;32;2;16;18446744073709551615
1505193058;32;4;16;32;1;1;41243555
1505193112;1;1;1;1;1;1;53221968148
1505193113;16;32;16;16;2;1;16671852
1505193113;16;64;16;16;16;2;18446744073709551615
1505193113;16;32;1;16;8;1;167864000
1505193114;16;32;16;16;8;8;18446744073709551615
1505193114;64;32;16;8;2;1;46503704
1505193114;4;8;256;4;8;1;63088148
1505193115;1;128;1;1;2;1;458149630
1505193116;8;8;32;8;8;8;18446744073709551615
1505193116;16;32;16;2;8;2;115361333
1505193116;16;16;16;16;2;2;23344445
1505193117;64;32;16;4;8;2;64234074
1505193117;16;32;16;16;16;1;12251408
1505193118;16;32;8;16;8;2;21813333
1505193118;128;32;128;2;8;64;18446744073709551615
1505193118;2;4;256;2;4;8;63575852
1505193119;16;32;256;1;2;64;381565778
1505193121;4;4;2;4;1;1;1824551260
1505193122;16;64;32;16;8;1;21948000
1505193122;16;64;16;4;8;2;57760000
1505193122;16;32;64;16;16;64;18446744073709551615
1505193123;16;32;16;8;4;2;25886074
1505193123;16;32;16;8;16;8;18446744073709551615
1505193124;4;512;1;1;1;1;216272592
1505193124;8;8;4;2;1;2;255899852
1505193125;1;16;16;1;4;2;226748889
1505193125;512;8;1;1;2;1;492938370
1505193126;64;32;8;4;8;4;61469630
1505193126;64;32;32;2;4;1;135804593
1505193127;64;32;256;32;1;1;20771259
1505193154;1;2;1;1;1;1;26598966666
1505193155;64;4;1;2;1;1;355105630
1505193156;1;64;4;1;32;2;576666519
1505193156;16;32;2;16;8;2;83579852
1505193157;256;32;16;1;8;2;213300296
1505193157;8;16;16;2;8;2;51752592
1505193157;128;16;4;128;8;1;18446744073709551615
1505193158;2;16;16;1;2;4;126561037
1505193160;1;1;64;1;1;32;1532940593
1505193160;16;8;256;4;8;128;18446744073709551615
1505193161;128;32;16;2;8;2;122619555
1505193161;128;16;16;2;8;2;120822074
1505193161;16;8;8;16;8;4;18446744073709551615
1505193162;16;32;16;16;32;2;18446744073709551615
1505193163;4;1;16;1;1;2;894309629
1505193163;16;32;16;4;8;2;52833926
1505193164;8;64;32;8;1;1;27647111
1505193165;32;4;1;1;4;1;640552148
1505193165;4;512;32;1;2;1;139293778
1505193165;4;8;128;2;4;2;50784740
1505193166;16;32;32;16;8;2;16451407
1505193166;16;128;16;8;8;2;39049185
1505193167;32;16;16;4;8;2;39294815
1505193167;8;32;16;2;8;8;47548000
1505193167;16;2;16;16;2;2;161678222
1505193168;256;32;8;1;8;4;265562518
1505193169;512;16;8;4;1;8;123160000
1505193169;8;256;64;2;1;1;104754519
1505193169;16;4;512;16;1;2;27768148
1505193170;32;32;16;8;2;16;31383259
1505193170;16;32;64;16;8;2;20552592
1505193171;16;1;16;16;1;2;318147407
1505193171;32;4;16;4;1;1;86796000
1505193225;1;1;1;1;1;1;52722924593
1505193225;64;32;32;64;2;1;16352444
1505193225;1;8;256;1;1;8;110363260
1505193226;16;32;32;8;8;2;35424889
1505193226;16;2;16;16;2;2;163277926
1505193227;16;16;1;16;8;1;325621630
1505193228;2;64;1;1;4;1;426323852
1505193228;8;128;512;8;1;1;26496000
1505193229;16;512;16;16;8;1;23724593
1505193229;2;8;64;2;4;8;98934370
1505193229;16;64;16;16;8;4;18446744073709551615
1505193230;16;2;32;16;2;1;78544741
1505193230;8;32;16;2;8;2;58603111
1505193230;16;32;16;16;4;2;14524593
1505193231;4;32;16;1;8;16;174439704
1505193232;16;4;128;1;2;64;194905334
1505193232;32;256;2;16;1;2;24255259
1505193234;4;8;1;1;1;1;1761195408
1505193235;8;8;1;2;1;1;1003946519
1505193236;16;64;16;8;8;2;35975703
1505193236;16;32;16;16;32;1;18446744073709551615
1505193236;2;32;16;2;1;2;77880148
1505193237;16;32;16;4;1;2;85132445
1505193237;1;32;16;1;1;2;155376000
1505193238;1;32;16;1;8;2;123930814
1505193238;16;32;32;1;8;1;253797185
1505193239;64;32;32;4;8;2;65592741
1505193239;32;16;16;8;8;1;34636593
1505193240;16;512;16;16;8;2;22597481
1505193240;16;32;16;16;8;4;18446744073709551615
1505193240;1;256;64;1;4;2;151599407
1505193294;1;1;1;1;1;1;52714603555
1505193294;8;32;32;2;8;32;18446744073709551615
1505193295;64;64;256;32;64;1;18446744073709551615
1505193297;4;8;1;2;1;1;1782904741
1505193297;64;32;1;2;1;1;195729333
1505193298;4;64;256;4;32;2;74324741
1505193298;16;16;4;1;8;1;87853186
1505193298;1;16;32;1;2;1;155416297
1505193299;1;512;64;1;1;8;220595704
1505193301;1;1;256;1;1;128;1221099259
1505193301;8;16;8;8;8;1;68770666
1505193302;256;128;1;2;1;1;328313186
1505193302;16;64;32;8;4;8;31666963
1505193302;4;8;128;2;4;2;50209185
1505193304;512;16;8;1;1;1;707864888
1505193304;8;512;64;1;8;8;369459111
1505193305;16;4;16;1;1;2;265567259
1505193305;16;32;512;16;8;64;18446744073709551615
1505193306;16;4;16;16;1;2;78636296
1505193306;8;32;16;1;8;2;157883852
1505193306;16;4;512;16;1;32;18446744073709551615
1505193307;32;32;256;1;2;1;212887852
1505193307;128;4;16;16;1;1;27521037
1505193308;1;512;16;1;32;16;18446744073709551615
1505193308;16;32;512;16;1;64;18446744073709551615
1505193308;64;32;256;32;1;1;20886370
1505193309;4;1;256;1;1;8;103873185
1505193309;2;64;4;1;4;1;129563556
1505193310;8;128;8;1;4;1;194246370
1505193310;16;32;32;16;4;1;29989629
1505193311;16;32;16;1;8;2;212180148
1505193311;2;1;256;2;1;8;120275112
1505193313;1;1;128;1;1;64;1344940445
1505193313;32;256;2;16;4;1;21418370
1505193314;16;32;8;16;2;4;22744000
1505193314;512;32;16;1;2;8;332149333
1505193315;8;32;16;2;4;2;59974074
1505193315;16;32;16;4;4;4;48398815
1505193317;4;8;1;1;1;1;1795878222
1505193326;8;1;1;2;1;1;8154889778
1505193327;1;256;16;1;32;2;182254371
1505193327;2;8;256;2;4;1;58577926
1505193327;32;32;32;8;8;8;18446744073709551615
1505193328;32;32;16;2;8;2;110785482
1505193328;32;64;32;8;2;1;45972889
1505193329;16;32;2;16;8;1;85166519
1505193329;64;32;256;32;8;1;17560889
1505193329;32;32;32;8;8;1;39620593
1505193330;1;32;16;1;8;2;125116296
1505193330;2;32;16;2;2;2;65169481
1505193331;4;512;64;2;16;64;18446744073709551615
1505193332;64;1;1;2;1;1;1357735556
1505193333;4;256;256;4;32;2;70497778
1505193334;16;1;4;1;1;1;1189297334
1505193335;128;4;32;1;2;4;224096889
1505193335;16;32;4;16;8;2;41921481
1505193335;16;32;8;16;8;2;21586223
1505193336;16;4;16;16;4;2;82864000
1505193336;32;1;16;8;1;2;163083704
1505193338;1;1;64;1;1;2;853225629
1505193339;1;2;256;1;2;128;1563478815
1505193340;8;64;8;8;2;1;22677333
1505193344;4;4;1;1;4;1;3565665629
1505193344;8;16;16;8;8;8;18446744073709551615
1505193344;16;32;16;16;8;2;12795407
1505193345;16;16;64;16;2;4;16748740
1505193345;4;16;128;2;8;2;93334223
1505193346;512;16;8;4;1;2;91191703
1505193346;256;256;64;1;1;1;208608297
1505193347;16;32;16;8;8;4;27184296
1505193347;16;16;16;16;8;4;18446744073709551615
1505193347;1;4;512;1;1;2;148768148
1505193348;16;32;16;2;4;2;114290519
1505193348;512;1;1;4;1;1;205544296
1505193349;128;4;256;16;1;2;26128148
1505193402;1;1;1;1;1;1;52721409629
1505193403;64;32;32;64;2;8;18446744073709551615
1505193403;16;32;16;8;4;8;24261186
1505193403;8;16;16;1;8;2;123942371
1505193404;32;32;16;8;16;2;35736889
1505193404;4;512;2;4;8;2;21249926
1505193405;1;4;256;1;1;1;224028593
1505193405;8;128;1;1;1;1;229309037
1505193406;16;32;128;16;8;2;22167408
1505193406;64;32;8;4;8;8;60235555
1505193406;16;32;16;16;1;16;15778667
1505193408;1;32;2;1;8;1;888382815
1505193408;128;32;16;2;4;2;118502815
1505193409;2;4;256;2;4;1;52469778
1505193409;16;4;128;16;2;64;18446744073709551615
1505193409;32;16;2;16;4;1;86468592
1505193410;128;128;1;1;128;1;287360741
1505193412;1;8;4;1;1;1;1730316000
1505193413;512;256;16;1;4;1;281901630
1505193417;2;8;1;2;4;1;3453980593
1505193417;256;32;256;32;8;1;16921185
1505193417;16;128;16;8;32;2;18446744073709551615
1505193418;16;128;16;4;8;2;64234222
1505193418;32;8;16;8;8;16;18446744073709551615
1505193418;32;32;8;8;4;4;29096741
1505193419;16;32;32;8;8;1;37206222
1505193421;4;8;1;2;1;1;1805861778
1505193423;64;1;1;2;1;1;1350526666
1505193423;4;256;256;4;128;256;18446744073709551615
1505193425;64;1;1;1;1;1;1317750074
1505193425;1;256;1;1;8;1;225510370
1505193426;16;32;16;2;8;1;138017481
1505193426;16;32;16;16;4;1;13161778
1505193426;64;32;16;4;16;2;75709778
1505193427;2;16;32;1;2;1;149698667
1505193427;1;512;512;1;1;1;208610222
1505193428;1;1;256;1;1;16;282348000
1505193428;8;16;8;8;8;1;68415111
1505193429;16;32;16;8;4;2;25712296
1505193429;256;32;256;1;8;64;18446744073709551615
1505193430;16;32;16;16;16;8;18446744073709551615
1505193430;256;128;16;32;1;4;19145481
1505193430;16;1;512;16;1;256;18446744073709551615
1505193431;256;8;1;16;4;1;49395556
1505193431;2;256;8;1;32;2;173107111
1505193432;16;32;256;16;8;64;18446744073709551615
1505193432;16;32;4;16;4;1;41486519
1505193433;128;256;64;2;1;1;104527555
1505193434;8;4;8;1;4;2;272978074
1505193436;1;32;1;1;4;1;1756816593
1505193436;128;1;256;32;1;1;21464297
1505193436;32;4;16;8;1;4;43391407
1505193437;16;32;16;4;8;1;67456740
1505193437;8;8;16;1;8;2;85583260
1505193438;16;32;16;16;2;4;14784741
1505193438;1;512;1;1;32;1;185200445
1505193438;64;32;32;64;2;1;16364297
1505193439;4;512;2;2;32;2;88588296
1505193440;2;16;4;1;16;1;521920148
1505193440;16;32;1;16;2;1;161082222
1505193441;64;32;8;4;4;4;57906074
1505193441;16;32;8;4;8;4;24847852
1505193441;16;16;8;8;8;4;44602074
1505193442;8;128;512;4;1;128;18446744073709551615
1505193442;16;128;16;16;1;2;36600000
1505193442;2;4;256;2;4;128;18446744073709551615
1505193444;16;4;1;1;1;1;1194856592
1505193444;16;64;8;8;8;4;26125926
1505193445;16;16;16;16;4;2;22267407
1505193445;128;32;16;2;32;2;131207852
1505193446;32;256;2;1;4;1;275366963
1505193446;4;512;512;1;1;1;208330370
1505193460;1;1;4;1;1;2;13633913777
1505193461;16;128;16;16;16;2;18446744073709551615
1505193461;1;256;16;1;1;16;263145630
1505193462;2;4;256;2;1;32;68978963
1505193462;4;32;256;4;8;1;70928740
1505193463;4;8;512;2;1;64;206207111
1505193463;16;32;32;16;8;4;18446744073709551615
1505193464;16;4;64;16;1;64;18446744073709551615
1505193464;32;128;4;8;8;1;36005777
1505193465;8;32;32;2;8;1;113158667
1505193465;16;16;16;16;8;8;18446744073709551615
1505193465;64;8;1;2;4;1;176350370
1505193466;4;256;1;4;32;1;76900000
1505193466;16;16;128;1;8;1;255463259
1505193467;2;128;32;1;2;8;189022518
1505193467;128;128;16;2;8;2;123781926
1505193468;1;512;512;1;1;1;208594814
1505193469;1;1;256;1;1;16;282413037
1505193469;1;64;16;1;2;8;79606667
1505193469;256;64;16;32;1;4;19893630
1505193470;32;64;8;4;16;4;68867407
1505193470;16;16;4;16;16;1;86122815
1505193471;4;16;32;1;2;8;148008888
1505193472;8;8;1;1;4;1;1010812889
1505193473;4;16;8;1;1;2;147034667
1505193473;1;32;16;1;8;2;124920297
1505193473;2;32;128;2;8;64;18446744073709551615
1505193474;128;256;64;64;1;8;18446744073709551615
1505193474;32;32;8;8;8;4;34148000
1505193474;16;32;8;16;2;8;23910814
1505193475;16;32;16;4;1;2;84341630
1505193475;16;4;512;16;1;128;18446744073709551615
1505193476;32;32;16;8;2;1;45169037
1505193476;128;32;256;32;8;1;17279111
1505193476;32;64;512;4;32;256;18446744073709551615
1505193477;16;64;16;16;8;8;18446744073709551615
1505193477;16;32;4;4;8;2;48920592
1505193477;1;32;16;1;8;2;127948296
1505193478;128;32;1;64;1;1;26189926
1505193478;4;512;2;4;8;1;21246963
1505193479;1;64;4;1;4;1;226038667
1505193479;8;128;512;2;1;1;104637926
1505193480;16;32;64;16;32;16;18446744073709551615
1505193480;32;32;4;8;8;1;26241186
1505193480;256;32;16;16;8;2;22657926
1505193481;4;8;16;1;8;2;131036592
1505193482;1;8;16;1;8;2;487024593
1505193482;2;4;256;2;4;64;18446744073709551615
1505193482;16;1;128;2;1;1;181417778
1505193483;32;256;2;16;1;1;31784148
1505193483;16;32;16;8;4;1;32597333
1505193484;16;32;1;16;8;1;179606666
1505193484;4;512;512;1;2;1;138447407
1505193485;64;8;4;4;2;2;47521482
1505193485;1;1;512;1;1;2;160651852
1505193485;1;8;256;1;4;256;18446744073709551615
1505193486;1;32;16;1;8;1;128642074
1505193486;32;32;16;8;2;16;31626222
1505193487;4;32;4;1;4;2;127785185
1505193487;64;64;256;16;4;1;22458074
