GLOBAL_SIZE_0;GLOBAL_SIZE_1;GLOBAL_SIZE_2;LOCAL_SIZE_0;LOCAL_SIZE_1;LOCAL_SIZE_2;cost
16;4;64;8;2;32;18446744073709551615
4;32;16;2;2;2;5991851
128;64;32;8;8;32;18446744073709551615
1;1;64;1;1;1;103096148
128;2;2;128;1;1;23220297
1;32;4;1;1;2;55142519
16;2;128;4;2;1;8504889
32;32;4;2;32;1;7689037
4;32;16;2;2;4;4912889
4;4;16;2;2;2;28513037
4;8;16;2;8;2;18067259
4;1;16;2;1;2;112761037
16;32;16;4;2;16;4234370
4;32;2;2;2;2;28714815
4;32;16;2;2;4;4931704
4;8;16;2;8;4;24738815
16;32;16;16;16;16;18446744073709551615
16;32;16;1;2;16;26284000
16;1;16;4;1;16;56366518
64;32;16;1;2;16;27096889
16;32;16;4;4;16;3589333
16;32;16;1;2;16;26110815
16;32;16;4;2;2;7264741
16;32;16;4;2;1;7687852
4;32;16;2;4;16;8777926
2;32;16;2;4;16;16959259
16;32;16;2;4;16;7492000
16;128;64;4;1;16;11128296
32;32;32;2;4;16;12540592
4;64;8;1;8;4;7483260
1;4;1;1;4;1;1723951408
16;32;64;4;8;16;18446744073709551615
16;32;16;2;4;16;7590519
16;8;8;4;1;1;9793629
16;32;16;4;4;4;3353186
8;32;16;8;4;4;2449185
16;32;16;4;1;4;8416148
4;32;16;2;4;2;5294222
16;256;16;4;256;4;18446744073709551615
8;32;16;8;8;1;2420889
8;32;16;1;4;4;14764445
8;32;16;8;1;4;2805185
8;32;8;8;4;2;4342074
8;32;8;8;8;2;4542074
8;32;16;8;1;1;3496593
8;32;16;8;8;2;2354666
8;32;16;8;8;8;18446744073709551615
8;16;16;1;16;2;9614370
8;32;8;8;8;2;4514518
32;32;16;2;8;2;10980889
8;4;16;8;1;2;16175852
16;32;16;16;8;2;1488000
64;32;16;1;8;2;22219703
8;32;32;8;8;2;1735704
16;32;16;4;8;2;4087112
16;2;16;16;2;2;20136889
4;32;16;1;2;2;10019703
1;32;16;1;8;2;15254666
16;32;64;16;8;2;2323704
16;32;8;16;8;2;2720296
16;8;2;16;2;2;40663852
16;128;16;16;2;2;2217481
16;32;16;16;1;2;1721778
16;32;128;16;8;2;2533778
16;32;4;16;8;2;5143111
32;32;16;2;8;1;12748741
16;4;16;16;1;2;9837333
16;32;16;4;8;2;3733630
8;32;16;2;8;2;5941629
16;32;128;8;8;2;4733630
16;128;16;4;2;8;8281037
16;32;16;16;8;2;1483259
1;64;16;1;8;2;10145186
16;16;32;4;8;2;4062370
16;32;16;1;8;2;21797037
2;32;16;2;8;2;8576445
16;32;16;16;1;16;1754667
16;32;16;16;8;4;18446744073709551615
16;32;16;16;16;2;18446744073709551615
16;64;16;16;8;2;1658815
16;32;256;16;8;2;2483407
16;32;16;16;8;2;1489037
4;32;16;1;16;2;8740889
16;1;16;16;1;1;38815112
16;4;16;16;1;2;9876444
256;32;16;1;8;2;20861630
16;32;16;4;8;2;4131259
128;32;16;2;8;2;13061777
1;32;64;1;2;4;16695852
8;16;2;1;4;1;32096296
8;32;16;2;8;2;7049778
16;16;16;16;8;2;2661926
16;32;16;16;8;16;18446744073709551615
16;32;4;16;8;2;5162370
1;32;16;1;8;2;15200148
2;64;16;1;2;2;10005334
8;4;32;2;2;32;18891852
16;8;8;4;4;4;11055704
32;128;64;16;1;32;18446744073709551615
16;32;16;1;8;2;21194222
16;32;16;1;8;4;19834519
2;32;16;1;8;2;9798815
4;256;128;1;32;128;18446744073709551615
1;1;32;1;1;2;209552297
16;32;8;8;16;2;2760000
8;32;8;2;8;2;5978074
16;32;16;16;4;2;1554815
16;32;16;1;2;2;23863259
16;32;1;16;8;1;20284148
16;32;16;16;4;2;1573482
256;1;16;4;1;2;4871111
16;32;32;16;8;2;1668296
16;32;16;16;2;2;1637334
16;32;16;2;1;2;9026963
16;32;8;16;8;2;2690222
32;32;16;16;8;2;2242518
16;32;2;16;8;2;10250815
16;16;16;8;8;2;2751851
1;4;2;1;1;2;846625926
16;32;16;16;8;4;18446744073709551615
16;32;2;16;8;2;10158371
16;256;16;16;8;2;2497630
16;32;16;2;8;2;11786667
16;32;16;16;1;2;1715259
4;2;64;1;1;2;18281037
128;16;8;64;4;8;18446744073709551615
4;1;8;2;1;4;231815704
64;128;8;8;4;2;3896000
16;1;16;16;1;2;39535111
128;32;16;2;8;1;13777777
64;64;32;8;32;16;18446744073709551615
8;32;4;8;8;1;8543407
2;256;16;1;4;4;19232296
64;16;64;2;8;32;18446744073709551615
16;32;16;16;8;2;1481481
16;8;16;16;8;2;5161333
16;1;16;16;1;2;39534370
16;32;1;16;8;1;20077778
16;32;16;1;1;2;17451703
16;32;16;16;2;2;1644148
1;32;16;1;2;2;16548296
16;2;16;16;2;2;20282666
64;32;16;16;8;2;2492740
1;32;16;1;8;2;15352444
16;32;4;16;8;2;5203259
16;32;256;16;8;2;2448741
16;32;1;8;8;1;20075703
16;16;256;16;8;2;2616000
16;32;32;16;8;2;1625777
16;64;16;16;8;2;1579408
16;16;16;16;8;2;2670815
16;32;8;16;8;2;2663556
16;32;16;16;2;2;1646074
16;128;16;8;16;2;4213333
32;32;16;16;8;1;2396000
4;32;16;1;8;4;7826667
16;2;16;16;2;4;20731851
16;8;16;16;8;2;5170370
16;32;8;1;8;4;9032593
16;32;16;8;8;2;2993037
64;256;128;4;8;128;18446744073709551615
2;128;256;1;1;1;25858815
256;64;2;4;32;2;8806815
1;16;2;1;16;2;344762518
16;32;16;2;8;8;6811111
16;64;16;16;8;2;1672148
16;128;16;16;8;2;2254815
16;32;16;16;4;2;1550074
16;32;16;16;16;2;18446744073709551615
256;32;16;1;8;2;21724149
32;64;16;32;8;2;18446744073709551615
4;128;32;1;16;2;25320297
32;16;16;16;8;2;1533333
16;32;16;2;8;2;11516592
16;64;16;16;8;4;18446744073709551615
16;64;16;2;8;2;12725926
16;64;16;16;8;8;18446744073709551615
16;32;8;8;8;2;2765926
16;32;16;16;8;1;1528888
32;4;16;16;1;2;5249630
1;32;16;1;2;2;16330667
4;64;16;4;8;2;2671260
4;1;8;1;1;4;228062963
32;32;4;8;1;4;2903259
2;1;8;2;1;1;418277185
16;32;16;16;8;16;18446744073709551615
1;64;16;1;8;2;10418518
16;32;16;4;8;2;3784593
16;32;8;8;8;2;2905185
1;1;1;1;1;1;6515729777
1;1;1;1;1;1;6517169926
8;16;1;2;16;1;80157630
8;32;1;1;8;1;32673481
4;256;4;1;8;2;16085037
16;32;16;8;8;2;2963555
4;32;16;2;8;1;5948000
16;256;16;16;8;2;2507852
1;1;4;1;1;1;1655895852
16;16;8;16;4;2;5082074
16;32;16;1;16;2;20788296
1;32;16;1;8;2;15236445
16;256;16;8;8;2;4592000
4;256;8;4;4;1;3627260
32;2;2;4;2;1;82283408
2;2;16;2;1;8;117846518
256;256;64;16;128;1;18446744073709551615
16;32;1;16;4;1;20009334
4;32;16;1;8;2;8389481
4;128;1;1;2;1;18168000
16;32;16;16;32;2;18446744073709551615
16;32;16;16;8;4;18446744073709551615
4;128;4;4;4;2;4427111
16;32;4;2;8;2;5949926
256;32;32;8;4;16;18446744073709551615
2;8;16;1;8;16;110770074
64;1;1;8;1;1;172135555
1;1;16;1;1;2;418883408
16;32;2;8;32;2;18446744073709551615
16;32;16;4;8;4;3406814
16;32;16;8;2;2;2958667
16;4;16;16;1;2;9844593
16;32;128;16;8;2;2552889
16;32;1;16;8;1;20244297
16;32;32;16;4;2;1918222
16;32;16;16;8;8;18446744073709551615
16;32;16;16;8;8;18446744073709551615
16;32;128;16;16;2;18446744073709551615
16;32;32;16;4;2;1930074
16;16;128;16;8;2;2507555
16;32;16;1;8;4;19974370
16;32;16;16;1;2;1666963
16;1;16;4;1;2;39196000
1;32;16;1;8;2;15233778
4;256;16;1;8;4;25114815
16;32;16;16;8;2;1481777
32;32;2;16;8;2;5430074
16;32;256;16;8;8;18446744073709551615
4;128;16;4;8;4;4570222
4;128;8;4;8;8;3606667
16;32;64;16;16;2;18446744073709551615
16;8;16;16;4;2;5131852
2;32;16;1;8;2;9599407
16;4;16;16;1;16;10723407
2;256;16;1;8;2;19383408
16;64;16;16;8;16;18446744073709551615
4;4;1;4;2;1;455485926
256;2;2;2;1;1;15044296
4;64;128;1;64;1;36801185
128;2;2;128;1;1;23204296
4;64;16;1;8;2;13936593
8;64;8;1;8;4;9652000
4;128;8;2;8;8;5346814
16;64;8;16;4;4;1483260
8;32;16;1;8;8;12597185
16;32;16;16;8;4;18446744073709551615
1;8;16;1;2;2;54390370
4;128;16;1;8;4;19926519
16;32;16;16;1;2;1627111
1;16;4;1;1;2;107092593
4;1;128;2;1;1;17022074
8;64;32;8;32;8;18446744073709551615
4;128;16;1;8;4;20902371
128;32;16;16;1;1;3182518
16;32;4;16;32;2;18446744073709551615
32;8;16;1;8;2;18999852
16;16;16;16;8;4;18446744073709551615
4;32;16;2;8;2;5609629
16;32;16;16;1;4;1727111
2;1;16;1;1;2;210209333
1;4;32;1;2;32;157697333
256;128;8;4;128;1;18446744073709551615
32;128;64;32;1;32;18446744073709551615
16;32;64;16;8;2;2336889
16;32;16;4;8;4;3180889
1;128;16;1;8;2;16450666
16;32;32;16;16;2;18446744073709551615
16;16;16;16;8;1;2679407
16;64;32;16;8;2;2312297
1;8;16;1;8;2;60852000
64;4;16;16;1;2;2877778
1;2;64;1;1;64;162492296
32;1;8;8;1;4;44361926
1;128;32;1;16;32;18446744073709551615
64;256;128;4;8;1;5382667
16;1;16;16;1;2;39506074
16;32;1;1;8;1;20025185
16;32;32;1;2;2;23938963
16;32;16;8;8;16;18446744073709551615
64;4;16;16;2;16;18446744073709551615
16;128;16;2;8;2;13497333
2;128;2;1;1;1;28658223
256;128;1;4;32;1;8569926
1;16;2;1;16;2;341006074
4;16;8;1;4;2;15509778
2;32;16;1;8;2;9622815
256;32;16;16;8;2;2568445
16;16;16;2;8;2;6881334
64;128;16;8;8;2;4391259
16;16;16;1;8;2;19244889
4;32;16;4;8;2;4075111
16;32;16;16;8;1;1519703
32;32;128;8;1;1;4178074
2;1;8;2;1;1;415981333
4;1;1;4;1;1;1794508297
8;32;1;2;16;1;40420741
1;8;16;1;8;2;60851407
8;32;16;1;16;2;10581926
16;64;16;4;8;2;6316148
16;32;16;2;1;16;17434963
128;16;16;16;8;2;2570815
4;2;2;4;2;1;457085037
2;2;16;2;1;8;117380741
256;256;1;1;128;1;51412000
256;32;32;8;4;8;3804740
8;32;16;1;1;2;17774222
32;32;16;16;8;2;2127703
2;32;32;1;8;2;8311259
16;2;4;16;1;2;79091259
2;8;1;1;8;1;436483704
64;2;1;8;2;1;86427111
1;2;16;1;2;2;217053037
4;256;1;4;2;1;8740296
1;32;16;1;8;4;19405926
16;32;16;1;8;2;20966963
16;32;16;2;1;2;8942371
64;32;16;16;4;2;2632000
256;2;1;64;1;1;25885482
4;1;1;1;1;1;1753958814
128;2;2;128;2;1;23081777
1;32;4;1;1;2;54729778
64;32;16;32;8;2;18446744073709551615
16;16;16;16;1;8;3155852
16;32;4;8;8;2;5317333
16;32;16;4;8;8;3228445
64;32;16;4;8;2;6658074
1;32;16;1;1;2;18108444
1;128;16;1;2;2;10884741
16;32;16;16;8;2;1485185
64;32;2;1;8;2;19178518
16;2;16;16;1;16;21282815
2;32;2;2;8;2;69266370
16;32;1;16;8;1;19994223
16;1;4;16;1;2;160535111
16;32;16;16;8;16;18446744073709551615
2;32;16;1;8;8;19420888
128;128;16;16;1;2;2929333
16;32;1;2;8;1;20807704
2;32;16;1;8;2;9469185
1;32;2;1;4;1;107793926
16;1;32;1;1;2;19237481
16;1;16;8;1;4;41970963
8;32;16;1;8;2;15404445
16;32;16;16;1;4;1722222
8;32;16;1;8;16;13198815
1;32;16;1;8;4;19394370
16;1;16;16;1;2;39558370
128;32;16;16;8;2;2552593
64;8;8;16;8;2;2844297
16;32;1;16;4;1;19960148
16;32;32;16;8;1;2195407
16;16;32;16;8;2;1504148
16;2;1;4;2;1;317072149
1;8;64;1;2;8;15557037
2;4;16;1;1;2;56673778
8;4;2;2;1;2;126832000
32;64;16;16;8;2;2506074
16;2;4;16;2;2;81106815
4;8;8;4;4;4;31245926
32;128;64;16;128;32;18446744073709551615
4;2;64;4;2;2;14633926
32;1;64;8;1;64;18446744073709551615
4;128;8;2;8;2;5420297
64;128;16;16;8;2;2524000
16;16;16;2;8;2;6726815
32;128;8;8;4;2;3850667
64;256;4;4;8;4;7493778
2;128;256;2;1;1;12949037
256;16;8;2;1;1;23316593
2;32;4;1;8;2;29847260
1;32;16;1;8;1;15367704
16;32;32;1;8;2;21942667
16;32;64;16;8;1;5172592
1;16;2;1;16;1;280116889
4;16;128;1;4;32;22528592
32;32;1;8;1;1;10153482
2;1;8;2;1;1;418487259
16;32;8;1;8;8;18486963
16;256;16;1;8;2;22710814
4;1;1;1;1;1;1756674519
64;8;1;2;1;1;22837777
32;4;2;1;4;2;39494519
1;1;16;1;1;8;440764741
16;32;64;16;8;8;18446744073709551615
16;64;16;8;8;2;3975111
16;64;32;16;4;2;2516741
16;32;32;2;8;16;12390667
1;2;16;1;2;2;216010222
256;64;1;1;1;1;49038518
1;32;32;1;4;8;9999852
4;64;16;1;1;16;25000148
8;2;1;8;2;1;518486666
8;32;16;1;8;1;17298371
16;32;16;4;4;2;3400297
1;2;1;1;2;1;3424475704
16;256;1;1;16;1;24266223
256;2;2;2;2;1;12113630
16;32;16;16;4;2;1517926
128;32;16;8;8;2;4302963
4;64;1;1;1;1;36152741
2;2;2;2;1;1;831955407
4;32;1;2;8;1;61174074
1;32;4;1;1;4;54240740
16;32;32;1;8;4;21813333
16;16;16;16;16;2;18446744073709551615
16;64;16;16;8;1;2141482
16;64;128;4;32;1;8722370
32;256;4;2;32;1;15437630
4;64;32;2;2;2;6940445
8;4;32;2;2;8;10506222
16;8;8;1;4;4;10656444
32;128;16;16;2;1;2877926
1;2;64;1;2;1;55329481
32;1;8;8;1;4;44198370
16;32;32;16;1;2;2065778
16;16;8;16;8;2;5152296
16;16;16;16;16;4;18446744073709551615
16;32;32;16;8;8;18446744073709551615
16;32;8;8;4;2;2911408
2;128;8;2;4;2;4724593
64;256;128;16;8;1;2072445
128;128;256;8;128;1;18446744073709551615
64;128;1;16;32;1;18446744073709551615
1;16;16;1;1;1;36163704
8;16;8;8;4;2;8494371
32;32;4;16;1;1;2911111
2;4;8;2;2;1;105409185
16;32;4;1;8;2;8118963
16;32;32;16;4;2;1934666
32;32;16;1;8;2;22513037
16;32;16;8;8;1;3517037
4;1;4;1;1;2;447090963
64;128;4;2;4;1;18540148
32;4;2;1;1;2;37447407
2;64;1;2;64;1;145877334
16;32;1;16;8;1;20048889
4;32;16;4;8;2;4041926
32;32;16;16;32;4;18446744073709551615
256;4;1;1;1;1;33092740
256;32;128;1;4;2;7194815
4;32;16;1;2;16;9076593
64;8;1;8;2;1;21194222
8;256;32;1;32;1;27604000
64;256;1;32;2;1;1898815
256;1;1;2;1;1;48852296
4;64;1;1;1;1;34519259
16;32;16;1;8;4;19998963
16;16;8;1;8;1;19593334
8;32;16;2;8;2;5870371
128;2;1;128;1;1;46866963
1;1;1;1;1;1;6550129037
16;64;128;4;4;1;5958222
32;16;4;1;1;1;36734519
16;32;128;16;2;2;2654814
16;8;8;1;8;2;10862370
16;32;8;16;16;1;2718815
16;4;16;8;1;2;9917037
64;64;1;8;2;1;3209630
8;4;8;2;1;2;31883555
1;16;8;1;2;1;54936148
32;16;16;16;16;1;1517185
64;2;8;32;2;2;10962370
32;128;8;8;32;4;18446744073709551615
1;128;1;1;1;1;62380593
16;32;64;4;8;4;7416148
32;32;16;16;4;2;2372296
8;64;16;1;8;4;19096889
16;256;16;16;1;2;2600148
64;256;128;1;8;1;7661630
2;128;256;2;4;1;6204296
256;128;2;4;32;1;8759555
1;32;16;1;32;4;56873333
8;1;8;4;1;2;129426814
32;64;4;8;64;4;18446744073709551615
16;32;16;16;4;1;1557778
2;1;8;1;1;4;427572444
4;1;4;4;1;1;452022370
64;2;4;2;2;1;22329630
4;4;2;1;1;2;223117630
32;32;16;32;8;2;18446744073709551615
16;64;16;16;4;1;1828297
16;32;8;1;8;2;19280148
16;64;4;1;8;2;20322963
8;64;16;2;8;2;9472889
1;2;1;1;1;1;3319574963
4;64;1;1;1;1;33191259
4;256;32;1;1;8;22471852
4;32;16;1;2;1;17708000
1;8;1;1;1;1;841042519
1;1;32;1;1;1;206521333
64;1;1;4;1;1;171254370
128;2;64;2;2;4;11550370
16;32;32;16;8;1;2174075
16;32;16;1;4;2;22818666
32;128;16;8;4;2;3890074
16;32;8;16;8;1;2646815
4;64;1;2;1;1;31459703
128;2;2;128;1;2;22921333
1;32;4;1;1;4;54254519
16;64;128;4;1;1;6533037
32;1;4;2;1;1;73829926
64;64;1;4;2;1;6946370
8;4;16;2;1;16;23663111
16;8;1;1;4;1;75724593
16;64;16;16;16;2;18446744073709551615
32;32;16;32;8;1;1298074
16;64;16;8;8;1;3811260
128;32;16;32;4;1;2059111
32;32;16;32;16;1;18446744073709551615
32;32;8;32;4;1;1611260
32;32;16;32;4;1;1318963
32;32;8;32;8;4;18446744073709551615
32;32;16;2;8;1;13283408
64;32;16;32;8;8;18446744073709551615
32;16;8;32;8;1;2811852
8;32;64;2;8;1;12349333
32;32;16;1;8;1;26039703
32;64;16;32;8;1;1779852
32;32;16;32;16;2;18446744073709551615
16;64;16;2;32;1;15368444
16;32;16;1;8;1;24827704
32;32;32;32;8;1;1760889
32;8;16;32;8;1;2813778
16;128;8;16;8;1;1841037
32;128;8;32;8;1;1793925
128;32;16;16;8;1;2556148
64;32;16;32;8;1;1963703
32;32;16;32;2;1;1213926
32;32;4;16;1;1;2911259
32;32;16;32;4;2;1136444
32;32;4;32;4;1;2835704
16;32;16;2;2;1;13211852
32;32;2;32;2;2;5470519
32;16;32;8;4;2;3848592
16;32;8;1;4;2;21054371
32;64;16;32;4;2;1687111
32;128;16;32;4;2;1807407
16;64;16;1;4;2;23569185
32;128;16;32;4;1;1888149
128;32;16;128;4;2;18446744073709551615
32;64;16;32;4;8;18446744073709551615
32;32;16;32;4;4;18446744073709551615
128;32;32;32;4;2;1996741
32;32;16;32;1;2;1395703
32;16;16;32;8;2;18446744073709551615
32;64;8;32;4;2;1124741
128;64;4;32;4;1;2188000
64;128;8;32;4;2;1992445
16;64;8;2;4;2;23978963
32;64;8;1;2;2;37466963
32;128;4;32;4;2;1053629
128;64;8;32;8;2;18446744073709551615
32;64;8;8;4;2;3468740
64;64;8;32;16;2;18446744073709551615
32;128;4;32;4;4;18446744073709551615
32;64;4;16;4;2;1630371
16;128;4;1;4;2;25674815
32;256;4;32;4;2;1730222
16;256;8;1;4;2;24089778
32;128;4;1;2;2;38315407
16;64;4;2;4;1;14505630
32;128;4;32;8;2;18446744073709551615
32;128;4;1;4;1;35057333
32;128;2;32;8;2;18446744073709551615
32;128;4;16;4;2;2185629
32;128;4;32;2;1;1180296
32;128;4;16;4;1;2181630
32;256;4;16;1;1;3301185
32;128;2;1;2;2;36298074
16;128;2;1;4;2;24387111
32;128;4;8;4;1;4454074
16;256;4;1;4;2;24624592
64;128;4;32;2;4;1984889
32;32;2;1;2;2;23789926
16;64;8;16;2;2;1582963
32;128;4;2;4;2;13420000
32;128;4;8;8;2;3937926
32;128;2;32;4;1;1615852
32;64;4;32;4;2;1605481
64;128;4;32;4;2;1981333
32;128;4;32;4;1;1161185
32;128;4;32;1;1;1578815
32;128;4;32;2;2;1260149
64;128;16;32;2;2;2092296
32;256;8;32;4;1;1983704
32;64;2;32;4;2;2950815
32;256;4;32;8;2;18446744073709551615
32;128;4;1;4;2;33521334
16;128;4;1;4;1;29046666
64;128;4;16;4;2;2748000
64;128;4;32;2;2;2059111
32;128;2;32;4;2;1625185
8;128;32;1;4;2;18634666
32;256;16;32;4;2;1828296
32;256;4;32;4;4;18446744073709551615
32;128;1;32;4;1;2920000
32;128;4;1;8;2;26844741
32;128;4;16;1;2;2571704
32;64;2;32;2;2;2945926
32;128;4;32;4;1;1148889
16;128;2;1;8;2;20244296
32;256;4;8;4;2;3768000
32;128;4;8;4;4;3457777
32;128;4;2;4;4;14336444
64;128;4;32;8;2;18446744073709551615
32;32;4;16;4;1;2855111
32;256;4;32;1;1;2212444
32;64;4;1;2;2;24949037
32;128;4;32;16;2;18446744073709551615
32;128;8;2;1;2;18462223
32;128;8;16;4;2;2661926
64;128;4;32;4;4;18446744073709551615
128;128;4;32;4;1;2177037
32;128;8;1;4;1;33344592
32;128;4;32;8;4;18446744073709551615
64;128;2;32;4;2;1722963
32;256;4;8;4;4;7413481
32;32;4;8;4;4;5360889
64;128;4;32;4;1;3316593
8;64;4;2;4;2;9829185
32;128;8;32;1;2;2789185
32;64;4;8;4;2;2933334
32;64;4;32;8;2;18446744073709551615
16;128;4;16;4;4;2710074
16;128;4;1;8;4;32355555
32;32;4;32;2;2;2771704
32;128;4;4;8;2;5977481
32;256;4;32;4;1;1953481
32;128;8;32;8;8;18446744073709551615
32;128;16;32;16;2;18446744073709551615
16;128;4;2;4;4;11448741
32;1;8;16;1;2;42068445
32;128;4;8;2;2;4236297
32;128;2;1;4;1;35328444
32;128;16;1;4;2;26468593
32;128;8;32;4;2;1727259
64;128;4;1;4;1;42992000
16;128;8;16;4;2;1465037
32;128;4;1;4;4;32310371
16;64;2;1;4;2;15881185
16;128;4;1;1;2;21840296
32;256;4;1;2;1;17286667
32;64;4;32;2;2;1584889
32;1;4;32;1;2;86016445
32;64;4;32;16;2;18446744073709551615
32;128;4;16;8;2;2162815
32;128;4;4;4;1;8496000
32;128;4;32;4;2;1128297
32;8;4;32;4;2;10741333
16;128;4;1;8;2;23295259
32;1;2;32;1;1;167994074
64;128;4;4;4;4;7707407
32;4;4;32;4;2;21174222
32;128;4;32;1;2;1339555
32;32;4;32;4;4;18446744073709551615
32;128;4;8;4;2;3500000
256;128;4;1;4;2;38877333
32;256;4;2;4;2;12534222
32;16;4;32;16;2;18446744073709551615
32;128;4;32;1;2;1400592
32;2;4;32;1;2;42267260
8;128;4;2;4;2;7328148
128;32;4;32;4;2;1570519
32;32;4;32;4;1;2812148
16;1;4;1;1;2;152921630
32;256;4;32;4;1;1928592
4;128;4;2;4;2;4784889
32;128;4;4;4;2;6751111
32;128;4;32;32;2;18446744073709551615
16;128;4;1;16;4;15710518
4;128;4;4;4;2;4349481
4;128;4;4;4;1;4529037
32;128;4;2;8;2;12039852
32;2;4;32;1;1;41321037
32;16;16;16;4;16;18446744073709551615
64;2;8;4;2;2;10708444
32;1;256;1;1;64;38757334
32;128;4;2;4;1;15057482
32;128;1;32;4;1;2920296
32;128;4;32;64;4;18446744073709551615
32;128;8;8;8;2;4333926
128;256;1;16;8;1;4921926
2;128;256;1;2;1;29508593
256;256;1;256;32;1;18446744073709551615
1;16;32;1;1;1;28736888
8;1;8;8;1;1;128369037
32;128;4;1;1;4;41584148
1;1;1;1;1;1;6515758815
4;1;4;1;1;1;440145481
64;128;1;2;4;1;19486074
16;4;2;2;1;2;76900000
4;2;16;1;1;16;73214222
2;128;4;2;1;2;9077481
32;128;128;32;4;2;1627704
32;1;4;32;1;2;85175852
32;128;4;16;8;4;18446744073709551615
32;128;4;32;2;2;1255703
256;4;1;32;1;1;12781926
1;32;32;1;1;16;12030963
4;32;16;2;8;16;16410666
64;8;1;8;4;1;21706963
1;1;32;1;1;1;206882962
32;128;64;32;4;2;1746667
32;128;32;8;32;2;18446744073709551615
2;128;4;2;4;2;8409333
1;256;1;1;2;1;32018222
2;1;64;2;1;4;53878963
4;64;1;2;16;1;37571111
128;1;32;1;1;8;24006371
32;128;4;32;64;2;18446744073709551615
32;32;4;32;4;2;2885629
64;32;4;4;1;4;7595852
16;64;1;1;64;1;28500296
32;32;16;2;1;8;14769333
64;32;1;8;4;1;5424593
8;4;256;2;2;1;8915259
16;1;8;1;1;1;74031555
256;128;4;32;4;2;2194963
32;128;4;32;128;2;18446744073709551615
32;128;4;1;4;2;31652296
4;128;4;1;4;2;8476297
32;32;16;16;8;1;2360741
4;256;8;1;2;2;11971111
32;256;256;1;32;64;18446744073709551615
32;128;128;1;4;2;7558963
64;32;128;16;8;1;2658222
2;64;256;2;4;1;7783851
256;128;1;1;4;1;41164741
16;32;32;8;32;1;4078518
8;16;8;2;1;2;9512296
32;128;32;16;4;2;2734371
32;128;4;4;1;4;11904593
4;2;4;1;1;2;221720148
32;128;1;32;4;1;2885926
32;64;1;8;64;1;18446744073709551615
1;4;8;1;2;4;233953037
4;2;4;1;1;1;218894963
16;128;4;2;4;1;15722814
32;128;4;32;2;4;1084000
32;16;2;1;16;2;15988296
4;32;16;1;8;16;18053777
256;4;1;32;1;1;12900148
256;32;32;8;4;1;4294074
16;128;4;1;2;1;17555556
32;128;4;2;4;2;13774074
32;128;4;32;4;1;1130223
4;32;16;2;2;16;6952888
1;8;1;1;4;1;863397185
256;2;1;256;1;1;25801629
16;256;32;2;64;1;16426371
256;2;64;2;2;1;11816593
128;64;1;128;1;1;1913630
16;2;64;4;1;4;5521185
4;32;4;1;4;4;15750963
16;64;128;8;1;1;3385778
32;128;32;1;4;2;18565334
64;32;4;2;4;1;13800000
1;64;1;1;2;1;107492149
8;4;256;1;2;1;17482963
16;64;16;1;1;4;27072889
32;16;16;8;16;4;18446744073709551615
256;2;8;1;2;1;17889926
32;1;2;1;1;1;145147111
32;16;8;8;4;2;2871408
128;128;4;32;4;2;2042815
64;128;4;32;2;1;2081037
32;128;64;32;8;2;18446744073709551615
256;128;8;32;4;2;2031703
64;1;16;1;1;8;13287259
2;256;256;2;4;1;6425481
256;128;1;4;32;1;8608889
16;128;32;8;32;2;18446744073709551615
4;32;4;4;4;2;14739407
32;128;256;32;4;2;1517777
8;4;16;8;1;1;17070222
32;32;1;8;4;1;10527260
8;16;16;8;16;8;18446744073709551615
1;256;4;1;16;2;11304740
16;128;2;8;4;1;2835259
1;16;2;1;1;1;210442222
128;32;64;1;8;4;20792000
256;4;1;32;2;1;13027259
256;32;32;8;8;8;18446744073709551615
4;32;16;2;32;16;18446744073709551615
128;1;256;1;1;1;25962963
256;2;1;256;1;1;25291407
32;16;16;32;4;2;1618519
32;128;64;32;4;8;18446744073709551615
32;2;4;32;1;1;41351407
64;2;64;2;2;1;12074963
128;2;128;2;2;2;10328000
128;64;1;2;4;1;13822370
16;2;4;4;1;1;75891704
64;64;4;4;2;4;6839111
16;64;128;4;1;1;6533037
32;32;4;2;1;1;19910518
64;2;1;8;1;1;84679703
8;4;8;1;2;2;32517185
32;8;8;1;4;4;6202519
32;16;16;1;16;1;25337926
16;2;8;1;2;2;38962074
64;128;32;32;4;2;1935555
32;1;4;32;1;2;85124445
32;1;256;2;1;64;16634815
32;16;8;8;8;2;2838963
64;256;2;16;8;1;2754074
2;128;256;2;1;1;12946963
16;128;4;1;4;2;26009333
32;16;4;32;4;1;5358667
1;128;4;1;4;2;15164000
16;128;1;4;32;1;5885482
16;32;1;2;32;1;33911407
8;32;8;8;2;2;4619408
32;32;4;8;1;1;4135852
32;128;4;8;4;2;3485333
2;4;16;2;4;16;140271703
1;256;1;1;16;1;33014222
16;32;2;8;4;1;9882371
32;16;1;1;4;1;18906075
32;16;4;32;4;2;5517481
256;32;16;1;8;16;48950222
256;128;1;4;1;1;12494370
256;32;1;8;4;1;1979112
4;32;8;2;2;2;8391259
32;128;32;32;4;2;1795556
32;128;64;32;1;2;2016148
64;8;8;8;2;1;2807259
8;2;1;2;1;1;495176888
4;32;1;4;8;1;58783704
128;2;2;2;1;2;22843407
32;128;4;32;2;2;1308000
8;4;64;2;4;2;5773481
32;128;4;8;4;2;3519852
32;4;4;8;4;1;20910963
32;64;1;1;1;1;27158519
16;2;64;1;1;4;22484000
64;64;4;2;2;4;13506518
1;64;128;1;1;2;17398814
32;128;4;32;4;2;1110074
16;32;4;1;32;1;11174519
1;2;1;1;1;1;3319701778
8;4;256;8;1;128;18446744073709551615
32;8;8;1;4;2;10057630
32;1;4;32;1;2;85952000
8;128;4;2;1;2;9007407
128;16;1;16;16;1;5944444
64;2;8;4;2;1;10572148
2;1;256;1;1;64;48606666
1;16;8;1;1;2;55147407
32;128;8;32;4;2;1716444
2;4;4;2;4;2;233141630
128;256;128;16;8;1;1933333
2;2;1;2;1;1;1661630370
1;128;1;1;32;1;84781037
16;32;128;8;32;1;4721778
32;256;4;32;2;2;1904149
64;128;8;8;4;2;3882667
16;128;4;16;4;2;1569037
8;128;4;2;32;2;6139259
32;1;4;32;1;1;84713037
64;128;2;16;4;2;2278074
64;128;2;64;4;2;18446744073709551615
64;128;4;1;4;2;36160148
32;128;8;32;8;2;18446744073709551615
16;64;4;1;4;2;22858963
32;128;2;8;2;1;3762370
8;128;4;1;4;2;16676297
32;32;4;1;4;2;21480741
64;1;4;64;1;2;43794963
32;256;2;16;4;2;2366963
32;64;4;32;4;4;18446744073709551615
32;64;2;32;4;1;2877482
32;256;2;32;4;2;1095407
128;64;2;64;4;2;18446744073709551615
64;128;4;32;8;1;2059852
64;32;4;32;4;2;1641185
32;16;2;32;4;1;10507852
16;128;16;1;8;2;22619408
32;128;4;1;16;2;24986370
32;32;4;32;8;2;18446744073709551615
32;128;4;32;1;4;1425482
64;128;4;64;4;2;18446744073709551615
16;32;2;1;4;2;10253630
32;128;2;32;1;2;1690074
32;128;4;16;4;4;1898667
32;64;4;32;2;4;1530370
32;128;4;2;2;2;17502963
32;32;2;32;4;2;5546667
32;256;1;32;2;1;1718815
32;1;4;32;1;1;84485778
32;128;1;8;4;1;2889185
4;128;4;4;64;2;18446744073709551615
32;1;2;32;1;2;175139704
128;128;4;32;1;2;2163704
2;2;4;2;1;2;418596741
128;256;4;128;4;2;18446744073709551615
16;128;4;1;4;4;27157482
128;16;4;1;4;2;24162814
32;4;4;32;4;2;21229333
128;128;4;32;2;2;2126370
32;128;4;32;1;1;1506519
16;128;256;1;4;2;9097630
16;128;4;1;16;2;22536297
16;128;8;1;4;2;23696296
32;32;8;32;4;2;1607704
32;64;4;32;4;1;1649037
4;128;32;4;4;2;5090814
32;16;4;32;2;2;5497482
64;64;4;32;4;2;1822222
64;64;2;32;4;2;2959111
32;128;64;32;4;4;18446744073709551615
32;128;4;32;4;4;18446744073709551615
2;128;4;2;4;2;17418815
32;128;8;1;1;2;30473186
32;32;8;8;8;2;1644148
32;16;4;16;4;2;5408000
32;4;1;32;4;1;84315556
32;32;4;1;1;4;26865629
2;4;128;2;2;1;9567111
1;256;4;1;16;2;11185629
16;128;2;8;4;2;2948148
32;256;2;1;1;2;17361778
16;32;16;1;8;16;15435556
32;128;1;4;1;1;7649333
256;32;1;16;8;1;1921630
4;64;16;2;1;16;12944889
64;8;4;8;4;1;5373778
256;2;1;1;1;1;29824000
64;256;2;32;2;1;2100000
1;128;4;1;2;2;16429185
32;128;4;2;2;2;17376741
64;128;4;32;64;2;18446744073709551615
256;128;4;8;4;2;5200445
16;128;4;1;2;2;30367556
128;128;4;64;4;2;18446744073709551615
16;32;128;2;1;2;8682518
32;256;2;2;1;2;16339703
128;2;64;128;1;4;18446744073709551615
64;1;4;32;1;2;44169778
128;8;4;1;1;1;26533777
32;32;4;2;16;1;6442963
64;64;8;8;16;4;18446744073709551615
8;16;256;1;2;1;17313481
32;8;8;1;4;1;23862666
32;256;16;16;1;1;3294222
64;2;1;4;1;1;84223852
32;1;256;8;1;64;18446744073709551615
32;16;256;8;8;32;18446744073709551615
128;256;1;4;8;1;7591704
2;128;256;2;2;1;8610519
32;2;4;32;1;2;42271555
32;1;4;4;1;2;84189481
16;128;128;4;32;16;18446744073709551615
16;256;32;2;32;1;16248148
32;32;8;8;32;2;18446744073709551615
32;256;1;8;1;1;4817037
2;4;128;2;1;32;15129777
1;256;4;1;16;2;11419408
16;16;64;8;4;4;4068593
32;1;2;32;1;2;174168593
16;32;16;1;4;4;20519703
32;256;1;1;256;1;15741185
128;1;8;16;1;1;22440889
32;128;4;1;64;2;29748297
32;2;4;1;1;2;36747852
4;1;256;2;1;2;10310963
32;8;8;16;2;1;5147259
32;128;4;32;4;4;18446744073709551615
32;1;64;16;1;2;5356592
1;2;1;1;1;1;3319700592
64;256;1;32;2;1;1896741
16;1;128;2;1;8;6602815
128;64;1;128;4;1;18446744073709551615
32;32;4;32;4;2;2889037
64;128;4;32;4;1;2054815
16;2;8;4;1;2;38641778
64;64;4;8;2;4;3347111
32;64;16;4;1;16;9520740
2;32;4;2;16;1;36409481
64;64;1;8;2;1;3067704
8;128;256;2;2;1;8668296
64;8;4;16;4;4;5521925
32;1;256;16;1;4;4331407
64;2;8;4;1;2;10509185
32;128;4;4;4;1;8206667
2;1;256;2;1;64;42478815
32;16;8;8;8;8;18446744073709551615
128;256;128;1;32;1;13861778
16;128;256;8;8;1;3725037
16;64;1;4;32;1;11584593
16;64;32;8;32;1;4387852
32;32;8;8;8;2;1612592
32;32;4;8;8;4;2861037
2;4;128;2;2;1;9607556
1;128;4;1;4;2;15143704
1;256;4;1;16;4;19438666
16;128;1;2;4;1;6241334
32;16;2;2;16;2;15809037
16;32;16;2;8;16;6869926
1;128;4;1;4;2;15116148
256;16;4;8;4;2;3040741
32;128;8;1;1;4;42956741
256;32;1;16;8;1;1935703
4;2;1;2;2;1;885922518
128;8;8;8;2;1;3792148
256;2;1;8;1;1;25040296
2;256;1;2;1;1;17445777
16;1;128;8;1;16;6341037
128;64;1;4;2;1;6818963
16;128;64;4;16;4;7978814
32;64;4;8;2;4;2615260
16;64;128;16;1;1;2364000
32;256;4;2;16;4;12743852
64;64;4;8;2;2;4329037
8;256;32;2;2;1;8698371
64;64;4;16;1;1;3379852
1;16;4;1;16;4;287919260
256;32;8;64;1;2;2451260
32;1;256;2;1;256;18446744073709551615
16;1;8;8;1;1;78384000
128;256;128;16;256;1;18446744073709551615
32;128;256;8;8;8;18446744073709551615
16;128;1;8;32;1;5597333
1;32;32;1;32;1;12688741
32;16;8;32;16;2;18446744073709551615
32;32;4;8;8;2;2870370
2;4;128;2;2;1;9682666
1;256;4;1;16;2;11445333
16;8;16;4;1;4;5553777
1;128;4;1;4;4;15235852
32;32;2;2;8;2;5950815
128;32;16;64;8;16;18446744073709551615
32;128;256;4;1;1;6494519
256;32;8;16;1;2;2969037
2;128;4;1;4;2;8825481
32;128;16;32;4;4;18446744073709551615
4;64;2;2;4;2;15559407
16;8;8;8;2;1;9828741
256;2;1;8;1;1;25057334
64;256;1;1;64;1;22751704
16;128;4;16;4;2;1549926
16;1;2;8;1;2;324290074
128;64;1;128;1;1;1927556
64;2;64;1;1;4;24098666
32;1;4;8;1;4;89826519
32;8;2;1;1;2;19344445
32;256;4;2;4;2;12625185
16;8;128;1;1;1;25976000
1;32;1;1;1;1;210107407
128;64;1;8;2;1;3658667
