GLOBAL_SIZE_0;GLOBAL_SIZE_1;LOCAL_SIZE_0;LOCAL_SIZE_1;cost
16;4;2;1;1142830482
4;4;4;2;1575451226
32;16;8;8;786082589
16;64;8;8;1017650138
16;8;8;2;663391086
32;16;8;4;892083893
1;2;1;2;11040887708
32;16;8;1;990968453
64;1;2;1;1221213138
16;32;8;8;859731065
2;8;1;2;1665004653
16;1;8;1;1800039117
2;256;2;16;632033550
2;1;2;1;10875376333
256;64;256;2;18446744073709551615
16;8;8;2;692657923
1;1;1;1;22293452167
2;32;2;16;1183617572
2;256;2;16;632983147
2;256;1;16;630963000
2;4;1;2;2765009503
2;128;1;1;688655974
2;128;1;8;831423229
256;256;1;16;460744013
256;256;1;128;393028515
32;256;4;16;674860644
256;64;1;16;586961438
256;256;1;16;458390012
128;256;64;128;18446744073709551615
8;256;1;128;582543893
256;256;16;128;18446744073709551615
4;256;4;128;18446744073709551615
4;4;2;4;1564516252
4;256;1;32;604894625
4;256;1;128;615212356
256;256;8;128;18446744073709551615
8;64;2;8;938558325
2;16;1;16;1299018734
2;32;2;32;1197320774
32;128;32;8;1473059220
2;32;2;4;1190282901
1;32;1;2;1273761947
4;2;1;1;2728845193
1;2;1;1;11073531753
256;32;1;2;623865172
4;32;1;2;703952350
256;256;256;128;18446744073709551615
256;2;1;2;749556136
256;128;1;64;421677171
32;256;1;128;507595309
256;1;1;1;692727878
256;256;1;64;390290883
256;256;1;256;401698431
128;256;1;256;437199420
256;1;1;1;692659798
128;256;1;64;423037512
128;256;1;32;433947018
256;256;2;64;320799554
128;1;2;1;883179176
1;128;1;64;657808297
256;256;4;64;315101416
256;256;2;128;321985756
256;128;4;64;378073926
256;256;8;64;18446744073709551615
1;256;1;64;788657069
64;256;4;64;461994086
128;256;4;64;381787419
256;1;4;1;1161157493
256;256;2;32;324359334
256;256;4;256;18446744073709551615
128;256;4;256;18446744073709551615
256;1;4;1;1162562570
256;1;4;1;1163847953
256;256;4;32;318646546
1;64;1;64;1143454732
1;1;1;1;22293385584
128;256;4;32;393818047
256;128;2;128;365170884
256;64;4;64;417733090
256;1;2;1;1164510728
128;256;4;128;18446744073709551615
1;256;1;128;668925182
128;128;8;128;18446744073709551615
256;1;8;1;1164532131
256;256;4;128;18446744073709551615
256;1;2;1;1162892563
128;128;4;64;445254139
256;128;8;64;18446744073709551615
128;1;4;1;897199729
256;256;16;32;18446744073709551615
1;256;1;8;796525049
1;256;1;64;810156087
1;16;1;2;1528921740
2;2;1;1;5430318917
256;128;256;64;18446744073709551615
128;256;8;64;18446744073709551615
16;128;1;16;603685089
256;128;1;128;427556972
256;1;4;1;1167586625
256;128;16;64;18446744073709551615
128;1;8;1;889036495
256;128;4;1;1577664369
1;256;1;64;763259465
1;256;1;64;798437216
1;1;1;1;22293101042
128;256;8;128;18446744073709551615
256;256;8;32;339345466
256;1;16;1;1163630667
256;128;4;16;446062218
256;64;4;32;453064833
128;1;4;1;890490190
1;128;1;1;649505552
16;1;16;1;1730326337
256;4;4;1;1353811637
2;256;1;64;662319877
256;2;4;1;1253244709
256;1;256;1;1478240482
256;16;4;2;1365591318
256;256;4;2;976618248
256;256;4;8;508355964
256;256;256;64;18446744073709551615
32;256;4;64;542653185
256;256;4;16;353451792
256;16;4;2;1356528259
4;256;4;64;610856469
2;256;2;64;606540730
256;256;4;4;650713483
256;256;4;1;1320566561
256;8;4;4;1037366091
256;256;64;64;18446744073709551615
64;256;64;64;18446744073709551615
256;64;4;1;1719694708
64;256;8;64;18446744073709551615
256;256;16;64;18446744073709551615
128;64;2;64;459194219
256;128;4;128;18446744073709551615
256;128;4;2;1064830781
256;1;4;1;1165571021
256;256;4;1;1304685876
1;256;1;64;783088775
256;256;1;64;387851133
256;32;4;32;454173554
2;256;1;64;652710716
256;128;2;64;366829220
4;32;2;16;694547650
32;256;4;256;18446744073709551615
1;256;1;64;789785507
1;8;1;8;2806598590
8;32;2;32;830456488
32;32;8;4;1124621213
1;64;1;4;1124914823
256;1;8;1;1163907397
256;1;4;1;1166493785
128;256;2;128;370259634
256;256;8;256;18446744073709551615
256;256;2;16;377771627
256;1;2;1;1164195403
128;64;4;64;470813723
256;32;4;1;1757403750
16;256;2;4;847521974
8;8;4;4;1153466190
256;256;128;64;18446744073709551615
8;128;2;8;944881585
1;1;1;1;22293152666
128;256;2;64;368929210
8;256;8;16;1027558834
8;64;2;16;767402140
8;64;1;32;646254797
256;64;2;32;421198636
128;256;8;32;440400965
256;128;8;32;424109754
256;1;2;1;1162728827
1;256;1;16;789040762
128;256;2;64;368747378
64;1;4;1;1229444243
64;256;1;32;477661094
1;128;1;64;668477500
128;128;2;64;417976928
1;1;1;1;22293347209
256;1;2;1;1165299097
2;64;1;1;700806837
256;2;1;2;746895562
4;32;2;8;693238345
16;2;2;2;1259728109
256;128;4;32;383511507
128;1;4;1;896887042
64;256;4;128;18446744073709551615
128;256;16;128;18446744073709551615
128;1;8;1;886937610
64;256;2;32;429643393
1;256;1;32;788411258
1;256;1;32;792607774
1;64;1;32;1138912969
64;256;8;32;554419833
256;256;16;256;18446744073709551615
1;128;1;32;667678361
256;64;4;16;540526511
1;1;1;1;22293523803
1;1;1;1;22293293304
1;64;1;64;1135854885
1;1;1;1;22293686262
1;256;1;256;664542473
1;256;1;64;782730280
1;1;1;1;22293125096
256;64;8;1;1625529307
256;256;1;1;602668098
128;256;2;32;372480126
256;128;2;32;372677633
1;256;1;16;802735175
128;32;2;1;1256368628
256;32;16;1;1787417500
64;1;4;1;1218393804
256;128;8;128;18446744073709551615
8;32;4;16;796340891
256;1;4;1;1167071909
1;256;1;2;782674296
256;1;2;1;1162703371
16;16;1;8;832345256
1;256;1;1;623710053
256;256;2;256;18446744073709551615
1;256;1;256;671937733
256;64;2;64;408575669
128;1;8;1;885060721
256;1;256;1;1479253935
2;256;1;8;627883171
256;32;4;4;1090566326
64;256;16;64;18446744073709551615
256;64;2;1;1123131395
256;64;2;2;1027004705
1;256;1;4;772308838
256;8;4;1;1584845878
256;1;4;1;1164556249
1;128;1;32;661594731
1;256;1;32;771155595
128;256;4;16;449670756
64;256;4;256;18446744073709551615
32;256;4;128;18446744073709551615
128;64;16;64;18446744073709551615
8;16;2;4;677712147
1;64;1;32;1164937680
256;1;128;1;1476363233
256;1;4;1;1165480187
256;128;32;1;1606030543
256;256;1;32;401559598
256;1;8;1;1164765014
64;128;4;64;485384259
256;256;8;16;390805174
256;32;2;1;1224572913
256;64;4;1;1637822344
64;128;4;32;546989060
32;4;2;4;702310675
64;128;64;32;18446744073709551615
128;8;32;8;1038391100
128;1;4;1;890275061
128;128;32;16;18446744073709551615
1;8;1;1;2795969666
32;256;16;256;18446744073709551615
2;64;1;64;665541584
256;1;8;1;1163155125
256;256;32;128;18446744073709551615
1;256;1;32;777669477
256;64;1;1;678153313
1;32;1;1;1262401046
64;256;2;64;416278969
256;1;16;1;1165474964
256;64;8;64;18446744073709551615
128;256;2;256;18446744073709551615
1;256;1;256;665863459
1;256;1;128;668566473
64;1;2;1;1229776016
64;256;8;128;18446744073709551615
1;1;1;1;22293410553
128;128;1;32;476312056
128;128;1;64;463360058
256;256;2;1;1002910623
1;64;1;16;1154794712
128;256;16;64;18446744073709551615
128;128;8;32;527799217
256;8;1;4;864249464
64;32;4;1;1548558927
256;1;1;1;694752229
256;32;4;2;1251670333
256;256;8;8;545539603
256;1;32;1;1167510631
2;1;2;1;10868463202
16;2;8;2;1231353731
32;16;8;8;812085656
1;8;1;8;2805666217
4;1;1;1;5461922106
64;2;4;1;657623716
8;1;8;1;2735733636
1;128;1;32;643917860
8;256;4;64;572761215
32;1;4;1;1326721082
64;64;8;64;18446744073709551615
64;64;4;64;538157626
256;128;8;1;1538651263
256;128;16;128;18446744073709551615
64;256;2;128;421653170
256;128;4;8;641520109
256;128;2;16;441084137
1;128;1;64;675441775
256;256;16;16;485109257
64;128;8;16;984879841
128;32;4;1;1670927111
256;16;4;4;1147209839
32;64;4;64;589957393
1;1;1;1;22293461125
16;256;2;64;521096391
256;128;1;2;503686210
256;1;4;1;1164031370
256;256;32;2;1096878825
256;4;32;1;1364197144
1;256;1;16;783000025
64;128;4;16;701688007
128;64;2;32;488000768
256;256;32;32;18446744073709551615
8;32;2;4;857636024
32;256;8;8;973215639
64;1;1;1;1261960882
1;64;1;1;1294100966
256;256;32;64;18446744073709551615
256;16;2;2;1150638162
16;32;4;1;1107261587
8;256;4;1;887161490
1;1;1;1;22293696125
1;32;1;8;1276928944
256;2;64;2;1254693802
256;1;4;1;1163909730
256;256;16;1;1282358919
128;1;4;1;893324598
64;1;8;1;1222187607
1;256;1;128;668931264
64;256;4;32;476427963
32;256;2;16;543819002
1;128;1;16;660385563
128;64;4;2;1320852969
1;128;1;128;1272985928
256;128;2;1;1100818125
128;128;4;1;1538247920
1;1;1;1;22293183137
1;256;1;16;786230125
128;64;8;64;18446744073709551615
128;128;2;1;1076402065
1;256;1;2;805416891
256;8;1;2;727393189
16;16;2;1;940024202
128;4;16;1;1031189840
128;128;16;64;18446744073709551615
8;1;1;1;2736225456
4;64;1;32;821028446
32;1;2;1;1317465835
1;128;1;32;650465844
1;128;1;64;651550926
256;4;4;2;1240678757
256;32;1;16;536405459
1;8;1;8;2805901741
256;128;128;16;18446744073709551615
1;1;1;1;22293390054
1;1;1;1;22293352637
256;64;4;4;939066583
1;64;1;32;1151129516
256;64;16;64;18446744073709551615
256;1;2;1;1164257491
1;64;1;64;1141818495
64;256;2;16;496781308
1;128;1;128;1273480129
128;64;32;2;1839503862
64;128;8;64;18446744073709551615
64;256;4;16;551444134
64;1;8;1;1230486702
1;256;1;128;669894668
256;128;4;4;781864796
1;8;1;1;2818808516
32;1;16;1;1317999339
2;64;1;64;640968630
256;1;32;1;1165238209
128;1;2;1;887723846
16;64;8;32;1076917257
64;16;8;1;1416250337
16;1;4;1;1761537246
256;128;8;16;510849087
256;4;4;1;1362570496
2;256;1;128;642444375
128;128;4;32;473438351
256;32;8;1;1789153265
4;1;4;1;5445759685
64;1;8;1;1218382241
32;1;32;1;1333056847
1;32;1;32;1262910965
32;8;8;2;756740716
1;64;1;16;1145989573
2;64;2;1;676356043
1;128;1;64;671703359
1;128;1;2;659696294
128;64;4;1;1661083277
1;64;1;1;1275814670
1;1;1;1;22293042845
64;256;1;64;465295593
256;64;4;2;1127104876
128;64;4;32;492318253
64;128;2;64;467298791
256;1;1;1;691976759
16;32;4;32;679973803
1;2;1;2;11040784459
256;16;1;4;868494437
32;128;4;64;572014970
256;256;256;8;18446744073709551615
1;4;1;1;5592855433
64;256;32;64;18446744073709551615
1;256;1;2;792485059
256;8;1;4;866853728
1;16;1;8;1534329039
1;4;1;1;5592970150
256;64;8;32;502274626
128;256;2;16;436565976
128;128;4;128;18446744073709551615
1;256;1;256;668818930
1;256;1;256;665694709
128;1;8;1;887156003
1;256;1;1;623907009
1;256;1;8;789610151
32;256;2;64;469301261
1;128;1;32;661153555
4;16;4;4;1207902210
64;64;1;32;565090478
256;4;4;4;943236843
1;128;1;64;666650542
256;32;8;16;734357345
128;8;2;8;677132775
128;128;4;16;553556895
1;8;1;4;2794507934
32;256;2;32;482551474
128;256;32;64;18446744073709551615
128;1;16;1;886107958
2;1;1;1;10898448246
128;1;32;1;887742867
2;16;1;2;1275038496
1;256;1;1;630691710
1;1;1;1;22293352416
1;256;1;32;778766073
32;1;4;1;1328752887
64;128;4;128;18446744073709551615
128;1;4;1;890173741
1;128;1;32;651577754
1;256;1;64;774522441
128;1;1;1;662976516
16;64;8;2;1327663318
32;1;8;1;1321563715
1;1;1;1;22293939679
256;256;128;8;18446744073709551615
4;1;4;1;5445735463
1;2;1;1;11073421506
32;1;32;1;1302545454
8;32;1;32;826279549
32;8;16;2;744403395
1;1;1;1;22293014167
2;64;2;2;669571278
256;1;1;1;693967709
64;1;4;1;1213505098
256;128;1;32;437885726
1;256;1;64;768170250
16;32;4;1;1127633454
8;16;4;2;704084142
256;64;128;64;18446744073709551615
2;8;1;4;1638956984
16;256;4;64;547233552
128;256;4;1;1150323942
128;256;16;32;18446744073709551615
1;8;1;8;2795703183
64;1;4;1;1233065713
32;256;2;256;18446744073709551615
1;8;1;2;2805112976
256;32;1;1;771941068
256;4;4;1;1376577000
8;256;4;32;576308178
8;256;4;16;617895474
256;1;32;1;1162018061
128;1;16;1;895212437
256;1;16;1;1163359362
256;128;16;32;18446744073709551615
256;64;16;32;18446744073709551615
1;1;1;1;22293274845
256;128;1;1;630544307
64;256;16;128;18446744073709551615
16;16;4;8;811917006
32;4;4;1;806165432
8;1;2;1;2736488000
256;64;4;8;791895125
256;32;8;32;483528423
64;64;4;64;535498557
256;128;128;4;18446744073709551615
1;128;1;1;657656093
64;32;1;16;639332347
256;256;2;8;524042978
1;256;1;16;787612572
1;128;1;128;1267938125
128;8;1;2;884766795
16;128;4;16;713507750
64;8;16;4;876434567
128;1;32;1;886800592
64;64;2;1;1275240392
16;1;4;1;1809401917
1;128;1;1;668979916
128;1;2;1;886135949
2;64;1;64;697120023
128;1;128;1;1557957705
2;1;1;1;10898850037
8;64;8;8;909947644
128;4;4;1;1054286310
256;8;2;4;988096710
1;64;1;64;1129449560
128;256;4;8;620504983
256;128;1;2;505361894
1;1;1;1;22292876887
32;16;1;8;784035478
1;1;1;1;22293546792
4;1;2;1;5460511788
1;8;1;1;2823516213
1;256;1;64;796147510
32;4;32;4;1267237958
8;32;1;8;870251877
32;1;2;1;1308399484
1;2;1;2;11040738835
256;256;16;1;1277517836
256;256;64;8;18446744073709551615
128;256;2;1;828939141
32;256;8;32;832893597
1;64;1;2;1134626619
256;1;1;1;693996857
128;1;1;1;668334625
1;1;1;1;22293413637
256;32;1;2;625766600
16;1;4;1;1828225688
256;1;64;1;1166415118
256;1;32;1;1164112028
128;16;2;2;1262681292
1;1;1;1;22293740762
1;16;1;4;1573029684
1;128;1;2;636352057
256;8;16;2;1408665102
16;256;4;8;854439846
1;256;1;64;765151090
256;4;8;1;1380228009
1;256;1;128;666403847
256;1;8;1;1164890709
32;256;4;32;561971930
256;64;16;1;1742142428
128;1;16;1;889091551
32;4;32;4;1278718345
1;16;1;4;1466340752
64;128;4;64;494059305
32;2;2;1;1076337296
128;128;1;128;459079880
128;128;1;1;629603416
1;128;1;128;1277897477
256;1;8;1;1164258199
128;8;16;4;1359695357
128;64;4;16;614883259
1;1;1;1;22293092429
