857b059d68d09f263cf3e54d8a87624c1ac04e09c1a9968694cd77cab2487126.cl -> 4919407 (4096;1024;16;16;14;126;4919407)
f19ee4bcc1af1e8dc1e57bf8b19fcf5721cd778c1fd82a4df115569196979b0c.cl -> 4837629 (256;4096;32;2;2;1170;4837629)
fc7159b0c6fc7d1c250faddc848796bc1d87e5b588305ce9010f05ffaad239f1.cl -> 3560149 (512;4096;64;1;2;3;3560149)
050b3d6f1e9737c3db1f126f87886d72329be44321ffc2499b9de47adc932ec2.cl -> 2678519 (2048;8192;64;1;2678519)
