GLOBAL_SIZE_0;GLOBAL_SIZE_1;GLOBAL_SIZE_2;LOCAL_SIZE_0;LOCAL_SIZE_1;LOCAL_SIZE_2;TILE_0;TILE_1;TILE_2;cost
2;8;1;1;2;1;2;64;1;1229488608
32;256;64;8;16;1;256;8;128;42370835552
1;2;1;1;1;1;16;32;8;10342157792
32;64;16;32;2;2;128;4;64;620886688
32;64;16;32;8;1;128;4;64;2207626112
32;64;16;32;1;2;128;4;64;630399648
32;128;16;32;2;1;2;4;64;20199189152
32;64;32;8;32;1;128;4;64;21560720864
4;1;1;2;1;1;2;2;1;5016999520
128;128;1;1;8;1;4;1;16;64065120
16;32;128;8;32;1;4;16;4;31386892320
8;2;128;1;1;128;128;4;128;18446744073709551615
1;4;8;1;4;4;2;16;4;1619972192
256;256;2;4;1;2;32;128;2;18446744073709551615
64;8;32;4;1;2;2;32;8;538652768
128;64;128;4;64;1;2;8;32;18446744073709551615
1;2;2;1;2;1;2;128;4;9926062016
8;1;1;2;1;1;1;64;2;4282690368
32;16;16;2;16;2;4;8;1;1443532064
1;1;256;1;1;4;16;16;16;4408862816
128;4;1;128;1;1;1;2;16;3953085376
1;128;8;1;32;2;8;1;32;2058748448
128;64;1;1;8;1;4;1;16;75524512
128;256;1;1;8;1;4;1;32;63379072
128;256;1;2;8;1;4;1;16;39465568
32;256;1;8;8;1;4;1;32;116830016
128;256;1;1;8;1;8;1;32;63790624
128;128;1;1;8;1;4;1;64;74358816
128;256;1;2;64;1;8;1;32;120793888
128;256;4;2;16;1;8;256;32;3775294784
128;256;1;2;8;1;2;1;8;47390560
64;256;1;4;16;1;4;1;16;88805920
128;256;1;2;8;1;4;1;16;39496960
128;256;1;2;16;1;2;256;4;910655552
128;256;1;2;8;1;2;1;16;46816928
256;256;1;1;8;1;8;1;16;64760064
256;64;8;1;32;2;128;1;256;1861889472
64;256;256;16;2;2;256;32;32;43029383680
256;1;256;1;1;32;1;128;128;18446744073709551615
16;1;16;2;1;1;16;16;4;1304408960
128;128;1;2;8;1;8;256;16;581325504
256;256;1;1;8;1;4;1;16;64362784
1;256;1;1;8;1;4;1;16;515610688
128;256;1;2;2;1;4;1;16;39065536
256;256;1;256;1;1;4;128;16;10053866976
128;1;2;2;1;1;4;1;16;123268288
128;256;1;2;2;1;4;128;16;49890528
128;256;1;1;4;1;8;1;16;63912544
1;64;1;1;2;1;2;256;16;9331647392
128;1;1;2;1;1;4;1;16;123645472
128;256;1;2;4;1;4;1;16;39413024
128;256;1;2;2;1;4;256;16;4284647808
128;256;2;2;2;1;8;1;16;80128000
128;256;1;2;2;1;8;1;8;41150496
128;1;1;2;1;1;4;256;8;123591840
256;256;8;4;64;1;64;1;256;2149676864
16;2;2;4;1;1;4;32;8;665519136
2;2;128;1;2;4;1;128;64;1452351584
64;8;4;16;2;4;256;4;16;197899424
128;256;1;2;2;1;4;32;16;40629568
128;16;1;1;2;1;4;1;32;74803840
128;256;1;2;32;1;32;1;256;151015744
128;256;1;2;2;1;4;1;16;39130240
128;256;1;2;2;1;4;1;32;38817312
128;1;1;2;1;1;4;1;16;123472608
128;256;1;2;2;1;8;256;8;4373632384
128;256;1;2;2;1;4;1;16;39151040
32;256;1;8;2;1;4;1;32;66112256
256;256;1;1;2;1;4;1;32;62525888
128;256;2;2;2;2;4;1;32;21028832
128;256;1;2;2;1;4;1;64;44854944
128;256;2;2;2;2;8;1;16;21762464
128;256;2;2;2;1;4;1;32;77166112
256;1;2;1;1;2;4;1;32;102521504
1;256;2;1;1;2;4;1;32;65711040
256;256;2;1;2;2;4;1;32;33205472
256;256;2;1;1;1;4;1;32;18446744073709551615
32;256;2;8;4;1;4;1;32;141243744
128;256;2;1;2;1;4;1;32;124122592
128;256;2;2;2;2;2;1;32;23628256
128;256;2;2;2;2;4;1;64;23014368
128;256;2;2;2;2;1;1;32;41824064
64;256;2;4;2;2;4;1;32;16777856
16;256;2;16;4;2;4;1;32;245703360
64;256;2;4;1;1;4;1;32;64334208
64;64;1;2;2;1;1;1;32;80907936
1;256;2;1;2;2;4;256;32;4895647968
64;256;2;4;4;1;4;256;64;4528697248
64;256;2;4;8;2;4;1;8;35913504
64;256;4;4;2;1;4;1;32;128590208
64;256;2;4;2;2;2;1;32;32680928
128;256;4;2;8;1;4;1;32;156333984
64;256;2;4;2;2;8;1;32;17263520
64;256;2;2;2;1;4;1;32;94730656
64;1;2;4;1;2;32;256;128;308249984
32;256;2;8;4;2;2;1;32;130210720
64;256;4;4;2;4;4;1;32;8562848
64;256;1;4;1;1;4;1;128;34705696
256;256;4;1;2;2;4;1;32;66022688
128;256;4;2;1;4;4;1;16;13371040
64;1;4;4;1;2;4;1;32;146060416
64;256;2;4;2;1;4;1;32;64396576
128;256;2;1;2;1;2;1;32;124375072
128;1;4;1;1;4;4;1;64;62754016
64;256;4;4;2;4;4;1;16;8683168
64;256;16;4;2;4;8;1;32;35775296
64;256;4;1;2;4;4;1;32;17811616
64;64;8;4;4;4;4;1;64;37958784
32;1;4;4;1;4;4;1;32;151854496
64;256;4;4;4;4;8;1;32;17190752
16;256;32;16;2;4;4;1;32;2383931136
128;256;4;2;2;2;2;1;32;46447648
64;256;4;4;1;2;8;1;8;33865280
8;8;8;2;2;8;64;256;128;187026400
128;16;256;16;4;1;256;256;256;18446744073709551615
1;1;4;1;1;2;16;32;4;8853383328
8;256;128;1;32;2;128;1;4;2688607136
64;1;4;4;1;1;4;1;16;348709248
64;256;4;4;2;4;2;1;32;16781696
64;256;4;4;2;2;4;128;64;60378976
64;256;4;4;2;1;2;1;32;254422464
64;256;2;4;2;1;1;256;16;12587460704
64;128;4;4;2;4;4;1;32;8595552
64;256;2;4;1;2;4;1;32;16270208
64;128;4;4;2;4;8;1;32;8998880
64;256;4;4;2;4;1;1;64;18723648
64;256;4;4;4;4;4;1;64;16300288
128;256;4;2;2;4;4;1;32;11373120
8;8;1;2;4;1;8;8;2;462921760
128;32;2;64;2;2;64;4;1;110456320
1;64;128;1;1;2;256;1;1;5296956768
128;8;1;16;1;1;4;32;128;207164320
64;256;256;4;2;2;4;1;32;2168153312
64;256;4;4;2;4;4;256;32;1163502912
64;256;4;4;1;4;4;1;32;8528704
64;256;64;4;2;4;4;1;32;136177696
64;256;256;4;1;8;4;1;32;148777568
64;256;4;4;1;4;1;4;32;21353664
64;256;4;4;64;1;1;1;32;1309786432
64;256;4;1;4;4;4;4;32;8690880
64;256;4;4;1;4;1;1;32;19381408
128;256;4;2;128;1;4;8;32;4473701824
64;256;4;4;1;4;4;1;8;8913856
64;256;4;4;1;2;4;1;32;32347072
64;256;4;8;4;4;4;1;32;69786336
64;256;4;2;128;1;4;1;32;1240681952
1;256;4;1;128;1;4;1;64;7233098560
64;256;1;2;128;1;4;1;32;260738816
64;256;4;4;1;4;4;1;256;9052192
64;256;4;4;1;1;4;1;32;128280832
64;1;4;4;1;4;4;1;8;85322336
64;4;1;4;2;1;4;1;1;160192768
32;256;4;8;2;4;4;1;32;35870464
64;256;2;4;64;1;4;1;32;559112736
64;256;8;4;2;1;4;256;256;35139744832
64;256;4;4;1;2;4;1;32;32368288
64;4;256;2;2;8;128;1;8;374934528
2;256;32;1;1;2;2;1;64;569475104
8;32;16;1;8;4;2;128;4;75738976
8;16;128;1;16;16;32;1;1;18446744073709551615
64;256;4;2;128;1;4;1;2;1233052608
1;256;4;1;128;1;4;1;2;8545101184
64;256;4;4;1;1;4;1;32;127780352
64;256;4;4;1;4;4;1;1;33454400
64;256;4;4;1;4;4;1;64;8857792
32;256;4;8;2;2;16;1;8;35041792
64;128;4;4;2;4;2;1;32;16830944
64;256;8;4;2;1;4;1;32;256997184
32;1;1;8;1;1;4;1;2;1739045472
16;1;4;16;1;4;4;1;32;2804140832
16;256;4;8;2;4;4;1;32;36031744
64;256;8;4;1;1;16;256;32;62019185664
32;4;4;2;2;1;16;2;8;193518720
64;256;4;2;128;1;4;128;32;347595744
64;128;16;4;64;1;4;1;32;3841376064
64;1;4;4;1;4;4;1;32;76632288
1;1;1;1;1;1;4;64;1;14301758880
1;4;128;1;1;128;256;8;1;18446744073709551615
1;1;64;1;1;1;1;32;256;14520028832
4;64;2;4;16;1;8;2;128;2161165760
64;256;128;4;32;1;256;1;32;18446744073709551615
16;256;4;16;4;4;4;1;32;303655808
64;256;4;64;2;1;4;1;32;9963779808
64;128;4;4;1;1;4;1;32;128604064
64;256;4;4;2;4;4;1;32;8558560
64;256;4;4;1;1;4;1;16;128522432
64;256;4;4;4;2;4;1;64;33466784
8;32;32;8;4;8;128;2;128;392096320
64;256;4;4;1;1;2;1;32;253300480
64;256;4;4;1;4;4;1;128;8834848
2;256;64;1;1;2;1;16;16;1463147264
2;8;1;1;2;1;2;64;1;1231858816
32;64;64;32;2;1;128;4;64;5626688480
4;1;1;2;1;1;2;2;1;5020481440
8;64;16;2;4;8;8;8;16;16027328
64;256;4;4;1;4;2;256;32;4133907968
16;256;4;16;8;1;4;1;32;2613977952
64;64;4;4;1;2;4;1;32;33632480
4;256;4;1;128;1;4;1;32;1953880608
8;256;4;2;128;1;4;1;4;1374406080
64;256;4;4;1;4;2;1;32;16855808
1;1;8;1;1;8;8;64;1;14251992704
64;256;4;4;1;1;4;1;32;128193664
64;256;4;4;64;1;4;1;32;1032628736
128;64;8;16;1;2;64;2;64;102287360
1;1;1;1;1;1;8;1;128;14195457632
16;32;128;8;32;1;128;16;4;20357305920
128;2;128;16;1;4;128;4;1;3672112224
1;1;8;1;1;1;1;1;4;17045911488
128;256;4;2;64;1;4;1;32;502021408
64;256;4;4;64;1;4;1;16;1030445024
64;1;4;1;1;4;4;1;128;59150944
128;64;8;64;4;1;16;4;32;2496853536
16;256;4;16;1;4;4;256;32;30135988608
64;256;1;4;1;1;4;1;32;32276480
4;256;4;1;128;1;4;1;2;2099379040
64;256;4;1;128;1;4;1;32;612316576
64;256;4;4;1;4;4;1;16;8648896
32;64;16;32;1;1;32;4;32;1116673856
32;64;8;1;32;2;32;8;4;946940640
16;16;8;2;8;2;16;4;16;227265600
32;32;8;32;1;8;64;8;16;55487424
1;256;32;1;256;1;2;16;32;17869854240
256;32;2;4;4;2;128;128;2;301430944
256;8;32;4;1;2;1;32;8;681213024
128;1;64;4;1;8;1;8;32;153171840
64;256;1;4;1;1;4;1;128;34700928
64;256;8;4;1;1;4;1;128;273958592
64;256;4;2;128;1;4;1;64;1192716224
32;256;8;8;2;1;4;1;32;533196256
64;256;4;4;2;1;4;1;32;128750240
128;256;4;2;1;1;4;64;32;208585472
64;256;2;4;32;1;4;1;32;248032160
64;256;16;4;1;16;4;1;32;4575648
64;256;16;4;1;16;4;1;128;5715520
64;256;32;4;1;8;4;1;16;19232704
64;1;16;4;1;8;4;1;32;40630496
64;256;16;2;128;1;4;256;32;2984131616
64;256;16;4;1;8;8;1;32;9265504
256;256;16;1;128;1;4;1;32;2228034944
64;256;16;4;1;4;4;1;32;33663552
64;256;16;4;64;1;4;1;32;3757485696
32;256;16;8;1;16;1;1;32;9431232
64;256;16;4;1;16;4;256;128;1948538880
64;128;16;4;1;16;4;1;32;4549856
32;256;16;8;32;1;4;1;32;7376201984
128;128;16;2;128;1;4;1;32;3886517440
64;128;16;4;1;16;4;1;64;5592672
64;128;16;4;1;16;8;1;64;5299680
64;64;16;4;1;16;8;1;32;4719680
64;1;32;2;1;8;4;1;16;47096864
64;256;16;4;1;16;1;1;32;6492768
32;128;16;8;1;16;4;256;32;3750233280
64;128;16;4;1;8;4;1;16;9596512
64;64;16;4;1;16;4;1;64;5701216
64;128;16;2;1;8;4;1;32;14737824
32;128;16;8;2;16;8;1;32;16555296
64;128;16;2;128;1;4;1;16;4155924096
32;1;16;8;1;16;4;1;32;109179328
32;128;16;8;2;16;4;1;32;34044256
64;128;16;4;1;16;2;1;32;8744768
64;128;16;4;2;8;1;1;16;28240000
1;64;16;1;1;8;4;128;32;1138332640
64;128;16;4;4;16;4;1;32;15067616
64;32;64;4;2;8;4;256;32;1331557216
256;128;16;1;128;2;2;1;32;993045792
32;128;16;8;2;16;4;1;16;33177536
64;128;16;1;128;2;4;1;32;1035317120
64;128;16;4;1;16;8;1;32;4680448
64;128;16;2;64;2;4;1;64;1036675552
32;64;16;8;2;16;4;1;32;35386464
64;128;8;2;128;1;2;1;32;2433002368
64;128;16;4;64;1;4;1;32;3834382176
64;256;16;4;64;1;16;1;32;3710282848
64;128;16;4;1;16;8;1;16;4801440
128;128;16;2;2;16;2;1;32;4807040
32;128;16;4;1;16;4;256;32;580033376
64;128;16;4;2;16;4;1;32;8038912
64;128;16;4;1;8;16;1;32;9456960
128;128;16;2;128;1;2;1;16;4080637216
128;128;16;1;1;16;4;1;32;5716512
64;128;16;1;128;2;8;256;32;674855104
64;128;8;4;2;1;2;1;64;511684448
64;128;16;1;128;2;4;1;64;1151751616
64;128;16;4;1;8;4;1;32;9287808
16;128;16;16;16;1;4;1;32;27075416384
64;2;16;4;2;16;4;1;32;22808192
64;128;16;4;1;16;4;1;1;60939456
64;128;64;4;1;4;256;1;32;2187913152
64;128;16;4;1;16;4;1;32;4521888
64;128;16;64;1;1;4;1;32;19920295840
64;128;16;4;1;16;4;16;32;6483680
64;128;16;8;1;16;4;1;32;16644384
64;4;16;4;1;16;4;1;256;8232448
64;128;2;4;1;2;4;1;32;16782592
4;128;16;1;1;1;64;1;32;991958240
64;128;16;4;1;16;32;2;32;4915552
64;128;128;4;1;4;4;1;32;272504224
1;128;16;1;1;16;4;1;32;10274080
64;128;8;4;1;2;4;1;32;67299040
64;1;16;4;1;16;4;1;32;22332224
64;128;16;4;1;4;4;1;32;34060704
64;16;16;4;1;16;4;128;32;12268928
64;1;16;4;1;16;4;256;32;21440544
256;128;16;4;1;16;4;1;32;5194304
2;128;4;2;1;1;4;1;32;224705824
64;128;16;4;16;1;4;1;32;971769728
64;128;16;4;1;16;4;1;256;6991648
16;128;16;16;1;16;64;1;32;23129792
64;128;16;16;1;16;4;1;32;63341024
64;128;16;4;1;16;1;1;32;7045120
64;4;16;4;1;16;4;1;32;7630112
64;16;16;4;1;16;4;1;32;5409856
64;128;16;4;1;16;4;1;16;4537056
256;128;16;1;64;1;4;1;16;1415543072
64;2;16;4;1;16;4;32;32;12168512
128;128;16;2;1;16;4;1;16;4081760
128;128;8;2;1;2;1;1;16;168720896
1;128;128;1;1;2;4;1;16;2605274240
128;128;16;1;1;16;32;256;16;821283296
128;4;16;2;1;16;256;1;16;291433056
128;128;16;32;1;2;8;1;16;2110374464
128;128;32;2;1;8;4;1;16;26849216
128;2;4;2;1;1;4;1;16;231639008
128;1;16;2;1;16;4;1;128;11855584
128;128;16;2;1;4;4;1;16;46324576
128;128;16;2;128;1;4;1;4;3912885056
128;128;16;2;1;16;4;1;256;4522528
128;128;16;2;1;16;4;64;16;18446744073709551615
128;32;16;1;1;16;4;1;16;6605984
1;128;16;1;1;16;4;1;16;10200544
256;128;16;1;1;16;2;1;16;6978464
128;128;16;2;32;1;4;1;16;957647104
128;1;16;2;1;16;4;32;2;105761024
128;1;16;2;1;16;4;1;16;14648576
128;256;256;2;1;2;4;2;16;3259088448
128;128;16;32;1;2;4;1;16;4407122080
32;128;16;8;1;16;4;1;16;18525632
128;128;16;2;1;16;4;1;16;4089120
128;128;16;2;1;16;4;128;16;18446744073709551615
128;128;16;2;1;16;4;32;16;18446744073709551615
32;128;1;8;1;1;4;1;16;66655744
128;128;16;2;1;4;4;1;16;46417312
8;128;2;2;1;2;4;4;16;39810528
128;128;16;2;1;16;4;1;32;3772512
128;1;16;2;1;16;4;1;16;14651072
256;128;16;1;1;16;4;1;16;7004416
128;128;4;2;1;1;4;1;16;155100960
128;4;16;2;1;4;4;1;32;47201760
128;128;128;2;1;2;4;1;32;1325781728
32;128;128;8;1;8;8;1;32;167217088
128;8;16;2;1;16;4;1;32;4427040
128;128;64;2;1;4;4;1;32;178749440
128;2;16;2;1;16;4;1;32;5732064
128;128;16;2;1;16;4;256;32;509394400
4;128;16;2;1;16;4;1;128;6225952
128;16;16;16;1;16;4;1;8;195511776
128;128;16;2;1;16;4;1;32;3781632
128;32;16;128;1;2;4;1;32;17133653408
128;128;16;32;1;2;4;1;32;4389442656
128;128;16;2;1;16;256;1;1;2589521408
128;128;16;2;1;8;4;1;32;12714240
128;128;16;2;32;1;1;1;4;1431661984
128;128;16;4;1;16;4;1;16;4946304
1;2;16;1;1;8;16;1;32;1190491040
128;128;16;2;2;16;4;1;32;4614528
128;128;16;2;1;1;4;1;32;615417632
128;128;16;64;1;1;4;1;32;19061200384
128;128;16;64;1;1;4;1;32;19074688224
128;128;16;2;1;16;4;1;2;29487040
128;128;16;2;16;2;4;64;32;613921184
128;128;1;2;1;1;4;1;32;38813856
128;128;16;2;2;16;32;1;32;5607520
1;128;16;1;1;16;4;1;32;10364352
128;128;16;2;1;16;4;32;1;18446744073709551615
128;128;16;2;1;16;1;1;32;7374144
256;128;16;1;1;16;4;1;256;6367008
128;128;16;2;1;16;64;1;32;4689696
128;128;16;2;1;16;4;1;64;4068096
128;4;128;2;1;2;4;1;16;1379470080
128;128;16;1;1;16;4;1;16;6192704
128;128;16;2;1;16;128;1;64;6537728
128;128;128;2;1;2;4;1;4;1460879872
128;128;16;2;1;16;4;1;8;7822624
128;128;2;2;1;2;4;128;32;41589664
128;128;32;2;1;8;4;1;32;25450176
128;128;16;2;64;2;4;256;32;1421462368
128;128;16;2;8;16;4;1;32;15765024
128;256;16;2;16;2;4;1;64;255193472
128;4;16;2;1;4;4;1;32;47087872
128;128;2;2;64;2;4;1;32;196572096
128;64;16;2;1;4;256;4;32;3154261664
128;128;16;2;1;16;4;1;128;4276480
128;128;16;2;1;16;4;4;256;5325344
128;128;16;2;1;16;4;1;1;44849472
128;128;16;2;1;2;4;1;32;165735072
128;128;16;2;1;8;4;1;32;12725504
128;128;64;2;2;4;4;1;32;181420768
128;128;16;2;1;16;4;32;32;5427680
8;64;32;4;4;8;32;4;64;69034336
8;32;4;8;4;4;8;8;8;77918240
16;16;8;2;4;2;8;16;16;80227136
4;16;64;2;4;8;64;32;32;83643648
128;128;4;2;1;1;4;1;32;153912896
128;64;16;2;1;8;4;1;32;13114528
128;128;16;1;1;16;4;1;1;65916960
128;128;16;1;16;16;4;1;32;17669440
128;128;8;2;1;2;16;1;32;87110464
128;64;16;2;1;8;4;1;32;13097152
128;32;32;1;1;8;4;1;16;45168352
1;2;2;1;2;1;2;128;4;9929681728
8;1;1;2;1;1;1;64;2;4287693568
32;16;16;2;16;2;4;64;256;240771424
256;1;256;256;1;1;16;1;16;18446744073709551615
256;256;16;1;1;16;4;1;32;7116416
64;128;16;4;4;8;4;1;32;30263936
128;256;32;2;1;8;4;256;64;6868543456
32;128;16;8;1;16;2;1;32;36001312
128;128;16;2;1;4;128;1;32;54034688
128;128;16;2;1;4;4;1;32;44715680
128;1;16;2;1;4;4;1;8;73729824
64;128;16;64;2;1;8;4;32;10428757984
128;128;16;2;1;16;8;1;64;4168128
256;128;16;1;2;16;4;1;32;6176352
128;128;16;2;1;16;8;256;32;499292864
128;128;16;2;8;16;4;1;128;17278848
2;128;16;2;1;16;128;1;32;7271168
16;128;16;16;1;16;4;16;32;98685920
1;2;16;1;2;1;64;32;4;9926476288
256;64;8;32;2;1;128;64;1;716363520
64;1;256;16;1;1;256;32;32;40385799584
256;1;256;1;1;32;1;128;128;18446744073709551615
128;128;16;2;1;8;16;1;32;13682080
128;64;64;2;1;4;4;1;32;181090496
32;64;16;4;1;16;4;1;32;4756352
128;128;16;2;1;16;8;1;32;3729888
128;128;32;2;1;4;32;1;32;97592128
128;64;8;2;1;2;8;1;32;86096672
256;256;16;1;4;16;8;1;32;6710944
128;128;64;2;1;4;8;1;32;182040608
64;128;16;4;1;16;8;1;32;4677664
128;256;16;2;1;16;8;256;32;1014647872
128;64;32;2;1;8;8;1;32;26280224
128;64;16;2;1;16;8;1;64;4211360
256;128;16;1;1;16;8;1;32;6134656
1;128;16;1;1;16;8;1;32;10085120
128;64;16;2;1;16;8;1;128;4497504
128;128;16;2;1;8;8;1;32;12890240
256;128;16;256;1;1;8;1;32;25088081504
256;1;32;1;1;8;16;256;64;141653312
128;128;16;1;1;16;8;1;32;5671648
128;128;16;2;2;16;8;1;32;4963008
128;128;16;128;1;2;8;1;16;8795788928
1;128;8;1;1;2;8;1;32;189594688
128;256;4;2;1;1;8;1;32;18446744073709551615
64;128;64;4;1;2;8;1;32;543811072
128;256;16;2;1;16;8;1;32;4488704
128;128;16;2;1;16;8;1;128;4371072
128;256;16;2;1;8;8;1;64;14036128
128;1;16;2;1;16;8;1;32;19659360
128;64;16;2;1;16;8;1;32;3759488
128;256;16;1;1;16;8;1;32;6892096
128;128;32;2;1;8;8;1;32;25745536
128;128;8;2;1;2;8;1;16;86396096
128;128;16;2;1;16;16;1;32;3945888
128;128;16;2;1;4;8;1;32;45678144
128;128;16;2;1;16;2;1;32;4367200
128;256;16;2;1;16;8;1;16;3744608
1;128;16;1;1;8;8;1;64;34258048
128;1;32;2;1;4;4;1;32;106385152
128;128;16;2;2;16;8;256;32;342064032
128;64;16;2;1;16;4;1;64;4061952
128;32;16;2;1;16;16;1;32;4562272
256;128;8;1;1;2;8;1;32;131352096
64;128;16;4;2;16;8;1;16;8514560
128;64;32;2;1;8;8;1;16;28569824
128;256;8;2;2;2;8;1;32;84843744
128;128;4;2;1;1;8;1;32;157866560
128;128;16;1;1;16;4;1;16;6274560
128;128;16;2;1;16;8;1;16;4297536
256;128;16;1;4;16;4;1;32;6643104
128;128;16;2;2;8;8;1;32;13022080
128;128;8;2;1;2;8;1;32;84961632
1;64;16;1;1;16;8;1;32;19647776
128;128;16;1;2;16;8;1;32;5858144
64;1;16;2;1;16;8;128;32;25674528
128;128;16;2;1;16;8;1;4;17047264
256;128;16;1;1;16;8;1;128;6507712
256;128;16;1;1;16;8;256;32;818011616
32;64;16;8;2;16;8;1;32;19368448
128;64;32;1;2;8;8;1;32;42377952
1;256;16;1;1;16;8;1;32;9604992
128;64;16;2;1;16;2;1;32;4372288
128;128;8;2;1;2;4;1;32;82796544
128;128;32;1;1;8;8;1;64;44573440
64;64;32;4;1;8;8;1;32;19642912
128;128;16;1;1;8;4;1;32;20132608
128;256;16;2;1;16;4;1;32;4423680
1;128;64;1;1;4;8;1;16;347665952
64;128;8;4;1;2;8;1;32;68480256
128;128;4;2;1;4;32;1;32;13218848
128;128;32;2;1;8;16;1;32;27217728
256;128;16;1;1;16;8;1;64;6430848
256;128;16;1;2;16;16;1;32;6556416
128;256;16;2;2;8;8;1;64;14190976
64;16;16;4;1;16;32;1;32;5510944
64;1;16;4;1;16;8;1;32;27201920
1;128;16;1;1;16;16;1;16;9834400
64;64;16;4;1;16;8;1;32;4736160
128;128;16;2;2;16;8;1;16;5627712
256;256;16;1;1;16;32;1;16;8766400
128;1;16;2;1;16;8;1;16;22672736
64;128;16;2;1;8;8;1;16;13192736
32;128;32;8;2;16;8;1;32;30213696
256;128;16;1;2;16;8;1;16;7425664
128;256;16;2;1;16;16;1;32;4587136
256;128;4;1;1;1;2;1;64;286997472
32;128;32;4;1;8;8;1;32;19404192
128;256;16;2;2;8;16;256;32;1414543008
128;256;8;2;1;2;16;1;128;91123744
64;256;16;2;1;16;8;256;32;1009128160
256;64;16;1;1;16;8;1;32;6330144
1;64;16;1;4;16;4;1;128;70308864
128;256;16;2;1;16;8;1;64;4237760
1;128;16;1;1;16;8;256;64;1164579744
4;8;16;1;4;4;32;16;8;181791840
128;256;8;2;1;1;8;128;32;492806816
4;8;16;4;2;16;32;32;4;261588448
64;128;32;2;1;8;16;1;32;26781056
256;64;16;1;1;16;8;256;32;404858336
128;256;32;1;1;8;8;1;32;45893408
128;128;8;2;2;2;8;1;32;86143424
8;16;16;8;4;1;32;16;8;805597632
128;64;16;2;4;16;8;1;32;9243392
128;16;32;64;1;1;8;256;16;18446744073709551615
16;64;16;1;8;8;32;8;16;18776288
8;64;32;4;4;8;16;8;32;62969952
8;64;8;1;4;1;8;8;16;272977632
16;32;16;2;4;16;8;16;16;8983392
128;128;8;1;1;2;8;1;32;130569248
128;128;8;2;4;2;16;1;32;90190304
128;128;16;2;1;4;8;128;32;87425664
128;128;16;2;1;16;16;1;8;9443968
128;32;16;1;1;16;8;1;16;6905440
16;4;16;2;4;1;64;1;4;1966448608
8;8;1;2;1;1;256;256;128;8668656320
128;16;4;4;4;1;256;64;8;5181651264
1;1;1;1;1;1;16;32;1;16224899328
8;256;256;1;1;32;128;1;4;266818016
128;8;1;16;8;1;1;1;128;1859320448
64;4;256;2;2;8;16;32;128;200962144
2;256;1;1;256;1;2;1;1;8811731808
128;64;16;2;1;16;8;1;16;4610080
128;128;16;1;1;16;8;1;64;6379488
64;256;16;4;1;16;8;1;32;4465056
8;32;32;4;4;8;32;16;32;65084224
8;32;16;4;4;8;16;16;16;38513728
16;32;16;2;8;16;16;8;16;20028512
16;64;16;2;16;1;16;8;8;1594519040
128;32;16;2;1;16;8;1;64;4343520
256;64;16;1;2;16;8;1;32;6446368
128;128;16;1;1;16;4;1;32;5732000
128;4;128;2;2;4;8;1;32;384441472
1;128;32;1;1;8;8;64;32;549873088
128;8;1;2;1;1;8;1;32;62244160
128;4;16;2;1;16;8;1;32;5785344
16;64;16;1;8;16;16;8;32;8033504
8;32;16;1;8;1;2;128;4;733187680
8;16;128;1;16;16;32;64;1;4314022272
64;4;8;2;1;8;256;8;1;2587184640
16;64;16;2;2;16;16;8;64;6401184
128;256;32;2;1;8;8;256;32;7029440448
128;128;16;8;1;16;8;1;32;8575904
128;64;16;2;4;16;8;1;32;9255552
128;128;1;2;1;1;128;1;32;71487808
128;128;16;2;1;16;2;1;8;7609376
16;64;16;2;1;16;16;8;256;8899264
128;64;16;2;1;8;8;256;32;872061792
128;64;16;1;1;16;8;1;32;5843168
64;64;64;4;4;16;64;8;128;95820576
128;64;8;2;1;1;8;1;32;316950784
1;1;64;1;1;1;1;32;256;14485062336
32;64;32;4;4;16;32;8;64;36346016
256;32;2;256;1;1;8;2;128;2728524320
2;8;4;1;2;1;2;64;1;1326305152
32;64;16;32;2;2;8;1;64;4189021568
4;1;1;2;1;1;2;2;1;5013175872
256;128;1;256;1;1;4;1;16;3123572192
1;32;128;1;32;1;128;16;4;10938501376
1;128;16;1;1;16;8;1;32;9993792
128;1;16;2;1;16;8;1;16;22688736
64;256;4;64;4;1;4;2;32;9859452544
256;128;16;1;1;8;4;1;16;22968032
16;64;32;2;4;16;32;16;32;19412576
128;128;16;2;128;1;8;1;32;4046039328
64;64;4;64;4;1;16;8;32;1240282784
128;2;4;16;1;1;256;1;1;1671665888
128;4;8;2;4;4;16;16;4;67122752
256;32;2;4;4;2;128;16;2;111260448
16;64;32;2;4;16;16;8;32;17805728
64;8;32;32;1;1;2;32;8;31243138304
16;1;64;4;1;8;1;8;32;602193312
1;1;2;1;1;2;1;128;4;9865719872
64;256;16;64;4;1;16;2;128;10557790528
128;256;32;2;2;8;8;1;32;25765600
16;64;16;2;4;16;16;16;32;8123136
128;128;16;2;1;8;8;1;32;12884320
128;128;16;2;2;16;8;1;32;5037120
4;64;4;4;4;2;4;8;8;96186432
8;1;1;2;1;1;4;64;2;2474737280
32;16;256;2;16;2;4;64;16;9917242976
1;1;256;1;1;4;64;16;16;4399636224
32;64;32;2;4;16;32;8;64;20133216
16;2;128;1;2;1;256;64;1;87386204320
64;1;256;16;1;1;256;32;32;40616164064
256;1;256;1;1;32;1;128;128;18446744073709551615
4;64;4;2;4;2;4;8;8;65154144
256;256;16;1;1;8;8;1;32;23537312
128;8;16;2;1;1;8;1;32;646454240
16;128;16;16;1;16;8;1;32;42358368
16;256;1;2;1;1;16;16;4;85169696
1;8;8;1;2;8;64;256;1;8594850688
128;16;4;4;4;1;256;64;1;5883513632
1;64;4;1;4;2;16;128;4;1797499264
1;256;256;1;1;32;16;1;4;235214944
128;128;16;2;4;16;8;1;32;8555744
128;128;16;2;1;16;16;1;128;4540672
128;128;16;2;1;16;32;1;32;4100096
128;128;16;1;1;16;8;256;32;817445664
128;128;16;2;1;16;16;256;64;493547776
128;128;16;2;1;16;8;256;128;537498048
256;128;16;1;2;16;8;1;32;6333952
128;128;16;2;1;8;32;1;32;14286464
256;128;4;1;1;1;8;1;32;248469600
128;128;16;2;1;4;8;1;16;47014144
128;128;8;2;1;1;8;1;16;317933056
64;128;16;4;1;8;8;1;32;9810656
128;64;16;2;1;4;16;1;32;48516928
128;128;16;1;1;16;32;1;32;6223264
128;1;16;1;1;16;4;1;16;17300480
128;128;8;2;1;2;8;128;32;162437696
128;128;32;1;1;8;8;1;32;40323392
1;128;16;1;1;16;32;128;32;612522144
256;1;1;16;1;1;4;32;128;599673696
64;1;256;64;1;1;16;32;128;59815777696
2;256;32;1;1;2;2;8;64;720206432
8;32;16;1;8;2;2;128;4;197060096
128;32;16;2;2;16;8;1;32;5383776
128;128;16;2;1;16;8;16;32;5426528
128;8;16;2;1;16;256;1;4;916328576
1;128;16;1;1;16;2;4;32;20530400
128;2;16;1;1;16;8;1;32;21263648
256;16;128;1;16;2;32;256;1;4323539744
64;4;8;4;1;1;256;8;64;5043885472
1;1;1;1;1;1;1;2;256;14545840096
1;64;32;1;4;1;8;2;16;2414699872
128;1;16;2;1;16;8;1;32;19657248
128;8;16;2;1;16;8;256;32;42099456
128;128;16;2;1;16;8;1;32;3726048
128;1;16;2;1;16;8;1;16;22678048
128;128;16;2;32;2;256;1;32;35757400640
128;128;16;2;128;1;8;1;32;4036270528
128;128;16;2;1;16;8;1;8;8485952
128;128;16;2;1;16;8;32;32;6881152
128;128;16;2;1;1;8;1;32;628890464
128;128;16;2;2;2;8;1;32;171338144
128;128;16;2;1;16;2;1;32;4365792
128;128;16;2;1;16;64;1;1;67649568
128;128;16;16;1;16;8;1;32;32763520
128;128;1;2;1;1;4;1;32;38797152
128;128;16;2;1;16;8;1;1;47041312
128;128;16;2;1;16;8;128;32;13411136
128;16;16;2;1;16;256;1;32;238659040
256;2;16;1;1;16;8;128;32;19710656
128;128;16;2;1;16;8;64;32;7020576
128;2;16;2;1;16;8;1;32;10767520
128;128;1;2;1;1;8;1;32;40019872
128;128;16;2;1;16;32;1;32;4055840
128;8;16;2;1;16;32;1;32;10760160
128;128;16;2;1;16;1;1;32;7443680
256;128;16;256;1;1;8;2;32;24331980640
128;128;16;2;1;16;1;1;128;6307680
128;128;64;2;1;16;8;16;32;19163008
128;128;16;2;1;16;8;16;32;5428992
128;128;1;2;1;1;8;1;32;40051712
128;128;16;2;8;16;8;1;32;15951104
32;128;16;2;1;16;8;1;32;4175616
128;128;16;2;2;16;8;8;32;4760032
128;128;1;2;1;1;8;1;32;39960864
128;128;16;32;1;8;4;1;32;983909664
128;1;16;2;1;16;8;4;32;23873664
1;128;16;1;1;16;8;1;2;73623200
128;128;64;8;1;16;8;1;32;38344576
128;128;256;2;1;16;8;64;32;76795168
128;128;16;64;1;2;128;1;32;625065376
128;128;16;4;1;16;8;1;32;4899232
128;128;16;2;1;8;1;1;32;25260672
1;2;256;1;1;16;8;4;32;653618848
128;128;16;2;1;16;1;256;32;825477952
128;128;16;2;1;16;16;1;32;3926400
1;128;16;1;1;4;8;1;32;100457376
128;128;16;2;8;16;8;1;8;31502528
8;128;16;2;1;16;8;1;32;4965824
128;128;16;2;1;16;4;1;32;3773696
128;128;16;64;1;2;8;1;32;5062611232
1;128;16;1;1;1;8;1;32;1283488256
128;128;128;2;1;16;8;1;128;34955392
128;128;16;2;1;4;8;1;32;45682944
128;128;16;2;1;16;64;1;128;5266592
16;128;16;16;1;16;8;1;32;39240448
128;128;16;2;1;16;8;1;4;17130176
128;128;16;2;1;16;8;1;64;4174848
128;128;16;2;1;2;8;1;32;169414848
128;128;16;2;1;16;8;256;32;499294656
128;128;16;2;1;4;256;1;32;3104133568
128;128;16;2;2;16;8;1;32;5075776
128;64;16;2;1;16;8;1;32;3756544
128;128;1;32;1;1;8;1;32;223586368
128;32;16;2;1;16;32;1;32;5699360
128;128;64;4;1;16;8;1;32;19408896
128;128;16;2;8;16;1;1;256;19375776
128;128;16;64;2;1;8;1;1;20666622432
128;128;32;2;1;16;8;1;1;93125856
128;128;16;8;1;16;256;1;64;160986720
128;128;16;2;32;2;8;64;32;726700864
128;128;16;2;1;16;8;1;16;4304992
2;128;16;2;1;16;8;1;32;6640960
128;128;16;2;1;16;8;1;32;3730496
1;128;16;1;1;16;8;128;32;601822016
128;128;16;2;1;2;8;1;32;169688768
128;1;16;2;1;16;8;1;32;19672768
128;128;16;2;1;16;8;8;8;18446744073709551615
64;32;16;4;1;16;8;1;32;5223104
128;128;16;1;1;16;2;16;32;6530560
128;128;2;2;1;1;8;1;1;93236480
2;128;16;2;1;16;1;1;32;11273888
128;128;4;2;1;2;8;1;32;42569184
128;2;16;2;1;16;8;32;8;27798880
128;128;16;2;1;16;8;8;32;4686688
1;128;16;1;1;16;8;1;32;10041536
128;128;16;2;64;1;8;1;32;2085810016
128;128;16;2;1;16;8;1;4;17111936
128;128;16;2;1;16;256;64;32;370887712
128;128;16;2;1;1;8;1;2;708135040
128;8;16;2;1;8;8;1;32;16124192
128;16;16;2;1;16;8;1;64;4913184
128;128;32;1;1;16;8;1;32;11319552
128;128;1;2;1;1;8;1;32;39952448
128;2;8;64;1;2;8;1;32;1492036736
128;128;16;2;1;16;8;1;128;4388992
8;128;16;2;1;16;8;2;32;4836480
128;32;16;2;1;16;8;1;32;3970336
128;128;16;128;1;1;8;1;32;18880630912
128;128;16;2;64;1;8;1;32;2079426656
128;128;256;2;1;2;8;1;32;2711144864
128;128;16;2;32;2;8;1;1;1405717760
128;128;8;2;1;1;8;2;32;403457376
128;128;1;2;1;1;8;1;2;44896032
128;16;16;2;1;16;8;1;32;4484672
128;128;16;128;1;1;1;1;32;2195626368
64;128;16;4;1;16;8;1;32;4661056
128;128;16;4;1;1;8;1;32;484827936
16;128;16;16;1;16;8;128;32;222007776
8;128;1;2;1;1;8;1;32;56357856
1;128;16;1;1;16;8;1;32;10075552
2;16;16;2;4;16;8;128;32;132834688
128;64;16;2;1;2;8;1;32;171627808
128;128;128;2;1;16;8;1;32;29411264
2;8;8;1;2;1;1;64;1;1115092352
16;1;1;1;1;1;128;4;16;8620251936
256;1;1;2;1;1;2;1;1;73095008
4;128;1;4;8;1;8;4;1;308772352
128;128;16;128;1;1;8;1;32;18909949856
1;128;16;1;1;16;1;1;32;11157824
128;64;16;2;1;16;8;1;32;3747456
1;128;128;1;32;1;128;16;4;15679024608
16;2;2;16;1;2;256;128;1;18446744073709551615
1;4;1;1;4;1;1;1;4;16950233024
256;32;4;4;4;2;128;16;1;288144288
64;256;32;4;2;8;2;32;8;82645664
128;64;64;4;1;8;1;8;32;88312672
2;1;2;2;1;1;1;128;4;15964783520
8;1;4;2;1;4;1;64;2;2006733056
128;128;16;2;1;16;64;1;32;4663008
128;128;16;2;1;16;128;1;32;5684480
8;128;16;2;1;16;256;1;32;17658688
32;16;16;2;1;1;4;64;256;762135456
1;1;256;1;1;4;64;16;128;4076777952
32;64;8;32;1;2;128;64;1;18446744073709551615
64;1;256;1;1;32;256;32;32;1769234848
1;1;256;1;1;32;1;128;128;642025472
16;256;1;2;32;1;16;16;4;77255872
8;1;8;2;1;2;64;256;128;1046665344
128;32;1;4;16;1;256;16;1;1308890080
128;128;16;4;32;1;8;1;32;1863290592
128;128;256;2;1;16;8;1;32;58909664
128;128;16;32;1;1;128;1;32;1088165504
4;1;16;1;1;16;8;1;32;318253856
1;64;4;1;4;2;256;128;4;1391761728
1;256;256;1;1;32;1;1;32;24027136
128;128;1;16;1;1;4;32;128;207426944
64;4;4;1;2;1;16;32;4;344151744
4;128;16;1;1;1;8;1;32;1291284000
128;128;16;2;16;1;8;1;32;645639392
128;8;16;2;1;16;8;1;32;5828576
128;32;16;16;16;1;8;1;32;9058684192
128;128;16;1;1;2;8;1;32;261135104
128;128;16;2;1;16;128;1;64;6581920
64;256;32;16;16;1;64;1;4;9852628608
8;64;1;1;8;1;1;128;8;208558656
8;128;128;1;2;2;32;64;1;5181793376
64;4;16;2;1;4;128;8;1;1445404960
256;128;32;1;1;16;8;1;32;12098848
128;64;16;2;1;16;4;1;32;3774272
128;128;8;2;1;4;8;1;32;22889728
128;128;8;1;1;2;8;1;32;130516576
8;128;16;1;1;16;8;2;32;6669824
128;128;16;1;1;16;8;1;32;5690976
128;128;1;2;1;1;8;1;1;46992320
128;256;16;2;1;16;8;1;32;4495488
128;128;8;2;1;1;8;1;8;323212256
128;128;16;2;2;16;16;1;32;5194400
1;1;64;1;1;1;1;32;256;14418077184
4;64;2;4;16;1;1;2;128;3409081408
2;8;16;1;2;8;1;64;1;1063847616
32;64;16;32;2;2;128;16;64;634344032
256;128;16;1;1;1;8;1;16;1004936416
1;128;32;1;2;4;8;1;32;199187808
128;64;16;2;1;16;8;1;16;4607872
128;128;32;2;1;16;8;1;32;7481888
128;256;16;2;1;1;8;1;32;18446744073709551615
256;128;16;1;2;16;16;1;32;6574656
128;128;64;2;1;32;8;1;32;5773376
256;256;16;1;1;16;16;1;32;7394688
128;256;16;2;2;16;8;1;32;4746592
128;128;16;2;1;16;8;256;8;1187989600
128;128;16;2;1;16;8;2;1;63252448
128;16;16;2;1;16;64;1;32;10759552
128;64;16;2;1;16;8;256;64;248559776
256;128;16;1;1;8;8;1;32;20639680
128;128;16;2;2;16;8;256;32;340299648
1;1;1;1;1;1;2;1;128;14290063264
128;128;1;1;8;1;4;1;16;64104256
1;32;128;1;8;1;128;16;2;4425639584
128;2;4;16;1;1;1;1;1;933496096
128;128;32;1;1;1;4;1;32;1974165632
256;128;16;1;1;16;8;1;32;6074016
128;128;16;2;1;16;4;128;32;6966528
128;128;16;2;1;16;8;256;64;500983872
128;128;32;2;1;8;16;128;32;51284800
128;128;16;2;1;16;16;1;64;4379712
256;128;16;1;1;16;16;128;32;38599200
128;128;16;4;64;1;8;1;1;3750588288
64;256;16;4;1;16;8;1;64;5288960
256;128;16;1;2;4;8;1;32;72182144
128;4;1;2;4;1;16;16;4;223734656
2;32;2;1;4;2;128;16;2;186662368
64;256;2;4;16;2;2;256;8;2038950336
128;64;8;4;1;2;1;1;32;167065184
128;128;16;2;1;1;8;1;16;634916512
256;256;8;256;1;1;8;1;16;11962560256
64;64;16;4;1;16;2;1;32;8608640
128;128;16;2;4;8;8;1;32;17328384
128;128;16;2;1;16;8;1;32;3736832
128;128;16;8;1;16;8;1;32;8647712
128;256;16;2;1;16;4;1;32;4426240
32;128;16;8;1;16;8;1;32;9392096
256;128;16;1;2;16;8;1;64;6606080
64;128;64;2;1;16;8;1;32;14490848
32;128;16;8;2;16;8;128;8;56727840
128;128;8;2;1;1;8;1;32;314817952
128;128;16;2;1;16;8;4;64;4332256
128;128;16;2;2;8;8;1;32;13147680
1;128;16;1;1;2;8;1;32;322406144
128;256;16;2;1;16;8;256;32;1014626848
1;1;2;1;1;2;1;128;16;9550596448
8;1;4;1;1;2;1;64;2;995061920
32;16;16;2;16;4;4;64;32;176477248
1;1;256;1;1;4;64;16;128;4103798880
128;32;16;2;2;1;8;1;32;639083200
128;256;8;2;1;1;8;128;16;499417600
1;64;8;1;4;2;128;64;1;1342872224
64;1;1;1;1;1;256;32;32;16029365120
1;1;256;1;1;32;1;1;128;656948320
16;256;1;2;4;1;16;16;4;39589888
8;8;8;2;2;8;1;256;128;323300160
128;32;8;32;1;1;256;16;1;18446744073709551615
1;64;4;1;2;2;256;32;4;628644128
128;256;8;2;1;2;1;1;32;140991872
128;8;1;16;2;1;4;1;128;311894656
64;4;256;2;2;8;1;32;128;226253920
2;128;32;2;2;2;1;1;16;717876896
2;128;16;2;2;16;8;8;4;52863008
4;128;16;1;1;16;8;1;32;7396000
128;256;16;2;1;16;8;256;64;1000776992
128;128;16;2;1;1;4;1;16;619775776
128;128;8;2;1;1;8;1;128;378794944
4;2;16;4;2;4;2;128;4;1609605216
8;16;128;1;1;2;1;8;32;2596961184
64;2;16;2;2;1;128;8;1;3628559904
1;1;64;1;1;1;1;32;256;14476694816
1;64;2;1;16;1;8;8;8;1290550400
2;8;256;1;2;1;2;64;1;19367120544
32;2;16;32;2;2;2;256;64;7999303552
256;1;16;2;1;16;2;1;64;6435488
128;1;1;1;1;1;4;1;16;201723072
64;32;128;1;8;8;128;1;64;319935392
128;2;4;16;1;1;1;1;1;953356160
128;128;8;2;1;4;4;16;64;25417600
256;1;2;4;1;2;128;16;2;1400601152
64;32;32;4;4;2;1;8;8;265726592
128;1;64;2;1;8;1;8;32;112961120
1;1;128;1;1;2;1;128;16;9222422336
128;128;32;2;1;8;16;1;64;29052864
128;128;16;2;1;8;8;64;32;25238080
128;256;16;2;1;4;8;1;32;51560224
4;1;4;1;1;1;1;64;2;4250178976
64;16;16;1;4;2;1;256;32;552713920
1;1;256;1;1;4;64;16;128;4114710080
256;64;8;32;4;1;128;16;1;745438112
64;2;256;1;1;1;256;16;32;18446744073709551615
1;1;256;1;1;1;1;128;1;25929791168
16;256;1;2;4;1;128;16;4;128717216
8;8;8;2;2;8;4;256;32;191909344
64;32;1;4;16;1;256;1;1;2646943232
1;64;64;1;2;8;256;32;32;156122624
1;256;256;1;1;32;1;16;32;49724512
128;8;1;16;1;1;4;4;128;206104800
64;8;256;2;2;8;1;32;128;227234656
2;2;32;1;2;2;2;1;64;3881793888
1;32;1;1;8;1;2;128;4;1730946112
64;16;128;1;1;2;1;8;32;2559298624
64;4;16;8;4;8;128;8;1;1640921632
1;1;64;1;1;1;1;32;256;14455403424
128;64;2;1;16;1;32;32;16;145027136
2;8;4;1;2;4;1;16;8;328500256
256;128;16;8;1;8;8;1;32;19175296
128;128;64;1;4;16;8;1;32;26155680
128;128;16;2;1;2;8;1;32;169356896
64;2;16;64;1;2;8;1;32;2925285984
128;128;16;2;128;1;8;128;32;18446744073709551615
128;128;16;8;1;1;4;1;32;1101067680
128;128;256;32;1;1;2;1;32;18446744073709551615
128;128;1;2;1;1;8;1;32;40057824
128;128;16;2;1;16;8;1;4;17123968
128;128;16;2;1;16;8;16;64;5106432
128;128;16;2;1;16;32;128;1;18446744073709551615
128;128;16;64;4;1;1;1;32;4710756704
128;4;16;2;1;16;8;1;32;5788032
128;128;16;2;8;16;8;1;128;17685024
4;128;8;1;16;1;8;1;32;1027982528
128;128;16;2;1;8;8;16;32;16949248
128;128;2;2;8;1;32;1;32;133515616
4;128;2;1;1;1;8;1;32;164218336
128;128;16;2;1;1;8;1;32;629286240
128;256;16;2;1;16;32;1;32;4821824
128;128;1;2;128;1;8;1;256;330076032
4;128;16;4;1;16;8;1;32;4546400
128;1;16;2;1;16;8;1;32;19652928
128;128;16;2;1;16;256;32;32;284195392
128;128;16;1;1;16;8;1;32;5672448
128;128;16;2;1;16;8;1;1;47101184
128;128;16;2;1;16;16;16;32;6800800
128;128;16;2;1;2;8;1;256;194068128
128;128;16;2;64;1;4;1;64;2059998240
128;128;16;2;8;16;8;1;2;125722144
128;64;16;64;2;1;8;1;32;20692122880
128;128;256;64;1;2;8;64;32;84436330560
128;1;16;2;1;16;256;1;32;728599552
128;128;32;2;1;16;16;1;32;7822048
64;128;16;4;1;16;8;256;32;620735360
128;64;8;2;1;8;8;1;32;6602944
128;128;16;1;1;1;8;1;64;1153724032
128;128;16;1;2;16;8;256;32;303594656
64;128;16;4;1;4;8;1;16;36237600
128;128;16;2;1;16;8;2;32;4323616
128;128;16;16;2;1;8;1;32;1234079104
128;128;16;64;1;1;8;1;32;9560555072
128;128;32;2;1;16;8;1;128;8698688
128;32;16;2;1;16;8;1;32;3958112
128;128;16;2;1;16;4;1;16;4086624
128;128;16;2;1;16;16;1;128;4540928
128;128;16;1;1;8;8;1;64;22257312
128;64;16;1;1;16;16;256;64;408263424
256;64;16;1;32;2;128;16;1;18446744073709551615
256;1;1;32;1;1;2;1;64;4053830016
128;128;1;1;8;1;4;16;16;32881376
64;32;128;1;8;2;128;1;64;2940433248
128;1;16;2;1;16;8;256;32;20979520
128;64;16;2;1;1;8;1;32;632935456
32;128;16;8;4;1;8;1;32;557924672
128;128;64;2;1;16;8;128;32;27659328
128;128;16;2;1;16;1;1;4;22629248
128;128;8;2;1;1;8;1;16;317884064
128;128;16;2;1;16;16;1;8;9421568
128;256;16;2;1;1;8;1;16;18446744073709551615
128;256;8;2;1;1;8;1;32;18446744073709551615
16;2;4;16;2;1;1;1;1;14576000064
64;32;16;4;1;16;4;1;32;4985984
128;128;8;2;1;1;64;1;32;340686816
128;128;8;2;1;4;4;16;1;18446744073709551615
1;32;128;1;4;1;128;16;1;5918440192
64;32;2;4;2;2;2;32;8;39687136
128;1;64;4;1;8;1;8;32;149821696
128;128;16;8;1;16;8;1;32;8685024
128;8;1;2;1;1;8;1;32;60616768
128;128;16;64;4;1;8;1;32;38765206304
