epoch;GLOBAL_SIZE_0;GLOBAL_SIZE_1;GLOBAL_SIZE_2;LOCAL_SIZE_0;LOCAL_SIZE_1;LOCAL_SIZE_2;cost
1505186529;1;64;32;1;8;8;13548000
1505186529;256;32;1;2;1;1;26095852
1505186529;1;1;64;1;1;4;106460592
1505186529;1;32;256;1;8;4;32535852
1505186529;1;128;32;1;8;8;25123259
1505186529;2;64;32;2;8;8;6176148
1505186529;1;64;32;1;8;16;19140593
1505186530;1;64;32;1;8;8;12882222
1505186530;256;16;1;64;1;1;3648148
1505186530;32;64;16;32;1;4;1849778
1505186530;64;2;2;1;1;1;42896000
1505186530;1;256;256;1;4;2;17423407
1505186530;2;8;2;2;1;1;207847111
1505186531;2;16;1;2;2;1;211306223
1505186531;1;8;256;1;2;1;17957629
1505186531;16;256;1;4;128;1;18446744073709551615
1505186531;16;64;16;4;1;2;9102518
1505186531;32;128;16;4;1;4;9758518
1505186531;32;128;32;32;64;4;18446744073709551615
1505186531;32;16;16;32;16;4;18446744073709551615
1505186531;8;256;32;2;64;8;18446744073709551615
1505186531;8;4;1;2;1;1;246217778
1505186531;128;256;16;2;256;8;18446744073709551615
1505186532;16;1;32;2;1;1;18105482
1505186532;2;128;4;2;8;4;12271703
1505186532;128;2;64;128;2;2;18446744073709551615
1505186532;256;1;128;1;1;64;61510963
1505186532;64;256;32;2;128;2;18446744073709551615
1505186532;32;64;32;32;4;2;1777925
1505186532;32;32;16;32;2;4;1175555
1505186532;32;64;16;16;1;1;3232889
1505186532;32;64;8;32;1;4;1402815
1505186532;16;32;16;1;2;4;23750222
1505186533;128;64;16;64;1;4;1973037
1505186533;32;64;16;32;1;2;1858222
1505186533;32;32;16;32;1;4;1406815
1505186533;32;32;32;1;2;4;23721629
1505186533;32;32;16;1;4;4;22249037
1505186533;32;32;2;32;2;2;5542371
1505186533;32;32;4;32;2;4;2722370
1505186533;32;256;16;8;32;4;18446744073709551615
1505186533;64;32;16;32;2;4;1952148
1505186533;32;32;16;2;1;4;14682963
1505186533;32;16;16;32;4;4;18446744073709551615
1505186533;32;32;1;32;2;1;10610222
1505186534;16;32;256;1;2;4;19008297
1505186534;32;32;16;4;2;4;6199259
1505186534;32;32;16;2;2;4;11915407
1505186534;32;32;16;32;2;8;18446744073709551615
1505186534;32;32;16;16;32;8;18446744073709551615
1505186534;32;32;32;32;2;4;1683111
1505186534;32;32;16;16;2;4;2065334
1505186534;8;64;2;1;8;1;17871259
1505186534;16;256;16;1;1;4;38688148
1505186534;16;256;4;16;256;1;18446744073709551615
1505186534;128;128;64;1;1;4;9281777
1505186535;16;32;8;1;2;4;22364444
1505186535;8;32;16;2;2;16;6817333
1505186535;1;32;256;1;2;64;55358519
1505186535;1;256;1;1;8;1;27841481
1505186535;16;2;4;8;1;2;75503259
1505186535;16;1;128;1;1;2;27718222
1505186535;32;32;16;32;4;4;18446744073709551615
1505186535;32;32;16;32;1;2;1316149
1505186535;128;32;16;32;2;4;1965629
1505186535;32;32;64;32;2;2;1965186
1505186536;2;256;1;2;256;1;18446744073709551615
1505186536;64;4;64;1;1;1;26012741
1505186536;32;32;16;32;2;16;18446744073709551615
1505186536;32;32;256;32;2;4;1703555
1505186536;32;64;16;1;1;4;29570074
1505186536;8;8;16;2;8;4;13697926
1505186536;32;64;16;32;64;4;18446744073709551615
1505186543;1;1;1;1;1;1;6655479556
1505186543;256;128;4;128;1;1;2289482
1505186543;1;16;2;1;8;2;250202519
1505186543;256;2;4;1;2;1;23570815
1505186544;2;8;64;2;8;64;18446744073709551615
1505186544;128;4;8;8;2;8;3211112
1505186544;32;32;256;4;2;4;6454815
1505186544;32;32;128;32;1;4;2066519
1505186544;32;32;16;1;2;2;25955111
1505186544;32;64;4;32;1;4;1662074
1505186544;32;32;4;32;2;2;2817334
1505186544;32;32;16;32;2;1;1316000
1505186544;8;1;32;1;1;2;32011260
1505186544;128;1;16;128;1;2;5713926
1505186544;16;4;64;1;2;1;24308444
1505186545;2;8;2;2;2;1;211055704
1505186545;16;4;32;8;1;8;5928593
1505186545;32;32;16;32;2;2;1447556
1505186545;32;32;32;32;16;4;18446744073709551615
1505186545;2;128;8;1;1;2;18073778
1505186545;128;32;16;64;2;4;18446744073709551615
1505186545;32;16;8;32;4;8;18446744073709551615
1505186545;32;32;64;32;1;4;1981629
1505186546;8;32;16;4;4;4;3327556
1505186546;4;8;128;1;1;2;17661185
1505186546;32;256;64;2;64;32;18446744073709551615
1505186546;1;64;32;1;32;4;22509333
1505186549;1;1;2;1;1;2;3293964741
1505186549;16;32;16;2;2;4;12458963
1505186549;16;64;16;2;1;4;15946518
1505186549;64;4;64;4;4;64;18446744073709551615
1505186550;32;1;64;32;1;4;5191556
1505186550;32;32;16;32;8;16;18446744073709551615
1505186550;32;32;16;32;1;4;1459556
1505186550;32;16;16;8;8;4;1550370
1505186550;64;4;16;8;2;1;2804148
1505186550;16;32;8;1;16;2;10969185
1505186550;128;4;32;4;4;2;6006963
1505186550;32;32;16;1;2;4;23580593
1505186550;32;32;64;32;2;4;1748593
1505186550;2;64;32;1;8;8;12634814
1505186550;256;16;1;64;1;1;3597926
1505186551;32;64;16;2;16;8;12261333
1505186551;32;64;2;2;4;1;13512296
1505186551;32;32;4;32;2;1;2954222
1505186551;32;256;16;8;128;4;18446744073709551615
1505186551;32;1;16;32;1;4;20881482
1505186551;32;32;8;8;1;2;3961333
1505186551;32;32;4;32;2;1;2969778
1505186551;128;8;16;32;8;4;18446744073709551615
1505186551;16;16;64;2;16;32;18446744073709551615
1505186551;256;2;32;4;2;2;5317481
1505186552;1;256;1;1;4;1;28213333
1505186552;8;8;2;1;2;1;63166519
1505186555;1;2;1;1;1;1;3333415259
1505186555;32;32;1;32;2;1;10603260
1505186555;32;32;32;32;1;4;1927408
1505186555;64;32;16;32;4;2;1942814
1505186555;32;32;16;32;8;4;18446744073709551615
1505186556;32;32;32;16;1;4;2635852
1505186556;2;16;32;2;2;2;7820000
1505186556;2;8;256;2;2;128;18446744073709551615
1505186556;128;4;1;2;2;1;22606963
1505186556;8;8;32;2;4;8;6971704
1505186556;256;4;4;4;2;2;3368296
1505186556;8;32;16;2;2;4;7526815
1505186556;32;32;16;32;2;8;18446744073709551615
1505186556;32;4;16;32;2;4;5258371
1505186557;1;1;64;1;1;2;104935704
1505186557;32;16;16;16;16;2;18446744073709551615
1505186557;8;4;32;2;1;4;9191408
1505186557;1;8;16;1;1;8;55048888
1505186557;16;1;32;4;1;1;18354222
1505186557;64;8;16;8;1;2;3728445
1505186557;64;8;16;8;1;4;1833333
1505186557;128;8;8;8;1;8;2530074
1505186557;128;8;32;8;1;2;4023112
1505186557;256;32;16;32;2;4;2008592
1505186557;32;32;16;32;32;4;18446744073709551615
1505186558;32;16;16;32;4;16;18446744073709551615
1505186558;32;1;16;32;1;8;20709629
1505186558;32;32;32;16;2;4;2522370
1505186558;64;8;32;8;1;2;4388889
1505186558;32;32;16;16;16;2;18446744073709551615
1505186558;8;64;2;2;2;1;9536444
1505186558;1;32;1;1;1;1;210414963
1505186559;32;32;32;1;1;4;27787408
1505186559;256;1;16;2;1;16;6319704
1505186559;32;32;16;8;2;4;3603852
1505186559;32;32;16;32;1;4;1478222
1505186559;16;256;4;16;256;1;18446744073709551615
1505186559;1;128;64;1;1;4;13818519
1505186560;64;16;256;1;4;128;18446744073709551615
1505186566;1;1;1;1;1;1;6655453926
1505186566;128;4;16;4;2;8;4487408
1505186566;32;32;16;32;4;4;18446744073709551615
1505186567;16;32;16;1;16;1;26431852
1505186567;32;32;8;32;8;4;18446744073709551615
1505186567;32;32;16;32;2;1;1218370
1505186567;32;32;32;1;2;8;25417481
1505186567;32;64;16;32;1;8;1780148
1505186567;16;32;16;2;2;2;13682074
1505186567;8;32;16;1;8;4;9574074
1505186567;8;32;16;4;4;4;2973333
1505186567;32;32;16;16;1;4;2408445
1505186567;32;64;16;32;32;4;18446744073709551615
1505186568;32;32;16;16;2;8;2098963
1505186568;32;8;16;32;8;4;18446744073709551615
1505186568;32;32;8;1;2;4;22726370
1505186568;32;32;32;8;2;4;3908148
1505186568;32;32;8;32;2;8;18446744073709551615
1505186568;16;32;8;2;2;4;12007260
1505186568;32;32;16;1;2;8;26134370
1505186568;256;8;16;64;8;4;18446744073709551615
1505186568;16;8;32;2;8;4;6347852
1505186568;32;64;32;32;1;4;1967704
1505186568;32;32;64;16;2;4;2566963
1505186569;32;8;16;1;8;4;9311408
1505186569;64;32;16;64;2;2;1597481
1505186569;32;32;16;2;2;4;12332148
1505186569;32;32;8;32;32;4;18446744073709551615
1505186569;32;32;16;32;2;16;18446744073709551615
1505186569;32;16;16;32;2;4;1544741
1505186569;32;32;8;32;2;4;1499407
1505186569;32;64;32;16;1;8;2648445
1505186569;64;16;8;32;2;4;1569630
1505186569;32;32;8;32;1;4;1585186
1505186569;32;64;16;16;1;4;2594963
1505186569;32;32;16;32;4;8;18446744073709551615
1505186570;128;32;16;32;2;2;2152445
1505186570;16;32;16;1;8;4;20361778
1505186570;64;32;32;32;2;4;1971259
1505186570;32;32;32;32;2;2;1859852
1505186570;128;32;16;32;4;2;1979704
1505186570;32;16;8;32;4;4;18446744073709551615
1505186570;32;32;8;32;1;8;1564889
1505186570;32;128;16;32;32;4;18446744073709551615
1505186570;16;32;16;2;4;8;6968889
1505186570;32;64;16;1;2;4;24178963
1505186570;16;128;16;2;128;2;18446744073709551615
1505186571;32;32;16;32;1;8;1315852
1505186571;128;16;16;32;4;4;18446744073709551615
1505186571;32;64;128;32;1;4;2029629
1505186571;32;32;16;16;4;4;1942223
1505186571;32;32;16;32;16;1;18446744073709551615
1505186571;32;32;2;32;32;1;18446744073709551615
1505186571;32;32;16;16;2;16;18446744073709551615
1505186571;64;32;4;32;2;1;1648889
1505186571;32;32;8;32;4;4;18446744073709551615
1505186571;32;64;32;32;32;4;18446744073709551615
1505186571;32;8;16;2;8;4;6365926
1505186572;16;16;16;1;4;4;24414222
1505186572;32;32;8;1;32;4;15988592
1505186572;8;32;16;2;2;8;5988148
1505186572;32;32;32;1;4;2;21386223
1505186572;32;16;16;32;8;4;18446744073709551615
1505186572;32;16;32;32;4;4;18446744073709551615
1505186572;32;64;16;2;1;4;13820889
1505186572;32;32;8;16;2;2;1624889
1505186572;64;32;32;32;2;2;2041629
1505186572;32;64;8;32;64;4;18446744073709551615
1505186572;64;32;16;64;1;2;1773333
1505186573;32;128;32;16;128;4;18446744073709551615
1505186573;64;32;16;32;32;4;18446744073709551615
1505186573;32;32;16;32;8;8;18446744073709551615
1505186573;64;32;16;32;2;8;18446744073709551615
1505186573;8;32;16;4;2;4;3099851
1505186573;32;16;4;32;4;4;18446744073709551615
1505186573;32;128;16;32;1;4;1944444
1505186573;16;32;128;1;2;4;21187852
1505186573;32;256;16;1;256;4;18446744073709551615
1505186573;32;32;32;2;2;4;11774222
1505186573;16;32;16;1;1;2;17449629
1505186574;64;16;16;64;4;4;18446744073709551615
1505186574;8;128;8;2;128;2;18446744073709551615
1505186574;64;32;64;16;2;2;2317185
1505186574;64;32;16;64;2;4;18446744073709551615
1505186574;32;32;8;32;2;2;1533926
1505186574;8;16;16;2;4;4;5329185
1505186574;32;64;2;32;1;1;2820593
1505186574;8;16;16;2;8;2;5536889
1505186574;64;32;16;16;2;4;2446519
1505186574;16;32;16;1;4;4;21698815
1505186574;64;32;8;32;2;4;1503704
1505186575;128;64;64;32;1;4;1992741
1505186575;32;32;16;16;32;4;18446744073709551615
1505186575;32;16;16;1;4;4;21370814
1505186575;32;128;16;32;128;4;18446744073709551615
1505186575;128;8;16;8;1;8;4169481
1505186575;16;32;8;16;2;8;2754963
1505186575;64;8;4;8;1;2;5335556
1505186575;16;2;2;2;1;2;149852592
1505186576;16;1;128;16;1;2;5016889
1505186576;256;128;4;8;2;1;7243704
1505186576;8;32;16;2;1;4;9677037
1505186576;1;32;16;1;2;4;15187852
1505186576;32;32;1;32;8;1;10739111
1505186576;32;16;16;32;4;8;18446744073709551615
1505186576;32;16;32;1;8;4;22035556
1505186576;32;32;64;32;2;8;18446744073709551615
1505186576;32;128;8;32;2;4;1709037
1505186576;64;32;8;32;4;4;18446744073709551615
1505186577;32;32;32;16;4;4;2495259
1505186577;64;32;16;32;2;2;2096741
1505186577;128;32;16;32;1;4;2099852
1505186577;32;64;64;32;32;16;18446744073709551615
1505186577;64;32;32;16;2;16;18446744073709551615
1505186577;64;64;16;32;64;4;18446744073709551615
1505186577;16;32;32;2;2;4;13431704
1505186577;32;32;4;16;8;1;2820889
1505186577;32;32;16;8;32;4;18446744073709551615
1505186577;32;32;8;16;2;4;1604592
1505186577;32;16;32;32;1;16;18446744073709551615
1505186578;128;32;16;32;2;8;18446744073709551615
1505186578;32;32;32;32;1;2;3017926
1505186578;32;32;16;32;16;4;18446744073709551615
1505186578;32;256;64;32;64;4;18446744073709551615
1505186578;32;32;8;32;2;1;2736741
1505186578;32;64;32;1;1;4;34730963
1505186578;16;32;16;16;2;4;1567408
1505186578;8;32;16;1;2;4;16418223
1505186578;16;32;16;8;2;4;2168445
1505186578;64;128;16;16;1;4;2750963
1505186578;32;16;16;16;4;4;1513037
1505186579;8;4;32;2;2;8;10615407
1505186579;32;32;16;1;2;1;17346963
1505186579;64;64;16;32;1;8;1940296
1505186579;16;32;16;1;1;8;28904296
1505186579;32;32;16;16;1;1;2911555
1505186579;16;32;16;1;2;8;25026222
1505186579;128;32;8;32;2;8;18446744073709551615
1505186579;16;32;64;1;2;4;22557778
1505186579;32;16;16;8;4;4;1588000
1505186579;8;64;16;2;1;4;11727111
1505186580;32;32;16;32;32;1;18446744073709551615
1505186580;32;32;32;32;2;1;1761629
1505186580;64;32;8;32;32;4;18446744073709551615
1505186580;32;32;16;8;2;4;3547408
1505186580;1;256;2;1;256;2;18446744073709551615
1505186580;32;32;16;32;32;16;18446744073709551615
1505186580;32;8;16;4;1;4;3035703
1505186580;128;32;16;8;2;4;3864000
1505186580;256;2;4;1;2;1;23840000
1505186580;128;32;8;128;8;4;18446744073709551615
1505186580;16;4;16;1;2;1;24143556
1505186581;2;8;2;2;2;2;215592148
1505186581;32;32;16;8;32;16;18446744073709551615
1505186581;4;32;16;1;2;4;8440444
1505186581;32;32;16;4;2;4;6425482
1505186581;32;64;4;32;2;4;1491407
1505186581;4;8;128;1;1;32;34240148
1505186581;32;256;64;2;1;32;25364445
1505186582;128;64;32;2;32;4;14665926
1505186582;2;1;32;1;1;8;111095556
1505186582;32;32;1;32;2;1;10587259
1505186582;256;256;1;256;32;1;18446744073709551615
1505186582;32;64;1;16;1;1;5297186
1505186582;32;32;2;2;8;1;5427704
1505186582;1;128;256;1;4;2;14493037
1505186582;64;32;16;32;8;4;18446744073709551615
1505186582;32;16;16;32;2;2;1589926
1505186582;64;16;16;32;4;4;18446744073709551615
1505186583;32;32;32;32;4;4;18446744073709551615
1505186583;8;8;2;8;2;1;64075259
1505186583;1;64;1;1;2;1;108132593
1505186583;1;8;256;1;2;64;24958370
1505186583;128;256;1;128;1;1;1895111
1505186583;16;8;32;2;4;1;11968740
1505186583;8;1;32;2;1;4;32429185
1505186584;1;2;16;1;1;8;221696296
1505186584;2;32;16;2;2;4;8520592
1505186584;128;32;16;32;2;1;2062222
1505186584;32;32;16;1;1;4;27794667
1505186584;1;32;16;1;2;4;15196148
1505186584;32;32;16;1;2;4;36477926
1505186584;8;128;32;4;128;1;18446744073709551615
1505186584;8;64;2;2;2;2;8853926
1505186584;2;256;8;1;2;8;16761926
1505186585;16;256;1;16;256;1;18446744073709551615
1505186585;32;32;2;32;2;1;5497037
1505186585;32;32;64;32;2;2;1955703
1505186585;128;1;32;32;1;8;2935112
1505186585;1;32;256;1;1;64;85816296
1505186585;16;256;32;1;8;4;23878814
1505186585;16;2;4;8;1;1;77766074
1505186585;1;4;128;1;2;2;16326963
1505186585;256;128;64;64;1;4;1447111
1505186586;1;64;2;1;2;2;54647703
1505186586;256;16;4;64;16;4;18446744073709551615
1505186586;32;32;128;32;2;1;1888889
1505186586;128;32;16;32;4;4;18446744073709551615
1505186586;256;32;16;128;2;4;18446744073709551615
1505186586;128;1;16;128;1;1;5806222
1505186586;16;4;1;1;2;1;149748000
1505186587;2;8;2;1;1;1;206578371
1505186587;4;4;128;1;2;2;10289629
1505186587;16;1;64;4;1;32;17149333
1505186587;32;32;16;32;8;4;18446744073709551615
1505186587;32;32;16;32;2;4;1191555
1505186587;128;1;32;1;1;4;21357630
1505186587;32;8;64;32;8;4;18446744073709551615
1505186587;2;8;32;1;8;8;34414074
1505186587;256;1;1;64;1;1;50226370
1505186588;32;64;16;8;1;4;4710371
1505186588;32;2;2;2;2;1;73202963
1505186588;4;32;1;4;2;1;56251556
1505186588;32;32;16;16;2;8;2043111
1505186588;32;4;16;2;2;4;5677037
1505186588;32;2;16;32;2;4;10506666
1505186588;1;128;256;1;1;2;17216593
1505186588;8;8;1;2;2;1;124260444
1505186589;2;16;16;2;4;4;17380889
1505186589;32;8;8;32;1;4;5359111
1505186589;1;128;256;1;32;1;51025926
1505186589;128;256;1;128;1;1;1849334
1505186590;1;1;32;1;1;8;221500889
1505186590;8;4;32;2;1;8;9951556
1505186590;32;32;128;32;2;4;1754223
1505186590;32;1;16;32;1;4;20334222
1505186590;64;32;64;4;4;16;7292444
1505186590;1;1;32;1;1;1;206430814
1505186590;8;64;2;1;2;2;9890518
1505186591;2;256;8;1;1;8;17957185
1505186591;32;32;32;2;1;4;24708593
1505186591;16;32;4;1;8;4;9299555
1505186591;16;64;16;1;1;4;27263111
1505186591;32;1;16;32;1;4;20604593
1505186591;32;32;16;2;2;4;11275556
1505186591;32;32;32;32;2;16;18446744073709551615
1505186591;32;256;16;32;16;4;18446744073709551615
1505186591;32;4;16;32;2;2;5557334
1505186591;32;32;16;32;2;4;1208000
1505186592;32;4;16;4;2;4;5462074
1505186592;128;32;128;32;2;4;1802815
1505186592;8;32;1;2;2;1;32124889
1505186592;32;32;1;32;2;1;10584445
1505186592;4;256;16;4;128;4;18446744073709551615
1505186592;32;32;16;4;2;4;6532148
1505186592;32;32;16;1;16;4;22577037
1505186592;32;1;16;1;1;4;19575851
1505186592;32;32;4;16;2;1;2743407
1505186592;1;32;16;1;2;4;15187408
1505186593;32;32;128;1;8;4;22575111
1505186593;4;32;256;4;2;4;6499407
1505186593;32;32;16;4;4;4;5772741
1505186593;32;32;1;32;1;1;10420889
1505186593;4;32;16;4;2;4;3997925
1505186593;32;32;16;2;1;4;13604000
1505186593;64;32;16;32;2;1;1965482
1505186593;32;128;1;32;8;1;2902519
1505186593;32;32;16;16;2;4;2179259
1505186593;4;16;16;4;4;4;7973185
1505186594;32;256;16;32;128;4;18446744073709551615
1505186594;128;32;16;32;8;4;18446744073709551615
1505186594;32;16;16;32;8;4;18446744073709551615
1505186594;32;256;4;16;256;1;18446744073709551615
1505186594;128;128;32;64;32;8;18446744073709551615
1505186594;8;32;16;8;2;2;2461185
1505186594;16;256;32;8;8;4;4118814
1505186594;32;32;16;4;2;4;6838815
1505186594;16;1;4;16;1;2;154984296
1505186595;16;64;128;16;4;2;2678963
1505186595;256;128;64;64;1;2;1672740
1505186595;32;64;64;2;2;4;11755111
1505186595;32;32;1;8;2;1;10047111
1505186595;256;4;4;1;2;2;25006074
1505186595;128;256;16;128;16;2;18446744073709551615
1505186595;16;4;8;1;2;1;18368592
1505186595;2;8;2;1;1;1;205214223
1505186596;32;32;128;32;16;1;18446744073709551615
1505186596;64;4;16;32;1;4;2751260
1505186596;256;32;16;2;2;4;16193778
1505186596;32;128;16;1;4;4;28426370
1505186596;4;2;128;1;2;16;11334222
1505186596;16;1;128;4;1;32;7487704
1505186596;1;64;16;1;32;8;61240889
1505186596;1;128;1;1;8;1;55658222
1505186596;32;64;32;16;2;4;2543703
1505186597;32;1;16;4;1;4;21441926
1505186597;32;16;1;1;16;1;25070074
1505186597;64;64;16;32;1;4;2045037
1505186597;32;32;2;2;8;2;5998222
1505186597;16;128;256;16;4;1;2130814
1505186597;32;1;16;32;1;16;18446744073709551615
1505186597;32;8;8;32;2;4;5185629
1505186597;8;8;1;2;2;1;123377778
1505186597;2;16;32;2;4;2;8419259
1505186598;1;1;256;1;1;1;33496592
1505186598;128;256;1;2;2;1;10797185
1505186598;32;2;16;32;2;4;10517482
1505186598;32;32;256;32;2;2;2010518
1505186598;8;32;32;1;1;8;24075555
1505186598;64;4;4;2;1;4;12285926
1505186598;64;1;64;4;1;16;6086519
1505186598;1;32;32;1;1;1;27355852
1505186599;32;1;2;32;1;1;161344000
1505186599;32;32;2;16;2;1;5458371
1505186599;32;64;16;32;1;4;1926074
1505186599;8;64;2;2;16;2;13837778
1505186599;2;1;8;1;1;8;454158371
1505186599;16;256;4;16;1;1;2742814
1505186600;16;1;32;1;1;8;21915704
1505186600;8;32;64;8;2;64;18446744073709551615
1505186600;32;256;32;4;64;4;18446744073709551615
1505186600;16;2;4;8;1;1;74652000
1505186602;2;2;1;2;2;1;1696207703
1505186602;32;1;2;32;1;1;161785482
1505186602;1;32;16;1;2;4;15173333
1505186602;1;32;1;1;2;1;216767408
1505186602;256;128;64;1;1;4;9281037
1505186603;32;64;1;2;2;1;12008889
1505186603;256;2;4;4;2;1;5997037
1505186603;64;128;16;1;16;2;24678222
1505186603;32;32;16;32;8;16;18446744073709551615
1505186603;32;32;16;1;2;4;23097629
1505186603;1;4;4;1;2;1;425776297
1505186604;64;8;2;64;1;1;10586074
1505186604;1;4;16;1;2;2;108488741
1505186604;1;1;128;1;1;2;53887556
1505186604;32;32;16;2;2;1;15261777
1505186604;32;2;16;32;2;8;18446744073709551615
1505186604;128;64;16;2;32;8;18446744073709551615
1505186604;64;1;32;2;1;2;11472592
1505186604;256;16;1;1;1;1;96918667
1505186605;4;64;16;1;2;4;13962962
1505186605;32;32;16;32;2;2;1437186
1505186605;64;32;16;1;4;4;21885926
1505186605;16;32;32;16;2;2;1903111
1505186605;64;32;8;32;2;2;1705777
1505186605;16;32;16;1;2;2;25140296
1505186605;64;32;64;16;1;4;2581037
1505186605;32;32;32;32;2;8;18446744073709551615
1505186605;16;32;32;2;1;4;15823408
1505186605;32;64;16;32;4;4;18446744073709551615
1505186605;16;32;16;4;32;4;18446744073709551615
1505186606;32;4;16;32;4;4;18446744073709551615
1505186606;32;8;8;32;8;8;18446744073709551615
1505186606;32;32;8;4;2;4;4315703
1505186606;16;16;8;1;4;4;6681481
1505186606;4;32;32;4;2;4;2798667
1505186606;64;32;16;32;1;2;2010371
1505186606;64;32;4;32;2;4;1522667
1505186606;32;32;16;32;1;16;18446744073709551615
1505186606;16;128;8;1;128;4;18446744073709551615
1505186606;32;32;4;2;2;4;9179704
1505186607;16;128;16;1;128;16;18446744073709551615
1505186607;32;64;16;16;4;4;2489185
1505186607;32;32;2;8;8;1;5669778
1505186607;16;8;16;16;8;8;18446744073709551615
1505186607;16;8;2;16;1;2;39344741
1505186607;1;16;32;1;2;2;16283259
1505186607;32;64;8;1;1;4;28375852
1505186607;32;64;16;8;1;8;4879111
1505186607;1;8;256;1;1;1;26837481
1505186607;256;8;32;128;1;1;2005926
1505186608;8;8;32;2;1;8;6462518
