GLOBAL_SIZE_0;GLOBAL_SIZE_1;LOCAL_SIZE_0;LOCAL_SIZE_1;TILE_0;TILE_1;cost
1024;1;256;1;64;256;8608830650
16;8;2;2;1024;2048;2548130053
128;32;64;1;4096;4096;18446744073709551615
64;4096;1;2;2;8;1379441303
64;4096;1;2;2;128;1179908473
512;512;16;2;1024;32;3633618250
64;4096;1;2;128;8;1446486472
4;64;1;1;1;2;1015830624
4;32;1;4;1;2;18446744073709551615
4;128;4;1;1;4;9619654709
4;64;4;1;1;2;4120250703
1;512;1;2;4;16;1712037929
32;1024;16;16;16;1;76510314105
128;16;8;8;4096;256;88466007853
64;32;2;4;2048;1;2681051164
4;64;1;1;1;1;640344672
4;64;1;1;1;32;1229194670
4;4;1;2;1;2;4702049129
4;2;1;2;1;2;9361380170
4;64;2;1;1;1;772482379
4;64;1;1;2;1;943209272
4;64;1;64;1;1;43049371210
4;64;4;1;1;4096;18446744073709551615
4;1024;1;128;1;16;28179285674
1;64;1;1;1;1;3296132716
4;64;2;1;4096;1;613274982
4;128;2;1;4096;1024;9382118990
4;64;1;1;4096;1;2400812708
4;64;2;2;4096;1;1260261409
4;32;2;2;4;1;1698237141
4;1;2;1;4096;1;43394652475
32;128;2;128;4096;1;18446744073709551615
4;64;2;2;4096;1;1260002465
4;16;2;4;2048;1;5317139083
2;2048;1;128;1024;4;130759172583
1024;1;2;1;32;1024;2467582808
1024;128;128;2;8;2048;58965103290
1;512;1;32;1;256;2645377818
1;64;1;2;4096;1;2398764725
4;64;2;1;1024;1;970485841
1;512;1;128;4096;1;18446744073709551615
4;64;2;1;1;1;860998847
1;4;1;1;2;2048;37968673375
4;64;2;1;4096;2048;19080017004
4;64;2;1;32;1;1355382179
4;64;2;1;2048;1;971299708
1024;32;64;4;16;256;10723164875
4;64;2;1;4096;16;5023961793
4;64;4;1;4096;1;340719463
1024;64;128;2;256;1;4964456045
16;4;8;2;4096;1;5648956708
4;64;1;1;4096;1;2401328017
4;1;4;1;4096;1;23694497737
4;64;4;1;4096;16;1987007165
4;64;4;1;2048;1;506534183
16;64;8;2;4096;1;20044929252
16;64;8;2;512;1;6172526757
4;64;4;2;4096;1;697056475
128;1;2;1;1;4;2873804551
4;128;4;1;4096;1;4559748791
4;64;4;1;4096;64;1220906088
4;64;4;1;1;1;1578879879
4;64;4;1;4096;2048;9656138458
4;64;4;1;1024;1024;4705724863
4;64;4;1;4096;1024;4786649185
128;1024;128;2;8;16;81556585065
128;64;1;1;4096;1;81192177342
64;64;2;1;4096;512;53794344741
2;64;1;1;4096;1;2393590890
1;1;1;1;128;1024;76982744874
8;1;8;1;32;32;9034982625
16;128;8;1;512;128;1551841439
16;64;2;8;1;64;6016855044
16;64;16;8;64;128;2597796692
64;256;1;16;32;8;5354182960
64;64;2;32;4;32;1909133352
16;256;4;64;4;2;18446744073709551615
32;32;1;32;64;32;2642655584
128;32;128;1;32;1024;8463510898
256;256;32;1;256;8;1954417797
64;64;1;64;16;128;532971971
256;256;32;1;4;8;36705583196
256;256;32;1;8;8;17061210792
8;4;8;1;1;64;18301293887
256;2048;32;1;4;8;35354324708
64;128;1;32;16;16;3041532464
256;32;16;2;256;128;1829352770
2;128;2;16;1;8;1668020042
256;1024;32;2;1;8;137780249625
32;256;8;4;1;32;33904456667
256;256;32;4;1;8;148318607500
32;64;2;64;32;32;3126735105
256;256;256;1;32;128;34328966638
1024;256;32;1;16;8;4394692041
128;128;64;4;8;32;39691808154
32;128;2;64;2;4;38983998541
128;128;128;2;4;16;18446744073709551615
64;128;1;64;16;32;2113659833
128;128;64;4;16;16;18724544655
64;8;8;4;1;1;50875526370
1;4;1;1;1024;2;21835238785
128;128;16;1;4;16;18598752483
256;256;32;1;8;4;18093941129
128;128;32;2;4;16;39658214625
256;256;2;16;2;8;2455934394
128;256;64;4;8;16;39928057538
256;256;64;4;8;16;36235248959
256;256;64;4;4;16;79544243750
1;2;1;1;1024;8;36619491026
64;256;32;4;4096;128;8899575666
256;256;16;16;8;8;12490989646
16;512;1;16;2;4;14601041417
256;256;32;1;16;8;8017486418
128;16;32;8;512;1;26812464083
1;2;1;1;1024;32;35907037542
16;256;8;1;128;1;3985478294
4;256;1;128;4;2048;2821811958
256;512;32;1;64;8;3059269924
256;256;8;16;4;8;11714677976
128;4;32;4;128;512;1038930548
4;32;2;8;2048;4096;6004697625
512;2;64;1;512;256;3615482875
128;512;1;32;2;32;1010893789
2;256;2;16;2;8;5216419065
512;256;32;1;1;2;133081147625
256;256;32;1;1;2;151796025167
128;512;2;16;2048;128;3362182084
2048;4096;64;4;32;256;2349308303
4096;4096;4;2;1024;512;1799409517
1;1024;1;1;4096;128;3202458950
1024;256;1;16;8;8;1402237817
512;256;32;1;1;8;131000552208
16;32;8;8;64;32;1700201150
4;2;1;1;128;2048;9570313042
128;512;32;1;8;128;15319982000
128;512;64;1;4096;128;6619406000
256;1;1;1;2;8;1206079185
256;256;1;16;8;8;1969590122
256;256;32;8;4;8;38604089150
1024;256;2;1;1;1024;1003959791
1024;128;128;1;8;2048;50919133246
1;1024;1;256;1;256;3290272679
16;1;1;1;128;1024;5969129248
256;256;32;1;32;8;3029830168
256;256;8;16;1;4;67931492955
8;1;8;1;8;32;9763382615
16;128;8;1;1;4;28225041384
16;64;2;8;256;64;2864626341
256;1;8;1;1;128;9058894417
256;256;32;8;4;8;39584604774
64;256;32;1;1024;8;2258473084
256;256;32;1;4;64;35005346875
16;128;2;2;1;8;6181738924
4;256;4;1;1;2;14102833167
4;4;1;1;1024;1024;5101292784
256;256;1;16;2;8;1243687145
256;256;32;1;1;8;140699827709
1;2;1;1;1024;8;36535721856
64;64;2;64;4096;128;18446744073709551615
128;16;128;2;512;1;5635341553
1;1;1;1;4096;32;72485853209
128;256;32;1;4;8;40750725989
512;256;8;8;128;1;23497416979
256;2048;1;128;8;2048;285169636
128;64;32;1;1;512;81018585001
512;32;2;8;2048;4096;6128865839
1024;256;32;1;4;8;23281572583
4096;512;64;1;2048;256;2176425230
2;1;1;1;2;32;39985020541
128;512;2;16;2048;1024;2024639254
1;4096;1;32;4;1;145163242965
128;256;32;1;8;32;18628769250
4096;4096;1;1;1024;512;2600426217
1024;128;128;1;4096;128;28941506164
16;512;8;8;64;32;2441205633
4;1;1;1;1;2048;19668617153
256;256;32;1;1;8;149995596583
256;1024;32;1;1;8;139036362710
256;32;128;1;1;8;18446744073709551615
256;256;32;1;512;8;3575285155
128;512;32;1;8;128;16758300531
128;512;1;1;8;128;1662276679
1;256;1;256;1;1024;2149203596
1024;128;128;2;1;2048;18446744073709551615
256;64;64;2;4;8;78926979788
256;512;64;2;4;8;77455625583
256;256;64;2;1;4;18446744073709551615
128;512;2;32;1;256;3817382367
16;512;1;4;1;1024;1462265625
8;16;8;2;32;256;1235239125
16;16;1;16;512;128;1856489244
256;256;16;16;1;8;117842406083
256;256;32;1;2048;8;4238238072
256;256;4;16;4;8;3804336242
256;256;32;4;64;16;1491724428
16;4096;2;4;64;64;3441418121
256;32;16;4;1;2048;43587104233
1024;128;32;1;1;8;111007040083
4;256;4;4;256;2;18446744073709551615
64;256;1;32;8;8;6433812458
2;256;2;16;2;2;18446744073709551615
1;256;1;16;2;8;1534964808
4096;8;256;1;1;32;18446744073709551615
4;2048;1;256;1024;1024;2944240014
1;2;1;2;1024;8;38899386996
64;512;32;4;8;128;18975900873
32;256;1;16;1;32;3904137779
256;1;1;1;2;8;1195216859
256;256;32;1;4096;8;37365553848
128;16;128;1;512;1;3094121762
1;2;1;1;1024;32;35964478749
512;256;8;1;128;2048;2472945963
256;2048;1;128;1024;32;14879471578
256;256;64;2;4;8;80380006000
256;256;64;1;8;4;35841617625
256;256;2;16;2;256;992180962
256;32;256;1;8;8;150575038833
128;4;16;4;1;512;30340017917
64;32;2;8;2048;4096;3084237434
4096;64;1;1;512;1;1972035575
128;512;1;32;2;256;999184791
16;256;1;64;2;8;21620012526
256;256;32;8;4;64;38975483874
1;4096;1;16;1;1024;1510870483
2048;2;64;2;32;1024;2734677558
4096;4096;2;1;1024;512;1437747628
1;512;1;1;4096;1;599379966
16;256;1;16;2;8;6423824691
16;8;16;8;64;32;1381004706
4;2;1;1;32;2048;9553974546
128;512;32;8;8;128;19083386959
1024;512;8;8;8;512;844491049
256;256;32;8;16;8;6945253576
1024;256;2;1;1;128;1131636924
1024;1;32;1;8;2048;6715076899
1;1;1;1;1;256;71621083609
16;512;8;4;1;1024;5029718789
128;128;16;16;4;16;18524322520
512;256;32;2;8;8;12468178898
