GLOBAL_SIZE_0;GLOBAL_SIZE_1;LOCAL_SIZE_0;LOCAL_SIZE_1;v_TP_41;v_TP_42;cost
2048;256;128;2;182;26;248007104
8192;256;1;1;234;42;330449856
32;4;16;1;70;117;1307333888
8192;2;256;1;39;6;29529920
32;8;32;4;126;8190;6954840288
8192;2;256;2;39;1;15382976
4096;2;256;1;39;6;32360032
8192;1;128;1;39;6;57619168
8192;2;256;1;39;1;12953248
8192;512;256;2;39;1;12608736
1;4;1;2;39;1;18949127840
8192;2;256;2;78;1;9773888
8192;8;256;4;78;455;967155968
1024;2;8;2;14;1;29418528
8192;2;256;2;14;1;9883232
8192;2;256;1;273;1;12903040
1;2;1;1;78;1;21444811840
8192;2;2;2;78;1;73935936
8192;2;256;1;78;1;8161696
8192;8;256;2;78;1;8512576
1;2;1;1;78;1;23069610368
8192;2;256;1;78;30;227261088
8192;2;256;2;78;1;9663968
8192;2;256;1;6;1;9450816
2048;2;256;1;273;1;25470272
8192;2;128;1;78;2;8800768
8192;2;256;1;78;3;9525728
8192;4;256;1;30;1;8390848
8192;32;256;8;78;6;18446744073709551615
16;2;16;1;78;1;1438755456
16;32;8;1;78;1;114204480
8192;2;256;1;35;1;12975680
1024;2;256;1;78;1;26359872
8192;2;256;1;78;7;40304640
8192;2;256;1;78;39;358229824
8192;2;1024;2;78;2;18446744073709551615
8192;2;128;1;78;1;8196832
2;2;1;1;39;1;17951425984
8192;2;1024;1;78;1;12286208
1024;32;1;8;10;39;83686976
1024;32;8;8;7;5;42190496
4;8;4;4;910;26;4574735616
1;4;1;1;105;819;20175831360
8192;2;256;1;78;70;518726496
8192;2;256;1;78;65;587992736
8192;2;512;1;7;1;15731136
8192;512;1;512;78;1;299741184
16;8;16;8;39;30;939142848
1024;8;1024;1;6;10;24882752
1024;1;1024;1;546;117;2103630016
64;32;16;32;585;195;266953376
8192;128;256;64;78;1;18446744073709551615
8192;2;256;2;78;1;9808736
8192;2;32;1;1;1;18389888
8192;2;256;1;78;1638;7585249568
8192;1;64;1;78;1;8493056
8192;2;256;1;126;3;9526912
8192;1;256;1;126;6;58363328
8192;2;256;2;78;1;9743840
8192;2;256;2;4095;1;15152544
8192;2;1;1;78;1;278112352
8192;1;256;1;78;1;9902752
8192;2;16;1;78;1;19079776
8192;2;256;2;78;1;9835520
8192;2;1;1;78;1;278109376
8192;2;256;2;78;1;9633408
8192;2;8;1;78;1;36236928
2048;4096;256;64;234;819;18446744073709551615
4;4096;1;256;126;273;622976160
4096;4;4;2;1365;5;59216960
128;128;1;1;63;65;407235424
8192;2;256;1;78;585;4511529728
8192;2;256;1;78;1638;7639599168
8192;2;256;1;390;1;8197632
8192;1;16;1;78;1;22443744
8192;4;256;1;78;1;9552160
2048;2;256;1;126;1;15412352
1;2;1;2;78;1;23498251200
2048;2;256;1;70;1;15350816
4;1;1;1;7;2;10779215520
1;1;1;1;6;90;64778867232
128;256;1;1;5;390;329643136
32;2;8;1;1365;42;1444831968
32;8;8;1;30;30;340070624
8192;2;256;1;2730;1;8614784
8192;2;256;1;15;1;13051328
1;2048;1;512;26;1;737783360
8192;2;8;1;78;26;127280160
1;2;1;1;78;546;31305750240
16;256;8;128;42;21;126650752
8192;2;256;1;39;2;9086016
1;2;1;1;78;1;26767103168
32;4096;32;1;9;1;17932352
64;4096;1;2;42;210;177971488
512;512;4;256;39;2730;748911744
4096;1;1024;1;70;3;26240704
1024;2;32;1;78;1;24847104
8192;2;256;1;1;1;9968576
64;128;8;4;1638;1;187231584
32;1;32;1;1;1;1775038016
1;2;1;1;78;1;26263824384
256;8;256;4;78;1;50719072
4096;2;256;1;78;1;9944160
2048;1;1;1;1;26;339805280
8192;2;512;1;63;1;15343296
1024;2;256;1;91;1;46541728
2048;4;1024;2;15;26;18446744073709551615
256;2048;256;256;14;26;18446744073709551615
8;64;4;4;126;91;451761248
1;8192;1;4;390;1;2409708512
128;512;16;1;9;3;15147648
128;512;1;128;10;13;450304192
32;1024;2;512;21;9;182590592
32;128;16;1;15;10;38108352
8192;2;4;1;78;1;71048480
16;2;8;1;78;1;1432334976
128;512;1;64;78;1;386038240
8;32;4;2;210;39;705360256
16;1024;16;128;273;7;18446744073709551615
32;2;16;2;42;455;4076424832
8192;512;256;2;315;234;223907936
8192;4;256;2;90;3;10015200
8192;16;256;2;78;1;8118912
8192;2;256;1;45;1;12940064
8192;64;512;64;78;1;18446744073709551615
8192;16;512;2;130;2;8208672
8192;16;64;4;126;1;8668608
1;16;1;2;130;1;3012902912
4096;32;256;1;78;3;6737888
8192;16;256;2;78;2;7668064
8192;32;256;1;78;3;6849888
8192;16;256;1;78;1;8036000
4096;32;256;1;78;1;8171616
4096;128;256;64;78;3;18446744073709551615
4096;16;256;1;78;3;8086240
4096;32;128;1;78;3;6748704
4096;32;32;32;78;1;9176800
8192;32;256;16;63;7;18446744073709551615
4096;64;256;64;90;10;18446744073709551615
4096;32;256;1;65;5;30598496
2048;64;256;1;78;3;6554848
1;32;1;1;78;13;3191376608
4096;32;256;8;78;3;18446744073709551615
4096;64;256;1;70;3;6299264
2048;64;256;1;78;2;7064512
4096;64;256;1;90;1;8067008
2048;128;256;128;18;6;18446744073709551615
4096;128;256;128;70;3;18446744073709551615
4096;32;256;2;70;5;33614560
4096;64;128;1;70;3;6442656
1;128;1;2;70;3;389448032
4096;16;256;4;70;3;6666624
1;64;1;1;70;3;919836864
4096;64;64;64;70;3;18446744073709551615
4096;256;256;128;70;3;18446744073709551615
4096;64;256;2;70;3;6444032
4096;64;256;64;39;2;18446744073709551615
4096;64;256;1;35;3;6495808
4096;64;256;64;90;3;18446744073709551615
8192;64;256;1;70;3;6327712
512;64;512;1;70;3;7958464
4096;64;256;1;63;1;12814560
4096;64;1024;1;70;14;61298208
2048;16;128;4;63;3;7557888
8192;64;128;1;70;7;59517472
8192;64;512;1;65;7;50101152
4096;64;256;1;117;3;6400032
4096;512;256;32;70;5;18446744073709551615
4096;128;1024;128;70;3;18446744073709551615
4096;64;128;64;70;3;18446744073709551615
4096;64;256;4;70;3;5850272
4096;64;256;4;70;13;111825664
8192;64;256;16;70;3;18446744073709551615
4096;64;512;1;70;3;5981440
4096;64;128;2;70;3;6623712
4096;64;256;1;90;3;6351648
4096;64;256;64;18;13;18446744073709551615
4096;64;256;4;195;3;5962816
1024;64;256;8;70;1;18446744073709551615
1;64;1;8;70;3;975284256
4096;64;512;4;70;15;18446744073709551615
1;64;1;4;90;3;1105233312
8192;64;128;16;70;1;18446744073709551615
4096;64;256;4;78;3;5836960
8192;64;256;8;42;3;18446744073709551615
4096;64;256;4;35;2;6738272
1;64;1;4;70;10;1256159040
4096;64;256;4;78;5;12543232
4096;16;256;16;70;3;18446744073709551615
4096;64;128;2;45;3;6403904
2048;32;512;8;78;3;18446744073709551615
1024;64;256;4;78;3;6053888
2048;64;128;4;78;9;86691520
4096;64;256;1;195;3;6459232
4096;16;256;16;78;3;18446744073709551615
4096;64;256;2;117;6;18562112
4096;128;256;1;78;3;6149728
1;64;1;4;65;5;1400660864
4096;64;1024;4;126;3;18446744073709551615
4096;32;256;8;70;3;18446744073709551615
4096;32;256;16;126;3;18446744073709551615
4096;32;256;8;78;3;18446744073709551615
4096;64;1024;4;78;3;18446744073709551615
1;128;1;2;78;3;430639392
4096;64;256;4;90;13;110115616
4096;64;256;4;45;2;6759456
1024;64;256;4;42;3;6134816
2048;64;128;4;78;2;7161600
4096;32;256;8;78;5;18446744073709551615
8192;64;256;4;65;3;5880128
4096;128;1024;2;45;3;18446744073709551615
4096;64;512;4;78;2;18446744073709551615
4096;64;128;4;117;6;18412768
4096;64;128;4;78;3;6130976
4096;64;256;8;78;3;18446744073709551615
4096;64;256;4;105;3;5806784
4096;64;256;2;78;5;30459360
1;64;1;16;105;5;2821637376
4096;64;256;4;195;2;6682944
256;64;256;4;130;21;181423744
4096;64;256;8;105;3;18446744073709551615
8192;64;256;4;234;9;62524128
4096;64;1024;16;105;3;18446744073709551615
4096;32;256;8;105;6;18446744073709551615
8192;64;256;4;105;10;58352384
1024;64;256;4;105;3;6138048
4096;64;512;4;105;3;18446744073709551615
4096;64;256;4;182;3;6071776
8192;64;256;4;105;3;5833632
4096;64;256;4;126;2;6625312
4096;64;1024;4;195;3;18446744073709551615
4096;64;256;4;63;3;5895968
4096;64;256;4;105;1;12354752
8192;64;256;4;126;3;5640000
4096;32;256;8;105;9;18446744073709551615
1;64;1;4;105;3;1294350496
2048;128;256;8;105;10;18446744073709551615
8192;128;256;64;105;3;18446744073709551615
8192;64;256;4;126;7;32012800
1;64;1;16;126;3;1854921184
8192;128;256;2;105;10;82705120
8192;64;128;4;195;3;6641760
8192;64;256;1;126;15;131515840
8192;64;128;8;63;6;18573376
8192;128;256;2;234;3;6504736
4096;64;256;4;126;10;53350816
1;64;1;2;126;3;1481623264
1024;64;256;4;126;3;5842048
1;64;1;4;126;1;1482718720
8192;64;256;64;210;3;18446744073709551615
8192;256;256;128;126;3;18446744073709551615
8192;64;256;2;126;2;6569472
8192;64;512;4;126;9;18446744073709551615
8192;128;256;2;91;3;6235264
8192;64;256;4;234;3;5941792
1;64;1;4;126;13;2645798944
1;64;1;4;126;3;1573691712
8192;128;256;1;126;3;6305408
1;32;1;4;130;3;1602136576
8192;64;256;2;126;3;6014016
8192;64;256;8;126;10;18446744073709551615
4096;64;128;4;126;3;6051040
8192;32;256;8;126;3;18446744073709551615
2048;64;256;8;130;3;18446744073709551615
8192;128;256;8;126;3;18446744073709551615
4096;64;256;4;126;6;17249376
1;64;1;4;105;3;1257424192
4096;64;256;4;126;3;5608768
8192;64;256;16;126;3;18446744073709551615
2048;64;512;4;126;3;18446744073709551615
4096;32;256;8;126;9;18446744073709551615
4096;64;512;1;126;3;5780704
4096;64;256;4;130;3;5852544
1024;64;256;8;117;6;18446744073709551615
1024;64;512;16;126;13;18446744073709551615
4096;64;256;32;70;6;18446744073709551615
4096;64;256;2;126;3;6082432
4096;64;128;64;126;3;18446744073709551615
4096;128;256;8;210;3;18446744073709551615
4096;64;256;4;315;3;6089792
8192;32;256;8;130;5;18446744073709551615
4096;64;256;4;126;1;7840288
4096;256;256;1;117;9;89142176
1024;64;256;4;91;3;6188128
4096;64;64;4;195;3;6785920
4096;64;256;4;126;15;117846752
1;64;1;16;126;3;1838519488
4096;64;64;4;126;26;267624352
4096;32;256;8;126;3;18446744073709551615
2048;128;256;2;126;3;6334272
512;64;256;2;126;3;7382176
2048;64;128;4;195;3;6794080
4096;32;256;16;126;15;18446744073709551615
256;64;1;2;910;3;147862208
4096;256;256;2;126;2;6598208
4096;64;256;4;126;7;32361952
4096;16;128;16;126;3;18446744073709551615
4096;64;256;4;195;42;244581728
8192;64;1024;8;126;3;18446744073709551615
4096;64;256;4;63;1;12396800
4096;64;512;4;455;3;18446744073709551615
4096;64;256;4;455;3;6528320
4096;256;256;2;126;3;6072384
4096;128;128;2;126;6;26819840
4096;512;256;512;42;7;18446744073709551615
1;64;1;8;91;3;1262936672
2048;64;128;4;126;3;6187840
1024;64;128;4;126;1;9390144
4096;512;256;512;126;7;18446744073709551615
4096;64;256;2;315;3;6673632
4096;16;256;16;126;2;18446744073709551615
4096;64;256;4;90;3;5836096
4096;64;1024;2;126;3;18446744073709551615
8192;16;128;8;126;3;6669792
4096;64;256;4;65;3;5862016
8192;64;256;16;90;3;18446744073709551615
1024;64;512;4;126;3;18446744073709551615
4096;64;256;2;234;3;6597600
1;64;1;16;105;3;1695689280
4096;64;256;4;78;6;16821536
2048;64;256;4;130;3;5840448
4096;64;256;8;126;3;18446744073709551615
4096;32;256;8;91;3;18446744073709551615
2048;32;256;16;70;3;18446744073709551615
4096;128;256;2;126;3;6152384
4096;64;1024;4;126;2;18446744073709551615
4096;64;128;4;210;2;7974784
4096;64;256;2;91;1;12630112
4096;256;256;1;45;3;5871296
4096;8;256;2;210;9;26567808
4096;64;256;1;126;3;6370816
4096;64;256;2;126;5;29522624
4096;64;256;4;117;5;12975264
4096;256;256;4;273;14;90324544
4096;64;256;4;195;18;130674272
4096;128;256;2;63;3;5985120
8192;64;512;2;126;2;6343264
4096;64;256;64;126;2;18446744073709551615
4096;64;256;4;42;1;7826688
1024;64;256;4;273;3;6530624
512;64;256;4;315;3;8583552
1;64;1;2;234;9;2511085760
4096;64;128;4;126;2;6759040
4096;64;1024;4;130;2;18446744073709551615
4096;64;1024;4;130;3;18446744073709551615
4096;64;128;4;126;1;8161312
8192;64;1024;4;126;2;18446744073709551615
4096;64;512;4;117;9;18446744073709551615
2048;16;256;16;182;3;18446744073709551615
1024;64;512;64;126;3;18446744073709551615
4096;64;512;4;126;3;18446744073709551615
4096;64;256;4;126;9;62167520
2048;32;256;8;70;3;18446744073709551615
8192;128;256;2;126;10;82337984
2048;256;256;128;126;3;18446744073709551615
4096;32;256;8;273;3;18446744073709551615
4096;64;512;4;126;5;18446744073709551615
4096;32;256;8;130;3;18446744073709551615
8192;64;256;4;210;9;67178272
2048;64;256;4;126;3;5719808
8192;64;256;4;126;5;12696192
1;128;1;2;126;6;1112378080
2048;256;256;1;315;6;29069376
4096;64;1024;4;315;3;18446744073709551615
8192;64;256;4;91;3;5864032
4096;64;256;64;195;3;18446744073709551615
4096;64;256;8;195;7;18446744073709551615
4096;64;128;4;105;3;6359904
1024;64;128;8;78;3;6067264
4096;128;256;2;195;1;13032320
4096;64;256;4;273;2;6821504
4096;64;256;8;126;13;18446744073709551615
4096;32;256;8;90;3;18446744073709551615
1;64;1;2;126;10;2046018688
4096;16;256;16;126;14;18446744073709551615
4096;64;512;2;126;2;6261568
1024;16;256;16;126;14;18446744073709551615
16;4096;2;1024;42;42;18446744073709551615
16;128;16;2;90;10;59927616
1;256;1;1;126;3;804056576
4096;512;512;512;90;3;18446744073709551615
4096;64;256;32;78;3;18446744073709551615
4096;64;64;4;126;3;6384160
4096;64;256;2;126;3;6042080
4096;1;256;1;126;3;17729792
1;64;1;2;126;3;1473831776
4096;64;256;4;6;3;5839968
8192;64;256;4;70;14;97773440
4096;128;256;4;126;5;12766944
4096;64;256;4;130;9;66441728
128;8;8;8;3;1;49884256
32;2;32;1;91;195;3185985120
1024;512;32;1;35;7;16007904
64;1;8;1;819;585;8152349888
1;64;1;4;182;3;1162238784
64;64;16;2;10;6;22100768
4096;64;256;4;78;10;54995936
4096;64;256;4;78;13;109796960
16;512;1;2;39;1;251554496
4096;16;1;16;126;3;125156672
4096;64;4;4;126;3;17378240
4096;64;256;4;630;13;76426624
1;64;1;4;130;3;804748832
4096;64;256;8;117;3;18446744073709551615
4096;64;256;4;117;3;5980640
4096;16;512;16;126;3;18446744073709551615
2048;64;256;4;91;3;5901984
2048;32;256;8;195;3;18446744073709551615
8192;32;128;8;126;2;6886976
4096;64;256;8;210;5;18446744073709551615
4096;64;256;16;126;3;18446744073709551615
512;64;256;4;126;35;283460480
4096;64;256;4;546;15;98912896
4096;64;256;4;105;14;95648288
1;64;1;8;126;3;1682539456
2048;64;512;4;105;3;18446744073709551615
8192;128;256;2;126;1;7854784
4096;128;512;2;195;3;6152608
1024;64;256;4;126;2;7799712
4096;16;256;16;126;3;18446744073709551615
4096;8;256;2;105;9;25046880
1;64;1;4;126;6;2122803392
4096;32;256;2;126;9;83205120
4096;64;256;8;126;2;18446744073709551615
4096;32;256;4;126;6;19408512
512;64;256;8;126;3;18446744073709551615
2048;32;64;8;105;3;7760160
4096;64;512;4;126;18;18446744073709551615
4096;64;1024;4;126;7;18446744073709551615
4096;512;256;512;126;6;18446744073709551615
1;64;1;2;65;3;700729056
4096;32;256;8;126;2;18446744073709551615
4096;128;128;2;130;3;6534400
1;128;1;2;91;3;490392608
4096;64;128;4;126;14;124392672
4096;128;128;2;126;3;6272096
2048;4;256;1;70;14;42192480
4096;16;256;4;126;3;6391392
2048;64;512;16;105;5;18446744073709551615
8192;64;1024;4;90;1;18446744073709551615
4096;64;256;4;195;6;27202528
512;16;8;4;546;546;530285760
512;1024;16;4;7;8190;168853472
8192;4096;16;8;45;390;162055136
8192;2048;1;512;21;5;420490400
32;512;8;1;26;5;63598048
256;64;1;4;273;3;67913408
4096;128;128;2;126;1;8141440
4096;512;256;2;126;3;6087296
32;128;1;2;14;1;147895072
2048;16;1;16;126;42;128861856
32;256;4;1;15;3;59472480
4096;16;256;1;130;3;8234080
8;16;4;4;210;21;1046615712
2048;32;512;4;210;117;18446744073709551615
64;256;16;4;234;42;82437824
8192;4;16;1;455;117;507925760
32;64;1;1;10;9;430460544
4096;64;256;4;195;7;35964288
32;512;16;1;21;6;26396256
8192;256;16;1;78;1;18069632
8192;32;256;4;130;3;5847328
2048;128;128;2;234;3;7012448
1;64;1;4;42;9;1817876480
128;1024;16;512;1;1;18446744073709551615
4096;64;256;2;90;1;8018656
256;64;256;4;126;3;8576896
8192;128;256;2;130;3;6504544
32;128;16;2;42;9;33921856
8192;16;128;16;585;3;18446744073709551615
1024;64;128;4;126;3;6522336
2048;64;256;8;126;3;18446744073709551615
32;256;4;1;15;13;116102336
16;4;16;1;39;13;1557882240
1024;8;512;1;1;42;73972704
1024;1;1024;1;1;1;87525888
32;256;8;1;15;5;59199616
4096;16;256;8;65;10;18446744073709551615
4096;64;256;4;130;6;26554944
8192;64;256;4;117;9;61326272
1024;64;512;1;130;2;8042784
4096;1024;256;128;126;3;18446744073709551615
4096;64;256;4;210;3;6001824
512;64;128;4;126;1;12157600
4096;32;256;8;117;3;18446744073709551615
4096;128;256;128;130;3;18446744073709551615
2048;64;512;4;126;13;18446744073709551615
4096;64;512;4;91;7;18446744073709551615
4096;128;256;2;195;3;6161728
4096;64;128;8;90;3;6491360
4096;16;256;8;126;3;18446744073709551615
4096;64;256;8;210;3;18446744073709551615
4096;8;256;2;90;3;9859648
4096;64;64;4;117;3;6275456
1;64;1;16;126;14;2444755232
4096;64;128;4;42;10;81591520
2048;64;256;4;315;3;6516544
8192;64;256;8;105;3;18446744073709551615
4096;64;256;16;195;3;18446744073709551615
1;64;1;1;126;3;1448602944
2048;8;256;2;126;13;38191296
8192;16;512;2;195;2;6675712
2048;64;512;2;126;3;5912000
4096;128;256;2;126;6;22915584
512;32;256;8;130;3;18446744073709551615
4096;128;256;4;130;6;26741728
4096;32;256;4;63;3;5873952
4096;16;256;16;130;3;18446744073709551615
4096;128;256;2;234;3;6561696
4096;64;64;4;126;6;25051936
4096;64;512;2;315;1;12047584
4096;64;256;4;234;6;20151392
4096;64;256;2;126;10;79790976
4096;64;256;16;126;5;18446744073709551615
8192;64;256;4;126;13;108206848
4096;1;256;1;126;3;17791072
4096;64;256;1;126;3;6339200
4096;64;256;4;18;18;137221664
8192;128;64;4;117;13;134515328
4096;64;512;4;126;10;18446744073709551615
4096;64;256;2;126;1;8169152
4096;64;16;8;126;3;8704576
4;64;4;4;126;3;391351232
4096;64;32;4;126;4095;1337961696
4096;64;256;4;126;3;5607136
4096;64;256;2;2730;3;7556288
4096;64;256;4;117;3;5994560
4096;64;16;4;126;7;47414688
4096;2;256;2;126;3;9488512
64;64;2;4;126;3;40179552
8;64;1;4;126;21;345557760
4096;64;256;16;126;30;18446744073709551615
256;64;256;4;390;3;13730848
4096;64;256;16;126;3;18446744073709551615
4096;64;1;4;126;3;64048576
4096;1;256;1;126;390;4808444800
4096;64;256;4;126;78;210405920
4096;64;4;4;126;3;17391776
4096;64;256;4;126;1;7848896
4096;1024;2;4;126;3;33803584
2048;64;256;4;126;4095;1454442240
4096;64;8;4;126;3;10057664
8192;64;256;4;126;3;5632768
1024;64;1;4;234;455;161594336
1;1;1;1;126;3;52261836736
16;64;8;4;126;1;99367808
4096;64;256;4;126;8190;1743806624
16;64;8;4;126;3;101229248
256;32;4;32;585;195;250177216
4096;4;4;2;1365;18;64209504
32;256;1;1;15;9;427068032
128;128;16;1;63;65;182815648
4096;64;256;4;210;1;8361248
4096;64;128;4;126;3;6074592
4096;64;256;8;126;3;18446744073709551615
2048;128;256;4;273;3;6513888
32;256;16;1;15;6;28375808
4096;64;64;4;234;3;6658976
4096;64;256;2;126;2;6668032
1;64;1;1;126;7;2443492992
4096;64;128;2;126;3;6243456
4096;64;256;4;105;3;5804384
4096;64;256;4;126;1170;360029600
4096;64;256;8;18;3;18446744073709551615
4096;1;256;1;126;3;17371008
8192;64;256;4;273;3;5933664
32;1024;16;1;15;1;34225920
4096;64;256;2;91;2;6867424
4096;64;256;4;45;3;5834368
4096;256;256;2;117;3;6197760
4096;32;256;16;182;3;18446744073709551615
4096;32;128;16;126;3;18446744073709551615
4096;64;256;4;126;2;6487296
1;256;1;4;126;3;804049152
4096;64;512;4;126;1;18446744073709551615
4096;64;64;4;130;3;6854464
4096;64;256;8;78;1;18446744073709551615
32;512;16;1;15;3;17046944
2048;1;64;1;6;7;78475360
128;256;1;1;63;390;345989152
256;2;8;1;1365;42;213960736
4096;64;64;4;63;3;6413280
4096;64;256;2;126;1;8036896
1;64;1;4;126;3;1562200576
4096;64;256;4;455;3;6505504
8192;64;256;4;91;3;5850048
2048;64;1;2;126;21;224918496
4096;64;128;4;195;3;6763584
2048;64;256;8;126;3;18446744073709551615
32;8192;16;1;1;1;18021888
4096;32;256;4;126;3;5619296
4096;64;256;4;315;2;7078656
1;64;1;16;45;3;1117558112
2048;128;256;4;126;3;5530272
1;128;1;4;90;5;974529024
4096;64;256;4;90;3;5822592
512;64;64;4;126;10;85754880
1024;32;512;4;126;3;18446744073709551615
512;128;256;2;126;2;9080096
512;256;256;4;126;14;98651552
2048;128;256;4;910;6;26264640
512;128;256;8;63;3;18446744073709551615
256;128;256;2;126;3;6647168
2048;1024;256;4;126;1;8009120
1024;512;64;1;126;3;6057600
2048;128;256;4;126;7;33822496
2048;256;256;4;195;3;5957696
2048;128;128;4;315;3;7467520
2048;256;256;4;126;3;5530944
2048;64;256;4;91;3;5894592
2048;128;256;4;91;3;5811008
2048;128;512;4;126;6;18446744073709551615
1024;128;256;4;91;3;5941056
2048;64;256;4;126;13;106755808
2048;32;256;2;126;9;82048192
2048;512;256;4;65;3;5816000
2048;128;1;1;126;6;350514432
256;128;256;4;126;3;8543776
2048;512;256;4;195;1;13119840
1024;64;256;2;126;3;6795968
32;2048;16;1;7;3;15948512
1024;512;256;16;126;3;18446744073709551615
2048;128;128;4;126;3;6351584
2048;32;1024;4;126;3;18446744073709551615
2048;128;256;4;126;4095;1456938880
2048;2048;256;4;910;3;7764928
2048;128;256;1;126;234;99014336
2048;128;256;2;126;117;225879648
2048;128;256;4;126;2;7314304
2048;128;256;4;126;6;17957312
4096;128;256;4;126;3;5532032
2048;128;256;8;126;3;18446744073709551615
32;2048;16;1;6;2;16763136
64;4096;1;1;42;210;326924576
512;512;32;256;39;2730;18446744073709551615
4096;1;1024;1;1;3;22286016
2048;128;256;4;90;3;5813504
2048;128;512;4;210;3;18446744073709551615
2048;256;256;8;195;1;18446744073709551615
2048;128;512;4;117;3;18446744073709551615
2048;128;32;4;126;3;6733664
512;128;256;4;91;14;98612160
1024;128;512;4;546;3;18446744073709551615
1024;128;256;4;78;3;5809120
32;1024;16;1;9;3;15483712
1024;256;256;4;126;2;8212672
2048;128;256;2;126;18;153773824
2048;128;512;4;126;3;18446744073709551615
32;512;16;1;1;1;19820896
256;128;256;2;70;3;8752000
2048;256;128;4;819;2;7792832
1024;128;512;4;117;3;18446744073709551615
2048;64;256;4;117;18;133018944
2048;1024;256;1;126;3;6521728
512;128;256;4;78;3;6149792
2048;128;256;4;126;65;251845536
2048;8192;128;4;126;3;6327488
512;128;256;4;126;3;6567424
2048;128;2;2;126;3;58808768
64;4;8;2;15;26;364844608
32;512;16;1;6;2;16926720
1;128;1;2;126;1;720138848
32;8192;16;4;390;1;75916384
2048;32;256;4;126;3;6156576
2048;256;512;4;90;3;18446744073709551615
2048;128;512;4;78;3;18446744073709551615
2048;128;256;4;315;6;24592480
8;1;1;1;6;1;4520686784
2048;128;256;4;182;13;104436032
2048;256;256;4;182;13;107058336
4096;128;128;4;126;3;6000000
64;128;16;2;10;5;25092576
2048;128;256;4;195;1;13999840
512;128;1;4;182;3;67250688
2048;64;256;4;126;21;175411840
2048;128;256;4;234;3;6016032
2048;128;128;8;130;3;6377856
2048;64;256;4;126;3;5734272
8;32;4;1;7;39;398464096
8;1024;1;1;273;7;713265280
32;16;16;1;42;455;487611552
8192;512;256;1;315;234;140235328
64;512;16;2;9;3;9224064
64;1024;16;1;9;3;15397504
64;512;16;1;7;3;15377664
64;512;16;1;13;3;15978624
2048;128;256;4;117;5;13010944
2048;128;256;16;234;3;18446744073709551615
2048;128;256;4;78;13;110685088
2048;128;1024;2;126;3;18446744073709551615
2048;128;256;4;1365;3;8755808
2048;128;256;4;126;26;208064032
2048;128;256;4;7;3;6014912
2048;1;256;1;126;5;54198464
2048;128;256;4;126;10;54645760
128;128;1;4;117;1;131044544
1024;256;256;4;45;3;5760448
2048;128;256;4;195;3;5955040
512;1024;256;4;91;3;6496032
2048;128;256;4;105;10;58751264
2048;128;256;2;210;3;6972736
2048;128;64;4;26;3;6513376
8192;256;256;2;126;9;88586400
256;128;256;4;273;3;9629568
64;2048;32;1;9;2;9257888
128;128;16;2;10;5;20279328
32;2;32;1;45;195;3157408288
1024;256;32;2;90;91;279994624
2048;16;256;4;126;3;6446816
4096;128;256;4;35;3;5782880
512;128;256;4;126;3;6597920
2048;128;128;4;70;3;6860960
4096;128;256;4;65;2;6689920
4096;256;256;4;126;3;5503840
8192;128;256;8;126;3;18446744073709551615
1024;16;128;4;126;6;25536768
512;128;256;1;195;3;8819072
4096;256;512;2;126;15;111045312
4096;256;256;4;126;7;34002976
4096;256;256;4;117;3;5869312
4096;256;256;4;126;1;7755712
1;256;1;4;105;1;1222989408
8192;256;256;4;39;3;5874784
8192;256;256;4;126;3;5549920
4096;256;256;4;130;2;6985408
4096;256;256;4;126;10;54679616
2048;1024;256;4;126;2;7314464
4096;512;256;2;130;3;6416480
4096;256;64;1;126;3;5718208
4096;256;256;8;126;3;18446744073709551615
4096;256;256;2;126;3;6043808
4096;256;256;4;182;3;6075136
4096;256;256;4;90;5;33143072
8192;128;256;4;130;3;5848704
512;256;128;4;126;3;7131168
4096;512;1024;4;126;3;18446744073709551615
1024;256;128;4;126;3;6700736
4096;256;512;4;126;13;18446744073709551615
8192;256;1024;8;182;3;18446744073709551615
4096;512;128;4;117;1;12688800
4096;256;256;4;105;6;25840032
4096;256;256;8;117;3;18446744073709551615
4096;256;256;4;105;3;5802368
2048;256;256;4;126;2;7363648
4096;256;64;4;90;3;6724768
8192;256;256;1;210;3;6628704
4096;256;256;4;126;5;12773088
4096;256;256;16;126;3;18446744073709551615
4096;256;1024;4;210;13;18446744073709551615
4096;2048;256;4;210;3;5981408
4096;256;256;4;130;3;5842944
4096;256;256;4;130;6;26595680
4096;256;256;4;126;9;62454976
4096;512;256;4;273;3;5921216
2048;256;256;2;91;1;12625824
4096;1024;256;1;195;3;6531616
512;256;256;4;90;3;6590944
4096;32;256;4;105;3;5931648
4096;128;256;2;126;3;6090048
4096;256;256;2;126;15;129948352
4096;256;1024;4;91;15;18446744073709551615
2048;256;256;8;126;2;18446744073709551615
1024;512;128;8;117;3;6226784
4096;256;256;4;42;1;7649312
4096;1024;1024;4;126;10;18446744073709551615
4096;256;256;4;234;10;54711488
4096;512;256;4;126;3;5517856
4096;2048;256;4;126;7;33961568
4096;256;256;2;210;3;6881536
4096;1024;256;4;126;7;33898336
1024;1024;256;4;126;6;20480512
8192;256;256;4;126;10;54783456
4096;128;256;4;126;2;6550912
4096;256;64;4;126;3;6272032
4096;128;256;8;126;3;18446744073709551615
8192;2048;256;4;126;3;5983840
4096;256;256;4;126;2;6395072
256;256;256;2;126;3;6622368
8192;256;512;4;126;3;18446744073709551615
4096;2048;512;4;126;3;18446744073709551615
4096;256;256;4;182;1;7689696
4096;256;256;4;126;15;115969216
2048;256;512;4;39;3;18446744073709551615
4096;256;1;4;126;3;64365792
4096;1024;512;4;234;3;18446744073709551615
1024;512;256;4;126;3;5835424
1024;256;256;2;105;3;6685696
4096;256;256;4;91;5;16059872
4096;256;128;4;91;3;6161376
4096;256;256;4;42;3;5826944
1024;256;512;4;90;3;18446744073709551615
8192;256;256;4;210;3;5999232
8192;256;256;4;126;1;7676352
4096;256;256;4;390;3;6749728
4096;512;256;2;91;6;21054688
4096;256;256;4;45;14;97528640
16;8192;16;1;6;1;15320640
512;1;1;1;819;585;6027779424
512;16;8;2;546;546;422691392
1;1024;1;1;7;8190;313927712
32;2048;16;1;7;2;17954336
4096;512;256;8;126;3;18446744073709551615
2048;256;256;4;126;15;117504736
512;256;256;4;126;3;6559104
64;1024;32;1;9;3;8264256
128;512;16;2;9;3;8920224
64;512;16;2;10;3;9560192
128;256;16;2;10;5;17602400
4096;256;128;8;63;3;5859680
4096;256;256;4;78;6;15688544
8192;128;1;8;45;390;120328768
8192;2048;1;512;21;315;435208064
8;16;4;4;210;8190;5031414624
8192;4096;512;4;1;9;18446744073709551615
16;2048;16;1;6;1;15244896
128;256;1;4;126;3;67378688
1;256;1;4;126;3;786962304
32;1024;16;1;7;2;17767328
8192;256;256;4;390;1;7819392
128;512;32;2;9;3;6519872
64;512;32;2;9;3;6836608
32;256;32;1;234;1;42238464
1024;128;16;1;455;117;107234048
16;4;16;4;39;30;1835140416
1024;8;1024;2;6;1;18446744073709551615
2048;256;256;4;126;1;8213728
4096;512;256;4;126;7;34092832
4096;512;256;4;195;3;5956320
2048;2048;256;4;126;3;5546688
64;512;32;2;10;3;7292576
128;512;32;2;10;5;21734496
2048;256;256;4;105;3;5944032
8192;256;256;4;210;6;27198880
4096;256;128;4;390;3;8256768
4096;256;1024;8;91;3;18446744073709551615
4096;256;1024;4;42;3;18446744073709551615
4096;1;1;1;126;3;230798080
4096;256;8;4;546;3;12174848
4096;256;256;4;126;18;137854080
32;256;4;4;126;3;29363264
1024;1;1024;1;1;1;87562368
16;512;1;2;6;1;116462560
8192;32;1;32;585;195;198123232
4096;1;4;1;3;5;78743968
512;1024;256;2;126;2;8375936
4096;256;128;16;126;9;18446744073709551615
1024;256;128;8;126;3;6242176
4096;256;256;4;126;63;250170848
8192;256;256;2;126;3;6092128
1024;256;512;4;126;3;18446744073709551615
1024;256;256;4;117;3;6104640
4096;256;512;1;117;3;6007328
128;2048;16;1;63;65;179918784
256;1024;64;32;1;7;18446744073709551615
1024;1024;256;512;2730;390;18446744073709551615
256;4096;8;64;1365;42;103414336
4096;256;256;256;126;3;18446744073709551615
4096;256;256;32;126;3;18446744073709551615
1;256;1;4;126;3;788681632
4096;256;256;4;78;18;134994688
4096;256;64;4;210;6;30249152
4096;256;512;4;126;3;18446744073709551615
4096;1024;128;4;126;9;85210464
1;256;1;4;126;3;804026496
8192;256;512;4;78;3;18446744073709551615
64;4096;1;2;1;1;138689344
512;512;4;256;1;2730;200502880
4096;1;1024;1;1;3;22273568
64;4;16;2;15;210;771159072
8;64;4;4;126;1;188687072
32;16;16;1;390;1;138094240
16;32;1;1;7;39;499497536
8;32;8;1;1170;315;2416124320
4096;256;256;4;8190;3;17252480
4096;256;1024;4;126;3;18446744073709551615
2048;256;256;4;210;3;6004544
32;1;16;1;195;455;7138366944
8192;512;256;1;1;63;244771008
256;2;4;1;45;195;1197612608
256;512;32;1;35;1;15437280
32;1;1;1;819;585;5746864928
256;16;8;4;546;1170;1077630336
512;1024;16;64;45;8190;415403008
64;256;16;4;126;3;13852320
4096;256;256;4;45;3;5811488
4096;256;16;4;126;3;7174560
1024;256;256;2;210;7;59995360
1;16;1;4;126;3;3806182848
1;256;1;4;234;3;1403137408
2048;512;256;16;126;3;18446744073709551615
8192;128;1;8;45;1;63933664
2;4;2;1;21;45;11118827360
8;16;2;4;210;15;881827520
512;32;512;4;210;273;18446744073709551615
1;256;1;1;234;234;1874013920
128;128;16;1;130;117;158255808
16;32;16;8;630;30;562009248
1;8;1;1;6;10;8625337536
4096;256;256;4;90;3;5822016
4096;64;256;4;455;315;325914016
4096;256;256;4;126;1170;359511264
8192;256;1024;1;130;3;6008544
1024;2;1024;2;1;1;18446744073709551615
8192;256;256;4;585;195;284264928
2048;256;32;4;126;13;133772544
4096;256;256;4;126;70;222047872
4096;256;256;4;126;819;369943360
64;4;32;2;1365;5;465813280
128;2048;16;1;585;65;79236192
2048;128;64;32;90;105;18446744073709551615
128;256;32;1;5;390;176947936
4096;2048;256;4;126;3;5662272
4096;1024;256;4;130;3;5845664
4096;256;8;4;126;3;10014848
4096;128;1024;4;126;4095;18446744073709551615
4;256;4;4;126;3;203256832
1;256;1;8;126;9;1514726112
1;128;1;4;126;7;1349420000
1;1024;1;4;126;3;788478304
4096;128;256;4;117;3;5876672
256;32;8;1;1365;42;73032608
64;4096;1;1;1;1;259319136
4;512;4;8;1;2730;62023392
1024;256;2;32;42;3;44657792
4096;256;512;4;65;13;18446744073709551615
4096;512;256;2;234;26;191062912
2048;512;128;4;126;3;6307072
16;4;1;2;90;26;1112372736
1024;64;4;4;126;65;169097792
1;8192;1;4;390;1;2415156608
8;512;4;64;117;39;277420032
4096;256;256;4;91;3;5836608
4096;32;1;4;126;3;64059424
4096;256;128;4;182;3;6441632
4096;256;256;8;130;3;18446744073709551615
4096;256;256;4;819;3;7139104
4096;256;256;16;90;3;18446744073709551615
4096;256;256;8;126;10;18446744073709551615
4096;256;256;4;18;3;5888000
4096;256;256;4;1365;3;7500544
128;256;1;4;455;3;85925696
4096;8192;256;4;126;3;6547744
2;256;1;4;126;3;402028416
4096;128;256;4;126;1;7775104
4096;256;256;4;585;3;6494208
64;256;2;8;126;90;136816416
4096;256;256;2;210;65;203195168
4096;2;256;1;126;3;9488096
4096;256;32;4;126;3;6541088
4096;256;256;4;9;3;6008576
4096;256;16;4;315;3;8385216
4096;2048;256;2;126;3;6031456
4096;1;256;1;126;8190;53240616224
256;256;256;4;126;3;8513760
4096;256;256;256;126;26;18446744073709551615
4096;256;256;256;455;65;18446744073709551615
8;1024;1;1;273;182;543439808
32;128;16;32;42;455;125545216
8192;512;1;1;315;234;368413152
256;2;4;2;45;195;1303460960
256;512;32;1;4095;1;177130496
32;1;1;1;819;90;2191646400
4096;256;1;1;182;3;224460864
4096;256;256;4;45;2;6736800
2048;256;128;4;91;3;6517280
4096;256;256;32;126;9;18446744073709551615
16;256;8;4;126;3;54289856
4096;4;256;4;126;3;6224224
4096;1024;256;256;18;3;18446744073709551615
4096;256;256;64;126;3;18446744073709551615
4096;1;256;1;126;3;17734080
512;1;8;1;546;546;5426866080
512;4096;4;4;7;8190;121403072
8192;128;1;8;26;234;62303168
1;512;1;512;21;1;901119296
4096;256;512;8;105;3;18446744073709551615
4096;256;512;16;65;3;18446744073709551615
8;16;4;4;210;15;955320096
512;32;512;4;210;117;18446744073709551615
32;1;32;1;1;1;1758111072
8192;128;16;1;455;117;109206368
4096;256;256;1;126;3;6242240
4096;8192;256;4;126;105;221500832
4096;256;256;4;70;3;5813248
4096;128;1024;4;126;14;18446744073709551615
4096;512;256;8;195;3;18446744073709551615
4096;256;256;16;117;7;18446744073709551615
16;32;16;8;1638;819;2628663552
1024;8;128;1;6;10;19638240
1024;1;32;1;1;1;66074240
8192;32;1;2;585;1;228958336
4096;256;4;4;8190;3;68307360
8192;256;256;4;70;3;5863424
2048;256;256;2;42;3;6063968
4096;256;32;2;126;7;44618560
2048;256;128;4;210;3;8240512
4096;1024;4;128;1365;5;42751040
128;2048;1;1;546;65;443396832
256;1;1;1;6;7;599241440
32;256;32;1;5;585;206392800
4096;256;256;64;2;3;18446744073709551615
4096;256;256;4;234;3;5917888
4096;256;4;4;70;39;215752800
1024;256;256;128;126;3;18446744073709551615
256;256;256;4;126;15;121086272
1;256;1;4;90;10;826441600
4096;512;512;8;126;3;18446744073709551615
256;32;8;2;15;30;122081344
8;4096;1;2;1;1;138586464
2;512;1;8;1;2730;88988736
4096;1;1024;1;1;3;22278048
64;32;8;16;15;26;60197760
8192;64;4;32;126;273;152954400
2;32;1;4;126;3;1170096384
512;256;2;2;126;3;59369952
4096;256;256;4;455;455;414192160
1;256;1;32;126;3;1390625312
4096;1024;256;4;126;5;12717792
32;8192;16;1;390;390;216708864
8;512;4;64;117;1365;369135616
8;1;1;1;273;182;8797334400
2;1;1;1;42;455;40232293152
4096;256;256;4;15;3;5948704
4096;256;256;4;315;3;6086624
4096;16;256;4;126;3;6401632
8192;8192;256;1;315;234;140687072
256;2;4;1;65;35;206124992
4096;256;256;4;126;91;237003296
8;8;2;4;35;1;1446089184
256;1;1;1;819;90;729449888
16;16;2;2;546;1;214731168
512;4096;128;4;5;8190;642476256
256;256;256;16;126;3;18446744073709551615
32;128;1;32;195;234;175827200
256;8;4;2;21;5;89308864
8;16;2;4;210;39;1018715552
2048;32;1;4;210;117;137983488
1;256;1;2;234;1;1334539840
1;16;1;16;455;117;10576409824
16;1;1;1;18;195;5758701088
1;1;1;1;6;10;67469716064
64;256;2;8;9;3;35147520
4096;256;256;4;39;3;5808736
4096;256;4;4;1365;3;27547936
4096;64;256;4;126;5;12671968
4096;256;256;4;126;390;175943552
4096;256;256;1;126;3;6247840
4096;256;256;128;126;3;18446744073709551615
1024;512;32;16;182;1;9760992
8192;32;32;32;585;195;286811296
512;1024;4;1;1365;90;140178560
128;1;16;1;546;65;1008075648
4096;256;128;2;4095;3;9400640
4096;256;256;4;78;3;5783008
4096;256;256;4;210;3;6010944
4096;256;128;4;90;3;6969760
4096;256;128;4;126;3;6059136
2;1024;1;128;6;7;147321824
128;256;32;1;5;105;221948928
4096;32;8;1;1365;42;75894752
8;4096;1;1;1;1;258566752
8;256;1;4;126;3;97664320
4096;256;1;4;126;3;64360608
4;1;1;1;630;2730;21304545856
128;128;4;32;1;3;29685856
1;32;1;4;2730;26;23260607744
32;64;4;2;126;273;119089344
256;256;256;256;126;3;18446744073709551615
4096;256;512;16;126;3;18446744073709551615
32;32;16;4;390;117;291246656
8;512;1;64;117;39;272409088
8;1024;8;8;1;182;132977728
32;32;16;32;42;455;333209952
512;16;64;4;126;3;9212000
4096;256;128;16;126;195;18446744073709551615
8192;512;512;1;1;234;115666112
256;2;1;1;65;315;1633997088
256;512;32;1;35;78;176978368
256;1;1;1;455;90;730088160
8192;512;256;4;126;3;5547808
1;256;1;4;130;1;807226400
4096;256;256;4;126;6;17207904
4096;256;256;1;126;130;172108704
64;16;16;1;546;1;52730400
512;1;1;1;7;8190;52529680512
2;128;2;8;26;2;283248384
256;8;32;2;21;5;48087968
8;512;1;4;126;3;97706976
4096;512;256;8;126;2;18446744073709551615
4096;128;256;8;126;7;18446744073709551615
1;256;1;4;117;3;724417184
4096;64;512;4;126;3;18446744073709551615
4096;512;256;4;126;10;54032640
4096;256;128;1;126;3;6439520
4096;256;128;8;195;7;48177888
4096;256;512;4;126;1;18446744073709551615
4096;256;128;8;234;6;23223168
4096;256;256;8;91;3;18446744073709551615
4096;256;256;4;90;9;68282080
8192;256;256;8;126;3;18446744073709551615
4096;256;512;4;126;7;18446744073709551615
4096;2048;256;1;126;3;6294880
2048;256;256;4;182;3;6064064
4096;512;256;4;117;3;5889024
4096;256;256;8;126;5;18446744073709551615
1024;256;512;2;78;3;6165824
4096;128;128;4;117;3;6118496
4096;64;128;8;126;3;5884288
4096;4096;256;4;126;10;54312992
2048;256;128;4;126;6;18260896
512;256;256;4;546;3;10464672
4096;256;256;4;195;3;5962816
8;64;2;1;210;6;234252960
4096;32;256;4;210;117;147769024
1024;256;64;1;234;39;254829504
128;128;16;1;819;63;166967680
4096;256;256;4;126;13;108513216
4096;512;256;8;126;5;18446744073709551615
4096;256;128;4;126;15;137300288
1024;256;128;4;126;1;9338144
4096;1024;512;2;126;3;5705344
4096;128;256;4;130;3;5837216
4096;256;128;8;126;3;5811744
4096;256;256;1;126;14;125146752
2048;1024;256;16;126;3;18446744073709551615
1;128;1;4;78;3;503785120
4096;128;256;8;117;9;18446744073709551615
4096;512;256;16;126;3;18446744073709551615
4096;256;64;4;45;3;6398240
2048;256;512;4;126;3;18446744073709551615
4096;512;64;4;126;15;144618592
2048;256;128;2;126;5;33558720
2048;4096;512;4;91;5;18446744073709551615
8192;128;256;4;126;2;6599264
512;256;256;4;182;3;7031872
8192;256;256;2;126;10;82767232
4096;256;256;4;126;30;272301920
4096;256;256;2;65;3;5920320
4096;512;256;2;126;3;6105600
8192;256;256;1;182;3;6541696
4096;1024;256;4;195;3;5972480
4096;256;512;8;210;9;18446744073709551615
4096;64;64;4;126;3;6310752
4096;256;1024;2;126;2;18446744073709551615
2048;256;256;4;130;18;136388128
4096;256;256;16;126;2;18446744073709551615
4096;256;128;4;126;10;84758656
4096;256;256;4;90;2;6900288
4096;256;512;32;126;3;18446744073709551615
1024;512;512;4;273;3;18446744073709551615
4096;64;32;4;126;3;6571136
4096;256;256;4;63;2;6675168
4096;256;512;1;126;15;123042304
1;256;1;1;126;3;804043840
4096;256;256;2;126;5;29908000
1;256;1;4;90;3;555700128
4096;64;256;4;234;6;20365632
4096;64;256;4;195;3;5965344
4096;256;512;4;65;2;18446744073709551615
4096;256;256;8;126;2;18446744073709551615
8192;512;256;4;126;2;6523520
4096;256;256;2;90;1;7969152
4096;256;64;4;30;6;25600544
4096;256;128;4;126;13;132137344
4096;1024;256;8;126;3;18446744073709551615
4096;512;256;8;126;1;18446744073709551615
4096;256;256;8;65;3;18446744073709551615
4096;256;256;4;63;3;5787104
4096;256;128;4;91;2;6988032
4096;256;128;16;130;3;18446744073709551615
2048;256;256;4;105;1;12239392
4096;256;256;4;21;2;6778656
4096;256;256;4;273;15;107828896
4096;512;128;4;126;3;6042112
2048;256;256;4;130;3;5827008
4096;128;1;16;126;7;134174944
4096;1024;128;4;126;3;6029312
4096;256;256;4;63;1;12115424
4096;512;256;4;126;15;118425600
4096;1024;512;4;126;3;18446744073709551615
1024;256;256;4;63;7;32365280
4096;256;64;4;182;3;6631616
4096;256;256;4;455;3;6513568
128;32;2;8;630;30;89662496
4;1024;2;256;1365;10;3508031936
256;512;32;16;182;1;9698816
8192;32;1;8;585;195;180789504
256;1024;4;1;1;5;91219456
128;2048;8;1;585;65;136535392
2048;1;64;1;2730;1;24553312
1;256;1;1;182;390;1457511040
256;32;1;1;1;42;299241184
1;4096;1;2;182;1;1038304800
4;1024;1;8;1;2730;49685344
4096;2048;1;32;2;3;47648064
4096;512;256;16;210;3;18446744073709551615
4096;128;256;4;126;7;33960576
2048;128;256;4;130;3;5812864
64;32;1;32;15;26;104000608
64;64;4;4;910;273;458588160
1;8192;1;4;1170;1;7066970144
1;512;1;64;1;39;232174144
1;1024;1;8;1;1;63373504
32;128;32;32;42;546;129138112
8192;512;32;1;1;234;121509280
256;128;1;1;65;35;408134368
4096;256;256;4;126;195;143877984
1;4;1;4;126;3;12783168096
256;256;32;32;126;3;8534048
4096;8192;256;16;126;630;18446744073709551615
4096;256;256;4;35;3;5843584
4096;256;256;4;4095;13;95605152
4096;1;256;1;126;6;58378208
