GLOBAL_SIZE_0;GLOBAL_SIZE_1;LOCAL_SIZE_0;LOCAL_SIZE_1;v_TP_111;v_TP_112;cost
1;64;1;1;46;89;1638838766
4;2048;1;256;2;2;2045014616
128;4;64;4;1;2;17075968253
32;2048;4;4;1;1;1112456657
32;2048;4;32;1;1;5485071000
8;128;8;1;46;2;660132231
32;2048;4;4;178;1;629348816
8;1;2;1;46;2;8830149194
128;256;64;64;89;89;18446744073709551615
4096;1;32;1;4094;178;161225251
128;1024;4;16;4094;1;580082471
1;512;1;4;89;178;1146101442
4096;4096;32;4;4094;178;1007748203
4096;1;32;1;4094;178;156618796
4096;1024;1;4;4094;178;653408171
4096;1;32;1;89;178;145545295
4096;1;32;1;4094;178;293908044
2048;1;32;1;46;178;159984167
4096;512;32;8;89;178;96663709
4096;2048;32;8;89;178;99316336
64;1;32;1;89;178;817825228
4096;1;32;1;1;178;167407875
32;128;2;2;1;1;539911007
1;2;1;1;89;2047;16336259083
1;1024;1;4;4094;178;8062845669
4;4;2;1;89;23;2524222619
4096;512;128;8;89;178;18446744073709551615
4096;512;32;8;89;23;190808590
4;1;2;1;89;178;8511888709
4096;32;16;8;89;178;730793672
4096;8;2;8;1;23;504285185
4096;128;32;8;89;178;112196172
4096;512;32;8;89;2;648465774
1;4096;1;256;46;178;789423568
2;128;2;1;1;46;284236335
128;16;1;1;1;89;445082643
2048;256;4;2;2;2;333124305
1024;128;32;8;89;178;113795960
4096;16;32;2;89;178;770125682
1;512;1;8;89;178;1472273017
4096;512;8;256;89;178;18446744073709551615
2;2;2;1;178;1;32394428891
512;1;32;1;1;23;310427921
512;256;32;4;89;178;110955713
512;2;16;1;4094;89;162745626
32;512;32;8;89;178;419458559
512;1;32;1;89;178;185725711
4;512;4;8;1;178;252385464
4096;512;32;8;2047;178;1162008639
4096;512;32;4;89;178;103311129
4096;512;32;8;4094;23;202244257
4096;512;32;32;89;178;18446744073709551615
4096;512;32;2;89;178;144511292
4096;512;8;8;2047;178;1108268864
4096;512;4;8;89;178;169050129
4096;512;32;8;1;178;163972002
4096;2048;4;2;178;4094;343448591
1;512;1;1;1;4094;349270465
1;4;1;2;4094;2047;16231062416
2;1024;1;1;2047;178;8488630437
4096;512;32;8;89;1;1248142136
4096;512;256;8;89;1;18446744073709551615
4096;512;1;8;89;178;359577093
128;512;4;8;89;178;191378379
4096;512;32;16;89;178;18446744073709551615
2048;512;32;8;89;2047;85897334
512;512;16;16;89;178;88659336
2048;256;32;16;89;2047;18446744073709551615
2048;256;64;8;46;2047;18446744073709551615
2048;1024;32;8;89;178;96675793
2048;512;32;8;46;2047;84213500
2048;512;64;8;23;2047;18446744073709551615
2048;1024;32;8;46;2047;84677335
2048;512;8;2;46;178;93126668
4096;512;16;8;46;2047;84961543
2048;128;32;8;46;2047;94333459
2048;512;32;16;46;2047;18446744073709551615
2048;2048;16;8;46;178;91745670
2048;1;32;1;89;2047;579346439
2048;1024;32;8;46;89;124782255
2048;512;128;16;46;2047;18446744073709551615
2048;128;32;16;46;2047;18446744073709551615
2048;512;32;8;178;2047;84987998
8;512;2;8;4094;2047;998495292
2048;512;1;256;46;2047;515402510
2048;1;32;1;1;2047;581218231
1;2048;1;1;1;23;353401470
256;4096;16;8;2047;46;956082351
1024;4096;8;2;23;1;613343179
4096;1;256;1;1;4094;214223709
2048;512;128;8;46;4094;18446744073709551615
1024;512;32;16;2;2047;18446744073709551615
128;512;32;8;46;2047;82507249
128;512;16;4;46;2047;82301168
128;512;32;8;89;2047;86124336
128;256;32;8;46;178;128812628
128;512;64;8;46;2047;18446744073709551615
128;1024;4;4;46;2047;183964421
512;512;16;4;46;2047;83474876
64;512;16;4;46;2047;82814582
128;256;16;4;46;2047;82944002
128;256;16;4;46;178;109510997
256;512;16;4;46;2047;82379794
64;512;64;4;23;2047;88776585
128;512;16;1;46;1;1085303375
256;512;64;2;46;2047;88280295
128;512;16;4;46;4094;81650958
128;1024;32;4;46;4094;78582963
128;512;16;4;23;2047;84061295
128;512;4;8;178;2047;319443092
128;2048;32;4;89;4094;91749046
128;512;64;4;46;4094;83799211
128;1024;32;2;89;4094;81510001
32;1024;32;4;89;4094;79633003
64;1024;32;4;46;4094;81548000
128;1;32;1;46;4094;1110008231
128;2048;16;4;46;4094;81453542
128;2048;32;2;46;4094;83382458
128;512;64;4;46;1;2296722238
128;512;32;4;46;4094;78258334
128;512;32;4;46;2047;82626792
128;512;32;1;23;2047;90437084
128;512;32;4;23;4094;80790786
128;512;32;4;46;1;1241541147
128;512;32;4;46;178;123996587
128;1024;4;4;23;4094;147885042
128;512;32;4;89;4094;79376916
128;512;64;8;46;4094;18446744073709551615
1024;512;32;2;46;2047;84750959
128;64;128;4;46;4094;18446744073709551615
256;512;32;4;46;4094;78558792
64;2048;32;4;46;4094;82744710
32;1024;32;2;46;4094;83810419
256;256;32;4;46;4094;79690460
128;1024;32;4;46;1;1241294050
64;512;32;4;46;4094;78430253
128;128;16;2;46;4094;84306002
64;512;32;2;46;2047;85032502
128;512;32;8;46;4094;78368751
128;2048;32;8;46;2047;82553460
1024;64;32;4;46;4094;80458419
128;1024;64;4;46;4094;82684752
512;512;32;4;46;4094;79506709
256;256;32;4;46;2047;81704710
128;256;32;4;89;4094;81098293
128;2048;32;8;23;4094;80676878
128;1024;64;4;178;4094;84803545
128;512;128;4;46;4094;18446744073709551615
128;256;64;4;46;4094;83391500
128;512;16;8;46;4094;78920961
128;512;32;2;46;4094;83809253
128;512;32;16;46;4094;18446744073709551615
512;512;32;8;46;4094;79264334
128;512;32;4;89;1;1325582720
64;4;1;1;23;1;529492392
4;1;4;1;178;46;9376610667
1;4096;1;2;89;23;1162091582
128;512;16;4;46;1;1139650356
128;256;32;4;46;4094;79087793
128;4096;16;4;23;1;1121298232
128;1024;16;4;46;4094;81832751
128;512;32;1;46;4094;92458124
2048;512;16;8;46;4094;81814628
128;512;32;2;178;1;2173226773
128;512;32;2;23;1;2114922736
128;128;32;2;46;4094;83249713
128;128;32;4;23;4094;90547001
128;128;32;1;46;2047;94478961
256;512;32;4;46;2047;81384752
256;512;32;8;46;4094;79999170
128;1024;32;4;46;2047;82681210
64;512;16;1;46;4094;160630500
32;512;32;4;23;4094;80179045
256;512;32;4;89;4094;79587667
128;512;64;2;46;4094;83970582
128;512;32;16;46;1;18446744073709551615
256;1;32;1;46;4094;1109771662
128;512;8;8;46;2047;80550668
32;512;32;8;46;4094;78003584
128;256;32;4;46;2047;81642835
256;512;32;2;46;4094;83146584
8;128;2;8;46;4094;353909883
32;1024;32;8;46;4094;78013248
32;512;32;8;46;2047;83021419
64;256;32;8;46;1;1299294212
32;512;16;32;46;1;18446744073709551615
64;512;8;8;46;4094;78568043
32;512;16;4;23;4094;81639837
8;512;1;4;46;4094;466927016
32;512;32;32;46;4094;18446744073709551615
32;2048;32;8;23;4094;79418334
64;512;32;8;46;4094;78284377
32;256;32;8;46;4094;78070254
32;512;32;8;89;4094;82410542
32;512;32;4;46;4094;82956170
32;512;32;8;89;1;1433967935
16;512;1;8;89;4094;385036002
64;256;32;8;46;4094;80854794
16;512;1;16;46;4094;581759641
32;512;32;16;46;4094;18446744073709551615
32;512;1;8;46;4094;392523254
32;512;2;4;46;178;243894795
8;512;2;8;46;1;556725334
32;512;32;8;46;178;317572834
32;512;32;8;23;2047;86111875
32;512;1;8;89;4094;387188548
32;256;16;8;46;4094;87160879
32;128;1;8;46;4094;571777268
8;128;2;8;46;2047;608813679
32;128;32;8;46;4094;79837459
32;512;1;4;46;4094;566923932
128;256;32;4;89;2047;82906544
32;512;32;8;4094;4094;150372214
32;512;32;8;46;1;1336298250
32;2;32;2;46;2;17224776833
2048;2;32;2;1;2;2538214712
32;16;32;8;46;2;2407276591
32;256;32;8;1;2;3199694891
32;8;32;8;46;4094;159971668
32;2;32;2;4094;2;17501245937
32;2048;32;8;1;2;2533872636
32;2;32;2;46;2;17224659259
1;1;1;1;46;2;48427336958
32;2;32;2;46;2047;574510971
32;2;1;2;46;2;880292465
32;2;32;2;2047;2;19497811750
32;2;32;2;1;2;32128081708
256;2;32;2;46;2;2489460502
32;2;32;2;89;2;16254994042
32;2;1;2;46;2;880287424
32;2;32;2;178;89;813303718
32;2;32;1;46;2;17499289083
32;2;8;2;1;2;8239400676
2048;2;32;2;46;46;399829717
32;2;32;1;46;2;17499071021
32;8;32;2;46;46;321401506
32;4;32;2;46;23;789209335
32;2;32;1;1;2;15978925916
32;2;32;2;89;1;29879940537
8;2;2;2;46;23;2423793213
32;2;32;2;23;2;18057562380
128;2;32;2;89;2;4488089708
64;2;32;1;46;1;14744575583
32;4;16;2;46;2;4325852624
64;1;64;1;46;23;3070820886
32;2;32;1;46;2;17505670146
16;4;1;2;46;2;913103232
64;4;16;2;23;2;2442353957
32;4;16;1;46;2;4582707274
16;4;16;2;46;2;8766855147
32;4;16;4;46;2;4761880949
32;4;4;1;46;2;1168078070
32;1;16;1;46;23;2336409959
8;1;1;1;2;2;5781903584
32;16;16;1;46;2;1292695921
64;4;16;2;46;2;2300110158
32;8;16;2;46;2;2279024162
32;4;16;2;89;2;4137590761
32;4;16;2;23;1;7650769914
32;2;16;2;46;2;8529870478
32;32;2;2;46;2;188726382
32;4;16;2;46;89;366476847
32;4;1;2;46;2;452236337
32;4;16;2;46;1;7375837323
64;4;16;2;89;2;2104746211
128;4;64;2;46;2;4520111459
8;4;1;2;46;23;1334121417
32;4;16;2;23;23;654572763
32;4;8;1;46;2;2301528446
2;8;2;2;178;1;8480307063
128;64;4;4;46;4094;163914375
1;256;1;1;23;23;846065129
1;1;1;1;2047;178;32882523708
32;4;1;2;46;1;494196678
32;4;16;2;46;4094;548706556
32;256;16;2;46;2;680503380
32;1024;32;2;46;2;1317892676
32;4;1;1;46;2;874368052
8;2;1;2;46;2;3009575002
32;16;16;2;178;2;1211110866
32;4;32;2;46;2;8720264137
32;1;16;1;46;2;17279176720
1024;1;1;1;1;2047;16329387153
8;1;8;1;23;2;33507756604
128;16;16;2;46;2;706211603
4;512;2;2;46;2;1317259542
32;1;16;1;46;2;17282102500
32;4;2;2;46;2;582523760
32;64;16;2;46;2;703520933
16;4;16;1;23;2;8765183302
32;4;16;2;46;1;7376267172
8;16;8;8;89;2;2396149140
16;2;16;2;89;2;16243611686
64;4;64;2;46;2;8835799951
32;32;16;2;46;2;703518847
32;4;16;2;2047;2;4941567787
32;4;8;2;46;2;2181016216
32;4;16;2;1;2;8033797748
512;128;32;64;89;46;18446744073709551615
256;4;4;1;178;23;894363092
64;2;32;1;2047;89;407146717
32;128;32;16;2047;46;18446744073709551615
16;4;1;2;46;1;1158651528
1;64;1;16;46;89;1220808562
32;2;1;2;89;1;952522085
1;64;1;4;46;89;1302629605
64;16;16;2;46;2;711178934
32;4;4;2;46;2;1121274921
16;4;16;2;46;23;1242395552
32;4;32;2;23;23;837615352
32;4;16;2;23;2;4558126681
32;4;16;2;89;23;594489729
8;4;2;2;46;2;2308138971
16;2;16;2;46;1;29234278218
32;4;16;1;178;2;4553612338
32;512;16;2;178;2;843743250
32;1024;16;2;46;2;684553340
32;4;16;4;23;2;4639743182
16;4;16;2;46;1;15081653584
32;4;32;1;46;23;814395178
32;4;2;4;46;2;694210927
32;4;8;2;46;2;2180895224
32;4;16;4;2;2;8277481523
32;4;16;2;1;2;8033768581
1;4;1;2;46;2;12287994071
32;4;16;2;2;2;4068482464
512;128;128;1;46;2;2458040326
8;1;2;1;46;4094;15783000657
4096;256;64;64;89;89;18446744073709551615
4096;1;32;1;2;178;168174213
16;4;16;2;89;2;8229947000
8;4;1;2;46;2;1536470465
16;4;8;1;46;2;4645359583
64;64;1;1;89;46;294998295
32;2;8;2;2047;23;861112863
32;4;32;2;178;2;8739700228
128;4;8;2;23;2;752765336
32;4;16;2;46;23;607713589
32;4;8;2;46;2047;532418379
128;4;32;2;23;2;2473027000
256;4;16;2;46;2;772641854
16;2;4;2;46;2;4368616656
16;16;16;2;89;2;2290562601
32;8;1;2;46;2;234992338
64;4;32;2;23;2;4660240291
2048;1;4;1;46;46;780854644
4;4;2;2;46;2;4630976750
128;4;16;2;2;1;2197236441
2048;4;16;2;46;2;655134725
64;4;2;2;46;2;339109251
128;1024;4;16;4094;1;580116646
1;512;1;1;178;178;1872033036
32;128;2;4;1;2047;508174378
1;4096;1;64;89;2047;855476394
512;4;8;1;89;46;890934679
64;4;16;4;46;2;2478511069
4;8;4;2;46;2;4720741935
32;2;16;1;46;23;1207941799
256;16;64;4;2047;89;332513472
256;2;32;1;4094;89;210828167
128;2;16;2;4094;46;206789586
512;4;8;1;2047;46;907288617
32;512;16;2;46;2;680695753
32;4;16;2;46;178;392101223
32;4;16;2;46;46;416135559
4096;4;16;2;46;2;654587171
16;8;16;1;46;2;4854227702
16;1;2;1;23;1;7111650718
8;4;1;1;46;2;1594554848
32;4;1;2;46;23;559576719
32;4;1;2;46;2;451125600
512;4;256;2;46;2;18446744073709551615
32;4;16;2;178;2;4428624464
1;1024;1;64;89;178;1056047334
4;4;2;1;89;23;2524520558
1;4096;1;1;46;1;1946494143
2;128;1;1;1;46;304475466
32;4;32;1;46;1;15537724083
32;4;32;2;23;2;9033499878
128;4;8;1;46;2;692608515
512;16;32;2;2047;89;143905798
128;16;32;1;4094;89;411863208
2;4;1;2;46;2;6107154750
32;4;16;4;1;89;1402277817
32;2;16;1;89;1;15124299083
64;4;8;2;46;2;1177947750
64;4;4;1;1;2047;1022997012
32;16;2;1;46;1;526149130
16;2;16;2;46;2;17209994634
16;8;16;2;46;2;4542711628
16;2;8;1;23;2;8473862272
