GLOBAL_SIZE_0;GLOBAL_SIZE_1;GLOBAL_SIZE_2;LOCAL_SIZE_0;LOCAL_SIZE_1;LOCAL_SIZE_2;cost
2;1;16;1;1;1;877214927
64;16;2;2;16;2;564097917
8;1;8;1;1;1;1088572581
8;256;1;2;64;1;556645810
16;1;1;2;1;1;1834887028
64;1;1;8;1;1;1216800985
1;8;4;1;1;1;771395797
32;2;2;2;1;2;492205383
256;128;64;256;8;2;18446744073709551615
64;4;2;32;4;2;1008272378
128;64;8;2;8;8;780242941
4;64;128;4;16;64;18446744073709551615
32;2;2;2;2;2;411382586
32;2;2;8;1;2;531849437
32;1;2;2;1;2;883719130
32;64;2;2;1;2;1014469916
32;2;4;2;2;4;452101333
32;2;2;4;2;2;392898463
32;2;16;2;2;4;612156959
32;2;2;32;2;2;1170639251
32;1;2;4;1;2;880965570
32;2;2;4;1;2;514829594
32;1;2;4;1;2;875340135
32;2;2;32;2;1;696909731
128;2;2;64;2;2;1056219549
32;2;8;4;2;2;1204443484
8;2;2;1;1;2;738249059
32;32;256;32;8;32;18446744073709551615
32;4;2;8;1;1;737383270
32;2;2;8;1;2;455203134
32;2;1;1;2;1;1087585556
32;2;2;4;2;2;410555625
32;2;2;4;2;2;399402841
32;2;2;4;2;1;697574252
1;8;2;1;2;2;1433323415
32;64;64;1;16;8;1526442298
256;1;64;2;1;1;1719514841
64;16;32;4;16;1;896605944
1;1;256;1;1;1;406088597
32;128;32;8;2;8;1844738792
16;256;256;2;8;1;1127357130
64;2;8;2;2;4;918010146
4;8;1;4;1;1;1301128721
32;2;16;32;2;1;1562572414
32;2;2;4;2;2;436112556
64;2;1;2;2;1;673112984
32;2;2;4;2;2;401896501
32;4;2;4;1;2;507598143
16;2;2;8;2;2;799718033
32;2;2;4;2;2;409446002
32;64;2;4;4;2;1554220834
32;2;2;4;1;2;499146853
32;2;1;4;2;1;1078247622
32;32;2;4;8;1;1176423730
32;2;2;4;1;2;489736585
32;2;2;4;2;1;711772472
32;2;64;4;2;32;1349451936
32;2;2;4;2;2;394676841
32;2;2;4;2;1;687233422
32;2;2;4;2;2;390004681
32;256;2;4;1;1;1256140376
32;2;4;4;2;2;482466432
32;64;2;4;4;2;1615380426
32;1;2;4;1;2;874027734
128;2;2;1;2;2;907521922
32;1;2;4;1;2;918453158
32;1;2;4;1;2;873570052
32;256;128;4;1;2;1176969951
32;2;2;8;1;2;478390720
32;128;2;8;2;2;1547006538
32;256;2;4;1;2;986442665
8;2;2;1;2;2;726937674
4;2;2;4;2;2;1388963351
64;2;2;2;2;2;355289090
32;2;2;1;2;2;394884758
2;2;128;1;2;128;112889836
2;2;128;1;2;128;110759919
32;2;8;4;2;8;915659407
2;128;128;1;2;128;1362143553
2;2;128;1;2;128;109486961
16;2;128;8;2;128;18446744073709551615
2;128;128;1;16;128;18446744073709551615
2;64;1;1;1;1;700243421
2;2;128;1;2;128;107307292
2;2;128;1;1;1;294213174
2;4;128;1;4;128;18446744073709551615
2;2;128;1;2;128;108581125
2;1;128;1;1;64;181370841
2;2;4;1;1;2;1425350054
2;2;128;1;1;128;85986999
128;2;128;1;2;128;168894712
2;2;128;2;1;128;115547959
2;2;128;2;1;128;108063920
2;2;128;2;1;128;118705502
2;2;16;1;2;4;440662008
2;2;128;1;1;8;1159517816
8;2;128;8;1;128;18446744073709551615
8;2;128;1;1;128;910902844
2;2;128;1;1;16;986376253
8;8;128;1;1;128;1222637842
2;16;256;1;8;128;18446744073709551615
2;2;128;1;2;2;863286344
2;64;128;1;2;8;1795208875
4;2;128;4;1;128;18446744073709551615
256;2;2;256;1;2;18446744073709551615
2;2;32;1;1;2;328235302
2;2;128;1;1;128;117178418
2;2;8;1;1;8;770960803
2;2;2;1;1;2;2766687932
2;2;128;1;1;128;86014501
2;8;128;1;2;128;365635550
2;32;128;1;4;128;18446744073709551615
128;2;128;1;1;128;147360793
2;2;128;1;1;2;201958003
2;2;128;2;1;128;119672085
256;2;128;256;1;2;18446744073709551615
2;4;128;1;4;1;1386094026
2;2;256;1;1;128;112505586
2;2;128;1;1;128;106916752
2;1;128;1;1;128;161733337
64;2;4;2;1;2;946397322
2;2;128;1;1;2;179006463
2;4;128;1;2;128;120651961
2;2;128;1;1;4;1134770000
2;2;128;1;2;8;1157166640
2;2;128;2;1;128;107441129
2;2;128;1;1;32;124130171
2;4;4;1;4;2;751038031
1;2;128;1;1;128;173032130
2;2;128;2;2;128;18446744073709551615
2;32;128;2;4;128;18446744073709551615
2;2;128;2;1;128;107116296
256;32;128;256;2;128;18446744073709551615
2;1;128;1;1;128;161810626
1;2;128;1;1;8;200596299
2;256;128;1;256;16;18446744073709551615
2;2;128;1;2;128;113995921
2;8;128;1;1;1;510633223
2;2;4;1;1;2;1425948035
2;2;1;1;1;1;5431807077
2;4;128;1;4;128;18446744073709551615
2;2;128;1;1;64;85987296
2;64;128;1;2;128;1537355964
2;16;128;1;8;128;18446744073709551615
2;2;128;2;1;1;181840799
2;2;128;1;2;128;107889792
2;2;1;1;2;1;5431437857
2;2;128;1;1;1;364627468
256;2;128;256;1;128;18446744073709551615
2;2;128;1;1;1;287847293
2;64;128;1;2;32;2046426025
32;2;128;4;1;1;2338180958
32;2;128;4;1;128;18446744073709551615
128;2;128;64;1;128;18446744073709551615
64;2;128;2;2;128;18446744073709551615
2;128;32;1;1;2;1122198895
2;2;128;2;1;64;116887669
256;8;128;8;4;64;18446744073709551615
8;1;4;1;1;2;718696692
16;8;4;1;8;2;880972259
32;16;1;8;2;1;982279912
2;2;64;2;1;64;1025737032
1;2;128;1;1;1;380050013
4;1;128;1;1;128;96791420
64;128;128;2;1;128;98916710
2;8;128;1;8;128;18446744073709551615
2;1;128;1;1;2;175582922
32;2;16;4;1;4;682432589
32;128;128;4;1;128;18446744073709551615
1;64;128;1;4;16;2067375678
2;16;256;1;16;8;2172995618
16;2;1;8;1;1;1234739191
2;2;256;1;1;1;326208088
1;2;128;1;1;128;213313589
1;2;128;1;1;2;202295171
2;2;128;1;2;4;1060412780
8;2;8;1;1;2;216925380
32;2;128;8;1;128;18446744073709551615
64;2;128;16;1;128;18446744073709551615
2;2;1;1;1;1;5431806869
2;2;128;1;1;128;95836876
2;4;128;1;4;128;18446744073709551615
2;2;128;1;1;128;114763085
2;128;128;1;1;128;197690875
256;2;128;256;1;128;18446744073709551615
2;1;128;1;1;16;186887546
2;2;2;1;1;1;2766705927
2;2;1;1;1;1;5431719720
2;8;128;1;1;128;97817584
2;2;128;2;1;64;117652125
32;2;128;32;1;128;18446744073709551615
256;2;128;2;1;128;147286589
1;2;1;1;1;1;11076738664
2;2;64;1;1;64;178155336
2;2;128;1;1;128;104712046
2;256;128;1;256;128;18446744073709551615
64;2;128;2;1;128;725982052
2;2;128;1;1;64;86053835
2;2;256;1;1;128;106122251
2;8;128;2;2;128;18446744073709551615
64;2;1;2;1;1;659599627
2;64;128;1;32;128;18446744073709551615
2;2;16;2;1;4;440572002
1;2;128;1;1;32;194077713
32;2;128;4;1;4;2023776994
1;2;128;1;2;128;223110917
2;2;2;1;1;2;2766691856
2;2;128;1;2;1;199273793
2;1;128;2;1;128;204181798
128;2;16;4;1;4;1570386006
8;2;128;4;1;128;18446744073709551615
128;128;1;4;2;1;1087391710
2;2;256;1;1;16;1409793449
2;2;128;1;2;4;971173414
32;64;8;16;2;2;2098353442
2;2;1;1;1;1;5431706024
2;4;128;1;4;4;1518549920
2;4;128;1;4;2;1587552231
16;2;128;8;1;4;2041531245
2;2;64;1;1;1;322341879
64;2;8;4;1;8;1090174204
16;2;128;4;1;128;18446744073709551615
32;2;64;4;1;1;2055275475
2;2;64;1;1;4;196575878
2;2;128;2;1;16;1087566317
2;2;1;1;1;1;5431787536
2;1;8;1;1;8;1545088651
2;32;16;1;4;4;803513427
1;256;128;1;256;128;18446744073709551615
2;2;128;2;1;64;108841794
1;2;1;1;1;1;11076659257
2;1;128;2;1;128;204107042
8;4;8;4;1;1;787092594
1;2;256;1;1;128;120724707
16;2;64;4;2;1;1846190116
16;64;64;16;8;32;18446744073709551615
4;32;1;4;2;1;692412667
8;256;32;4;4;8;1395406359
1;2;1;1;1;1;11076941830
4;64;32;4;64;8;18446744073709551615
8;64;2;8;2;2;1325876594
2;8;64;1;1;1;723755506
8;32;16;4;8;8;2032672365
1;2;128;1;1;128;172948464
2;32;128;1;2;128;1050225194
32;2;128;8;1;128;18446744073709551615
16;2;128;8;1;1;2131329517
2;2;128;1;1;1;286705756
2;64;128;1;4;128;18446744073709551615
2;64;128;1;2;2;2052224862
2;16;128;1;16;128;18446744073709551615
2;2;128;2;1;32;117947085
1;2;2;1;1;2;5633660943
2;1;256;1;1;128;109446334
2;256;32;1;256;2;18446744073709551615
2;2;128;1;2;1;181647254
2;1;64;1;1;1;655135640
4;2;32;4;1;2;228038836
2;2;128;1;1;128;116576253
2;2;128;2;1;64;108015004
4;2;128;1;1;128;557956437
2;2;64;1;2;1;189198503
2;1;128;1;1;16;192094172
4;2;128;4;2;128;18446744073709551615
2;2;256;1;1;64;104745460
4;1;256;4;1;128;18446744073709551615
2;4;128;1;4;32;1350660671
2;2;128;1;2;64;108245836
1;2;128;1;2;64;220353549
2;1;128;1;1;128;161772377
4;1;128;4;1;128;18446744073709551615
2;2;128;2;2;1;911774859
1;2;64;1;1;1;716665649
2;2;128;2;2;128;18446744073709551615
2;1;128;2;1;128;204224879
4;2;64;2;1;1;579215939
2;4;64;1;4;1;1185275784
4;1;128;4;1;128;18446744073709551615
4;2;64;4;2;1;1183132091
2;2;128;2;2;128;18446744073709551615
1;2;256;1;1;128;120527170
4;2;256;4;1;128;18446744073709551615
2;1;256;2;1;128;114885086
1;2;128;1;2;128;220439632
2;2;32;1;2;2;378183791
2;2;128;2;1;1;180391337
2;2;64;2;1;2;171321044
1;2;256;1;1;128;121031667
4;2;128;2;1;128;707046154
1;2;64;1;1;1;717022738
1;2;128;1;1;64;193346503
2;8;64;1;1;1;1146796606
2;2;128;1;2;1;193923004
4;2;128;4;1;64;1543904021
4;1;128;2;1;128;907420822
2;2;256;1;2;128;106825959
2;1;128;1;1;64;181757337
2;2;1;2;1;1;5432230643
2;4;64;1;1;4;757425166
4;2;64;4;2;4;890952366
1;1;128;1;1;1;746709552
2;4;128;1;1;128;117891628
2;2;32;2;1;2;329972669
4;2;128;1;1;128;483684052
2;1;64;1;1;2;368759680
1;2;32;1;1;1;1312451130
1;8;256;1;8;128;18446744073709551615
2;1;128;1;1;128;161691878
2;4;256;2;4;128;18446744073709551615
2;2;128;2;2;128;18446744073709551615
8;2;128;8;1;128;18446744073709551615
2;4;1;1;4;1;2764827137
2;2;128;2;1;2;946930921
2;4;128;2;4;128;18446744073709551615
4;4;128;4;2;128;18446744073709551615
2;4;128;2;4;2;1270665731
4;2;128;4;1;128;18446744073709551615
2;2;128;1;2;64;110956416
2;1;32;2;1;2;434632017
4;8;128;1;1;128;632034259
1;2;128;1;2;64;220584753
2;8;128;2;8;2;1685831508
2;2;128;1;2;128;107749084
2;2;64;1;1;1;318374256
2;1;64;1;1;64;345401344
2;1;128;1;1;1;352952929
2;32;256;1;4;128;18446744073709551615
2;2;128;2;1;128;107476379
1;1;128;1;1;128;332012840
4;2;128;4;1;2;1424350180
2;2;1;1;1;1;5431875291
2;2;1;2;1;1;5432105601
2;4;256;1;4;128;18446744073709551615
4;2;256;4;1;64;1856849964
4;2;128;2;2;128;18446744073709551615
2;2;128;2;2;64;205412877
8;2;128;1;2;128;462824349
2;1;128;1;1;64;181261505
2;8;128;2;2;128;18446744073709551615
2;16;32;1;2;32;1321160086
1;64;128;1;32;1;2195936818
1;1;16;1;1;8;1846559635
2;16;1;1;2;1;1280948751
4;2;128;4;1;1;1168856547
4;1;64;1;1;1;355902967
2;1;1;2;1;1;10871869214
2;8;64;2;2;1;1648790407
2;4;64;2;4;2;744486020
4;1;4;1;1;1;1431011184
2;2;64;2;2;1;166207168
2;4;128;1;1;1;305484169
4;2;128;4;2;128;18446744073709551615
2;2;64;1;1;2;168546959
2;2;128;1;2;1;185451793
1;2;128;1;1;1;379586674
4;8;128;2;8;128;18446744073709551615
2;2;256;1;2;128;106025791
2;2;64;1;2;1;187933003
1;1;128;1;1;64;379946340
2;2;256;2;2;64;387807753
1;2;256;1;2;128;118669086
1;8;128;1;2;128;142637917
4;4;8;2;1;8;221480837
2;1;1;1;1;1;10902177621
1;1;128;1;1;128;331996667
4;2;128;1;1;64;408755006
8;2;64;1;2;1;1348257765
32;2;128;8;2;128;18446744073709551615
1;4;2;1;1;1;2799743424
4;1;32;1;1;1;644839926
32;128;8;16;2;4;1884926712
2;2;64;2;1;2;171463506
2;2;256;1;1;32;409845834
2;2;64;1;2;2;189644590
2;2;64;2;1;1;157075421
2;2;128;1;2;128;107404671
1;8;128;1;1;64;208205297
2;8;32;1;1;2;1134025614
4;2;64;1;1;1;846806324
4;2;1;4;1;1;2731710367
2;4;128;2;4;128;18446744073709551615
2;4;64;1;1;1;565683515
8;32;16;4;8;4;2082818619
1;2;128;1;2;128;220473960
2;4;128;2;1;128;116703711
8;2;256;4;1;128;18446744073709551615
1;128;64;1;2;1;1779414212
2;32;64;1;1;32;1428237155
256;128;64;16;1;2;2023665580
1;128;1;1;2;1;671670462
4;8;32;2;2;2;1160801197
2;8;8;2;2;8;222320041
8;4;8;8;1;4;173136252
4;8;16;2;1;2;1345299796
2;1;128;2;1;128;204427045
64;4;256;1;1;256;142878673
8;32;16;4;4;4;2030628278
1;8;64;1;2;64;1317924419
32;2;2;2;1;2;522514253
2;2;256;2;1;128;106825170
1;2;256;1;2;128;118817375
2;1;1;2;1;1;10872146750
1;2;128;1;1;128;172966047
1;2;128;1;2;128;220192919
8;2;128;1;2;1;1400901467
2;1;128;2;1;128;204148340
2;2;256;1;1;256;139537213
2;2;256;1;1;256;359904427
1;4;256;1;1;128;146679131
8;16;4;2;16;1;932487240
8;16;16;8;16;8;18446744073709551615
2;2;1;1;1;1;5431632696
4;1;256;4;1;256;18446744073709551615
2;1;64;1;1;1;656732605
1;2;128;1;1;128;172988047
2;8;128;1;2;64;115564794
1;2;2;1;2;2;5614848160
256;1;64;2;1;2;1333577361
64;4;2;32;4;1;923213359
128;64;1;2;1;1;1102695250
1;4;128;1;4;128;18446744073709551615
2;4;4;2;1;1;750996813
2;2;128;1;1;64;108805211
2;2;8;1;1;8;771572719
2;4;128;1;4;128;18446744073709551615
4;8;2;2;2;1;848531594
4;4;128;4;4;128;18446744073709551615
4;2;64;1;1;1;833731174
2;4;256;2;4;64;18446744073709551615
2;2;64;1;1;4;189114881
8;2;128;8;1;128;18446744073709551615
2;8;128;2;2;64;119206585
4;2;128;4;2;64;18446744073709551615
2;4;256;1;1;128;202726459
2;1;64;1;1;1;656448509
2;2;32;2;1;2;328888095
2;4;128;1;2;128;137916085
2;2;1;2;2;1;5416100618
4;2;64;4;1;2;1013618885
1;2;128;1;1;128;213193632
4;4;128;4;1;128;18446744073709551615
8;4;64;1;4;2;1654242957
4;1;128;4;1;1;913512824
4;2;128;4;2;64;18446744073709551615
2;1;1;1;1;1;10902216034
4;8;4;4;2;1;465864935
4;64;128;4;16;64;18446744073709551615
32;64;2;1;16;2;749147761
256;1;64;8;1;1;2122949025
64;16;32;8;16;1;900384337
2;2;4;1;1;2;1425021706
4;8;1;2;2;1;1326003545
4;8;16;2;2;4;653399140
4;2;64;4;1;1;1022772361
2;4;128;2;2;128;18446744073709551615
1;2;128;1;1;1;379954427
4;2;128;2;1;1;1019949997
8;4;128;4;2;128;18446744073709551615
2;2;16;1;1;8;444360834
1;4;128;1;4;1;971153621
2;2;32;1;2;2;328375679
2;4;128;1;2;64;189165839
2;2;256;2;1;64;107056338
1;4;128;1;4;128;18446744073709551615
2;1;128;1;1;128;161779837
2;2;64;2;1;1;198990796
2;8;256;2;8;128;18446744073709551615
2;256;128;2;256;128;18446744073709551615
2;2;128;1;1;128;109399795
16;16;128;8;8;128;18446744073709551615
1;2;32;1;1;4;459821302
4;4;64;4;4;1;1721070049
2;2;1;1;2;1;5431461173
4;2;128;4;2;32;1368092877
2;2;128;2;1;2;1069911131
2;2;256;1;1;128;106979085
2;2;64;1;1;32;177524464
2;2;32;2;2;2;329474292
1;2;256;1;2;64;119722875
2;2;128;2;1;1;193508878
2;4;128;1;4;2;1461198132
2;8;256;1;8;128;18446744073709551615
8;2;64;1;1;1;1319916459
1;2;32;1;1;2;458597476
2;2;128;2;2;2;842979735
2;2;256;2;2;128;18446744073709551615
2;4;128;2;4;128;18446744073709551615
4;4;128;1;4;128;18446744073709551615
8;2;128;1;1;2;1109158939
8;2;128;8;1;64;18446744073709551615
2;4;128;1;4;1;1326022846
2;2;128;1;2;2;998822709
4;2;128;2;1;64;828206647
16;4;128;16;4;128;18446744073709551615
4;1;64;4;1;1;206570173
2;16;128;1;4;128;18446744073709551615
32;2;2;4;1;2;471289179
1;2;128;1;2;128;220296085
8;2;128;1;1;64;1175197959
2;2;128;2;1;64;111929712
4;4;256;4;1;32;2067305095
1;2;64;1;2;1;370957177
2;1;32;1;1;2;436321462
8;4;128;1;2;128;887873365
2;4;64;2;4;1;803001061
2;2;128;1;1;64;116177543
2;2;64;1;2;2;192804049
4;2;128;1;1;1;1210052879
4;2;128;1;1;1;1201193842
2;2;128;1;2;32;118307958
1;2;32;1;2;1;458892417
2;2;256;2;1;128;207607836
2;8;128;2;1;1;1019444545
2;2;64;1;1;64;177652836
2;1;128;1;1;2;191310132
2;4;16;1;4;4;277058924
2;8;256;2;1;128;275487635
2;2;256;1;1;64;105891420
2;4;256;1;4;128;18446744073709551615
1;1;128;1;1;128;331812084
2;2;128;2;2;64;130112918
2;2;64;1;2;1;199343042
2;8;128;2;1;128;117295879
2;2;128;2;2;128;18446744073709551615
4;1;64;4;1;64;978233243
4;2;256;2;1;128;941263130
4;1;128;4;1;32;1236068549
1;16;128;1;16;128;18446744073709551615
16;2;64;8;1;1;1845031776
2;4;16;2;1;2;277293333
4;2;128;1;2;128;340731679
2;2;256;1;2;256;18446744073709551615
1;2;128;1;2;1;194324050
4;2;32;4;2;2;225372295
4;2;128;2;1;16;1425798423
1;2;128;1;2;1;201583422
1;2;128;1;1;128;172947046
2;1;256;2;1;128;109214291
2;4;128;1;4;64;1300237171
16;4;32;8;1;1;1716469899
1;1;256;1;1;1;406421379
256;8;128;8;4;8;1030815042
8;1;16;1;1;16;216691877
2;2;128;2;2;1;896120128
8;2;64;1;1;64;1355307191
4;4;8;1;1;4;250805340
4;1;2;2;1;1;2784368736
8;2;128;2;2;128;18446744073709551615
2;8;128;1;8;1;1583168403
16;8;2;16;1;1;858511417
32;16;1;32;2;1;973856750
16;1;64;4;1;4;1674837769
32;128;64;8;8;1;1930647137
8;1;128;1;1;128;340466796
2;4;128;2;4;2;1531084390
4;128;1;4;2;1;900372695
8;64;256;4;4;1;2329444013
1;64;128;1;16;1;2197957316
1;1;8;1;1;2;3255862001
2;2;128;2;1;1;172050713
2;1;64;2;1;1;323928465
8;16;1;4;2;1;730149879
32;1;128;8;1;128;18446744073709551615
4;1;32;1;1;16;380640256
32;128;8;16;2;1;1750900771
1;2;64;1;1;1;716642935
4;2;128;1;1;8;929423244
2;2;128;2;2;2;1063691535
2;1;128;2;1;64;204060088
2;2;128;2;2;128;18446744073709551615
8;2;128;1;1;1;1460639459
2;1;256;1;1;128;111592878
8;2;128;2;2;64;1431537702
2;1;64;2;1;64;1360346875
4;4;128;2;4;128;18446744073709551615
2;2;128;1;2;32;118688421
2;4;64;1;4;64;1241832541
2;2;64;1;1;32;177707461
2;1;64;2;1;1;379663221
2;2;1;1;1;1;5431911351
64;128;64;4;4;1;2068980191
32;32;64;4;4;32;18446744073709551615
256;128;64;32;1;2;2428953077
1;128;16;1;32;2;1571663584
2;4;128;1;1;128;97392713
1;2;1;1;1;1;11076688334
2;1;64;1;1;32;383437426
2;1;256;1;1;128;110288046
2;2;128;2;1;32;122656668
