GLOBAL_SIZE_0;GLOBAL_SIZE_1;LOCAL_SIZE_0;LOCAL_SIZE_1;cost
1;1;1;1;28561444741
512;2048;4;4;16448444
1024;512;16;8;7324148
128;8192;2;32;42330518
2048;512;8;8;11559556
512;1024;16;8;7074222
2;8192;1;32;147430371
4096;256;8;16;12218815
4096;256;64;4;5154815
512;1;2;1;98784593
2;1;1;1;15324572297
8;1;1;1;4508879555
4;256;1;4;41395111
4096;256;64;256;18446744073709551615
16;256;2;4;42468741
8192;256;8;4;11723408
4096;256;64;2;5968296
4096;512;128;8;18446744073709551615
4096;128;256;4;18446744073709551615
32;32;1;4;53882370
1024;1;2;1;57830371
8192;1;64;1;7561333
2048;64;1;2;66809630
4096;64;64;4;5700296
64;256;64;256;18446744073709551615
4096;256;64;64;18446744073709551615
4096;256;128;4;18446744073709551615
32;64;8;2;22845777
1;128;1;1;246311852
8;1024;1;8;61152296
1024;8;16;8;7456741
8192;256;64;4;4753778
2048;1024;64;4;4655259
4096;256;16;4;7448296
1024;1024;16;4;6587852
2048;1024;16;1;8122371
2048;1024;64;8;18446744073709551615
8192;1024;32;4;4870370
2048;1024;256;4;18446744073709551615
2048;256;64;4;7793630
4096;1024;64;16;18446744073709551615
2048;4096;64;2;5187703
2048;1024;128;4;18446744073709551615
4096;1024;64;4;5448592
256;128;64;4;7845482
8192;1024;64;16;18446744073709551615
512;1024;64;8;18446744073709551615
1024;1;128;1;60988741
128;4;32;4;95227556
32;16;32;4;92873333
2048;512;32;2;5632296
1024;1024;64;4;4949926
8192;1024;64;8;18446744073709551615
2048;1024;64;2;5697630
2048;1024;16;4;6442667
8;1024;4;256;18446744073709551615
2048;8192;64;32;18446744073709551615
4096;1024;64;8;18446744073709551615
8192;512;64;8;18446744073709551615
2048;2048;32;4;5030370
512;16;16;1;9050963
1;2048;1;64;69548444
1;4;1;4;7458425778
128;2048;1;16;69496741
1;1024;1;1;100972148
1024;1024;128;4;18446744073709551615
8192;1024;128;8;18446744073709551615
16;512;1;4;82251259
2048;2;16;1;12559704
2048;8192;64;4;3293926
512;512;64;4;5740296
2048;8;4;4;26446519
2048;8192;64;128;18446744073709551615
2048;1;64;1;24724741
2048;32;64;4;5744741
2048;8192;1;4;30111555
2048;8192;64;16;18446744073709551615
2048;8192;64;8;18446744073709551615
2048;8192;256;4;18446744073709551615
2048;8192;64;2;3359259
1;8192;1;4;48767555
2048;8192;1;4;30109777
2048;8192;32;4;3525630
2048;8192;2;16;15977926
2048;8192;128;4;18446744073709551615
8192;1;64;1;7578519
2048;1;64;1;24775556
256;8192;32;4;4960741
2048;8192;64;1;3266074
8192;8192;64;1;2639556
2048;8192;128;1;4094223
4096;8192;64;1;3732592
8192;8192;64;8;18446744073709551615
8192;2048;64;1;4814667
1;4096;1;1;105758074
2048;4096;128;1;4399259
8192;8192;128;1;2746518
8192;4096;16;1;6470963
8192;1;16;1;8506074
8192;2048;64;2;4341482
1;8192;1;1;91867852
8192;8192;64;2;2712148
8192;1;64;1;7563704
4096;8192;64;4;2353038
4096;4096;64;1;3553481
1;8192;1;1;91697037
8192;8192;64;4;2477482
4096;8192;64;2;2418963
4096;8192;64;8;18446744073709551615
512;4096;64;4;4411703
1024;8192;64;4;3652445
4096;1;64;1;13486667
8192;2048;64;4;3890074
4096;8192;32;4;2525186
4096;8192;128;1;2444148
4096;2048;64;4;4167259
4096;8192;128;16;18446744073709551615
4096;8192;128;4;18446744073709551615
1;8192;1;2;62378815
1;8192;1;4;50178074
4096;1;64;1;13502371
4096;1;32;1;13254815
4096;4096;64;4;3572889
4096;1;128;1;13473630
4096;8192;128;8;18446744073709551615
4096;8192;1;2;69087259
512;8192;64;4;4037185
512;8192;128;4;18446744073709551615
8192;8192;256;4;18446744073709551615
4096;4096;32;4;3917037
1;4096;1;2;63245926
4096;8192;256;16;18446744073709551615
1;1;1;1;28561684148
1024;1;64;1;48443852
512;1;64;1;96770075
8192;8192;128;4;18446744073709551615
1024;8192;64;8;18446744073709551615
4096;8192;256;4;18446744073709551615
4096;1;256;1;13455852
1;1;1;1;28559320297
512;8192;32;4;4774815
4096;2048;64;8;18446744073709551615
4096;1024;32;4;5018518
1;2048;1;1;94863704
2048;4096;64;4;3830667
8192;4096;64;2;2825185
4096;8192;32;2;2376000
1;8192;1;4;49373778
1;1;1;1;28453420889
2048;4096;32;4;4547111
4096;4096;64;2;3567704
8192;8192;32;4;2537926
4096;512;64;4;4753185
4096;4096;64;8;18446744073709551615
1024;4096;64;4;4195259
4096;8192;128;2;2475112
4096;8192;16;4;3033482
4096;4096;128;4;18446744073709551615
4096;1;128;1;13503408
4096;4096;256;4;18446744073709551615
4096;1;64;1;13465333
256;4096;64;4;4901333
8192;1024;64;4;4263259
1;4096;1;4;49956445
1;1;1;1;28811039259
1024;1;64;1;47828592
4096;8192;32;8;2858074
512;8192;32;16;18446744073709551615
1024;8192;128;4;18446744073709551615
1;8192;1;4;48254223
2048;8192;128;2;3400000
2048;2048;64;4;4279555
4096;2048;16;2;5930666
4096;8192;64;16;18446744073709551615
8192;4096;64;4;3038666
1024;8192;64;16;18446744073709551615
2048;512;64;4;5010815
1;8192;1;4;49038371
1024;4096;64;8;18446744073709551615
4096;4096;128;2;3411555
4096;1;64;1;13510370
8192;1;256;1;7627703
1024;2048;16;4;6385926
4096;1024;64;2;5428889
1;4096;1;4;50179852
2048;1024;64;1;5721630
4096;4096;32;8;3884000
4096;2048;16;4;6025926
2;8;2;4;1969565630
64;64;2;2;47813333
8;4;8;2;1140969334
1024;64;32;4;6075407
1024;8;128;4;18446744073709551615
4096;2048;128;2;4331111
4096;2048;128;4;18446744073709551615
4096;8192;1;4;30180889
32;8192;1;16;74054814
8192;1;128;1;7588889
4096;1;128;1;13489185
2048;4;32;4;6586222
128;32;128;4;18446744073709551615
128;128;16;8;7621778
128;64;32;8;6812444
256;1;64;1;190602963
8192;8192;64;16;18446744073709551615
1;2048;1;8;128631556
2048;4096;64;8;18446744073709551615
4096;8192;16;2;3989037
1024;32;2;32;55380000
4096;1;32;1;13238815
8192;4096;128;4;18446744073709551615
4096;8192;1;8;21102370
512;32;8;16;9597185
4096;8192;2;4;18588741
256;8192;64;4;4360888
64;8192;64;4;5450963
256;128;64;8;18446744073709551615
1024;4;128;1;22410963
1024;16;128;1;7548593
8;256;4;16;31670518
4096;2048;32;16;18446744073709551615
512;32;64;2;5256149
2048;2048;64;8;18446744073709551615
512;32;256;1;5262370
8192;2;128;1;4516741
1;1;1;1;28822785037
1;1024;1;4;44567704
256;1024;8;2;13462370
1;128;1;128;641154667
1024;8;128;1;6606667
1024;8;64;2;6292593
16;2;1;1;1364858667
128;512;1;4;73731852
128;2048;4;4;22443260
1;1;1;1;28567820740
8192;8192;16;4;3196889
4096;256;4;256;18446744073709551615
256;1;2;1;179796592
512;32;64;4;4303851
2;1;1;1;15322595407
8;2048;1;128;119572000
32;1;8;1;1442925037
1024;1;32;1;48032889
8192;1;32;1;7361777
256;32;256;1;6368000
4096;2048;32;4;4702074
512;16;128;2;6161926
4096;8192;1;4;30208889
1024;8192;64;2;4354519
1024;64;64;2;6157629
4096;1;64;1;13735408
2;16;1;4;958863852
4096;512;128;4;18446744073709551615
16;8192;2;4;33215852
32;8192;1;4;52212741
1;512;1;4;67677630
4096;8192;64;1;2381334
8;8192;4;4;18044296
4096;2;64;1;7546370
4096;8192;64;256;18446744073709551615
4096;1;2;1;52445926
4096;1;64;1;13734519
64;8192;4;4;22150518
4096;8;64;4;5040444
4096;4;64;4;3979260
4096;8192;32;128;18446744073709551615
4096;512;64;1;6123407
4096;16;64;4;5834222
1024;32;64;2;5844000
2048;64;64;4;5805185
4096;16;16;2;9511556
2048;64;1;1;89300444
512;1024;1;8;48250223
1024;1;64;1;48492740
128;4;32;1;94227111
4096;128;64;4;5511111
4;8192;1;4;38642370
4096;256;1;4;57366815
32;8192;16;4;9340000
4096;1;64;1;13711852
4096;1024;4;4;8702074
4096;8192;32;64;18446744073709551615
1024;2;16;1;23436889
4096;8192;64;32;18446744073709551615
4096;8192;64;64;18446744073709551615
2;8192;1;4;36952000
4;8192;1;16;73482074
4096;8;4;4;26767556
64;8192;1;4;30548000
4096;2;2;1;54673778
4096;8192;64;128;18446744073709551615
64;8192;2;4;18526519
4096;8192;4;4;8534074
4096;128;64;1;6080889
8;8192;4;2;17217037
1;8192;1;64;275977629
4;2048;1;4;40880000
4096;1024;64;64;18446744073709551615
4096;16;256;4;18446744073709551615
4096;4;64;2;4162074
4096;8192;1;1;89318815
4;8192;1;1;89147556
2;8192;1;64;251961481
32;512;1;16;77075111
512;64;16;1;10800889
64;2048;2;2;34239556
1;4;1;4;7421493037
16;8192;2;2;27906222
4096;8;1;4;170257333
128;2048;4;16;22048889
16;8;4;2;343233037
64;512;2;8;41659111
8;4;8;2;1141052593
4096;1024;256;4;18446744073709551615
8;8;4;4;574667408
1;8192;1;128;325257481
4096;16;64;1;6087408
16;32;1;4;87632000
1;128;1;8;236109333
64;1;16;1;723712000
128;1;128;1;377693333
128;8192;64;4;4959408
8;256;4;1;28545333
2048;1024;2;4;19830370
4096;1024;8;2;8637630
1;128;1;8;239440000
1;8192;1;4;49648889
16;8192;2;128;48837778
4096;2;32;1;7279555
128;256;1;4;76071111
512;1;4;1;91853778
4096;256;1;8;87153778
64;8192;8;4;12997185
4096;8192;8;4;4797630
512;128;4;32;23534963
64;1;8;1;723924741
256;2048;1;2;55691703
32;1;1;1;1433131111
4096;8192;1;1;89318074
8;1;2;1;4513530370
8192;1;4;1;26097778
512;64;1;1;89618666
512;128;4;8;21480741
2;8192;1;4;37052148
4096;2;64;1;7578667
1024;256;64;256;18446744073709551615
128;4;2;1;96276445
256;1;1;1;185276889
128;16;64;1;23998815
4;4;1;4;2049454519
4096;1;64;1;13719407
4096;8;64;2;5957333
1024;1024;64;64;18446744073709551615
128;4;64;4;94170667
4096;4;1;4;189321926
4096;8192;1;64;68730667
16;8192;8;4;14434666
8192;8;64;4;5840593
4096;32;64;4;5877481
4096;8192;2;64;29920740
4096;2;1;1;186709334
4096;8192;2;16;15639259
1024;8192;64;1;3840445
4096;32;64;1;6062074
16;2;2;1;1375698667
512;8192;64;1;4209333
4096;4096;64;1;3545778
1;8192;1;4;49765481
1;1;1;1;28812011555
256;1;64;1;189142371
16;1024;2;64;47185037
2;8192;1;8;60382666
512;8192;64;64;18446744073709551615
8192;512;64;4;4420889
4;8192;1;256;169722815
8;8192;1;4;52496445
8;8192;4;16;24919408
2048;8192;16;4;4903852
4096;4;2;4;67897037
8;8192;4;4;18219260
8;1;2;1;4538087852
4096;8192;8;128;18446744073709551615
32;8192;2;4;37892741
64;8192;4;4;21612149
64;8192;64;8;18446744073709551615
16;8192;16;4;9909926
8;4096;4;4;18996148
16;1;2;1;2739267704
4096;256;1;4;56867259
256;1024;64;4;5763703
4096;16;64;2;6197630
4096;4;256;4;18446744073709551615
4096;512;1;4;30092741
4096;1;2;1;52209037
8192;64;64;4;5502815
4096;64;1;4;118152592
4096;8192;256;64;18446744073709551615
8;64;4;4;72077037
32;2;1;1;706427407
64;1024;64;4;5766666
8;16;4;4;286334666
16;8192;2;32;48737185
4096;8192;1;32;24268888
2048;2;64;1;12860297
4096;2;32;1;7282074
128;8192;64;8;18446744073709551615
4;8192;1;32;105960593
4096;1;64;1;13516593
128;1;1;1;361918518
4096;8192;1;8;21122666
32;8192;32;4;6659556
1;1;1;1;28820171407
4096;4096;256;16;18446744073709551615
8192;2048;64;16;18446744073709551615
4096;8192;1;1;89317777
4096;8192;8;2;6570518
8;16;8;8;291552148
4096;64;64;1;6049334
32;8192;4;4;20953482
4096;4;4;4;24792296
8;8192;4;32;25339703
1;8192;1;256;295415112
4;8192;2;4;24872149
1;8192;1;4;50508741
32;8192;2;4;37321926
1024;128;256;4;18446744073709551615
4096;8;1;2;175561334
256;8192;256;4;18446744073709551615
128;1024;64;4;5972741
4096;32;32;4;5961482
4096;8192;256;8;18446744073709551615
8;8192;4;64;25628889
4096;1024;128;4;18446744073709551615
4096;8192;4;32;10181629
4096;8192;16;64;18446744073709551615
64;2048;2;1;44702371
1;4;1;4;7434652592
128;1;4;1;371561037
16;8;4;2;341949333
1024;512;64;4;5438222
1;2;1;2;14789333037
8192;1;8;1;16452741
64;32;16;4;24892592
4096;128;64;8;18446744073709551615
4096;4;32;4;4260741
1024;2;128;1;24474815
512;16;128;16;18446744073709551615
8;2;1;1;2257394666
4096;8192;1;256;279308593
128;1024;2;32;48653334
4096;64;8;2;15117926
32;128;4;8;14420296
2048;2;32;1;12680445
128;512;1;16;72691852
512;1024;256;4;18446744073709551615
1;256;1;1;146621777
512;128;32;32;18446744073709551615
16;1;8;1;2770230963
256;2048;8;2;12330074
32;32;1;1;131164149
1024;1;32;1;47730074
32;1;1;1;1434068741
2048;1;1;1;119492444
1;128;1;8;236242370
1024;16;64;8;18446744073709551615
8192;4;32;1;8606815
256;8192;64;16;18446744073709551615
256;4096;1;16;53469037
512;16;1;1;111455408
1;1024;1;2;63450222
8;1;1;1;4522020593
4096;256;64;8;18446744073709551615
8;8192;4;256;18446744073709551615
4096;1;16;1;13101926
4096;2;64;1;7449630
128;1024;4;16;23010518
16;1;4;1;2742990815
64;512;1;1;89353037
8192;1;1;1;136025778
1;8192;1;64;285159111
512;8192;64;16;18446744073709551615
1024;64;8;2;15202222
128;2048;64;8;18446744073709551615
1024;4;128;2;12141037
1024;16;128;16;18446744073709551615
8;256;1;1;95070370
2048;512;1;4;30407556
4096;2048;8;2;6354370
8192;1;64;1;7590963
32;16;4;8;92497926
4096;2;32;1;7280297
128;512;1;64;107593037
2048;1;64;1;24697037
4096;1;128;1;13497481
512;2048;4;16;20974815
1024;256;4;4;23291556
512;128;1;32;105177185
4096;512;32;32;18446744073709551615
64;4096;8;4;14018074
4096;2048;64;2;4916741
128;1;1;1;365455556
1024;1;4;1;48462370
8192;4096;32;64;18446744073709551615
2048;8;1;4;117074814
1;128;1;8;239225629
8192;1;128;1;7577185
8192;4;1;1;185580445
256;32;1;1;99043111
512;64;1;1;89656444
64;2048;1;2;55861333
8;1;1;1;4537652000
128;1;4;1;370004741
16;8;16;2;345930222
8192;16;256;2;18446744073709551615
4096;1;32;1;13240593
4096;2048;256;4;18446744073709551615
8192;4096;16;4;4192741
8192;1;32;1;7394371
1;1024;1;4;41451852
1;8192;1;16;138008444
4096;4096;16;2;3632296
4096;8192;32;16;18446744073709551615
2048;8192;32;16;18446744073709551615
1024;4096;64;16;18446744073709551615
4096;8192;32;1;3635556
2048;1;256;1;24720148
1024;8192;128;8;18446744073709551615
4096;4096;256;1;3236296
512;8192;64;2;4907852
8192;128;64;4;5064889
4096;8192;16;8;2996889
4096;2048;8;4;7676148
4096;2048;64;1;4519556
1;8192;1;2;72865925
4096;2048;32;2;5218074
1;8192;1;4;49926074
2048;1;128;1;24901482
4096;4096;64;16;18446744073709551615
4096;4096;32;2;4221186
4096;4096;16;4;5240445
1024;8192;128;16;18446744073709551615
2048;1;32;1;24358222
8192;4096;256;4;18446744073709551615
2048;1;128;1;24714222
1;8192;1;8;67591704
1;2048;1;4;46097482
2048;4096;16;1;5671407
1024;8192;32;2;4314815
8192;4096;128;8;18446744073709551615
1;4096;1;8;64357037
1024;8192;32;8;4204296
1;1;1;1;28561019259
2048;1;64;1;24722222
256;8192;128;4;18446744073709551615
16;8192;2;1;44558222
512;1;128;1;96756444
4096;8192;256;1;2391259
128;256;64;4;5446815
256;8192;64;8;18446744073709551615
4;1;1;1;8124786223
32;64;32;4;23384889
4096;128;4;8;22041333
1024;128;128;2;5849037
1024;16;1;2;91643259
2048;256;64;2;6200889
2048;1024;2;8;26993333
4096;2048;8;64;18446744073709551615
32;128;4;4;16870519
16;32;1;16;106633186
4096;1;32;1;13258222
4096;4096;128;8;18446744073709551615
1;2048;1;4;47657629
8192;8192;128;8;18446744073709551615
1024;2048;64;4;4540593
1;1024;1;8;38821926
1;1024;1;16;37289778
1;4096;1;16;175767852
8192;1024;16;8;5788000
4096;8192;256;2;18446744073709551615
1;8192;1;1;91876741
256;2048;64;4;5364444
256;8192;64;2;5278222
1024;8192;128;1;4942223
4096;1;16;1;23639852
1;8192;1;16;130701482
4096;2048;32;8;4310519
2048;4096;128;4;18446744073709551615
512;8192;256;4;18446744073709551615
2048;1;32;1;24890222
1024;8192;32;4;4294222
2;512;1;16;36663111
512;4096;4;8;14652740
256;256;64;4;5822074
512;1;4;1;91198815
512;2048;64;4;4924592
1;1;1;1;28563850963
4096;1024;16;4;6301778
1024;8192;32;16;18446744073709551615
8192;1;64;1;7713185
64;4;4;4;184845778
4096;2048;8;1;11193481
32;32;1;2;70008888
4096;1;16;1;13104592
