GLOBAL_SIZE_0;GLOBAL_SIZE_1;LOCAL_SIZE_0;LOCAL_SIZE_1;TILE_0;TILE_1;cost
32;2;4;1;2;32;229738963
512;4096;128;2;2048;32;33652741
32;32;1;2;2;1;24618667
4096;4;256;1;64;512;219135111
32;32;2;2;2;1;20845333
8;32;4;4;2;1;274561185
64;32;64;4;8;1;818662370
32;32;1;2;2;2048;59371852
4;16;1;1;1;32;72082074
2048;256;4;8;128;1024;3426074
8;128;2;4;8;16;9022666
512;2048;1;4;4;1;151557777
2048;256;4;8;128;4;17200445
32;256;4;8;128;1024;10825926
32;256;4;2;32;1024;30793333
8;256;4;8;128;1024;41842370
128;2048;32;8;2048;64;9723852
2048;4;32;4;4096;2048;210882815
2048;256;4;8;128;1;43803703
2048;256;32;8;1024;1024;34830667
1;1;1;1;1;4;5384626222
2048;512;4;8;128;1024;3378667
512;128;1;8;128;1024;12243704
2048;128;16;8;128;1024;4550223
256;64;4;8;128;2048;5701037
256;512;4;4;1024;1024;38429185
128;512;8;8;128;1024;3318963
2048;512;8;8;128;2048;3572296
32;512;8;8;128;1024;12085629
128;256;8;16;128;1024;2033185
128;512;4;8;128;1024;2978519
128;512;4;8;32;1024;3053037
128;64;8;16;64;1024;2041629
128;128;8;16;128;1024;2025333
128;256;8;16;128;512;2006223
128;256;8;16;1024;2048;13103259
128;128;8;16;32;512;2026371
32;256;8;16;128;1024;6205778
256;256;8;16;128;2048;2131111
128;128;8;16;128;512;2031408
128;512;8;16;128;512;2021629
128;256;4;32;128;128;3456445
1024;256;8;16;4096;512;515244741
128;256;4;32;256;512;2699555
128;512;8;8;128;512;2040445
512;256;8;1;128;512;9711260
128;256;8;16;128;2048;3380593
64;1024;8;16;128;4096;147742963
128;256;8;16;64;512;2037630
32;256;8;16;64;512;3249926
512;32;32;1;1024;1024;23172889
4096;256;256;1;1;8;354376593
128;1;32;1;64;4096;57431260
4;2;1;1;128;256;574123111
256;256;16;4;128;512;3839556
64;256;8;16;128;512;1996444
128;512;8;16;256;512;2018074
64;128;8;16;128;512;1980296
256;256;8;16;128;512;2795556
64;1024;8;16;128;128;2269333
128;128;8;4;128;256;2867852
64;128;8;16;128;256;2055407
64;128;8;8;512;128;2097185
128;128;4;16;128;256;1622667
256;64;8;32;128;256;4368296
128;256;4;16;128;128;2207112
128;128;2;16;128;256;2134074
32;128;4;16;64;256;3205926
128;128;4;16;512;128;5809334
64;128;4;16;128;512;1856445
128;128;4;32;128;256;2285037
128;128;4;16;64;256;1569778
128;128;4;32;512;256;5811111
256;64;4;16;128;256;2370667
128;128;8;16;64;256;2029630
128;32;4;8;64;256;3513037
128;128;4;16;32;256;1599259
64;128;4;16;64;128;2194814
512;128;2;16;64;1024;2089630
64;128;4;16;64;256;1967111
64;128;4;16;128;256;1970963
256;128;4;8;64;256;2434963
128;128;4;8;64;256;2122222
128;128;4;32;64;256;2207704
128;128;4;16;32;128;2077777
128;64;1;16;128;128;7085185
128;256;4;16;512;256;4955555
128;128;16;2;64;128;5370371
128;128;2;16;64;256;1973037
128;128;4;8;64;1024;3061926
128;128;2;64;128;256;3631259
8;4;2;4;1;1;866854815
128;128;4;16;1024;256;11717482
128;128;4;32;32;128;2753778
256;16;8;16;64;256;4570667
256;128;4;16;64;64;5970815
256;1024;8;8;32;2048;3422667
8;128;4;8;64;256;10511556
128;128;4;8;32;256;2155852
128;64;4;16;64;64;3458667
128;128;4;16;128;128;2350370
128;128;4;16;16;256;1608000
128;32;2;16;64;512;3623704
128;128;4;16;64;128;2281186
1;1;1;1;2;2048;4650168000
64;128;2;16;64;256;1927259
256;128;4;16;8;256;1965778
32;64;4;4;2048;64;18762222
128;256;4;16;16;256;1720444
128;128;4;4;64;256;2974519
128;128;4;16;8;1024;1821926
128;128;4;4;64;256;2952741
128;4;4;2;64;256;16113334
128;1024;4;16;128;256;1665926
4;128;4;16;64;256;22692444
128;32;4;16;64;256;4220445
128;128;2;16;16;256;2018370
32;128;8;16;64;256;3247260
128;64;4;16;64;256;2333481
8;1;1;1;4;2048;587361778
128;8;1;8;2048;2;2645750963
64;256;8;16;32;1024;3261482
64;1;16;1;1;16;1283194814
128;128;8;16;256;256;1996889
128;128;4;16;64;1024;1898222
128;128;4;16;512;256;5799555
32;128;4;8;64;1024;10809334
256;1024;128;2;1024;64;20328445
64;128;4;64;64;256;2615555
128;128;4;64;32;256;2255703
64;256;8;16;64;256;1965778
32;128;2;16;64;256;3178223
64;256;4;8;64;256;1945481
8;1;1;1;16;16;618661333
256;128;8;16;512;256;7360000
64;128;8;16;64;256;2081630
256;128;64;2;512;512;16103556
128;128;4;16;256;256;3009185
128;128;4;16;4;256;1355704
128;128;4;64;2;256;2543111
128;2;4;1;64;256;30608000
128;128;4;16;64;8;5629482
128;128;16;16;4;1;169087259
128;128;16;16;4;256;12956741
128;128;4;16;4;64;1417481
128;128;4;1;4;256;8631703
128;128;4;16;4;128;1346963
128;128;64;2;1024;256;8128148
128;128;4;16;4;1;22465185
1024;128;4;16;4;256;3820444
128;128;4;16;1;1024;5058075
128;512;4;16;4096;128;45287259
128;1;4;1;4;128;61002667
128;128;32;1;4;128;66959704
16;256;4;16;4;128;3199555
1;128;1;16;16;256;79505778
1024;128;4;16;4;128;4423704
256;2048;4;8;4;128;3163111
128;128;4;32;4;128;1383407
128;512;4;16;4;128;1733481
128;128;4;16;256;128;2986963
128;512;4;64;4;128;1935111
128;2;4;1;4;128;29256444
1;128;1;16;4;128;81102518
128;128;4;16;4;512;1620593
2;64;1;16;256;128;82898815
128;1;4;1;4;128;60833333
128;256;4;16;4;128;1485630
128;128;2;16;4096;128;118616000
2;256;2;8;4;32;19624741
1;1024;1;32;32;256;20525777
256;4096;1;256;4096;8;10877800296
512;32;64;4;64;16;27095259
32;16;16;4;16;512;28153778
256;128;4;16;1;512;1875407
128;128;4;16;1;128;3097185
64;128;4;16;4;128;1831704
256;512;128;2;512;128;19264444
256;128;4;32;4;128;1896445
128;64;4;64;4;128;2029926
128;128;4;16;2;128;2527556
128;1;1;1;4;128;37538222
128;128;128;1;4;128;289224593
128;128;4;8;4;128;1775407
128;128;4;16;4;4;4751555
128;128;4;8;2;128;3244000
128;32;2;8;4;256;3316296
512;128;4;16;4;128;2552593
32;64;16;4;64;1024;25006222
512;128;4;16;4;256;2451703
32;128;4;8;4;256;2886371
256;512;128;2;512;256;18820741
128;256;4;16;1;128;2149778
512;128;4;16;4;512;2704148
128;16;4;16;2;512;11798370
32;64;16;4;64;256;6401333
256;128;4;16;4;4096;12428889
128;128;4;1;8;128;8306815
32;128;4;16;4;128;3196148
4;128;4;4;8;2;48728444
1024;16;64;1;1024;64;28750963
1024;1024;1;32;1;64;17793481
1;1;1;1;8;32;4747367260
256;128;4;16;4;512;1870370
128;64;4;16;4;128;1886222
512;16;2;16;4;128;2991259
64;128;32;8;128;256;3814667
128;128;4;8;4;32;1816148
128;128;4;16;2;256;2523852
128;128;4;64;4;2;36763259
512;128;4;4;4;128;6703852
128;128;4;16;2048;128;22736148
128;128;2;16;4;128;1739407
128;128;4;64;512;128;7221186
128;128;64;2;1;128;70543556
128;128;64;2;128;128;10764741
128;4;4;2;4;128;16388889
128;64;4;16;4;64;2240296
128;4;32;2;4;4096;396806814
128;2048;4;2;4;1;146379408
128;128;32;1;2048;128;12070222
128;128;8;16;4;128;3892148
128;128;4;4;4;128;2829778
128;2048;4;16;4;128;1749482
128;128;4;16;4;4096;11318222
2048;4096;1;32;4;4096;232230222
256;128;4;8;4;32;3119852
128;32;4;16;2;128;5974815
128;256;4;16;2;128;2592741
32;256;4;16;4;128;1866371
128;4;1;4;4;128;17500296
64;128;1;8;1024;128;37874370
128;128;2;16;4;128;1736000
512;64;16;1;4;128;59361925
128;32;4;16;4;128;3251704
1024;512;8;8;64;2048;2366815
128;512;16;8;64;1024;3833481
64;512;64;1;16;256;63545778
256;2048;16;1;256;512;12099259
128;1;2;1;16;1024;59742074
512;64;256;1;2;256;2772414963
1;2;1;1;256;2;2925767408
512;128;1;8;4;128;11706815
256;256;4;32;4;128;2234222
128;32;4;16;8;128;3343260
64;256;4;16;4;128;1348296
128;128;2;16;4;64;1633333
16;128;4;8;4;128;5364592
128;128;4;16;4;2048;3068889
256;64;4;16;4;128;1447111
256;128;8;16;4;128;4616593
128;128;16;16;4;128;12990519
64;128;4;8;4;128;1929482
128;128;4;16;1024;128;11462075
128;2;4;2;4;128;32118963
32;128;2;16;4;128;2919408
128;256;4;16;4;512;1614963
128;128;4;32;2;128;2599852
128;32;4;8;4;128;3252889
128;32;4;32;4;128;3516296
128;128;2;32;4;64;1305481
128;64;2;32;4;64;2002518
128;512;2;32;4;128;1836741
128;128;2;64;4;64;1222666
16;128;2;8;4;64;5546963
512;128;2;64;2;128;2375852
128;256;2;64;4;64;1367703
128;64;2;64;4;64;1953185
64;128;2;64;4;64;1853037
128;128;2;128;1;64;2967703
128;256;4;32;8;64;1945333
128;128;2;64;8;64;1469778
128;512;8;1;4;128;11471259
128;32;2;1;4;64;14460297
128;128;2;128;4;32;4170370
128;64;2;32;4;32;2029482
256;128;2;128;2;64;2418815
64;256;2;64;4;8;7459111
128;128;2;64;16;16;8627852
256;128;8;1;4;64;18047703
1024;128;2;32;4;256;4118074
128;128;2;32;4;32;1225926
128;128;4;64;4;64;1344000
128;128;2;64;4;32;2205926
512;128;2;64;4;64;2431852
128;128;2;128;32;64;8522222
128;512;2;32;16;64;2561185
256;32;2;1;4;64;14515704
512;16;1;2;2;64;14295112
64;128;2;1;2;64;14397482
64;512;2;64;4;64;1380000
128;128;1;128;8;64;5536444
128;128;2;128;4;64;2288445
128;64;2;64;4;256;1949630
128;128;2;128;8;64;2663852
64;128;2;64;1;64;2907555
256;128;1;64;4;64;2122963
128;128;1;64;4;128;1298963
128;32;2;1;16;64;14480445
128;1024;2;64;4;64;2892740
128;128;2;64;4;8;7482518
32;128;2;64;4;64;3274815
128;128;2;64;1;64;1721629
128;16;1;2;4;64;13252148
128;128;2;64;4;128;1323259
256;128;2;64;4;128;1585482
128;128;1;64;4;64;1334222
128;1024;2;32;16;64;3077630
256;16;4;2;4;64;4327556
128;128;2;64;2;64;1216296
32;128;2;64;1;256;5882666
64;256;2;64;4;64;1187111
64;128;4;64;4;64;1892297
64;256;4;64;1;32;5875259
64;1024;2;64;4;64;1730222
64;1024;2;128;4;64;4773481
64;256;2;64;4;32;2083703
64;256;4;1;2;64;16276889
64;128;2;32;16;64;2105777
64;64;2;64;4;64;3276593
64;256;1;1;1;64;18844889
32;256;2;32;4;64;1842370
8;256;1;64;8;256;5499556
64;128;1;128;4;64;3195111
16;256;2;64;4;64;3230666
32;256;2;64;4;64;1868000
64;256;1;64;4;32;1998223
64;512;2;1;4;64;14410963
32;256;2;128;4;64;3452889
64;256;2;64;4;512;1238222
16;256;2;64;8;64;3102814
64;256;2;128;2;64;2155111
64;256;2;64;8;64;1213778
64;512;2;64;8;64;1413334
64;256;2;64;1;64;1746815
64;256;2;32;4;64;1251111
64;256;2;64;16;32;2301037
64;128;2;32;8;64;1953926
64;256;4;64;4;64;1345037
64;32;4;1;32;64;8705629
64;256;1;64;4;256;1377185
64;128;2;1;4;64;14415408
64;256;2;64;16;64;1524592
32;512;2;64;4;64;1180296
32;128;8;1;4;64;11770223
32;256;2;64;1;64;2917482
64;512;4;64;4;64;1769629
32;512;1;64;4;8;6260000
32;512;2;64;4;16;3962371
32;512;2;64;4;256;1198371
32;512;2;32;4;64;1231408
32;64;2;1;4;64;14766815
32;2048;2;16;4;128;1529778
32;256;8;1;4;128;17247259
64;2048;2;128;4;64;5726963
32;512;2;64;2;64;1162370
32;512;2;64;8;64;1220889
32;512;1;64;4;64;1060445
16;512;1;64;4;128;1742962
64;512;1;64;32;128;2370814
64;512;1;128;4;64;2294370
32;256;1;256;4;64;5382371
64;512;1;256;8;32;12391556
32;128;1;16;4;64;3324889
32;256;1;64;8;64;1714815
32;512;1;64;16;64;1483704
128;512;1;32;4;128;2584889
32;64;1;64;4;64;5626074
32;512;1;64;4;512;1274222
32;4096;1;64;1;64;1969926
32;512;1;64;8;64;1082667
8;512;4;64;2;128;7066667
32;512;1;32;4;64;1218815
32;512;1;64;4;4;10816000
32;1024;1;64;16;32;2064741
32;1024;1;64;4;64;984148
32;128;1;64;4;64;2971111
32;1024;1;64;8;64;1040740
32;1024;1;64;2;64;988444
8;1024;1;64;4;64;1529777
32;1;1;1;4;128;148125334
32;1024;1;64;4;32;1623111
32;1024;2;64;1;64;1279704
128;512;1;64;4;64;2554518
16;2048;1;64;4;32;1638371
32;2048;1;32;2;64;1821778
32;1024;2;64;4;64;1234518
32;1024;2;128;8;64;2563852
64;1024;1;64;1;64;1821333
32;1024;1;64;1;64;981334
4;4096;1;64;4;64;1025482
64;1024;2;64;1;64;1639556
16;1024;1;128;1;64;2024889
32;1024;1;256;2;64;4217630
32;1024;1;64;1;512;1004444
32;512;1;32;1;16;2048297
32;512;1;64;4;128;1077481
32;1024;1;64;2;128;1104888
32;2048;1;64;1;64;1509482
32;512;1;64;2;512;1108889
32;1024;2;32;1;64;1305037
32;1024;1;128;1;64;2345481
16;1024;8;1;1;32;28244000
16;1024;1;64;1;64;1014370
4;1024;1;32;1;128;2833630
64;1;1;1;1;256;90369778
16;1024;2;32;1;128;1682963
256;1024;1;64;1;64;4741185
32;1024;1;64;2;256;1199852
32;256;1;64;1;64;1589778
32;1024;2;64;2;64;1360593
16;512;1;64;1;128;1762519
32;512;1;64;1;64;1010963
32;1024;1;64;1;32;2004297
32;1024;1;32;2;64;1502815
32;1024;1;128;1;32;4510963
32;512;1;128;1;64;1972593
32;1024;2;128;2;64;2819852
64;1024;2;64;1;128;1709333
128;1024;1;128;1;64;7821926
128;512;1;64;1;64;2514519
32;1024;1;64;1;256;960297
16;1024;1;128;1;32;3946370
4;1024;1;64;1;64;3167111
16;1024;1;64;1;256;984000
32;512;1;64;1;512;989334
128;1024;2;64;1;256;2055852
16;1024;1;32;1;256;1625629
32;1024;1;64;4;256;1340444
32;1;2;1;1;256;320582667
32;1024;2;64;1;512;1757926
32;2048;1;64;2;512;1123260
64;1024;1;64;1;32;4421778
32;1024;2;64;16;256;1309630
32;1024;2;64;1;256;1140593
32;512;1;128;1;256;1099111
64;1024;1;64;1;512;1157630
16;1024;1;64;8;64;1024296
32;2048;1;64;1;256;1031852
128;512;1;16;1;256;2258815
32;4096;1;32;1;256;1092740
32;1024;1;64;1;1024;1519111
16;1024;1;64;1;512;1572148
32;512;1;64;1;256;1032148
32;1024;1;128;1;128;1038074
128;1024;1;32;1;256;2129185
64;1024;1;128;1;256;1524445
32;1024;1;128;8;128;1041777
32;1024;1;256;1;512;1005630
32;1024;1;128;2;256;1242518
64;512;1;64;2;256;1266074
32;4096;2;64;1;1024;2810222
32;1024;1;8;1;512;5503556
128;1024;1;64;1;256;2173037
32;1024;2;64;2;512;1127852
16;1024;1;64;2;256;1090667
64;512;1;64;1;256;1053778
32;128;1;16;1;512;2791260
32;1024;2;64;2;256;1212445
128;1024;1;64;2;256;2262370
16;1024;2;64;1;256;1727556
32;1024;1;64;1;16;3818815
16;512;1;32;1;256;1647556
32;1024;4;64;1;256;1953481
64;1024;2;64;1;256;1581037
4;1024;1;64;1;512;5556740
32;1024;2;64;1;128;1349778
128;1024;1;64;1;64;2501778
4;1;2;1;128;1;1973917926
512;16;32;4;1;256;35851111
512;1024;2;4;1;1;125684296
4096;256;8;8;1024;128;14747704
64;1024;1;64;1;2048;1592444
32;4096;1;128;1;128;2001630
64;512;2;64;1;256;1300444
64;1024;4;64;2;256;3069333
64;1024;1;64;1;1024;1022963
32;256;1;64;2;512;1643407
32;1024;1;32;1;512;1622815
32;2048;1;128;1;256;1517778
32;512;1;32;1;256;1153038
4;1024;2;64;2;256;3304445
32;256;2;64;1;256;2996445
32;1;1;1;1;256;160038222
32;2048;1;64;1;512;1016444
128;512;1;64;1;256;1653185
32;512;1;64;1;128;1112445
8;1024;1;64;2;256;1556000
16;2048;1;64;1;1024;2753037
32;1024;2;128;1;256;1286519
32;4;4;1;2048;4096;578604593
1;1024;1;256;1;1;1332368889
1;4;1;1;2;512;1092990222
64;128;8;32;4;256;3788741
32;1024;2;1;1;256;26641630
32;1024;1;128;1;1024;1033482
256;512;32;1;128;1024;10575852
128;256;64;1;256;512;17013037
32;1024;4;64;2;128;2601037
32;512;2;64;1;256;1950074
8;1024;1;64;1;256;1601629
32;1024;1;16;1;256;1840740
32;1024;1;32;1;1024;2754667
64;1024;1;64;1;256;1517185
32;512;1;128;4;256;1106518
32;1024;1;64;1;2048;2767556
32;1024;1;32;1;256;1098370
4096;512;1;8;1024;1;63646518
8;4096;1;64;1;256;1634666
32;4096;1;64;1;256;1017630
128;512;32;8;32;512;4004741
32;2048;1;16;1;256;1825334
64;1024;1;64;2;256;1543111
16;1024;1;256;2;256;1056000
64;128;1;128;1;256;1842815
32;1024;1;64;1;128;1021037
1024;2048;1;8;4;4096;858090222
32;4096;1;32;1;128;1500148
32;4096;1;64;1;512;1020000
8;1024;4;8;2048;16;2032297
64;128;1;4;16;128;6155259
256;512;32;8;128;1024;4082814
128;2048;64;1;1;1024;590035703
256;32;16;1;4;4096;669682815
64;1024;1;32;1;256;1582667
256;1024;16;16;128;1024;2961630
32;512;1;64;2;256;1122519
32;256;1;32;4;256;1859111
256;512;4;2;16;1024;5763407
16;1024;1;64;1;128;1085926
256;512;8;4;32;1024;2993926
256;512;4;8;16;1024;2137926
2048;4;256;1;64;512;148670962
4096;1024;256;1;1;128;78430815
128;4;32;1;64;4096;60962074
256;512;1;8;4;1024;4033926
32;1024;4;64;1;2048;9954074
32;1024;2;64;4;256;1337926
1024;512;1;8;32;4096;217366519
16;1024;2;128;2;256;1220000
64;2048;1;64;1;1024;1032149
32;2048;1;64;2;256;1190074
64;1024;1;64;4;256;1665185
256;512;16;8;32;1024;2924148
32;256;1;64;2;256;1722963
8;1024;1;64;4;256;1546963
32;1024;8;1;1;256;73088592
32;64;1;64;1;256;5903556
1024;512;2;8;8;1024;20956851
4;2;4;1;1;256;2499907852
128;8;1;8;2048;128;580982222
2048;256;2;2;32;64;27503933
128;1024;1;256;1;256;2063704
128;2048;1;32;8;128;3956593
64;1024;1;32;2;256;1795704
64;1;16;1;1;1;866854666
2;256;1;8;128;32;18578222
64;1024;4;32;1;128;2128889
256;2048;1;2;4096;256;2798590667
256;512;16;8;64;1024;2925926
32;1024;1;128;1;256;1071259
256;128;8;8;32;256;2398667
16;4096;1;64;1;4096;74430814
8;1024;1;32;4;256;2711259
64;512;1;128;1;128;1201482
256;256;8;8;32;512;2956593
32;1024;1;32;2;256;1204741
512;512;8;8;32;2048;2285778
256;512;8;8;32;1024;2089482
256;1024;8;16;64;1024;2081630
512;32;64;2;64;16;31624592
4;256;4;4;8;2;24217185
1024;512;4;8;1024;1;56591259
256;512;1;32;1;64;4171408
32;1024;1;32;1;64;1469778
64;2048;1;64;1;128;2085037
8;2048;2;64;1;64;1845037
256;1024;8;16;32;1024;2075111
512;1024;8;16;64;2048;2284888
256;1024;8;16;64;2048;2080148
1;1;1;1;8;1;4655773778
128;1;2;1;1;1024;100613778
1;1;1;1;2;256;4690822519
1;2;1;1;256;8;2514307259
32;1024;1;16;2;1024;5180000
64;1024;8;16;64;256;1996148
32;1024;4;64;1;64;2008889
16;1024;8;16;64;64;1950222
512;128;1;64;4;128;3833926
4;1;2;1;1;1;1718341629
512;2;64;2;1;256;460740741
32;1024;4;64;1;256;1950667
32;1024;1;1;1;256;19735111
32;1024;1;64;1;2;14465037
32;1024;1;2;1;256;12346223
32;1024;8;16;64;1024;6240149
32;2;1;1;1;256;72918519
2048;1024;1;64;2048;256;12618074
32;32;1;1;1;256;17570518
32;1024;1;64;1024;256;3586074
32;64;1;64;1024;256;46486222
32;1024;1;8;8;256;3386371
32;1024;1;4;1;256;6284889
32;1;1;1;1;16;164667704
32;1024;1;1;1;256;17535259
32;256;1;64;1;256;1641482
32;16;1;2;1;256;18459407
32;128;1;64;1;256;2986519
32;1024;1;64;4;128;1300444
32;1024;1;256;512;512;2062519
32;1024;1;64;1;4;11610666
32;1024;2;64;1;256;1211704
64;256;2;64;1;256;1808297
32;128;1;32;1;256;2993629
32;1024;2;128;1;512;1113481
512;1024;2;2;1;1;208172148
4096;256;8;8;1;128;17392889
512;4;2;1;2048;4096;2164289481
1;1;1;1;1024;1;7701934815
32;1024;1;64;32;256;1364741
32;1024;1;64;8;256;1348000
32;1024;1;64;1;4;11760296
32;1024;16;2;1;256;113751852
4096;1024;64;1;1;256;19636444
32;1024;1;64;1;8;6753629
1;4;1;1;1;1;1349782074
64;128;8;32;1;32;10912445
8;1024;4;8;1;16;5915852
64;128;1;1;16;128;19451408
64;1024;2;32;1;32;1472445
2048;1024;1;64;1;256;9470370
128;1;2;1;1;1024;82394963
128;4;128;2;64;128;193856741
4096;1;256;1;1;128;307795260
1;4;1;1;64;4096;3517317926
128;1024;1;64;1;1024;1259852
16;1024;1;64;2;128;1103111
32;2048;1;32;2;512;1740592
32;4096;1;64;1;1024;1529037
128;1024;2;64;1;1024;1178223
32;1024;1;256;1;256;1046963
8;2048;1;64;2;256;1697629
8;1024;1;64;1;128;1811555
32;4096;1;64;2;256;1177481
32;1024;4;64;2;64;2729630
128;2048;1;128;1;256;3681630
64;512;2;32;1;256;1155259
8;512;1;64;1;256;3177185
32;1024;1;256;1;4096;4679407
16;256;1;64;2;256;2694814
32;1024;1;128;4;1024;1330371
128;1024;1;64;1;512;1609333
512;1024;1;32;1;256;6682519
256;1024;1;64;1;256;3865037
8;1024;1;32;4;64;1791259
32;2048;1;32;1;256;1112296
32;4096;2;64;1;512;1775407
32;1024;1;256;4;256;992000
32;4096;1;128;4;256;1664593
32;1024;32;2;1;256;220371704
32;64;8;16;1;256;42116444
128;1;1;1;2048;128;2398848148
64;256;4;16;32;512;1846074
64;1;16;1;1;1;866838518
16;1024;1;128;1;256;1202223
2;256;1;8;1;64;18134519
64;1;4;1;1;128;320911852
256;2048;1;128;4096;256;1721333778
1;32;1;32;64;16;655009185
32;4096;2;64;1;256;1214370
1;1024;1;64;1;256;10940296
2048;1024;1;2;1;256;15756000
32;1024;1;4;1;2048;31856000
4;4;4;4;8;2;1130555259
1024;16;64;1;1;1;31147556
256;512;64;4;1;512;65239260
1;1;1;1;8;1;4674044741
32;2048;1;64;128;256;1394223
32;1024;1;64;1;256;1057185
32;1;2;1;16;1024;235452444
512;1;256;1;2;16;9741696444
1;2048;1;4;1;8;6892297
512;1;1;1;4;128;21272000
32;1024;1;128;1;2;31173778
512;1024;1;64;1;256;6515555
32;1024;1;64;2048;256;6884592
32;1024;1;4;1;2;541511459
32;256;4;1;2;64;16219112
4;1;2;1;4;1;2032603556
512;1024;8;1;8;256;13894222
512;1024;1;4;1;1;129232889
4096;256;256;1;1024;1;72535703
32;1024;1;64;1;256;1117185
32;1024;1;64;1;4096;12199260
32;1024;1;1;8;256;17773185
8;1024;1;256;1;256;1689482
32;4;4;1;2048;1;361763852
1;1024;1;256;256;4;688168444
1;1;1;1;256;512;4635572148
64;128;2;32;4;8;6192740
8;1024;1;64;1;512;2836444
8;512;1;128;1;256;3377037
32;1024;1;64;1;4096;13962371
32;1024;2;2;2;256;9578814
64;1024;2;128;1;256;1538222
2;1024;2;8;1;16;10502074
1;128;1;2;16;128;25746604
8;1;2;1;64;1024;945422222
2048;4;64;4;64;512;34501778
128;1024;2;128;4;256;2582519
128;2048;1;64;1;128;3343111
8;2048;1;128;4;128;1055704
1;1024;1;64;1;256;11008592
32;1;1;1;1;256;160379703
32;512;1;1;1;256;17258963
16;2048;1;32;1;256;1622371
16;4096;1;64;1;256;985926
16;2048;1;64;1;256;1009778
16;4096;1;128;1;256;1131851
4096;1024;1;256;512;128;5826371
128;4;32;1;64;128;20778518
32;1;8;1;1;1;866618074
128;1;1;1;2048;32;2450139112
32;1024;1;256;2;256;994815
2;1024;1;1;1;64;37604888
64;2;1;1;1;256;36413778
32;1024;8;1;1;256;73013630
32;4;1;1;1;256;36454666
2048;1024;1;64;1;512;5154370
32;128;2;64;1;256;5882370
32;1024;1;64;16;256;1389334
32;1024;16;4;1;256;60376741
32;8;1;4;1;32;33296296
32;1024;8;8;1;256;16789926
128;128;8;1;1;256;19942963
32;1024;2;64;1;4;20706518
32;1024;1;1;512;256;76444000
256;1024;1;64;4096;256;866175111
2048;1024;4;64;1;256;10624148
32;1024;1;128;128;256;1710370
32;1024;32;4;1;64;35732592
32;1024;1;16;128;256;2541630
32;2;1;2;1;256;117430370
32;1024;4;64;4096;256;11753482
32;1024;1;64;128;8;19135111
16;1024;1;64;256;256;1206371
32;1024;1;64;1;1;24547111
4;8;1;4;1;256;250448592
1024;1024;1;64;1;256;8532000
32;1024;8;1;1;1;98257630
32;2;1;1;128;256;73244296
32;1024;8;4;1;256;32099407
32;1;1;1;1;256;160081926
32;1024;1;4;32;256;6311555
256;256;256;1;4;256;1173545630
64;1024;1;128;8;256;1825630
32;1024;4;64;1;512;3005037
8;4096;2;64;1;256;2981926
32;2048;1;64;1;32;3228741
32;1024;2;128;1;128;1173630
32;1024;1;32;4;128;1821925
256;1024;2;64;1;256;3525333
32;4096;1;32;2;256;1238074
8;1024;1;128;1;256;1801778
32;128;1;64;8;256;3092297
8;2048;1;64;1;64;1064000
32;128;1;64;1;512;2930963
32;4096;1;256;1;256;1988889
32;1024;1;16;1;128;1977630
4;1024;1;64;1;128;3520296
8;2048;1;64;1;256;1643704
64;256;1;128;2;256;1128296
128;1024;1;32;1;128;3430518
64;1024;4;64;1;256;2039556
16;1024;1;64;1;2048;5243407
8;1024;2;64;1;256;2969333
32;1024;1;32;2;128;1671852
64;256;4;4;32;512;4865926
64;1;16;1;1;128;1249660000
2;256;1;8;8;64;17333185
16;1024;4;32;1;128;3112296
32;2048;2;64;1;256;1162667
2;1024;1;64;1;256;5733629
128;1024;1;128;1;512;2089185
256;1;1;1;4096;256;7229089926
64;1024;1;64;8;256;1716296
32;2048;1;32;1;512;1622074
64;1024;1;32;8;128;2344148
32;512;1;16;1;256;1824741
32;1024;2;32;1;256;1612000
8;256;1;32;1;128;5810814
32;512;1;1;2;256;17627407
32;2048;1;64;4;256;1333185
32;1024;2;32;2;256;1137334
16;2048;4;1;1;2048;594692296
32;4096;1;16;1;256;1812593
32;4096;2;64;1;128;1553482
512;32;1;32;1024;16;169918074
4;256;4;8;8;2;49497630
256;16;2;1;1024;1;232782223
256;512;1;4;1;64;14337926
32;8;2;1;8;1;37390370
128;64;2;2;1;16;12206667
512;64;32;1;1;16;18486667
2;256;2;4;1;8;39693185
64;512;1;64;1;128;1044000
512;64;1;64;1;4;18850963
1;1;1;1;1;1;3464120741
512;4096;8;4;8;1;167615852
2;1024;2;4;1;128;61125926
32;1024;2;64;2;128;1320740
32;1024;1;128;1;512;1093629
4096;256;128;2;1;128;45519111
1;4;1;1;2048;1;2128220296
1;4096;1;256;256;4;174301926
1;4;1;1;1;512;1238258222
64;128;8;4;4;256;5334667
512;1024;64;1;2048;16;46276297
64;128;1;4;1;16;6464000
32;1;1;1;1;256;160328741
32;1024;2;64;2;256;1292889
2048;1;1;1;1;256;20477778
32;1024;1;128;4;512;1356296
32;4;16;1;1;256;620569778
32;1024;16;2;8;128;9830370
1;1;1;1;1;1024;5121255556
2048;256;64;1;64;512;80772000
4096;1024;128;1;512;128;46610963
128;8;1;1;64;128;28251407
64;1024;1;256;1;256;1645037
32;64;8;2;1;256;56946518
128;4096;1;1;1;128;22250667
64;2;32;1;1;512;1238333778
64;1;16;1;1;256;1249365926
4096;1024;1;1;1;4;208151407
32;16;1;1;1;256;20007259
2;8;1;4;1;128;496710963
32;8;1;4;1;256;33536296
2;512;1;8;8;1024;131622222
64;1024;4;1;1;256;20300148
1;2048;1;1;4096;256;288136148
512;32;1;32;64;16;40449629
64;2048;1;128;1;256;2144741
32;4096;2;64;1;64;2001926
4;256;1;4;1;2;22158371
1024;16;64;1;1024;32;36273185
256;8;1;8;1;64;5513037
32;8;2;1;512;1;98409778
128;64;4;2;1;16;13128149
512;1;32;1;4;16;154568000
1;2048;1;4;1;512;241805333
512;512;64;1;4;128;326030518
32;1024;1;8;1;256;3294370
32;2048;2;64;1;128;1587556
4;1;4;1;1;1;3464969629
512;1024;8;16;8;2048;2173778
2;1024;2;4;256;128;34394371
4096;256;256;1;1;128;86685925
32;1;1;1;1;256;160340741
2;1024;1;64;1;256;5721186
32;4;2;1;2048;1;677128296
1;1024;1;32;256;4;84181630
32;256;1;8;1;256;3307259
16;512;1;64;1;1024;2762370
32;1024;2;64;256;256;1491408
128;1024;1;64;16;256;2475852
32;1;1;1;1;256;160352296
1;4;1;1;4;2;1501245038
64;128;32;2;4;256;49996741
32;1024;1;2;512;16;11317185
64;512;1;4;512;512;45841482
32;1024;2;16;1;256;2785185
32;1024;4;64;1;8;14866963
16;4096;1;64;1;512;1523407
256;1;1;1;2048;1;4305916000
2048;1;64;1;64;512;34854222
4096;512;1;256;512;128;10083260
128;1;32;1;64;128;84154815
16;4;16;1;1;64;1239145333
32;4096;4;4;1;128;10766074
1;256;1;16;32;256;39684444
64;1;16;1;256;1;172549037
32;4096;2;32;1;256;1609629
64;1024;1;64;2;64;1761778
1;8;1;8;8;2;3724857185
64;32;4;1;64;32;8233926
1;1;1;1;1;256;5129359852
512;1;64;1;64;128;32901629
32;1024;1;64;1;1;24070074
1;32;1;4;1;1;795569185
1024;16;1;8;1;64;4456445
1;512;1;32;1;64;24386667
4;8;2;1;8;1;276163259
128;256;1;2;1;16;27407111
512;1;32;1;1;16;328391704
1;2048;1;4;1;8;6888445
512;128;1;1;256;128;34258667
32;512;1;64;4;256;1261926
32;2048;2;64;1;128;1581926
512;1024;8;2;1;1024;20016148
2;1024;2;4;256;1;22588000
4096;256;8;2;4;512;51088593
32;4;1;1;1;1;39668000
1;1;1;1;256;4;5330458963
128;2048;1;16;1;256;2216593
1;4;1;1;2;512;1093912889
64;128;1;32;128;256;3082667
8;1024;4;1;2048;16;8271852
64;128;1;32;16;128;2664593
128;32;2;2;1;1024;17714518
2048;4096;16;8;1;1024;7434074
4096;1024;1;256;512;1;359399111
128;1024;32;1;64;128;10661482
32;64;16;4;1;64;61855111
32;128;16;16;1;128;40941926
64;1024;4;16;32;128;1644148
64;1;16;1;4;1;354933926
8;256;1;64;4;512;5395112
2;256;1;32;8;64;22822370
64;4096;4;1;4096;128;129999259
16;512;16;16;4096;256;5273926
