GLOBAL_SIZE_0;GLOBAL_SIZE_1;LOCAL_SIZE_0;LOCAL_SIZE_1;v_TP_141;v_TP_142;cost
2048;256;2;128;1023;1;11543892584
32;2;8;1;33;44;3174508199
8;256;4;1;33;372;1899666041
256;1;256;1;3;12;28878479828
256;32;64;4;4;2046;1382889337
32;64;2;4;132;1364;1075763244
16;2048;4;1;2;66;895005544
8;256;4;1;33;66;1366670500
8;32;1;1;4;1;1632155550
4;2;4;2;31;2;19039787585
4096;2048;1;2;31;1;2181262962
1;512;1;16;2;682;1331871041
512;128;128;1;12;93;1403832301
2;1;2;1;1023;1;78684224695
1;4;1;4;1023;33;24197431508
2048;32;8;8;12;93;494480268
2048;16;8;16;12;93;575247922
2048;16;8;16;31;93;516489378
2048;64;32;4;12;93;606551771
2048;32;8;8;31;93;492084547
2048;32;8;8;22;62;508729050
1;32;1;8;3;93;3326834458
4;1;1;1;132;124;20916172375
2048;32;8;8;66;93;576162333
2;1;2;1;186;6;44910848621
16;2048;2;64;682;4;1373400547
1;16;1;16;6;66;7642651068
1;128;1;8;93;1;9573710148
1;1;1;1;3;1;154915774417
2048;32;16;8;31;93;532114765
2048;64;8;4;12;93;482473762
2048;16;8;16;22;93;540414645
1;1;1;1;1;1;160099686833
1;2048;1;16;1;132;500093042
1;1;1;1;3;1;154915399125
1;1;1;1;3;1;154915803542
4096;1;1;1;3;1;1937386851
8;1;4;1;3;1;28448444519
1;1024;1;16;12;1;2828164925
1;1;1;1;341;1;155009608917
2048;1;256;1;1;1;21366641959
8;256;2;16;341;3;1067030097
4;256;1;32;1;132;539603764
1;1024;1;64;62;33;931446233
16;8;8;4;22;31;1522746252
1;1;1;1;3;372;80465210603
1;1024;1;16;3;1;3289511594
1;1;1;1;11;1;150215561791
