GLOBAL_SIZE_0;GLOBAL_SIZE_1;GLOBAL_SIZE_2;LOCAL_SIZE_0;LOCAL_SIZE_1;LOCAL_SIZE_2;TILE_0;TILE_1;TILE_2;cost
4;128;32;2;2;8;1;128;1;9313389472
64;1;4;8;1;4;32;1;256;946287744
4;1;32;1;1;4;128;2;2;18912601312
8;1;1;2;1;1;512;256;512;18446744073709551615
2;256;16;1;16;8;512;2;1;63277923808
256;512;256;1;8;1;1;64;1;18446744073709551615
1;1;16;1;1;4;4;512;32;35464010688
1;1;32;1;1;8;2;1;64;18212224000
64;2;4;8;2;1;32;1;1;3730018784
32;1;4;8;1;4;32;1;512;1996523392
64;1;4;8;1;4;32;1;512;1008274464
256;1;8;4;1;4;16;512;256;371995104
256;1;8;4;1;1;16;512;128;5054339392
256;2;16;4;2;2;8;512;256;2549821440
512;1;8;4;1;4;8;512;256;328165312
256;1;8;2;1;4;4;1;256;360940416
8;8;64;1;1;1;8;16;64;45703958496
1;8;512;1;2;8;512;32;1;43473252640
2;16;128;1;4;4;64;1;1;39388382464
256;16;256;64;1;1;2;1;64;18446744073709551615
512;2;8;4;2;4;4;512;256;328765024
512;2;8;16;1;4;8;256;256;1497867136
512;2;8;4;1;4;8;512;256;734793920
1;1;4;1;1;1;8;512;1;18446744073709551615
512;1;8;4;1;4;8;512;128;331741248
512;1;8;4;1;2;8;512;256;1411731776
512;1;32;4;1;1;8;512;128;22529380192
512;1;8;4;1;4;8;512;256;330735680
512;2;8;16;1;4;8;512;256;2994584000
512;1;8;4;1;4;128;512;512;2648509504
512;1;8;4;1;4;8;512;8;316968032
512;128;8;1;4;4;8;512;8;5212717920
512;1;8;4;1;8;8;512;8;102025408
512;1;8;4;1;4;1;512;8;623380800
512;1;64;4;1;16;8;512;8;675004576
512;2;512;4;1;8;8;1;8;4824641824
512;64;1;4;32;1;8;512;8;1423872128
512;1;8;8;1;8;8;512;16;126626240
512;1;8;4;1;1;8;512;8;5156756416
32;1;8;4;1;4;8;512;8;1589594400
512;1;16;4;1;8;256;512;8;2781169056
512;1;32;4;1;8;1;512;512;439401888
512;1;512;256;1;1;512;128;8;18446744073709551615
512;1;8;4;1;8;8;512;8;102196800
512;1;8;2;1;8;8;512;16;172925632
1;1;8;1;1;8;8;512;8;16912401376
512;4;4;2;4;1;4;512;8;1196381344
512;1;8;4;1;1;8;512;8;5075901952
512;1;8;4;1;2;8;8;8;1531232576
512;1;8;4;1;8;8;32;8;108325184
512;1;2;2;1;2;8;1;8;551827072
128;512;32;128;1;2;2;64;256;18446744073709551615
4;16;128;1;4;64;8;512;2;14594012096
1;512;1;1;1;1;512;32;512;7289473824
16;2;64;8;2;16;2;512;128;4014034144
512;1;8;4;1;8;4;512;4;179840704
512;2;16;2;1;8;8;512;8;372831168
512;1;8;4;1;8;8;256;8;112256736
512;1;8;4;1;8;8;512;4;202361056
16;2;32;4;1;8;8;8;8;741120256
512;1;8;4;1;8;8;64;8;107881504
512;1;8;4;1;1;8;512;8;5180615648
512;8;8;4;4;8;8;512;128;491077536
128;8;128;2;4;1;256;512;4;18446744073709551615
128;2;512;8;2;8;2;4;64;18446744073709551615
2;1;512;2;1;2;4;1;1;18446744073709551615
512;16;8;1;16;8;512;2;512;18446744073709551615
256;1;8;4;1;4;8;512;16;300604064
512;1;4;4;1;1;16;1;8;2509174880
512;1;4;4;1;2;8;512;16;620494336
512;1;8;4;1;8;32;512;8;357922656
1;1;32;1;1;1;1;1;32;18446744073709551615
512;1;8;4;1;2;8;512;8;1284328832
512;1;8;4;1;8;64;512;8;713013824
512;1;8;4;1;8;8;512;8;102331072
4;4;32;4;2;32;256;512;64;1142027936
512;1;8;8;1;2;8;512;8;1994525376
512;2;8;4;1;8;8;256;8;18446744073709551615
512;1;8;2;1;8;16;512;8;315357536
1;2;1;1;1;1;1;16;512;57925509760
512;1;8;4;1;8;8;512;8;102047872
16;1;8;4;1;8;16;512;8;1479101536
512;512;64;4;4;8;8;512;8;18446744073709551615
32;4;512;2;2;8;32;512;1;46636506496
64;8;2;1;4;1;128;1;1;18446744073709551615
256;512;1;32;2;1;64;128;4;595724160
2;1;4;2;1;1;64;4;512;18446744073709551615
4;4;8;2;4;1;256;64;256;13218029632
256;1;8;4;1;8;8;512;8;102007744
512;1;8;4;1;8;32;512;16;367999680
512;1;8;4;1;8;4;512;8;91728288
256;1;8;8;1;8;4;1;8;264240256
512;2;8;8;1;8;4;512;8;681123392
512;2;16;4;1;4;1;512;8;1665226112
512;1;8;2;1;8;4;512;8;96878336
512;1;8;8;1;8;2;256;8;444785216
128;2;8;4;1;8;4;512;8;213924096
1;1;8;1;1;1;4;1;8;18446744073709551615
512;2;8;4;1;8;4;1;8;93648800
512;1;8;8;1;8;4;512;8;261496992
512;1;4;4;1;1;4;512;16;2665102720
512;1;8;4;1;8;1;512;8;154055072
256;1;8;4;1;8;1;512;4;540670336
256;1;8;4;1;8;4;512;8;117253920
256;1;8;4;1;8;4;256;8;107922272
512;2;8;4;1;8;4;512;8;191489152
512;1;8;1;1;8;4;512;8;181920960
512;1;8;4;1;8;16;512;8;183435648
512;1;8;8;1;8;4;1;8;186176640
1;1;8;1;1;1;2;512;8;18446744073709551615
512;1;4;4;1;1;4;512;8;2685780864
512;2;16;4;1;8;4;512;8;371337408
512;1;8;16;1;8;4;512;16;869241152
512;1;4;16;1;1;4;512;8;9344808576
1;2;8;1;1;8;4;512;16;20290119296
512;4;8;4;1;8;4;256;8;100237792
256;1;8;2;1;8;4;512;8;96452064
1;2;8;1;2;8;4;512;8;11220658912
512;1;8;8;1;4;4;512;8;623595968
1;1;4;1;1;4;4;512;8;37599898944
512;1;8;4;1;2;4;512;8;1402896288
1;512;1;1;16;1;1;32;8;1236144096
512;1;8;4;1;8;4;256;8;90996192
1;1;16;1;1;16;4;512;8;16717106880
512;4;8;4;1;1;4;512;4;19655598592
512;1;8;2;1;1;4;256;8;5493135392
512;1;8;4;1;1;4;256;4;5205648512
512;1;16;4;1;8;4;256;8;187103680
512;1;8;8;1;8;1;256;8;306205504
256;1;8;4;1;8;4;128;16;114895904
512;1;16;4;1;8;4;64;8;198250560
1;1;8;1;1;1;4;256;16;18446744073709551615
512;1;8;4;1;8;4;256;4;173703872
512;1;8;16;1;8;4;512;8;906888960
512;1;16;4;1;8;8;256;16;187462592
512;1;8;4;1;8;4;1;16;81018368
512;1;8;4;1;8;4;1;128;86301536
512;1;4;4;1;1;4;1;16;2680538400
512;1;8;8;1;8;2;1;16;370442560
512;1;8;4;1;8;2;512;16;156644608
512;2;8;4;1;1;8;512;16;10414130880
1;1;16;1;1;2;4;1;32;66620240064
512;1;8;4;1;8;2;1;16;151562752
512;1;4;4;1;1;4;1;16;2652385024
512;1;8;4;1;8;4;1;8;87812320
256;2;8;8;1;1;4;1;16;7285008544
512;1;16;4;1;4;4;1;16;709307456
512;2;2;8;1;2;2;1;16;928963520
256;1;8;4;1;8;4;1;16;104794496
512;2;8;4;1;1;2;1;16;7111743168
1;1;8;1;1;8;4;512;16;20294199648
512;2;8;4;1;8;8;1;16;70019872
1;2;8;1;2;8;8;1;8;20360704000
1;2;8;1;1;8;4;1;16;10529256928
512;4;8;4;1;8;4;1;16;91517024
512;2;2;4;1;2;8;1;16;295941184
512;4;8;4;1;1;8;512;16;20746589888
512;2;8;2;1;8;8;1;32;87936288
1;2;8;1;1;8;32;512;16;21723222976
512;2;8;4;1;4;8;1;16;335272416
512;2;32;4;1;8;8;1;8;325283488
512;2;8;8;1;8;8;1;16;215817952
512;2;8;4;1;8;8;1;8;89052288
1;2;8;1;1;8;8;512;16;21372977536
512;2;2;4;1;1;8;1;16;1468844992
512;4;8;4;1;8;8;1;16;88062912
512;2;8;4;1;1;8;256;16;6304885120
