GLOBAL_SIZE_0;GLOBAL_SIZE_1;LOCAL_SIZE_0;LOCAL_SIZE_1;cost
4;1;4;1;9402520000
256;64;16;64;18446744073709551615
4;1;1;1;9293197037
8192;32;1;8;193285333
8;256;8;1;30600592
32;4096;8;4;15079259
128;16;32;2;24042371
2;8;1;1;2255209630
4096;2;2;1;120944148
32;4096;16;4;10059556
32;1;16;1;1468846222
1;4096;1;16;96086222
32;8192;8;2;16381037
16;8192;16;4;9808000
32;4096;32;2;7756889
32;4096;32;4;7195556
32;2048;32;2;7785630
32;1;32;1;1501049185
32;8192;32;1;8966815
16;256;16;4;13689333
256;1;16;1;190837778
16;4096;1;4;75316740
4;4096;1;4;76097037
4;256;2;2;70241333
32;64;32;4;24569037
16;256;2;64;37601629
4;2048;2;4;43682075
1;2048;1;64;71903259
16;32;4;2;97101777
16;64;1;4;76545926
64;4096;32;4;7562371
16;4096;1;2;140013037
32;8192;32;8;6000000
64;2048;32;4;7801334
32;4096;32;8;6433333
32;1;32;1;1493138222
16;2048;1;64;218732740
32;8192;16;8;9555852
64;8192;32;8;6579111
256;8192;16;16;6270518
32;8192;16;4;9837629
16;2048;2;2;70065630
16;4096;1;8;59440741
4;1;1;1;9285833630
128;8192;32;8;5602963
128;2048;32;8;6781037
128;8192;32;16;18446744073709551615
32;8192;32;4;6884296
128;1;64;1;380303259
2;16;1;1;1128455407
16;64;1;8;54548592
2;8192;1;8;63927852
128;8192;8;1;29290222
128;1;64;1;381921630
64;2048;32;2;8009778
128;8192;32;4;6821037
64;8192;32;4;7418371
128;1;32;1;372997778
128;8192;16;8;7412889
128;8192;8;32;11897777
1024;256;2;1;117072593
4096;8192;1;32;43975407
4096;512;128;64;18446744073709551615
4;2048;4;8;15584296
256;1;64;1;191986815
128;8192;32;32;18446744073709551615
1024;8192;32;8;3955851
1024;4096;16;8;5157926
2048;8192;32;8;3921185
1024;4096;32;4;5886370
1024;8192;16;4;4977037
2048;2048;32;8;4751407
1024;8192;64;8;18446744073709551615
2048;1;16;1;26857037
2048;8192;64;8;18446744073709551615
2048;4096;64;16;18446744073709551615
2048;8192;32;16;18446744073709551615
4096;4096;32;8;7899111
2048;2048;32;16;18446744073709551615
128;8192;64;8;18446744073709551615
8192;8192;32;16;18446744073709551615
4096;8192;16;8;8211703
4096;1;32;1;24785630
2048;1024;32;2;7202222
2048;8192;32;32;18446744073709551615
2048;4096;32;4;3966518
4096;2048;32;8;4034667
8192;1;32;1;9036296
2048;1;32;1;25552888
512;8192;32;8;3828741
2048;8192;16;8;4578370
512;4096;16;8;6824593
512;8192;64;8;18446744073709551615
1024;4096;32;8;4499259
256;8192;32;8;4889482
512;8192;32;16;18446744073709551615
512;8192;32;4;3852445
256;1;32;1;191036444
512;2048;16;8;7057334
1024;1;32;1;49922222
512;8192;32;2;3866963
512;8192;128;8;18446744073709551615
512;1;64;1;96392741
512;1;32;1;96664592
16;2048;16;8;9407852
512;8192;16;8;4866370
512;8192;16;32;18446744073709551615
512;8192;2;8;27720000
256;2048;32;8;6232889
1024;1;32;1;49814814
64;16;16;4;59665186
512;1;32;1;96413038
512;1;32;1;96390223
512;1024;32;4;7110963
512;1;128;1;97669778
128;1;32;1;373622667
512;4096;32;8;4960592
256;8192;32;16;18446744073709551615
512;8192;16;16;5615704
512;4096;32;16;18446744073709551615
1024;2048;32;8;5421038
512;8192;32;32;18446744073709551615
256;4096;32;8;5731852
128;1;32;1;380513630
8192;128;32;64;18446744073709551615
8;256;2;8;29425926
512;8192;32;1;7399407
512;8192;1;8;47437333
128;8192;64;4;5571852
512;2048;32;8;5633037
512;1;8;1;95450223
512;1;16;1;95994519
512;8192;128;4;18446744073709551615
512;8192;8;8;8976445
512;4096;8;8;10382519
512;8192;16;4;4936889
4096;8192;32;32;18446744073709551615
64;8192;2;8;42361926
64;1;16;1;737177185
64;4096;16;8;9239852
512;8192;64;4;3810666
256;8192;32;4;6243408
512;4096;64;16;18446744073709551615
512;1;64;1;96428593
512;4096;64;4;4257333
64;1;1;1;744405926
1024;8192;64;4;3896593
512;8192;64;1;3939408
512;8192;64;2;3880148
256;8192;64;8;18446744073709551615
512;4096;64;8;18446744073709551615
2048;8192;64;2;3867259
512;8192;256;4;18446744073709551615
8;32;8;2;158511260
1;4096;1;2;141432000
8;64;2;4;95462666
128;1;4;1;371786666
256;2048;64;4;6203556
2048;8192;64;4;3844889
1024;2048;64;4;5067259
512;32;8;16;12556445
512;8192;64;32;18446744073709551615
256;8192;128;4;18446744073709551615
2048;1;128;1;26509778
256;8192;64;1;4224593
8192;32;8;1;31460889
8192;8192;64;4;3931704
512;8192;4;4;16708444
512;1;64;1;96671259
512;2048;64;4;5382074
128;8192;1;4;88902963
64;2048;16;1;14890223
2048;8;2;4;67034519
32;128;2;4;44552148
128;4;32;1;94347259
1;8192;1;1;234533333
512;4096;64;1;6536148
512;8192;8;2;15559556
512;1024;64;8;18446744073709551615
256;1;64;1;192642519
2048;8192;64;32;18446744073709551615
64;4096;32;2;7794815
1024;4096;64;8;18446744073709551615
512;8;4;4;21657334
2048;4096;64;4;3901037
128;1;64;1;381633186
512;8192;256;16;18446744073709551615
1;4;1;2;9030166815
512;32;64;8;18446744073709551615
1;8192;1;4;83408741
512;2;64;1;48811259
1024;1;16;1;48547556
256;8192;64;4;4177778
1024;1;64;1;49042370
512;4096;128;4;18446744073709551615
256;8192;16;2;7398074
512;8192;128;1;3877037
512;8192;1;4;75194667
512;8192;256;2;18446744073709551615
16;128;4;4;27069778
256;8192;256;4;18446744073709551615
128;8192;2;16;39611852
128;1;32;1;373815259
16;512;16;2;8943111
16;2048;2;4;42818371
64;128;2;32;41086074
128;4096;64;4;6270371
4096;8192;64;4;3826963
512;8192;4;32;20130963
64;64;4;16;20052148
256;8192;64;2;5943259
1024;8192;128;4;18446744073709551615
1024;8192;32;4;7929481
1024;8192;32;2;7981629
1024;4096;64;4;7843407
1024;4;1;1;314755704
512;4096;32;4;6538963
512;1024;128;4;18446744073709551615
512;2048;64;2;6913630
256;1024;64;4;6668296
32;128;32;32;18446744073709551615
4;512;4;128;18446744073709551615
512;128;256;128;18446744073709551615
256;2048;256;256;18446744073709551615
128;64;8;16;14562518
512;256;64;4;7157925
512;16;8;8;13267259
512;4096;64;2;6666518
256;1;128;1;193727407
64;8192;64;4;5888296
512;1024;64;2;7318519
2048;2048;64;4;4161037
512;1;256;1;99920297
512;8192;8;4;8142074
128;64;8;8;11706222
128;128;32;32;18446744073709551615
16;16;8;8;185190074
1;256;1;16;154710666
4096;8192;1;16;37263111
4;2;4;1;4678922074
512;1;128;1;97049629
128;8192;64;1;6710519
512;4;64;4;30071259
1024;16;1;4;136433778
512;1;16;1;96713482
512;32;4;8;21980000
256;4096;64;4;5388148
256;1;8;1;186772444
64;32;32;8;31730519
1;128;1;2;301884000
2;4096;2;4;47712889
1;16;1;4;2261296444
256;1;64;1;190323111
512;32;8;8;11884000
512;8192;2;4;41890371
1024;8;8;2;19553482
64;4096;64;2;7747852
512;8;1;2;154061185
4;4096;4;4;20911259
1;2048;1;1;236072741
16;32;4;4;92457778
512;128;64;4;7402519
512;32;64;4;5925926
2048;8192;32;4;3855408
512;8192;128;2;3822074
16;64;4;4;50427556
1024;4096;32;1;7414815
4096;8192;1;16;37237333
64;512;1;64;199236889
2048;8192;128;4;18446744073709551615
16;4;16;4;737384000
512;8192;64;128;18446744073709551615
512;8192;64;64;18446744073709551615
64;8192;64;8;18446744073709551615
512;1024;64;4;6327111
4;64;4;8;148378667
1;4096;1;2;141470370
32;64;1;4;87407408
128;1;64;1;381860148
512;8192;64;1;3931259
1;64;1;4;567449482
512;2048;256;4;18446744073709551615
512;1;64;1;96246074
512;2048;64;8;18446744073709551615
4;8192;1;1;234111111
512;8192;64;256;18446744073709551615
512;2048;16;1;14734815
32;32;2;1;135341334
32;128;8;4;14670222
16;4;16;1;722489334
512;1;64;1;96276445
4;8192;1;4;75782223
512;2048;8;4;10131408
128;8192;2;4;41920148
4;64;4;2;147518963
64;512;4;2;31384000
1;2048;1;4;85718074
1;512;1;128;282163852
512;128;1;2;139979704
256;2048;2;256;18446744073709551615
256;8192;8;16;10740444
512;8;64;4;16055555
1;1024;1;16;49344740
16;8192;16;4;10046074
256;2;4;1;124274222
8;256;1;1;242048296
16;8192;2;4;41952148
512;256;64;256;18446744073709551615
512;2048;2;4;41898518
32;1;8;1;1465983408
4096;1;32;1;14252149
512;1024;1;1;233913037
1024;4096;256;4;18446744073709551615
1;1;1;1;36118816593
64;32;16;4;24848741
16;64;4;4;51196741
1;4096;1;1;235180741
2048;8192;64;64;18446744073709551615
8;8192;4;64;27012741
4096;1;1;1;244285333
64;64;1;64;58493333
8;2048;4;1;59265334
1;256;1;2;172119556
512;4;64;4;30092297
4096;8192;1;4;75297037
128;1;64;1;381659704
1024;2048;1;1;233901629
1;1024;1;32;52981778
32;4096;8;8;14805333
128;4;128;4;18446744073709551615
16;8192;16;8;9301185
4;64;1;1;244042667
512;512;8;4;12608445
1;512;1;2;138877630
512;1;2;1;126668889
1;512;1;128;280420593
512;128;1;1;234094815
512;1;64;1;96551852
256;16;256;8;18446744073709551615
1;8192;1;16;102309482
16;1024;1;4;75577926
2048;8192;1;4;75275259
256;1;4;1;190661333
8;256;4;1;61313333
32;4096;8;2;17642815
16;256;1;128;79416592
8;8192;4;4;18927556
512;8192;2;64;46244296
64;8;1;2;141100296
4;1;4;1;9398029777
1;32;1;1;1128044741
8;1;1;1;5009155851
16;4096;2;4;42003408
16;64;16;4;46542963
64;4096;1;1;233942963
1;4096;1;16;112725926
64;64;1;1;236963852
1;8192;1;4;83200593
32;8192;1;4;75240740
512;2048;64;1;7418222
4;128;4;8;74236148
1;8192;1;2;141268000
4096;8192;1;1;234001778
128;256;128;4;18446744073709551615
4;8192;2;4;43332297
4096;16;64;4;7737926
512;2048;1;1;233902370
1;128;1;32;402950518
32;128;1;128;57724000
1;4;1;4;9037420888
512;16;64;4;8770518
16;32;16;8;95116741
4;64;2;2;154721333
16;4;4;2;716427111
1;4;1;4;9040721778
1;512;1;1;242340889
1;128;1;64;674791407
256;2048;256;1;7685778
256;1;1;1;257932741
512;4096;1;4;75200593
16;8192;1;1;233982815
256;2;4;1;124176889
8;256;1;1;241885333
128;2;64;1;190456445
256;8192;64;1;4928296
512;512;64;4;6836592
512;64;64;4;7449333
32;2;16;1;733386667
4096;1;32;1;14409333
64;512;1;2;140159703
4;4096;2;4;43622370
256;2048;16;64;18446744073709551615
4096;32;256;8;18446744073709551615
128;64;16;4;9730222
1024;4096;32;32;18446744073709551615
4096;2048;1;16;37647852
64;2048;1;64;179091852
1;1;1;1;36135105778
1;8192;1;1;234542370
512;64;64;1;8719111
512;256;128;4;18446744073709551615
128;1;16;1;371415407
512;512;16;1;14760740
1;64;1;4;567480444
512;1024;64;64;18446744073709551615
2048;128;64;4;7046667
512;128;1;4;88449926
8;4;4;1;1258806815
16;8192;16;1;15175852
4;1;4;1;9416883852
16;512;1;1;235937630
512;8192;1;32;61865333
2;16;2;16;1323179852
1;1;1;1;36115005186
1;128;1;2;297927407
256;512;256;1;8120000
1;8192;1;16;102524444
1;1024;1;1;238095703
2048;8192;1;4;75277629
256;2;4;2;103100000
128;1;1;1;372285185
512;8192;1;4;75195852
512;8192;64;16;18446744073709551615
512;1024;128;8;18446744073709551615
128;1;64;1;380338815
1024;1;32;1;49393481
64;512;64;4;7100148
128;4096;64;16;18446744073709551615
2048;8192;64;16;18446744073709551615
512;512;128;2;7324000
4096;8192;16;4;4575852
256;8192;16;4;6494519
128;8192;16;1;14680296
4096;8192;32;4;3845185
256;4096;64;16;18446744073709551615
512;2048;32;1;7447111
1024;4096;128;4;18446744073709551615
256;4096;64;2;6839555
1024;4096;64;1;4068000
2048;8192;32;2;3883408
128;2048;128;4;18446744073709551615
2048;4096;64;2;7967259
256;2048;64;1;8162815
512;4096;128;8;18446744073709551615
256;8192;128;2;7923407
512;1;128;1;110035407
256;8192;128;8;18446744073709551615
128;8192;128;2;5993185
512;2048;16;4;7197926
512;2048;128;4;18446744073709551615
512;1024;64;32;18446744073709551615
32;8192;4;8;23542074
2048;8192;256;4;18446744073709551615
16;4096;16;4;10044593
1024;8192;64;2;3934666
512;2048;256;2;18446744073709551615
256;4096;256;4;18446744073709551615
512;1024;256;16;18446744073709551615
4096;8192;64;1;3961778
512;2048;32;4;6858223
1024;8192;256;4;18446744073709551615
128;2048;64;4;6712000
256;2048;64;8;18446744073709551615
64;4096;64;8;18446744073709551615
256;8192;64;16;18446744073709551615
1024;2048;64;8;18446744073709551615
2048;1;64;1;25487111
1024;8192;16;2;7464444
512;1;32;1;96408889
1024;1;256;1;49234815
256;1;32;1;191547111
128;8192;64;2;8115704
64;128;1;1;249856593
16;2048;8;4;15122074
4096;2048;32;128;18446744073709551615
16;8192;1;2;139935704
512;8192;1;1;233897185
64;4096;2;4;41872741
1;2;1;1;18030853482
64;32;64;4;31226814
8;64;1;4;100089482
1024;16;64;2;7859407
1024;4096;1;1;233897629
4096;4096;1;16;37223704
1;64;1;1;577892593
4;2048;1;2;140998667
1;1;1;1;36118632741
4096;1;1;1;240873186
128;16;1;4;87706370
512;64;16;1;17218815
1;1024;1;2;146961333
32;1;8;1;1465150667
1;2048;1;1;236066963
64;16;4;1;64465037
8192;8192;64;32;18446744073709551615
64;64;32;2;13193333
1;16;1;2;2259348000
16;2048;4;4;24602963
1;1024;1;1;238123556
512;512;4;4;20911112
512;8192;8;1;29284889
512;1024;1;1;233916148
8192;8192;256;64;18446744073709551615
32;8192;8;16;14535112
1;1024;1;16;47040148
4;1;1;1;9278398223
256;32;64;2;10068592
8;256;2;8;28257037
32;4096;8;1;29362222
32;8;1;1;259452148
2;8192;1;4;83331111
256;1;32;1;191494667
16;1;16;1;2977502074
4;4096;4;2;32032296
1;256;1;1;240902667
4;2048;1;128;162797629
64;8;16;4;94858519
1024;64;16;2;10437926
1024;1024;32;1;7548741
4096;4096;1;1;233970075
1;8192;1;4;83718074
8;8192;2;4;42433926
2;8192;2;2;77395407
64;1;1;1;735692740
4;2048;4;1;59917926
1;4096;1;2;141480297
128;8192;1;4;75200000
128;16;1;4;89678074
128;2048;16;1;14714074
64;2048;2;32;59152297
32;2;1;1;736883407
128;4;2;1;128461481
16;8192;16;32;18446744073709551615
64;2;32;1;372915111
16;1;16;1;2965320592
16;1024;4;4;24961334
8192;1024;64;1;8738815
128;1;128;1;383712148
512;8192;128;16;18446744073709551615
256;1024;64;2;7692593
256;512;32;4;7401629
512;1;128;1;97933926
512;256;64;128;18446744073709551615
4096;4096;256;4;18446744073709551615
512;128;256;2;18446744073709551615
256;1;256;1;199309334
1;8192;1;16;101808593
1;1024;1;16;48986074
2048;4096;64;8;18446744073709551615
512;256;64;16;18446744073709551615
2048;2048;128;4;18446744073709551615
1024;8192;64;1;3997630
2;8192;2;4;47888148
256;1;64;1;188751852
8;32;2;8;165388741
4096;4096;4;4;16781185
4096;4096;32;128;18446744073709551615
2048;8192;1;2;139814519
4;8192;4;1;72221630
1;32;1;1;1128265333
64;64;16;4;14686371
4096;64;1;1;234110370
2;4096;2;1;131121482
256;4096;1;16;55105630
64;8192;4;4;16884741
32;8192;2;4;41874370
64;64;1;64;62780296
4;2048;1;8;56410667
2;8192;2;1;130083111
128;1024;1;4;75247259
1;16;1;4;2261352592
128;1;16;1;371713333
2048;1024;8;32;12689037
32;1;8;1;1463136445
4096;8192;128;4;18446744073709551615
512;512;64;256;18446744073709551615
128;1;2;1;376252592
16;4096;16;1;15536444
64;1024;32;8;7328296
8;512;2;32;28803852
2048;2048;32;2;6515111
512;1024;8;1;29342074
512;1024;32;1;7477186
256;2048;256;128;18446744073709551615
256;8192;2;16;37821037
64;1024;64;16;18446744073709551615
16;8192;1;4;75242815
128;128;16;128;18446744073709551615
1024;4;64;2;12773778
8;256;2;4;41795556
32;64;8;4;27765333
4096;1;32;1;13526370
1;8192;1;2;141317629
512;64;1;4;96131556
32;4096;2;4;41873185
1;2048;1;2;141729778
64;64;64;4;15976000
128;512;16;1;14966519
512;1;256;1;99463111
512;8;64;1;23065926
1024;4096;1;1;247374222
64;64;1;16;72731556
512;64;128;8;18446744073709551615
4;1;4;1;9398053630
512;8;1;4;109500296
2;8192;1;4;83290371
64;8192;1;4;75230963
2;16;2;8;1175503112
1;2048;1;1;236106223
2048;1024;8;1;29290223
32;128;8;8;16201629
128;4;16;1;93852889
16;128;16;8;24125630
64;1024;1;8;79593630
16;512;1;2;141541926
2048;2048;32;256;18446744073709551615
8192;1024;64;32;18446744073709551615
64;4096;64;4;6602963
8;1;2;1;5013810666
4;2048;4;1;60826667
256;1;128;1;192658074
1;1024;1;16;49432741
512;8192;256;1;3883407
16;8192;16;2;9361185
8192;1024;64;2;6363407
8;256;2;128;114646519
32;4096;8;16;14668444
4096;2;16;1;17134074
8192;8192;32;2;4184593
2;512;1;4;84756741
1;512;1;64;169836148
64;64;1;4;81577037
128;64;1;4;83319556
1024;128;32;1;10824888
128;4096;1;64;132728296
1;64;1;64;1381384444
4;4096;1;8;56371259
2;8192;2;4;48039259
1024;8192;1;4;75276000
128;2048;1;4;75220889
