GLOBAL_SIZE_0;GLOBAL_SIZE_1;LOCAL_SIZE_0;LOCAL_SIZE_1;v_TP_288;v_TP_289;cost
4096;1;8;1;4094;1;18446744073709551615
2;256;1;1;1;89;121519648
1024;2048;32;1024;2;2;18446744073709551615
32;2048;1;1024;178;2;15148512
32;2048;1;256;178;46;26858784
32;1;1;1;178;2;753610368
32;2048;4;1;178;1;151450944
64;512;1;2;178;1;92334208
32;2048;16;1024;178;2;18446744073709551615
32;2048;1;1024;1;2;1351588512
128;2048;1;16;178;2;11410176
32;2048;1;1024;178;1;17852800
2048;1;1024;1;46;1;11856701856
512;64;8;4;89;23;14480800
32;64;2;16;178;1;44663296
1024;2048;1;32;89;89;61333504
1024;2048;512;8;178;2;18446744073709551615
128;2048;1;16;23;2;13249088
128;512;1;16;178;23;47582784
128;2048;8;16;178;2;9336672
2;2048;2;16;178;2;66233760
32;2048;8;16;178;2;14277504
1024;2048;8;16;46;2047;18446744073709551615
128;2048;16;16;23;2;19971264
1;32;1;2;178;1;1385051616
128;2048;1;16;178;2;11397856
128;2048;8;16;178;2;9237888
2;2048;2;16;1;4094;18446744073709551615
128;2048;8;16;178;178;18446744073709551615
128;1024;8;16;178;1;17842304
128;2048;8;16;178;1;17552320
128;2048;8;2;178;2;41054432
128;2048;8;2;178;89;18446744073709551615
1024;2048;1;16;178;2;11239456
128;1;8;1;178;2;878241408
128;256;8;16;178;2;9937760
1;1;1;1;2;1;45468247648
1;4096;1;256;23;178;78970976
256;1024;8;1;23;4094;18446744073709551615
1;256;1;64;2047;178;18446744073709551615
16;1024;8;128;46;23;7375744
128;2048;8;512;178;2;18446744073709551615
128;2048;8;16;4094;2;18446744073709551615
128;512;32;16;178;2;38516576
1;2;1;2;2047;1;15425250944
2048;1024;8;128;2047;23;18446744073709551615
16;256;8;128;46;23;24086816
16;64;8;1;1;23;47696992
512;2048;128;32;89;178;18446744073709551615
16;2;2;2;46;23;492386304
16;1024;16;128;4094;178;18446744073709551615
4;1024;1;128;46;23;18344800
128;256;8;32;89;23;2997120
32;2048;4;512;89;23;18446744073709551615
32;256;32;1;89;2;272821216
128;2048;4;64;89;46;6989440
4;256;4;128;89;2;108927872
256;2048;128;32;46;178;18446744073709551615
256;256;8;32;46;23;2830528
4096;64;1024;4;89;46;18446744073709551615
512;256;8;32;46;23;2628576
256;512;4;32;46;23;3004032
256;64;8;32;46;23;3601984
512;256;8;16;46;23;2588896
512;512;8;8;46;23;4003552
512;256;4;16;46;23;3728352
512;512;8;16;89;23;4147712
1024;256;4;16;178;23;16659072
256;256;8;16;46;23;2656224
512;256;8;4;23;23;5255840
1024;256;16;16;46;23;2665152
512;256;8;16;46;2;8880512
1;256;1;4;2047;1;4210195040
1024;512;8;16;46;23;2391264
512;32;8;16;46;23;2724992
512;256;4;32;46;23;3011872
1024;512;8;16;23;23;2291648
2048;512;1;16;46;23;9811392
1024;512;64;16;46;23;6259168
1024;512;16;16;46;2;16811584
256;512;8;16;23;1;18977024
1024;128;8;16;23;23;2585760
512;2048;8;16;23;46;2657504
1024;512;4;16;46;23;3685024
8;512;4;512;178;2;18446744073709551615
1024;4096;4;16;23;23;3310464
2048;512;8;32;46;23;2370048
4096;32;8;16;23;23;2824384
128;1024;8;64;89;46;3790112
64;512;8;64;89;23;3822304
32;256;8;64;89;23;7198048
64;256;16;128;89;23;18446744073709551615
1024;512;8;16;23;46;2797088
1024;512;8;64;2;89;36023616
2048;2048;8;16;23;23;2191680
1024;512;16;16;23;23;2988608
128;2048;4;16;23;23;3382496
512;1024;8;16;23;23;2261120
4096;2048;8;16;23;23;2349056
1;2048;1;16;23;23;17256288
512;1;2;1;23;46;77827104
2048;2048;8;4;46;23;7697568
2048;4096;8;16;23;23;2230592
2048;2048;8;4;1;23;17348480
2048;1;8;1;23;46;28418528
2048;1024;8;32;23;23;2507712
4096;1;8;1;2;23;24627232
2048;1024;8;16;178;23;9702432
64;1024;8;128;89;23;3743968
256;1024;32;32;89;89;2951744
2048;2048;8;16;46;46;3782496
2048;2048;8;16;1;23;18225728
64;2048;2;16;89;23;13351552
1024;4096;8;16;23;23;2139712
2048;2048;8;16;23;2;9695968
1024;2048;8;16;23;23;2157920
2048;2048;16;16;23;23;2869312
2048;4096;8;16;23;2;9702656
1024;4096;8;16;2;2;46160736
1024;1024;8;16;23;23;2226816
1024;1;8;1;23;23;33493888
2048;4096;8;16;2;46;7658464
64;1024;4;32;89;23;4081280
1024;4096;4;8;2;23;12755136
1024;1;8;1;23;23;34112928
1024;4096;8;16;23;1;18154624
256;2048;8;64;89;23;2644576
512;4096;8;16;23;23;2242208
256;1;8;1;23;23;103208608
1024;4096;16;16;23;23;2851456
1024;1;8;1;89;23;49153088
512;4096;4;16;2;23;13180992
4096;4096;32;16;2;2;184442528
1024;4096;16;16;1;23;24277344
512;1024;32;256;89;23;18446744073709551615
1024;4096;8;16;46;23;2338240
1024;4096;8;16;1;23;17615424
1024;4096;1024;16;23;23;18446744073709551615
128;1024;8;64;89;23;2841344
1;256;1;32;1;46;1615416352
1;32;1;32;2;1;17306059488
128;2;8;2;89;2;479254688
512;4096;8;64;89;23;2541728
1024;4096;8;8;2;46;7536352
2048;1;8;1;89;23;48139456
1024;4096;16;8;2;23;6443584
1;4096;1;16;2;23;50966752
128;1024;8;64;89;1;22172288
1024;4096;8;1;23;23;16125376
2;1024;2;16;23;46;23272928
256;1;8;1;23;23;111276672
512;4096;8;16;46;23;2364160
1024;4096;8;2;23;23;9194016
128;4096;8;16;23;23;2327040
1024;4096;8;512;23;23;18446744073709551615
1024;4096;32;16;23;23;4470048
4096;4096;8;16;23;23;2577472
32;1024;16;8;4094;89;18446744073709551615
1;2;1;1;2;1;22842237568
16;4;2;1;4094;46;18446744073709551615
128;4;32;1;4094;46;18446744073709551615
1024;4096;8;4;23;23;5380448
4096;4096;8;8;23;23;3650464
1024;1;16;1;23;23;35857280
1024;4096;4;8;23;23;5041824
1024;1024;8;8;23;23;3040352
2048;4096;8;16;46;23;2400576
512;4096;4;16;23;2;7625952
32;4096;8;16;23;89;4774304
1024;4096;8;16;2;23;9529184
1024;4096;8;32;23;2;11026272
8;4096;8;16;23;178;10883456
2;4096;2;16;23;23;6595648
1024;2;8;1;23;23;17328928
32;4096;8;16;1;23;17293888
1024;512;1024;16;23;23;18446744073709551615
1024;2;8;2;23;23;19626304
1024;4096;8;16;23;1;18160896
1024;4096;1024;4;23;23;18446744073709551615
1024;4096;8;1;1;23;29372416
1024;4096;8;16;4094;23;18446744073709551615
1024;4096;8;256;23;23;18446744073709551615
1024;4096;256;16;23;23;18446744073709551615
1024;4096;2;16;23;23;5185280
1024;4096;8;16;2047;23;18446744073709551615
1024;1;8;1;23;23;33738720
32;256;8;16;23;23;5957280
4;128;1;16;23;23;48582688
1024;1;8;1;2;46;35387136
1024;2048;8;64;23;2;18501184
512;8;8;1;2047;2047;18446744073709551615
2048;32;512;4;46;1;18446744073709551615
128;512;4;1;2047;2;1105767424
512;1024;2;128;1;2;205348352
1024;4096;8;4;23;1;39241664
1024;4096;1;16;23;23;8089152
1024;1024;8;16;2;23;9716800
2048;4096;8;16;2;23;9859040
1024;4096;8;16;1;4094;18446744073709551615
128;4096;32;16;23;23;4590560
1024;16;8;16;178;46;17844192
1024;4096;8;16;23;2;9678304
1024;4096;4;4;23;23;7433280
2048;4096;2;16;46;23;7496544
1024;4096;16;16;89;23;3056736
2048;4096;8;16;23;46;2809056
64;32;64;1;46;23;46262624
512;1;32;1;1;89;75964992
4096;1;2;1;89;1;148050592
1;1;1;1;178;4094;18446744073709551615
1024;4096;8;64;23;23;4191648
2048;1;4;1;23;23;25993504
512;1;8;1;23;23;51834304
1024;16;8;4;23;23;6030784
1024;4096;16;2;4094;23;18446744073709551615
1024;4096;2;16;46;23;7069600
1024;4096;8;4;1;23;16888384
1024;4096;4;16;2;23;13652448
64;4096;8;16;23;23;2443136
1024;4096;8;16;23;2047;18446744073709551615
128;1;128;1;2047;2;13421691360
1024;2048;1;1;178;178;18446744073709551615
2;1;2;1;2047;2047;18446744073709551615
128;128;16;2;178;23;47573056
1024;4096;8;32;23;23;2373408
128;1;8;1;23;23;214231424
1024;1;8;1;1;46;44284704
512;4096;8;16;23;46;2622688
1024;256;8;16;1;23;18277920
16;4096;8;1;23;23;17762752
128;4096;8;16;23;178;10613792
1024;4096;2;32;23;23;3759872
1024;4096;8;8;89;89;35362208
256;4096;128;1;89;89;30240352
8;32;4;2;46;4094;18446744073709551615
2048;1;2;1;1;46;120010560
2;1;1;1;23;46;6300771616
32;4096;8;16;23;23;2769312
1024;8;8;2;23;23;10214048
1024;4096;512;16;23;2047;18446744073709551615
128;1;4;1;23;23;161446176
1024;4096;16;4;23;23;3447424
256;4096;8;4;46;23;7499456
2048;4096;4;16;46;23;3934304
1024;1;1;1;2;23;94191296
1024;4;8;1;4094;23;18446744073709551615
1024;4096;64;16;23;23;7733088
1024;4096;4;64;23;23;3698240
1024;1024;16;32;23;23;3443936
128;1;64;1;2;178;262489024
32;1;1;1;46;178;1017189600
1024;2048;32;64;178;2;18446744073709551615
1;4096;1;256;89;1;34724256
1024;1024;4;8;23;23;4833824
1024;4096;8;32;2;23;18586112
1024;256;8;16;23;23;2387712
1024;4096;8;8;1;23;17694144
256;128;8;8;23;4094;18446744073709551615
1;64;1;64;2;178;5617460352
4096;1;1024;1;89;46;175791712
1;256;1;32;178;1;192094048
32;4096;8;16;46;23;2906368
1024;4096;32;16;2;23;17461280
1024;4;8;2;23;23;10293472
1024;4096;8;16;89;23;4219744
2048;4096;4;16;2;23;13951296
1024;2048;8;16;46;23;2294400
1024;1024;32;16;23;23;4507872
256;1;128;1;2;1;18502483744
128;2048;8;4;89;1;39510400
16;2048;2;8;4094;46;18446744073709551615
1;64;1;1;2;1;734161568
16;4096;8;16;23;23;3223104
1024;8;8;1;178;23;109585344
1024;4096;16;16;23;2;19480512
2048;1;8;1;23;23;17833312
1024;512;8;16;23;2;10069760
16;4;2;1;178;46;586570656
128;4;32;1;4094;2;18446744073709551615
1;8;1;1;2047;2047;18446744073709551615
2048;2048;8;64;46;1;21426240
1;4096;1;16;23;23;9777216
1024;4096;8;4;23;89;14693760
1024;32;8;16;23;23;2707072
1024;4096;4;8;2;46;11410528
2048;1;8;1;23;46;28386112
1024;4096;8;8;23;23;3116640
512;4096;32;16;23;23;4485472
1024;2;256;1;23;4094;18446744073709551615
1024;4096;1;16;23;23;8079392
256;512;32;1;89;2047;18446744073709551615
512;1;2;1;1;2;267093152
64;32;64;1;2047;23;18446744073709551615
1;1;1;1;1;89;18727286944
1024;1;8;1;2;23;43870656
128;4096;8;16;2047;23;18446744073709551615
1024;4096;8;16;1;23;17612512
4;4096;2;16;23;23;6289984
1024;4096;512;16;23;23;18446744073709551615
1024;4096;1;16;2047;23;18446744073709551615
1024;4096;8;16;23;178;11097696
1024;4096;8;64;1;23;68496064
1024;4096;8;1;23;23;16146688
1;4096;1;16;23;23;9812704
1024;4096;128;16;23;23;18446744073709551615
256;1;8;1;23;2047;18446744073709551615
1024;4096;8;16;1;178;12206272
1024;1024;8;16;178;23;9576480
1024;1;8;1;178;23;112627680
1024;4096;256;16;23;178;18446744073709551615
256;4096;8;16;23;4094;18446744073709551615
1024;32;8;16;23;89;6482560
1;4096;1;1024;23;23;235550592
1024;1;64;1;23;23;93730976
1024;4096;8;16;23;89;4731872
1024;1;8;1;23;23;34848896
1;4096;1;16;23;4094;18446744073709551615
4096;4096;4;16;23;23;4056640
512;1024;16;16;23;23;2972000
4096;1;16;1;46;1;210509216
1;1;1;1;23;178;12288695008
128;1;2;1;2047;2;1353483520
1024;1;8;1;178;178;18446744073709551615
1024;4096;128;1024;23;23;18446744073709551615
1024;4096;256;1;2047;23;18446744073709551615
128;1;4;1;23;23;162421248
2048;2048;32;16;23;23;4469280
1024;2048;32;16;23;23;4470944
2;1;2;1;23;2047;18446744073709551615
128;4096;16;2;2047;23;18446744073709551615
256;4096;128;1;23;89;6219776
8;32;4;32;46;178;101580672
1024;4096;1;8;23;2047;18446744073709551615
1024;4096;8;64;23;46;3654400
1024;4096;4;16;46;23;3715424
512;4096;8;16;1;23;17484160
2048;2;1;2;1;2;184635008
512;1;1;1;4094;178;18446744073709551615
128;128;64;4;2;178;3540288
256;1;64;1;46;178;98977952
256;4096;8;16;2;46;7215328
1024;16;8;16;23;23;4190304
1024;2048;32;1024;2;89;18446744073709551615
1;4096;1;512;89;1;68959200
256;1;8;1;23;4094;18446744073709551615
1;64;1;64;89;2047;18446744073709551615
1024;2048;8;16;2;23;9631104
1024;4096;4;4;46;23;10594400
1024;2;8;1;2;23;25959424
1024;64;8;16;23;23;2679104
64;4096;8;32;23;23;2553344
4096;1;1024;1;1;46;401716384
4096;1;4;1;178;1;127602080
1;1;1;1;2;1;45721587968
128;2048;8;4;2047;178;18446744073709551615
1;1;1;1;4094;89;18446744073709551615
64;64;8;1;2;178;19721120
1;512;1;8;178;46;269522336
256;4;32;4;4094;46;18446744073709551615
1024;256;8;16;23;2;10041152
1024;4096;8;16;2;46;7429088
1024;512;8;128;23;23;8025504
1024;4096;1024;1;23;23;61184896
1024;512;8;16;89;23;4143712
1024;4096;512;16;1;2047;18446744073709551615
256;16;2;16;23;23;11304960
1024;2;1;1;23;23;74762048
2048;4096;8;16;23;1;18107456
4;1;1;1;1;23;5294276384
1024;4096;2;16;2047;23;18446744073709551615
1024;4096;8;16;178;23;9904896
2;4096;2;256;23;23;38854816
1024;1;8;1;23;1;215084384
16;4096;8;16;23;89;5117568
1024;4096;8;16;23;46;2641792
1024;4096;32;32;23;23;5577312
1024;4096;4;32;23;23;2366176
1024;4096;8;2;1;23;22888928
32;4096;32;16;1;4094;18446744073709551615
1024;4096;128;16;2;23;18446744073709551615
1;4096;1;16;23;23;9792352
1024;4096;256;16;178;23;18446744073709551615
1024;4096;8;16;2;89;8383360
1024;4096;2;16;23;2;9506816
1;1;1;1;2047;2047;18446744073709551615
2048;2048;8;16;46;1;15477408
128;512;4;1;2;2;102730880
128;1024;2;128;1;46;85091776
1024;512;8;16;23;178;10920864
256;4096;8;16;23;23;2256704
64;32;64;32;89;1;18446744073709551615
2048;1;32;1;1;1;961192288
4096;1;2;1;23;1;154796096
1;1;1;1;2047;178;18446744073709551615
16;1024;8;16;23;23;3435104
1024;4096;1;128;23;23;5452928
128;1;2;1;1;2;616361280
1;2048;1;1;178;178;18446744073709551615
1;1;1;1;23;178;11221184064
128;128;16;2;46;2047;18446744073709551615
64;4096;8;8;23;23;3178048
16;2;8;1;23;23;724828800
1024;32;512;1;178;23;58509888
8;4096;8;16;23;23;4644384
1024;4096;8;1024;23;23;18446744073709551615
32;4096;1;16;23;23;7799648
1024;32;8;16;23;4094;18446744073709551615
4096;4096;1;1;1;89;138499136
8;16;4;2;1;46;333552832
2048;1;2;1;1;46;119907072
512;8;1;4;23;1;54368320
128;128;2;4;2;178;18278304
256;1;4;1;178;178;18446744073709551615
1;256;1;2;2;2;132282624
1;8;1;1;89;23;1699709280
1;2;1;1;23;23;5984675392
1024;4096;1;8;2047;23;18446744073709551615
256;1;8;1;23;178;98996928
256;64;1;64;2047;178;18446744073709551615
4096;256;1024;1;89;4094;18446744073709551615
4096;1;4;1;23;2;70472736
64;4096;8;256;23;23;18446744073709551615
1;32;1;2;2;2;1037016096
128;2048;8;1;89;46;93346304
32;1;2;1;4094;23;18446744073709551615
512;4096;8;32;23;23;2455616
1024;1;16;1;2;23;45477248
1;256;1;1;2;178;123528064
1;512;1;8;1;46;204063872
128;4;32;1;4094;2047;18446744073709551615
512;8;8;1;178;2047;18446744073709551615
2048;2048;8;128;46;1;36911104
128;512;4;1;2;178;24253408
4096;4096;8;16;1;2;96847264
1024;1;8;1;23;1;214917696
128;4096;16;8;23;23;2669568
1024;1024;2;16;23;23;5091744
256;512;8;16;23;23;2486816
16;4096;2;16;23;23;5251296
256;4096;16;8;46;23;2928352
1024;4096;16;16;46;46;2018944
1024;1;8;1;23;1;214792320
1024;4096;16;32;46;46;2009984
1024;4096;16;16;46;23;2465120
4096;4096;16;16;46;2;16555712
1024;4096;32;16;46;2;35292800
4096;4096;16;32;46;46;2332992
1024;1024;16;32;46;46;2047264
1024;4096;16;32;1;46;32039168
1024;4096;16;32;46;23;3117312
1024;4096;32;32;46;46;3423456
1024;2048;16;32;46;46;2018368
1024;4096;32;32;23;89;2507520
1024;4096;4;32;89;46;10101312
1024;256;16;64;46;46;2571808
4096;4096;16;32;46;23;3207712
2048;4096;16;32;46;46;2065088
1024;1;16;1;46;46;31512832
1024;4096;16;8;89;46;7791520
1024;4096;16;32;89;2;18060608
1024;4096;16;32;46;89;3522144
1024;4096;32;8;89;46;5938048
256;4096;16;32;46;46;2047424
256;2048;16;32;46;46;2061824
1024;4096;8;32;46;23;2207904
512;1;16;1;89;46;75784416
1024;4096;32;32;46;89;2355392
512;4096;16;32;2;46;15906112
2048;4096;32;32;46;46;3487072
512;1;16;1;46;46;48632384
512;1;16;1;46;46;48664704
1024;4096;16;256;46;46;18446744073709551615
256;4096;16;32;23;23;3396896
1024;4096;16;8;46;2;15660288
4096;1;16;1;23;46;16228768
1024;4096;16;128;46;46;18446744073709551615
1024;4096;16;32;89;46;2725120
512;2048;2;32;46;46;13012096
2048;1;8;1;46;46;54311904
1;2048;1;32;46;46;43454432
1024;4096;8;8;2;178;6550048
1024;1;32;1;46;46;36235072
1024;4096;8;32;46;46;2693184
1024;2048;16;128;46;46;18446744073709551615
1;4096;1;32;46;46;40611008
512;4096;16;32;46;46;2027680
512;1;16;1;46;23;71443392
1024;4096;16;32;178;46;4609248
512;4096;16;128;46;46;18446744073709551615
512;4096;4;32;46;46;5305600
1024;4096;16;32;23;46;2132448
1;1;1;1;46;23;12242296416
1024;4096;64;64;89;89;18446744073709551615
1024;1;16;1;23;46;32286112
1024;4096;16;8;46;46;3231968
1024;2048;32;32;46;46;3410144
1024;1024;16;32;46;23;3174368
1024;4096;4;128;46;89;5647072
1024;4096;8;32;2;46;14491296
1024;1;64;1;46;46;46595680
2048;1;16;1;46;23;23015488
128;4096;16;32;46;46;2101536
1024;2048;16;32;46;23;3136480
512;4096;16;128;46;23;18446744073709551615
1024;4096;32;32;2;46;25655264
1024;2048;16;16;46;46;1975584
2048;4096;16;16;46;46;2092960
4096;4096;32;16;46;46;2790976
128;4096;16;8;46;46;3169216
1024;1024;16;32;46;178;5837664
256;2048;16;16;46;46;2067104
1024;4096;16;8;2;46;4186688
1024;256;32;16;46;89;2663360
1024;256;32;16;46;46;2736544
2048;2048;16;16;23;46;1908672
2048;2048;16;16;46;89;4866752
2048;2048;16;8;23;46;2079616
512;2048;16;8;23;46;2054912
2048;512;16;16;23;46;1939744
2048;1024;16;16;23;46;1903968
512;4096;16;32;23;46;2118336
2048;1024;8;16;23;23;2263680
2048;1024;4;16;23;46;5827328
1024;1024;16;16;23;46;1900448
1024;256;16;16;23;46;2034272
1024;256;16;16;46;46;2093088
1024;1024;16;16;46;89;4678528
1024;1024;16;32;89;46;2650272
1;1024;1;16;23;46;44478240
1024;1024;64;64;23;46;18446744073709551615
1024;1024;16;16;23;23;2919840
1024;512;16;16;46;46;2030688
1024;1024;16;2;23;46;5971168
1024;256;16;16;2;46;8361888
256;1024;16;16;23;178;5655808
1024;1024;16;16;2;46;8239104
1024;1024;16;32;23;46;2186848
1024;1024;16;8;23;46;2043872
256;1024;16;16;23;89;2748704
1024;1024;32;64;23;46;18446744073709551615
1024;1024;8;8;46;178;32426080
1024;1024;8;64;23;23;4181248
1024;2048;64;16;89;46;4082624
1024;2048;16;16;23;46;1873088
4096;1024;16;8;23;46;2141152
1024;512;16;16;23;46;1958016
1024;2048;16;16;2;46;8188448
1024;2048;8;128;23;46;6935840
1024;2048;16;16;1;23;24477216
1024;2048;32;16;23;46;3020800
2048;2048;16;16;46;46;2008960
512;2048;16;16;23;46;1901504
2048;2048;16;16;2;46;8421312
512;512;16;16;23;46;2016096
1024;2048;16;8;23;2;16997664
4096;2048;32;16;23;46;3097664
1024;2048;16;8;23;89;4036448
1024;1024;32;16;23;46;3057504
1024;2048;16;8;23;46;2026496
1024;2048;16;4;23;46;3335840
1024;1024;32;32;23;46;3769280
2048;2048;16;8;2;46;4296224
1024;2048;16;16;23;178;5752320
1024;2048;64;16;23;46;4972992
1024;2048;32;64;23;46;18446744073709551615
2048;2048;8;16;23;46;2732576
1024;2048;16;32;23;46;2156480
512;1;64;1;2;46;123849408
4096;2048;16;4;178;46;31781760
1024;2048;8;16;23;46;2654048
512;1;16;1;23;2;473408416
1024;2048;16;16;23;23;2870880
1024;2048;16;128;23;89;18446744073709551615
1024;2048;4;16;23;46;5683520
1024;2048;16;16;23;89;2680160
1024;4096;16;16;23;46;1877760
1024;2048;16;16;23;2;19544832
1024;2048;64;16;23;2;74177184
1024;1;16;1;23;2;242477440
1024;1024;16;16;46;46;1998496
1024;256;32;16;23;46;3192064
256;2048;16;8;23;23;2541408
2048;4096;16;16;23;46;1970240
1024;2048;64;16;2;46;17889216
512;4096;16;16;23;46;1867616
512;4096;16;32;23;89;2221216
256;4096;16;16;23;89;2727488
256;2048;32;8;23;46;2562336
512;2048;32;16;23;46;3054208
512;2048;128;16;23;23;18446744073709551615
512;4096;2;16;23;46;11418592
512;4096;16;8;89;23;4892480
512;2048;16;64;23;46;3644384
512;4096;16;16;46;46;2023424
512;4096;8;16;2;46;7256960
512;1;16;1;23;178;54342784
512;2048;16;8;46;46;3118656
512;1;16;1;23;46;48997056
512;4096;64;16;23;46;5046112
512;4096;32;16;23;46;3041312
512;4096;4;16;23;46;5586368
2048;4096;16;4;23;46;3617728
512;4096;16;4;46;46;5892224
512;4096;4;8;23;46;8206272
512;2048;32;32;23;178;2044224
512;4096;32;16;23;2;40990528
512;512;8;16;23;46;2820416
256;4096;16;16;2;46;7988448
512;4096;16;8;23;23;2504288
512;4096;16;16;23;89;2645088
512;1;16;1;23;23;72046304
512;4096;16;16;23;23;2884000
128;2048;8;32;23;46;2436576
512;4096;16;128;23;46;18446744073709551615
512;4096;32;32;23;46;3740512
256;4096;4;16;23;46;5586624
512;1;16;1;2;46;57455680
512;4096;16;16;1;46;15885152
512;1;4;1;23;46;46257760
512;4096;32;8;23;46;2501792
256;4096;16;16;23;46;1890144
128;4096;32;16;23;46;3098752
512;4096;16;4;23;46;3337664
128;4096;32;16;2;46;12313920
256;4096;16;16;23;23;2924832
512;4096;16;32;46;178;5825312
1024;1;16;1;23;46;32137248
1024;4096;32;16;2;46;12436544
256;4096;16;8;23;46;2093696
1024;4096;32;32;23;46;3749984
32;1;16;1;46;89;635205280
512;2048;16;16;46;46;2010432
512;1;16;1;23;46;49195808
64;1;16;1;23;46;360338464
64;4096;16;8;23;46;2334496
2048;4096;16;64;23;46;3844768
512;4096;16;8;23;46;2055424
256;4096;4;16;2;46;11878848
256;1;16;1;23;89;87483168
512;4096;8;16;46;46;3667904
256;1;64;1;23;46;178496032
512;1;64;1;89;46;88677824
128;4096;16;16;23;46;1951296
128;4096;16;16;23;2;20111392
512;1;128;1;23;46;176931936
512;1024;16;16;23;46;1932352
512;4096;8;16;23;178;10811968
512;4096;16;64;23;46;3609440
256;2048;16;64;23;46;3623392
128;4096;8;16;2;23;9431136
256;2048;16;16;23;46;1919360
256;1;8;1;23;46;86760544
256;4096;16;32;23;46;2137952
256;4096;4;32;23;46;3733472
512;4096;4;32;23;46;3656096
512;4096;16;16;23;2;19617856
256;4096;8;16;23;46;2682816
128;1024;16;8;23;46;2219232
2048;2048;16;32;46;46;2060384
512;1024;32;16;46;46;2650304
512;1;32;1;23;46;72422752
1024;4096;16;8;23;46;2069664
512;4096;8;16;23;89;4609792
2048;4096;32;16;23;46;3020704
512;1;8;1;2;46;68931968
4096;4096;16;32;23;2;23166304
512;4096;16;8;23;89;4026624
128;1;32;1;23;46;278992256
512;4096;16;16;46;89;4724160
256;4096;32;16;46;23;3983360
512;1;16;1;23;46;49222400
512;4096;8;8;23;46;4050048
512;1;16;1;23;46;49286784
512;1024;4;4;23;23;6805952
4096;4096;16;16;23;46;2227552
512;4096;32;8;23;23;3741856
512;4096;16;2;2;23;7962848
256;4096;32;16;23;46;3065440
1024;4096;4;16;23;46;5706752
2048;2048;16;4;89;46;15229536
512;1;16;1;46;46;48595456
2048;4096;16;16;23;89;2808128
512;4096;32;32;46;89;2314688
512;1024;32;16;2;46;12525440
64;4096;16;16;23;46;2041248
256;1;16;1;46;46;95882816
512;4096;8;8;178;46;34389472
512;4096;16;64;46;46;2430336
1024;4096;4;32;23;46;3713888
1024;4096;16;8;23;89;4121920
512;2048;16;16;23;23;2896736
512;4096;16;8;46;89;8761216
256;1;32;1;23;23;182195520
256;4096;4;16;23;89;8060192
512;512;8;16;23;23;2376000
64;4096;16;16;23;89;2762400
1024;1;16;1;23;46;32366528
512;4096;4;4;23;46;12616896
2048;1;16;1;23;46;16096896
512;4096;32;4;23;2;31668992
256;1;16;1;2;2;1392010144
1024;1;32;1;23;46;36543328
4096;2048;16;64;23;46;4061632
512;4096;16;16;2;46;8011040
1024;4096;64;16;23;89;3404128
512;1;16;1;23;23;72093568
512;256;16;16;23;89;2851040
128;1024;2;32;2;46;22130848
512;4096;16;256;23;46;18446744073709551615
1;4096;1;16;23;46;29587936
64;32;64;1;2;178;16447552
512;1;256;1;1;46;681367936
4096;1;2;1;89;1;148150048
1024;1;2;1;23;89;147762720
512;4096;16;1024;23;46;18446744073709551615
512;4096;16;16;23;2047;18446744073709551615
16;4096;16;16;23;46;2339680
128;1;2;1;46;2;307188608
1024;2048;1;1;1;178;104317536
512;1;2;1;23;178;285605248
128;128;16;32;178;23;5945600
512;512;16;16;23;89;2800192
256;4096;16;4;23;2;22203808
512;4096;16;16;2047;46;18446744073709551615
512;4096;16;1024;1;46;18446744073709551615
512;4096;128;4;23;46;5468288
256;4096;16;1;1;89;11995936
8;32;4;32;46;46;157515872
2048;1024;2;1;1;46;62194880
512;2;1;2;23;4094;18446744073709551615
8;4096;1;16;23;46;21760640
512;4096;16;16;23;1;36849024
512;4096;128;16;89;46;18446744073709551615
128;32;64;16;1;178;104219168
256;1;32;1;2;178;103501856
1;256;1;4;2;89;93013440
512;4096;16;16;4094;1;18446744073709551615
16;4096;2;16;23;46;11464640
512;2;16;1;23;46;24769440
64;4096;16;256;89;1;18446744073709551615
32;1;16;1;23;178;657395776
1;1;1;1;46;178;11567092320
4096;1;1;1;89;46;531379616
512;4096;16;16;23;1;36877088
4096;4096;16;16;23;1;36456384
16;1;4;1;89;2;3544131072
128;32;128;2;2;2;664471808
512;2048;8;32;89;1;16926432
32;1024;16;8;1;89;11267840
32;4096;16;16;89;46;4673376
64;64;8;1;2;1;250570176
1;1;1;1;46;46;11890906016
128;1;32;1;4094;89;18446744073709551615
512;8;1;1;2047;2047;18446744073709551615
1024;1;16;1;23;46;32132096
4096;1;8;1;89;1;153643040
128;512;4;1;23;178;137060576
512;1024;2;1024;2;46;18446744073709551615
64;32;64;32;2;178;18446744073709551615
512;256;32;1;1;89;7520448
128;1;1;1;1;1;698839648
1024;512;2;1;23;89;99795520
128;1;2;1;1;2;615915040
512;2048;16;32;23;46;2161568
4096;2048;16;16;23;46;2081728
512;512;2;16;23;23;5091744
256;4096;16;16;46;46;2070688
1024;2048;1;1;1;1;400891488
512;512;2;16;23;178;35142240
128;128;16;64;178;2;33711008
256;1;16;1;89;89;159907488
1;4096;1;16;23;46;29604608
256;32;16;16;23;46;4871840
512;4096;8;16;2047;46;18446744073709551615
512;4096;64;16;23;178;2311776
512;4096;1;64;23;46;24649024
512;2048;128;16;23;46;18446744073709551615
256;1;16;1;23;46;97403296
512;2048;16;16;23;89;2688992
2048;4096;64;16;23;46;5018912
512;2048;8;16;23;89;4638976
8;32;2;8;46;89;70620480
2048;1024;1;1;1;23;118202592
2;4096;1;16;23;4094;18446744073709551615
512;32;16;16;23;46;2859968
512;8;32;4;23;23;13219104
512;16;16;16;23;46;4934944
2048;128;64;8;2;178;5027872
512;1024;16;32;23;46;2218624
512;4096;16;16;1;46;15903072
512;4096;16;16;2047;23;18446744073709551615
512;4096;8;16;23;1;18287680
256;1024;64;128;46;2047;18446744073709551615
4096;256;32;4;4094;89;18446744073709551615
1;4096;1;8;23;89;35250944
2048;1;8;1;23;178;100247680
1;64;1;64;23;178;1170740672
2;1;1;1;89;2047;18446744073709551615
1;1;1;1;23;2;20138723936
32;1;1;1;2;2;1158797600
512;1024;8;32;2;1;173632576
2;4096;1;16;23;46;24045408
1024;1024;1024;1;1;89;38230944
1;4096;1;1;46;178;918184704
16;512;2;1;1;46;59222720
1024;4;32;4;4094;46;18446744073709551615
1;2;1;1;23;46;5769979904
512;4096;16;2;23;46;6100896
512;4096;16;16;178;46;7792800
512;4096;16;16;4094;46;18446744073709551615
512;8;8;1;46;46;37757248
2048;2048;8;16;1;46;14915456
64;512;4;1;1;178;32775776
128;1024;1;128;2;4094;18446744073709551615
512;4096;64;16;4094;46;18446744073709551615
64;32;64;2;2;178;17080704
1024;256;4;1;1;89;34589632
256;1;32;1;89;1;3361237696
1024;512;2;64;23;89;9139520
512;256;16;16;4094;46;18446744073709551615
512;1;16;1;1;46;72912384
128;4096;2;1;2;178;43135648
1024;16;1;2;1;178;97903360
512;512;2;2;2;178;22666272
1;128;1;32;23;23;233530464
512;64;16;16;23;46;2554048
512;4096;16;16;89;46;4222752
512;4096;256;16;23;46;18446744073709551615
256;1;128;1;23;23;703605632
8;1;1;1;46;89;1457108992
2048;256;2;1;1;4094;18446744073709551615
512;4096;32;4;178;23;13712896
512;4096;512;16;23;46;18446744073709551615
512;128;16;16;23;1;43583680
512;128;16;16;23;2047;18446744073709551615
512;4;16;2;23;1;239727712
128;128;8;4;1;178;15194208
256;2048;256;1;46;178;13895104
1;64;1;16;2;46;1649010016
1;4096;1;1;89;1;648814688
512;512;2;16;23;46;11303936
64;1;1;1;23;178;534610048
1;512;1;2;23;178;247872992
4096;2048;1024;128;1;46;18446744073709551615
128;1;4;1;23;2047;18446744073709551615
512;4096;2;16;1;46;36808512
256;4096;16;16;4094;1;18446744073709551615
64;4096;1;16;23;46;21548384
1024;32;1;4;2;2047;733576544
512;4096;8;32;89;1;16895040
2048;1024;1024;1;2;89;23777824
32;64;16;1;2;178;14434208
512;4;16;2;23;46;13541152
512;2;16;1;23;46;24762656
512;32;16;4;23;46;3678304
16;1;2;1;1;23;1563706016
128;1;32;1;4094;46;18446744073709551615
1;8;1;1;46;46;1696343840
512;2048;8;512;1;46;18446744073709551615
128;512;4;1;2;23;31300032
128;1024;2;32;2047;46;18446744073709551615
64;32;4;1;1;2;172523456
512;256;2;1;1;89;58095776
512;4096;256;4;23;46;10532128
512;4096;16;16;89;2;16900416
4096;1;2;1;89;23;122889952
1024;512;1;2;23;89;99740000
128;4096;32;1;89;23;22274080
1024;16;1;16;46;178;130289888
2;16;1;16;1;46;6410945568
512;512;2;2;89;1;76024288
16;128;16;1;178;178;18446744073709551615
256;4096;128;32;23;89;18446744073709551615
8;32;2;8;46;2;149536960
256;4096;16;128;23;46;18446744073709551615
512;64;512;16;23;46;18446744073709551615
128;1024;4;1;1;46;34639072
1024;8;32;4;1;23;26967136
512;4096;32;16;23;89;2050752
128;128;1;4;2;23;33780800
512;1;8;1;23;46;56204256
512;4096;512;16;23;2;18446744073709551615
512;4096;16;1;23;46;11134944
512;4096;2;16;23;46;11434048
128;1;16;1;23;46;181599520
512;1;32;1;23;178;60107584
256;4096;8;32;23;89;2781344
256;32;256;32;46;178;18446744073709551615
512;2048;16;32;2;46;16005440
8;256;4;2;2;23;25924832
4096;16;16;8;89;1;33652960
1024;4096;32;16;23;46;3037664
1024;64;8;16;23;89;4974816
512;1;4;1;23;46;46427040
1;512;1;2;23;46;75289152
512;4096;64;16;46;89;2846368
1024;4096;16;16;23;89;2675264
64;32;8;2;89;23;27455808
512;4096;16;1;89;46;53920832
512;128;16;16;178;46;7681632
2048;512;4;2;23;46;17024480
1;32;1;2;23;2;739476224
16;4096;1;32;89;1;10800384
4;2048;2;4;1;89;31927456
512;4096;64;16;23;23;7718208
512;1;16;1;46;46;48587936
512;4096;16;1024;23;2;18446744073709551615
32;1024;32;1;1;178;6530816
1;128;1;8;1;46;803001856
128;4;1;1;4094;46;18446744073709551615
32;2048;8;16;89;46;9977632
2048;4096;16;64;2;89;38786752
128;1;16;1;23;46;194148736
512;1;16;1;23;46;49392704
128;4096;16;32;23;46;2190304
1;1024;1;16;23;23;24991040
2048;2048;8;16;2;4094;18446744073709551615
128;4096;2;1024;2;178;18446744073709551615
1;1024;1;32;1;46;400845376
32;1;1;1;2;178;621608736
512;4096;32;8;23;178;4269632
512;256;16;16;23;46;2091104
512;4096;1;16;23;2;13792832
512;1024;128;16;23;46;18446744073709551615
512;4096;16;16;23;4094;18446744073709551615
1;256;1;1;1;89;159668704
4096;2048;2;32;89;23;8069824
1024;512;2;64;23;1;10581600
128;16;32;2;89;23;23029248
512;1024;8;16;23;46;2760128
256;2048;32;16;46;89;2637504
512;4096;32;16;46;46;2652352
512;1;16;1;2;23;86669952
512;4096;32;16;89;46;3731424
1024;4096;16;128;23;46;18446744073709551615
1024;4096;32;16;89;46;3786336
1024;4096;16;32;2;89;18021856
512;2048;8;16;23;178;10737856
32;4096;16;16;23;46;2201568
512;1;32;1;23;46;73247520
512;1024;32;16;23;46;3088768
1024;4096;64;16;23;46;5010336
256;4096;4;16;23;23;3293184
128;4096;16;2;23;46;6070112
1;4096;1;32;23;46;24054880
256;1;16;1;2;89;100547584
512;2048;16;32;23;89;2255424
512;512;16;16;23;23;3063136
512;1;64;1;23;46;94312896
512;2048;64;16;23;46;5043008
512;4096;64;64;23;46;18446744073709551615
512;4096;4;16;23;23;3240000
1024;4096;16;4;23;46;3430432
128;4096;16;64;2;46;32369984
1024;4096;16;16;2;46;8139904
512;4096;8;32;23;46;2207200
512;4096;8;16;89;46;8997632
2048;4096;8;16;89;89;19220768
512;4096;4;16;1;46;22944672
2048;1024;16;8;23;46;2082976
512;4096;16;32;1;46;31639168
2048;1;16;1;2;46;20602816
128;1;16;1;46;46;177621888
128;2048;16;16;23;46;1988640
512;1;16;1;46;89;58544320
2048;1;16;1;46;46;30889088
256;4096;32;8;23;46;2560960
512;2048;8;16;1;46;14367264
256;1024;32;16;23;46;3119072
512;2048;16;16;2;23;12800864
256;4096;32;16;89;178;18446744073709551615
512;4096;16;8;46;46;3161376
512;4096;8;32;23;2;11035136
512;4096;32;64;23;46;18446744073709551615
512;4096;16;8;2;46;4134080
512;4096;16;4;23;23;3391264
1;2048;1;32;2;2;197329408
1024;4096;64;128;2;46;18446744073709551615
128;4096;16;16;1;46;15875936
512;4096;16;16;23;178;5715392
512;4096;16;16;89;23;3073248
1024;2048;16;16;89;46;4216064
512;4096;32;4;23;46;2769248
64;4096;16;16;2;178;8305152
512;2048;8;32;23;89;2853024
2048;4096;16;16;2;89;9169600
1024;1;16;1;2;46;39789216
512;1;16;1;23;89;58545376
256;4096;16;8;89;46;7460576
4096;1;8;1;23;46;28547904
512;4096;16;16;2;89;8828480
512;1024;8;16;23;89;4680224
512;1;16;1;23;2;473240096
256;2048;8;16;23;46;2716736
256;4096;16;16;1;89;14235936
256;4096;4;32;2;23;13151648
128;4096;8;32;23;46;2350944
512;4096;16;16;2;23;12666304
512;4096;64;32;2;178;18446744073709551615
512;4096;8;32;46;46;2676288
512;2048;16;32;23;23;3383840
512;4096;4;32;23;23;2424160
512;2048;4;32;23;46;3740736
512;1;8;1;23;46;57125056
512;4096;4;16;23;1;14397984
1024;1;1;1;89;178;18446744073709551615
1024;512;1;2;2;178;42403072
128;128;2;64;46;23;4197536
512;4096;128;1;2047;89;18446744073709551615
8;32;2;8;23;89;76276544
128;32;4;32;1;46;145428064
512;32;16;16;23;89;3715520
16;4096;16;16;23;178;5755104
2048;8;32;8;23;23;4958688
128;128;2;4;2;178;18113056
256;2048;1;1;46;46;184440992
8;256;8;2;46;23;19225184
4096;128;16;1;89;1;126798784
1024;1;8;1;23;89;53821728
1;512;1;128;23;46;474175200
64;512;4;128;89;23;3895872
32;4096;16;128;23;46;18446744073709551615
8;1;1;1;23;46;1576486720
128;32;128;2;2;46;36034784
1;4096;1;128;89;2;21390784
32;1024;16;1;178;89;18446744073709551615
8;4096;8;16;23;46;4706496
32;1024;32;1;23;178;26672384
16;512;2;1;1;89;56871424
128;128;64;2;4094;46;18446744073709551615
1;2048;1;1;4094;46;18446744073709551615
512;4096;1;16;23;1;17803712
128;4096;16;16;23;1;37457952
2048;256;8;16;178;46;17613088
128;512;4;8;2;178;10090016
128;1024;2;128;2;46;44602112
256;32;64;1;2;178;4607520
512;4096;2;16;1;46;36815872
512;256;32;1;1;178;6721920
4096;512;4;32;89;1;8204832
1024;128;1024;64;23;89;18446744073709551615
128;32;32;32;89;178;18446744073709551615
512;4096;256;16;23;2047;18446744073709551615
1024;64;512;16;1;178;18446744073709551615
512;8;2;2;2;178;48227168
128;128;32;8;89;23;4283104
64;512;16;2;1;89;10042112
4;4096;4;16;178;46;40988320
2;1;1;1;23;46;5825635680
8;32;4;8;46;89;97001216
128;1024;8;1;1;46;22106016
2048;8;1024;8;2;1;18446744073709551615
128;128;32;8;89;178;18446744073709551615
64;4096;16;16;1;46;15817696
512;4096;16;1;23;46;11134880
128;4096;16;8;23;89;4074880
256;2048;256;1;178;1;1103693536
8;256;8;2;46;2;77179168
2048;8;16;1;89;1;129170592
1024;64;1;16;23;89;23314624
512;4096;2;16;2047;46;18446744073709551615
512;4096;16;32;23;4094;18446744073709551615
1;512;1;2;23;89;108892416
64;512;4;128;1;23;146247840
2048;4096;1;1;178;1;180185088
1;32;1;2;2;46;508005824
512;4096;128;16;23;46;18446744073709551615
512;4;16;2;1;46;35308224
512;1;16;1;23;89;58503584
16;4096;1;512;89;1;16222240
4096;1024;1024;8;1;46;18446744073709551615
2048;1024;1;1;46;2047;18446744073709551615
16;8;2;8;1;23;907282560
2048;4096;16;16;23;23;2894464
512;4096;256;512;23;46;18446744073709551615
4;4096;2;16;23;46;12651712
16;4096;16;16;46;46;2982880
512;4096;256;32;23;23;18446744073709551615
128;2048;32;512;4094;46;18446744073709551615
512;2048;8;16;89;89;17561376
2048;2048;8;16;89;46;9252160
1;512;1;8;46;89;86577376
2048;128;16;16;23;89;2890336
128;8;2;2;46;46;57567936
