b3f4969b5eac5ef76b04f1fa21cf514a33c5b1988304ecf6a1be8f4ed1101894.cl -> 111486126 (64;512;16;4;23;2047;111486126)
6565a9977112eede3262d0e65608e0b52b5a95c403f62bb4fe9b60cf540a6e46.cl -> 101837751 (4;1024;2;128;1;2;101837751)
6ff15ad6fff135b689ff5302dbcca88f2988586c73a8993d789afa23094eb10c.cl -> 95725670 (256;1024;16;8;2047;2047;95725670)
b2a294408dbacf8cdedbaba419cbe24be3feec8c6b1ab7c5aa478a66c4e1ff5d.cl -> 78885295 (4096;16;1;8;1;4094;78885295)
80ea1af9dba5b07bf2b8b5a11fa1bd671981347e38bb105386661e85d778fbe4.cl -> 76138834 (16;4096;8;4;2;2047;76138834)
599404971fc64ea79b51ff34b705b8aa1550b9fb9aed1f748e919bc6b6f2dc76.cl -> 71129169 (32;4096;8;1;1;1;71129169)
1b1065b5a02c7918d9b5ef3d07d3e5913dc3339f05449991c8ca0c9de13c3c2f.cl -> 49244417 (256;4096;256;1;49244417)
cbd04d6fa56212df52fccc7fcc58119c408712e857f2b5bf5acd98fec6b850b9.cl -> 48453246 (4096;256;1;256;48453246)
