GLOBAL_SIZE_0;GLOBAL_SIZE_1;LOCAL_SIZE_0;LOCAL_SIZE_1;v_TP_174;v_TP_175;cost
128;64;128;2;21;14;160389696
1;2;1;2;26;1170;18446744073709551615
8192;4;16;2;195;315;18446744073709551615
1;32;1;4;45;126;2512631648
64;1;1;1;1;35;1317994816
8;32;1;4;3;1;1256656064
4;1;1;1;546;2730;18446744073709551615
16;2048;4;32;315;42;18446744073709551615
128;64;128;1;21;14;157978400
128;64;128;2;21;910;18446744073709551615
1;64;1;2;21;14;900389728
128;1;128;1;21;14;8923417472
1;64;1;1;21;14;880044704
1;64;1;1;21;14;879096928
64;64;1;1;21;70;487702016
128;64;128;1;21;42;52871840
128;64;1;1;21;126;813900416
128;64;128;1;8190;42;18446744073709551615
128;2;4;1;21;14;329306688
128;64;128;1;65;42;88990368
128;64;32;4;21;42;21004384
128;8;128;1;21;78;199265088
128;64;128;16;91;42;18446744073709551615
128;64;128;4;21;42;69121632
128;64;32;4;21;1170;18446744073709551615
128;64;32;4;8190;26;18446744073709551615
1;64;1;4;21;42;901576256
128;64;32;4;2730;39;18446744073709551615
128;16;64;4;21;90;75580832
128;64;32;4;91;42;36481792
256;64;128;1;21;42;28698208
128;256;32;2;21;30;14682464
128;256;32;4;21;30;13306464
16;256;2;4;13;26;55824928
16;64;1;2;21;30;183560544
128;256;32;2;65;30;31613248
128;256;32;4;39;39;16413600
128;1024;32;4;21;30;10812320
256;256;32;64;63;30;18446744073709551615
128;256;32;4;18;15;30623616
128;4096;32;4;39;39;16169056
128;1024;64;8;30;30;16482144
128;2048;32;16;21;9;48157408
128;1024;32;4;30;30;10863776
128;1024;32;2;35;30;18643872
128;2048;32;4;21;15;21934528
128;1024;32;4;30;39;13333504
128;1024;32;2;21;30;13129184
256;1;4;1;42;6;452058848
128;8192;2;512;26;4095;18446744073709551615
16;1;1;1;26;30;3152595808
64;128;16;16;21;13;36307136
128;1024;32;4;1;3;265765600
128;1024;32;4;65;30;17459584
128;1024;128;4;21;30;28877920
128;64;32;4;21;30;19760128
128;512;32;8;21;30;12619488
128;1024;32;4;14;30;10570976
256;512;32;4;21;30;11003808
128;4096;128;4;21;18;49433952
128;512;4;4;14;30;31296640
128;1024;32;4;14;26;12427136
128;1024;128;4;14;26;35110784
512;1024;32;4;14;9;34314816
128;1024;1;8;21;10;45795488
512;1024;32;4;14;18;17262848
64;2048;1;4;18;18;73205280
128;256;32;4;14;30;13314528
128;1024;128;4;14;30;29551616
128;8192;32;4;14;30;10481568
256;2;32;1;14;126;172532064
2048;1;32;1;14;30;76617536
128;8;32;4;14;30;146720032
128;8192;32;4;14;91;8830368
128;8192;2;4;14;30;51417728
8;1024;2;4;14;30;56561280
128;8192;32;4;14;10;31653312
128;8192;32;4;18;91;10839168
128;8192;1;4;14;91;135142624
128;8192;32;4;91;91;53617792
128;8192;32;128;14;91;18446744073709551615
128;4096;32;4;14;91;8814400
128;2;32;1;14;91;363513024
128;4096;32;4;90;13;31234592
128;4096;32;4;14;10;31708224
64;4096;32;4;210;91;18446744073709551615
128;128;32;4;14;91;13315200
128;4096;32;4;910;91;18446744073709551615
128;4096;32;4;14;18;17834816
4096;4096;32;1024;14;5;18446744073709551615
128;4096;4;4;65;91;387926336
256;4096;32;4;14;91;8618816
128;512;32;16;14;91;8929408
16;32;1;4;14;315;524564928
128;4096;32;4;8190;91;18446744073709551615
256;4096;32;64;14;91;18446744073709551615
256;2;32;1;14;117;181581504
256;4096;32;4;70;91;53596480
256;4096;32;4;14;3;105038176
256;1;32;1;14;91;369534016
256;4096;32;4;14;390;49932512
256;4096;32;4;14;117;10673760
256;4096;32;4;14;234;18333504
256;256;32;4;14;91;9134720
256;1;32;1;2;91;517171136
256;4096;4;8;14;91;29147424
2048;4096;1;4;14;91;142170624
1;4096;1;4;14;91;141588544
1;128;1;4;14;42;458284608
2048;2048;32;4;14;91;8568928
256;4096;32;1;14;91;27792992
2048;256;32;4;14;91;8795648
64;2048;32;4;14;91;9198272
2048;2048;32;2;14;91;14628544
2048;2048;128;4;14;91;13231392
2;2048;2;4;14;91;77521024
2048;2048;32;1;14;91;27794048
2048;2048;32;4;910;91;18446744073709551615
2048;4096;32;4;14;91;8637472
2048;8192;32;4;14;91;8844160
2048;2048;32;128;63;13;18446744073709551615
2048;1024;32;64;14;91;18446744073709551615
2048;2048;32;4;14;90;8678944
2048;2048;32;2;13;91;15574688
2048;2048;32;4;10;70;8524672
2048;8192;32;4;14;70;9432256
2048;8192;32;4;1;91;16591584
1024;2048;64;4;9;210;9162560
2048;1024;32;4;10;70;8649824
2048;2048;32;4;13;70;9184640
2048;2048;32;4;3;130;9927968
2048;2048;16;4;10;70;12007008
2048;2048;16;2;10;70;20651584
2048;256;32;4;3;70;12210432
2048;2048;32;1;10;105;27223392
2048;2048;32;1024;10;70;18446744073709551615
2048;2048;32;4;234;70;18446744073709551615
2048;256;512;4;10;70;18446744073709551615
256;2048;32;4;10;70;8853088
2048;2048;64;1;10;70;17629344
2048;2048;16;8;1;117;28266368
2048;2048;32;2;10;70;12139072
2048;2048;32;4;45;70;24219904
1024;128;32;4;10;126;9611040
2048;128;32;4;10;70;9187040
2048;2048;32;4;10;3;114593216
2048;2048;1;4;78;70;499775360
2;32;2;2;18;7;1209328352
8;1;1;1;90;910;18446744073709551615
2048;16;1;16;1638;63;18446744073709551615
4;64;2;64;10;4095;18446744073709551615
1;2048;1;4;10;70;92500864
2048;4096;16;4;18;35;11370336
2048;8192;32;4;14;130;13649152
2048;2048;32;4;10;90;7891488
2048;2048;32;4;14;65;9465024
1024;512;32;4;10;90;8301728
2048;8192;32;4;10;90;8106816
2048;2048;32;1;2;90;20375424
2048;2048;64;4;10;70;12070848
1024;2048;16;16;7;90;10732960
2048;4096;64;1;10;90;17970016
2048;2048;32;4;10;63;7935040
2048;2048;64;4;3;90;14214496
2048;2048;32;16;13;70;10004160
2048;2048;16;4;10;90;14736096
4096;2048;32;4;7;130;9723232
2048;2;32;1;10;45;36883488
2048;2048;1024;4;10;90;18446744073709551615
2048;2048;32;4;10;4095;18446744073709551615
4096;1;16;1;117;819;18446744073709551615
1024;4096;32;16;26;7;53768224
2048;2048;32;4;10;234;14913120
512;2048;64;4;6;90;10487680
16;32;1;4;10;90;125401920
2048;2048;32;128;10;90;18446744073709551615
1;2048;1;8;10;90;87984288
2048;128;32;4;10;90;8482880
2048;2048;32;8;10;90;7956416
8192;2048;32;4;3;105;10331296
2048;2048;8;4;10;90;27668416
1024;2048;32;4;10;90;7940672
1;2048;1;8;6;90;65264832
2048;1024;32;4;10;78;8266144
2048;2048;32;2;10;90;12456800
2048;2048;32;4;2;117;9262432
2048;256;32;4;35;45;15218912
8192;2048;32;4;14;65;9917600
1024;2048;128;4;10;90;14666688
2048;2048;32;4;1;90;17331552
2048;2048;32;4;9;90;7523936
2048;2048;32;1;9;90;19880704
2048;2048;64;4;9;90;9984160
2048;2048;64;4;14;78;10086272
2048;2048;32;4;21;90;12751264
1024;2048;64;8;9;90;13459904
4096;2048;16;16;9;90;9164928
2048;1024;32;4;9;130;10456800
2048;4096;32;4;18;78;10793728
2048;256;32;4;13;90;9408928
2048;2048;32;2;9;35;16526784
2048;2048;32;32;9;90;16995424
1024;2048;64;4;9;90;10041856
2048;8192;32;4;9;105;8855808
2048;512;32;4;9;45;10352160
2048;2048;32;2;9;90;11539456
2048;2048;32;4;15;105;12089600
128;2048;32;4;7;90;7900768
2048;2048;8;4;9;90;24574432
4;2048;4;4;9;90;34403200
2048;2048;32;16;9;105;9865216
2048;8192;32;8;13;30;11696416
2048;1;256;1;9;65;245677216
2048;2048;32;4;7;90;7600032
8192;2048;32;2;9;91;12074272
8;32;8;1;3;1;3977637088
2048;2048;32;4;9;2730;18446744073709551615
2048;2048;32;512;9;90;18446744073709551615
2048;2048;32;4;9;234;16265440
1024;4096;32;8;21;90;8084576
4096;2048;32;4;3;90;9613888
4096;2048;32;16;15;117;8656928
2048;4096;32;4;9;90;7483552
8192;2048;32;4;91;90;57515168
8192;2048;128;4;9;90;15679872
2048;2048;32;4;9;1;271541120
16;4096;1;4;9;90;103303424
2048;4;2;4;6;90;95505728
2048;4096;64;4;9;90;9883968
2048;4096;32;64;9;90;18446744073709551615
2048;4096;32;4;18;90;10804960
2048;4096;32;1024;9;90;18446744073709551615
32;4096;32;4;9;90;8238752
2048;64;32;4;9;273;16746848
256;4096;32;4;9;90;7647456
2048;4096;1024;4;9;90;18446744073709551615
2048;1;32;1;9;91;64774816
2048;4096;32;4;9;210;13284960
2048;4096;32;4;9;546;29326432
2048;2048;32;1;9;1170;18446744073709551615
2048;512;32;4;9;90;7833920
64;256;64;64;15;18;18446744073709551615
8192;256;64;256;182;1;18446744073709551615
128;1;2;1;2;195;712750880
64;8192;4;16;5;117;21609920
2048;4096;32;4;1;18;45347072
2048;4096;32;4;13;90;9228480
1024;2048;32;4;5;90;7577888
128;1024;32;4;9;90;8240704
2048;16;1;4;9;90;133139936
2048;4096;32;4;6;90;7055776
2048;4096;32;4;315;90;18446744073709551615
1;64;1;4;6;90;996503360
32;4096;32;2;6;90;9935008
2048;4096;1;4;6;90;84922848
16;4096;1;4;6;90;79486272
2048;4096;32;1;315;90;18446744073709551615
128;4096;32;4;6;65;9401952
2048;4096;32;4;6;390;20837504
2048;4096;1024;4;630;90;18446744073709551615
2048;4096;64;4;6;90;10252096
2048;1;32;1;6;9;258695840
2048;4096;32;4;6;5;69845248
2048;4096;32;4;1;90;16722272
16;256;1;4;6;90;85420896
2048;4096;128;4;6;90;15963328
2048;4096;1;4;6;1365;1267022176
2048;64;32;4;6;90;8023520
256;512;256;16;26;10;18446744073709551615
128;2048;128;8;35;9;115407168
32;2048;1;256;26;18;54946368
512;16;256;2;70;70;59502688
2048;16;2;4;6;90;52359232
512;4096;32;4;6;90;6841536
2048;4096;32;256;65;90;18446744073709551615
8;4096;2;4;6;90;45081088
512;4096;32;512;6;90;18446744073709551615
512;4096;32;32;6;90;23533440
512;512;64;4;6;90;10693184
512;4096;32;4;39;1638;18446744073709551615
512;4096;2;4;6;90;43660992
512;4096;32;4;273;90;18446744073709551615
512;4096;128;4;18;90;13655168
512;4096;32;4;15;90;10013216
512;4096;256;4;819;90;18446744073709551615
4096;2048;1;1;6;90;258261376
128;4096;32;4;6;90;7145248
32;4096;32;32;6;90;23624768
512;4096;32;4;35;90;19755008
512;4096;32;1024;6;6;18446744073709551615
512;4096;128;32;6;90;18446744073709551615
512;4096;32;4;6;10;35246912
512;2048;32;16;5;90;14414208
512;2048;32;8;6;90;7832960
512;4096;32;4;6;63;8034304
2048;4096;32;4;6;195;10519040
512;4096;16;4;6;105;12033088
512;4096;32;4;3;90;8960160
512;4096;32;64;182;90;18446744073709551615
512;4096;2;4;6;90;43511392
512;4096;256;4;6;90;26795392
512;4096;32;4;2;45;13696608
256;4096;32;4;6;90;6929152
512;4096;64;4;6;90;10339264
256;4096;32;4;6;78;7864992
512;4096;32;2;6;65;11740672
64;4096;32;4;13;90;9876960
512;4096;32;4;6;91;6765184
512;2048;32;4;1;91;16865920
256;4096;8;4;1;91;47900832
512;4096;32;4;13;91;9086592
512;4096;32;8;5;91;8264992
512;4096;64;4;6;91;10227392
512;4096;32;4;42;91;18801184
512;4096;32;4;6;117;7502432
128;4096;32;16;6;130;12301792
64;4096;32;4;6;273;12856416
32;4096;32;4;6;91;7308864
512;8192;16;4;6;117;13095200
512;4096;64;4;6;45;16292224
512;1;64;1;9;91;280908480
1024;4096;32;8;6;91;7550656
512;4096;32;2;6;45;12927936
512;4096;32;8;18;126;9311360
16;32;8;32;26;234;228306208
2;1024;1;2;1;18;356548096
4;64;2;16;9;1;2136280000
16;4;16;4;3;78;2389072512
512;4096;4;4;6;126;47216864
256;4096;32;4;6;91;6836064
512;1;32;1;6;42;326826816
512;2048;32;2;5;91;10266016
512;4096;128;4;6;91;15770176
1;4096;1;4;6;70;83919808
1;4096;1;4;6;91;83665568
512;1;64;1;6;91;298601696
512;2048;32;4;6;63;8156640
512;2048;32;4;6;91;6899584
4096;8192;32;4;6;91;7498240
512;4096;32;2;2;91;11173952
2048;4096;32;4;6;91;6975712
512;512;32;4;6;91;7309728
8;4096;2;4;6;91;45273184
512;8;32;4;130;91;63864224
128;1024;4;128;26;126;33271136
512;2048;256;32;63;91;18446744073709551615
512;1024;32;4;6;91;7183232
512;2048;32;4;6;42;11326624
128;4096;32;4;6;21;17210912
4096;4096;32;4;6;91;7148960
512;8192;32;4;6;91;6711040
512;4096;32;4;6;21;16862304
512;8192;32;4;65;91;54561440
512;4;32;4;6;91;64114592
512;8192;32;16;6;1170;28446368
8;8192;2;4;6;91;45335328
512;8192;32;4;6;1;267435456
512;8192;32;4;14;91;8624224
8192;8192;32;4;6;91;8519712
512;4;32;4;6;91;63954080
512;8192;32;4;6;130;8408704
16;8;1;4;6;91;539952032
512;2048;2;128;6;26;57054464
512;8192;32;4;6;1365;52686816
512;4;32;4;6;91;64108672
512;8192;32;4;15;91;9965632
32;4096;32;4;6;390;20256384
512;8192;8;4;6;91;18974080
512;8192;1;4;234;91;18446744073709551615
256;8192;32;8;6;91;7498656
512;8192;32;8;6;91;7447680
512;1024;32;4;6;195;10590048
512;8192;32;4;18;91;10679936
512;8;32;4;78;91;64928320
1024;8192;32;1;6;91;16311552
512;1;32;1;1638;91;18446744073709551615
512;8192;32;4;819;91;18446744073709551615
8;32;1;32;10;1;2196097696
8192;8;128;2;630;30;18446744073709551615
128;32;2;4;2;315;117720384
1;512;1;2;5;546;778773056
512;8192;32;4;10;91;7832256
512;8192;1;16;234;91;18446744073709551615
512;8192;1;4;6;91;84569312
512;8192;1;4;6;91;84513632
512;8192;32;2;6;91;8914368
512;4096;32;4;6;35;13367648
512;8192;32;8;10;91;7701088
32;128;4;32;18;13;58172448
512;1;32;1;6;91;205272768
512;8192;32;4;2;91;8868992
512;8192;32;4;78;455;18446744073709551615
1024;8192;32;8;6;70;9504640
512;8192;4;4;2;91;45136800
512;2048;32;2;6;91;8866784
512;8192;64;8;6;91;11760544
512;8192;32;4;6;42;11189600
512;8192;2;4;6;91;43807008
32;64;4;1;39;105;519922784
512;8192;64;4;6;91;10158176
1024;8192;32;4;2;91;8937920
512;1;32;1;6;91;205865984
512;8192;32;1024;6;91;18446744073709551615
512;128;32;4;6;91;8122176
128;8192;1;1;30;15;243604864
512;4;32;4;126;126;18446744073709551615
64;128;2;64;35;63;27927200
1024;64;2;8;26;30;44786752
16;4;1;4;21;195;975449184
4096;1;32;1;6;91;34747104
512;8192;32;4;6;234;11307456
512;8192;32;4;7;126;8035520
512;8192;32;4;6;7;50168224
512;8192;512;128;210;91;18446744073709551615
128;512;1;32;35;15;30167872
512;8192;32;4;2;105;9266400
512;1024;64;4;1;91;25310560
512;8192;16;4;2;126;14469088
512;4096;16;4;455;91;18446744073709551615
512;8192;32;4;78;39;30904800
512;8192;1;4;6;65;84745152
512;8192;32;4;1;546;25233120
1;1;1;1;1;5;112155050080
4096;4;512;2;7;546;24459008
8192;16;16;16;910;126;18446744073709551615
8192;8;1;2;585;7;1070452512
512;8192;64;4;13;91;9354560
128;8192;32;4;21;91;12834336
1024;4096;32;4;6;91;6805376
256;8192;32;4;6;91;6772576
512;8192;128;4;6;91;15789728
512;8192;16;4;6;91;10356384
1024;1024;32;4;3;91;9543040
512;8192;32;8;9;91;8222496
512;1;32;1;5;126;216829696
1024;8192;32;4;6;91;6917504
512;8192;32;4;6;105;7743296
512;8192;32;4;7;91;7509152
512;1024;32;4;3;78;10970464
512;8192;32;16;5;195;12434304
128;1;32;1;1;91;1331323104
512;1;32;1;10;182;172537856
512;8192;32;4;5;39;13041504
1024;1024;32;4;6;117;7774304
512;8192;32;4;2;315;10645216
512;4096;32;4;3;63;11023104
512;8192;32;1;5;91;16427264
512;8192;16;4;35;91;42333664
512;1024;32;4;6;630;28101248
512;8192;2;4;6;315;163943136
512;512;512;4;6;91;18446744073709551615
512;1024;32;8;6;91;8912544
512;8192;32;16;6;45;18804768
1024;1024;32;4;3;182;10111488
1024;8192;64;2;6;91;8824896
128;64;1;64;45;45;37933856
512;8192;32;4;78;91;53969696
512;1024;32;16;6;91;12634720
512;8192;32;256;6;91;18446744073709551615
512;4096;256;4;15;117;17619232
512;8192;64;2;6;91;8801312
4096;8192;16;4;6;315;38680160
256;1024;256;256;65;117;18446744073709551615
512;1024;1;4;6;91;79828448
512;1;32;1;315;91;18446744073709551615
64;128;2;64;26;18;35798560
128;2048;16;32;3;65;48220672
32;4;1;2;8190;39;18446744073709551615
64;256;1;256;195;78;18446744073709551615
1024;8192;32;2;6;91;9086240
256;8192;32;4;6;90;6851328
256;8192;32;4;6;70;8583744
512;8192;32;4;5;91;7363904
8192;8192;32;4;6;273;16504640
32;8192;32;4;6;91;7303648
256;4;4;4;39;90;135698816
512;8192;64;4;1;91;24537184
1024;8192;32;4;3;91;8949920
32;1;2;1;8190;195;18446744073709551615
32;512;8;32;18;14;17028832
1;1;1;1;7;35;46393978240
1;1;1;1;1;35;77241052512
64;512;1;128;26;26;39752704
8;1;1;1;3;1;22584162016
4;1;4;1;546;2730;18446744073709551615
16;2048;4;32;1;18;152801568
64;64;16;16;39;63;34337792
512;8192;32;4;1;390;18646784
128;1;32;1;6;91;785042240
1024;8192;32;2;1;91;22049024
64;128;8;32;35;42;24569664
512;1;64;1;6;70;376393728
512;8192;32;4;9;91;7454208
16;4096;2;64;9;21;31955904
1024;1;32;1;6;117;124508064
512;2048;64;2;6;91;8874720
32;1024;16;64;15;30;37919744
2;2048;2;2;18;7;133669248
2;1;1;1;90;910;18446744073709551615
2048;64;1;16;1638;63;18446744073709551615
64;128;4;64;35;45;25362272
128;256;2;32;35;30;30698784
128;512;4;64;30;78;20038208
64;128;4;64;30;30;31867552
1024;8192;32;4;819;91;18446744073709551615
512;32;32;4;6;546;31304192
512;8192;256;4;6;91;26453568
512;8192;32;512;15;91;18446744073709551615
512;8;32;4;6;65;42291520
512;512;32;1;6;91;15774208
1;64;1;64;10;1;15657231360
1;16;1;8;182;1;8699008032
128;2048;2;4;105;195;18446744073709551615
64;1;8;1;5;117;1252512576
64;128;16;32;26;26;30113984
128;128;2;64;42;45;21469824
512;8192;32;4;6;26;13604768
512;8192;64;4;6;8190;18446744073709551615
64;128;16;64;42;90;24290912
512;8192;2;4;6;91;43837760
64;32;32;4;6;91;59761984
512;8192;32;4;6;390;20263136
64;128;16;64;39;65;28598752
1024;8192;64;16;6;91;19644864
256;1;256;1;6;30;4395730944
128;256;4;64;35;65;17719744
128;256;8;64;26;45;18726080
128;512;4;64;35;45;15788992
128;256;4;64;30;45;17816736
16;32;8;32;18;315;319893280
128;1024;32;32;1;18;350277792
2;8192;2;4;6;91;46608384
512;8192;32;4;6;3;116710592
512;8192;32;4;6;126;7366592
512;8192;32;64;6;91;18446744073709551615
512;8192;64;4;15;91;9739968
512;8192;16;4;9;65;11386720
128;8192;64;4;6;91;10505984
512;1024;32;2;6;70;11168544
512;8192;32;4;7;90;7304608
256;8192;32;4;6;45;10506464
512;4096;64;8;6;91;11768256
512;8192;32;8;1;91;30994816
128;1;32;1;15;91;717840800
4096;8192;32;2;6;91;9959680
512;2048;32;1;6;91;15721536
512;1;16;1;15;91;164203136
512;4096;32;1;6;70;19754080
4096;8192;128;4;6;78;18533824
2048;8192;32;8;13;42;11204832
512;8192;64;4;6;126;7745440
64;8192;16;4;6;42;12211072
512;8192;32;4;13;90;9202912
512;4096;16;4;6;91;10395776
512;8192;32;4;3;42;14407712
512;8192;128;2;6;91;12682176
256;8192;32;4;18;91;10681600
2048;8192;64;4;6;91;10193600
512;4096;32;8;6;234;7350528
1024;8192;32;4;15;91;10022240
1024;8192;64;4;6;91;10154240
512;2048;64;4;3;78;16056800
512;8192;128;4;6;70;20336704
512;8192;32;4;6;70;8500096
512;8192;32;4;5;273;12666112
512;8192;32;8;18;91;7893216
1024;8192;32;4;3;65;11961568
512;8192;8;4;1;91;48053472
512;1;128;1;6;91;396246976
512;8192;32;4;6;182;8970784
512;1;64;1;6;105;252502528
512;8192;32;16;6;117;11711936
1024;8192;32;1;18;91;36728032
512;8192;32;8;3;182;10023008
512;8192;32;4;6;15;23489888
256;8192;64;4;3;105;12435968
512;2048;32;1;13;91;27663840
512;8192;16;4;6;105;12021056
256;8192;32;4;5;117;7965664
512;8192;32;4;15;78;10266400
512;8192;16;4;7;91;12964320
512;8192;32;2;6;130;12615552
512;8192;16;4;3;91;14140896
2048;8192;32;4;2;91;9230016
4;64;2;32;195;1;1325573824
128;64;4;64;30;26;24806656
16;4;4;4;3;78;2203639232
8192;8;128;2;26;273;39842400
128;32;8;16;1;315;326186720
1024;512;32;2;5;130;13777120
128;64;1;1;1;15;498083008
512;64;4;4;126;126;18446744073709551615
64;8192;32;4;6;91;7252448
2048;8192;32;4;6;35;13461568
256;8192;32;4;6;65;9185600
128;512;4;64;30;70;15586400
512;8192;32;4;6;315;15137888
512;8192;32;1;2;130;20901216
4096;8192;32;1;6;91;18250848
128;256;1;64;39;70;71392416
1024;64;64;8;21;30;20406784
1;4;1;1;7;546;11617981888
8192;16;4;16;910;126;18446744073709551615
4096;1024;16;4;6;91;10958144
512;8192;32;8;35;91;11530048
512;4096;32;4;6;78;7785792
512;8192;32;2;6;90;9012768
512;2048;128;4;6;91;15916352
2048;1;64;1;6;195;83923456
256;8192;64;4;7;91;10458112
512;8192;64;4;1;70;31197408
512;2048;32;4;13;91;9094464
256;8192;64;8;6;91;11763232
512;8192;32;4;9;130;10180128
512;8192;32;4;6;90;6770400
1024;8192;32;4;13;91;9200832
512;8192;32;2;6;78;10243200
2048;1;32;1;6;91;67185280
512;8192;32;4;6;45;10469056
512;1;32;1;3;91;234697888
512;8192;32;16;3;91;22092384
512;512;32;2;3;45;18947200
128;8192;16;4;13;91;17698016
512;4096;32;2;6;91;8842144
128;8192;64;2;1;195;13414688
256;8192;32;4;6;26;13686624
1024;1;32;1;6;91;98790720
1024;8192;32;2;10;78;12294592
512;1;32;1;9;91;194855616
512;256;32;2;1;91;23535936
128;8192;32;4;6;91;6915072
512;2048;32;1;7;91;18608416
8192;1;8;1;585;91;18446744073709551615
128;1;16;1;3;105;786034016
32;4;1;2;1;39;1101723616
64;1024;64;256;6;78;18446744073709551615
2048;8192;16;4;6;91;10636576
512;8192;64;4;6;105;9408928
512;8192;32;4;6;18;19609280
256;8192;64;4;6;91;10265056
512;8192;16;4;6;130;14246720
8;1;1;1;8190;21;18446744073709551615
1;512;1;32;18;14;384244704
1;1;1;1;1;35;77261211008
8192;1;256;1;1;63;140661536
512;1;32;1;6;91;205172544
128;1;32;1;3;91;893615712
512;1;32;1;15;91;188688864
512;8192;8;2;6;91;31006528
512;8192;128;2;6;42;21933248
256;8192;32;4;5;91;7388448
1024;2048;64;4;2;91;13524512
2;32;1;4;3;1;4543135168
4;1;1;1;35;70;10911013440
16;16;4;1;1;18;512108832
2;64;2;2;1638;7;18446744073709551615
2048;8192;32;4;15;91;10352928
512;8192;32;4;6;65;9088544
2048;8192;32;4;6;91;7133184
8;16;8;16;90;910;18446744073709551615
2048;8;1;8;1638;63;18446744073709551615
1;64;1;16;10;1;3918042752
1;16;1;8;182;1;8707508192
1024;8192;32;4;6;117;7648384
512;8192;32;2;6;273;21830496
512;8192;32;4;6;117;7467424
2048;8192;32;16;6;91;12679808
128;2;128;1;2;546;486565696
512;1;512;1;5;90;1630404992
16;32;8;1;26;234;647607808
128;64;32;1;1;18;112596288
512;8192;32;4;6;195;10488832
256;8192;32;4;18;130;15857696
1024;8192;32;4;39;91;19751168
512;8192;8;4;9;91;24723232
512;4096;32;4;6;42;11205088
1;1;1;1;195;30;42548136512
2048;4;4;4;3;78;83694976
8192;2048;128;2;26;273;38823648
2048;32;2;4;2;315;124312128
2048;8192;32;4;13;78;9101248
512;8192;32;4;1;105;16995360
64;8192;8;4;30;78;60111424
512;8192;32;4;6;78;7708352
1024;1;32;1;2;130;115966688
128;4096;1;1;30;15;242120288
512;4;32;1;315;1;1730366048
1024;64;2;8;819;30;18446744073709551615
2048;4096;64;8;6;91;11845312
512;1;64;1;9;91;279734208
1024;4096;32;4;3;91;8888992
1;1024;1;4;6;546;606447488
8192;16;1;2;910;126;18446744073709551615
1;8;1;4;1;7;26701272288
128;1;16;1;3;78;793065760
512;4096;16;2;21;126;58809024
512;8192;32;1;7;70;19591616
512;2048;32;4;7;130;9198592
512;8192;32;128;6;91;18446744073709551615
512;8192;1;1;6;91;248645472
512;8192;32;4;6;39;11985504
32;4;4;2;1;455;1464918560
1;256;1;1;1;78;609762080
32;1;2;1;70;195;18446744073709551615
4096;512;512;64;1;14;18446744073709551615
1024;1;32;1;10;63;141524096
512;8192;32;4;2;130;8955520
512;8192;32;4;6;35;13322176
1;128;1;1;8190;35;18446744073709551615
8192;1;256;1;1;63;140725120
8;32;1;4;1;1;2468810816
4;1;1;1;15;910;18446744073709551615
256;8192;16;4;6;91;10442432
16;2048;4;64;1;18;299520640
2;1;2;1;18;7;36129104352
8;1024;1;4;90;910;18446744073709551615
2048;16;1;16;1638;15;18446744073709551615
512;8;32;4;6;91;32073024
512;8192;32;4;10;7;48498688
512;8192;32;512;10;91;18446744073709551615
512;8192;512;4;6;91;18446744073709551615
1024;8192;32;4;910;91;18446744073709551615
512;8192;32;256;1365;91;18446744073709551615
512;4;32;1;6;91;52474816
512;8192;32;2;1;91;21839968
512;8192;16;8;6;91;7251168
512;8192;32;4;90;39;30668032
512;8192;32;1;7;91;18801888
512;8192;32;4;18;70;10573056
512;8192;16;16;7;91;10382240
512;8192;32;1;6;91;15920960
512;8192;32;16;6;91;12264928
128;8192;32;4;6;6;57129280
1;1;1;1;10;1;128580660448
512;64;32;4;6;91;9595360
512;8192;32;4;6;2;139100832
1;16;1;8;5;1;14861033152
128;64;128;4;2;546;25060416
64;8192;4;16;210;1;56526016
16;32;1;16;26;234;517825344
1;8192;1;4;6;91;83787904
2;8192;2;128;6;10;99274272
512;16;32;4;6;91;16718208
4;8192;4;4;6;91;32784768
512;2048;64;4;6;91;10307872
512;8192;32;4;39;10;31138528
512;1024;32;2;6;91;8930560
512;32;32;4;6;91;9771104
512;8192;32;1;6;70;19923104
1;8192;1;4;6;91;83631328
512;8192;32;512;6;91;18446744073709551615
128;64;8;1;1;18;139182976
4;64;2;32;1;1;34050993184
2048;1024;4;256;1;78;685465056
8192;256;128;1;18;105;19131552
512;4096;256;4;6;91;26565824
1;8192;1;4;6;91;83761664
2048;8192;64;4;6;130;9146752
16;128;2;4;6;91;72342624
512;8192;4;4;6;91;30623136
128;1;2;1;2;78;579612320
512;32;4;4;6;91;36054688
1;512;1;1;30;1;1024108160
512;256;32;4;6;91;7495552
1;4096;1;1;2;15;342485344
512;4;32;4;315;1;1658829184
1;64;1;8;10;2;2297118944
4096;4;512;2;7;63;96793888
128;8192;32;4;13;91;9324096
512;1;32;1;5;91;210377600
256;8192;32;256;6;91;18446744073709551615
1;8192;1;4;6;91;83704128
1024;8192;32;1;6;91;16294528
512;8192;32;4;6;30;11114400
512;8192;32;2;6;182;14639648
512;8192;32;4;10;70;8540800
8;8192;8;4;6;91;21918624
512;8192;16;32;6;91;21926784
512;512;32;512;455;91;18446744073709551615
512;8192;16;4;14;91;17073920
512;2048;32;4;6;1;268208704
512;16;128;4;6;91;42321696
512;8;32;4;910;91;18446744073709551615
512;8192;32;4;6;10;35158144
512;256;32;128;630;91;18446744073709551615
512;8;64;8;6;91;58085056
512;128;32;4;6;1365;52833216
512;8192;8;1024;6;91;18446744073709551615
512;8192;64;1;6;91;12499776
512;8192;32;4;273;91;18446744073709551615
512;128;2;8;6;91;27146976
512;4096;32;4;6;105;7773216
512;2;32;1;6;91;103681920
512;8192;32;4;910;2;393885600
512;8192;32;8;6;26;15409984
512;8192;32;1;6;91;15913344
512;8192;32;4;35;1638;18446744073709551615
8;2048;2;4;8190;10;18446744073709551615
512;1024;16;4;6;91;10822304
512;8192;32;4;234;91;18446744073709551615
512;8192;32;4;910;91;18446744073709551615
512;8192;256;4;13;91;22915712
8192;8;32;4;6;91;8342848
512;128;32;4;6;315;16018752
512;8192;512;64;6;91;18446744073709551615
512;1;32;1;630;91;18446744073709551615
8192;1024;16;1;910;126;18446744073709551615
8192;8;1;2;585;130;18446744073709551615
128;2048;16;1;3;65;35985440
1;4;1;2;1;39;30682779168
512;8192;1;1;6;91;248671584
512;8192;32;1;6;90;16097408
1;256;1;1;1;78;615068864
1;1;1;1;8190;195;18446744073709551615
32;2048;1;32;18;14;34246304
1;1;1;1;8190;35;18446744073709551615
128;1;1;1;1;63;1147694144
8;32;1;16;126;1;688141888
4;1;2;1;90;70;11474241888
16;2048;16;32;1;18;350841216
2;8192;2;4;6;7;70520224
512;8192;32;4;6;2730;18446744073709551615
2;128;2;2;1;7;868238976
8;1024;1;512;90;910;18446744073709551615
2048;16;16;16;15;63;13977696
1;8;1;1;10;455;5870378144
512;8192;32;4;35;91;19672608
512;128;32;4;6;63;9828864
1;256;1;256;182;1;1057930720
512;64;1;64;1;546;2747596128
64;2048;4;16;5;117;22701088
16;32;8;32;26;1;2477404256
256;512;32;4;6;91;7291136
1;64;1;1;1;18;1351228000
4;64;1;32;13;15;662127712
32;4;4;4;3;78;1130186144
8192;256;128;1;1;1;1262791200
512;1;32;1;126;91;288973152
512;1024;32;4;10;91;8078624
1;1;1;1;126;315;18446744073709551615
1024;16;32;2;35;130;56933280
2048;4096;1024;1;1;1;11052742432
512;8;32;8;315;1;874001376
512;8192;32;4;105;390;18446744073709551615
64;8192;32;4;10;91;8202112
2048;64;64;8;3;30;38006080
4096;64;512;16;7;1638;18446744073709551615
8192;16;16;1;910;10;901533888
8192;8;1;1;585;30;18446744073709551615
512;8192;1;512;26;91;65388704
