<?xml version="1.0" encoding="UTF-8" standalone="no"?>
<!-- Created with Inkscape (http://www.inkscape.org/) -->

<svg
   width="1280"
   height="720"
   viewBox="0 0 338.66667 190.5"
   version="1.1"
   id="svg640"
   inkscape:version="1.2.2 (1:1.2.2+202305151914+b0a8486541)"
   sodipodi:docname="requirements_semantics_based_ML.svg"
   xmlns:inkscape="http://www.inkscape.org/namespaces/inkscape"
   xmlns:sodipodi="http://sodipodi.sourceforge.net/DTD/sodipodi-0.dtd"
   xmlns="http://www.w3.org/2000/svg"
   xmlns:svg="http://www.w3.org/2000/svg">
  <sodipodi:namedview
     id="namedview642"
     pagecolor="#ffffff"
     bordercolor="#000000"
     borderopacity="0.25"
     inkscape:showpageshadow="2"
     inkscape:pageopacity="0.0"
     inkscape:pagecheckerboard="0"
     inkscape:deskcolor="#d1d1d1"
     inkscape:document-units="mm"
     showgrid="false"
     inkscape:zoom="1.3545083"
     inkscape:cx="590.62022"
     inkscape:cy="379.47349"
     inkscape:window-width="2560"
     inkscape:window-height="1542"
     inkscape:window-x="0"
     inkscape:window-y="27"
     inkscape:window-maximized="1"
     inkscape:current-layer="layer1" />
  <defs
     id="defs637">
    <linearGradient
       id="linearGradient5349"
       inkscape:swatch="solid">
      <stop
         style="stop-color:#3ac511;stop-opacity:1;"
         offset="0"
         id="stop5347" />
    </linearGradient>
  </defs>
  <g
     inkscape:label="Layer 1"
     inkscape:groupmode="layer"
     id="layer1">
    <text
       xml:space="preserve"
       style="font-style:normal;font-variant:normal;font-weight:normal;font-stretch:normal;font-size:6.35px;font-family:'Liberation Sans';-inkscape-font-specification:'Liberation Sans';opacity:0.819381;fill:none;stroke:#000000;stroke-width:1.965;stroke-dasharray:none;stroke-opacity:0.945098"
       x="165.73161"
       y="81.366539"
       id="text1653"><tspan
         sodipodi:role="line"
         id="tspan1651"
         style="font-style:normal;font-variant:normal;font-weight:normal;font-stretch:normal;font-family:'Liberation Sans';-inkscape-font-specification:'Liberation Sans';fill:none;stroke:#000000;stroke-width:1.965"
         x="165.73161"
         y="81.366539" /></text>
    <g
       id="g9762">
      <ellipse
         style="opacity:0.819381;fill:none;stroke:#3ac511;stroke-width:3;stroke-dasharray:none;stroke-opacity:0.945098"
         id="path833"
         cx="165.59331"
         cy="95.286644"
         rx="43.008644"
         ry="31.140862" />
      <text
         xml:space="preserve"
         style="font-style:normal;font-variant:normal;font-weight:bold;font-stretch:normal;font-size:8.46667px;font-family:'Liberation Sans';-inkscape-font-specification:'Liberation Sans Bold';opacity:0.819381;fill:#000000;stroke:none;stroke-width:1.965;stroke-dasharray:none;stroke-opacity:0.945098"
         x="130.93701"
         y="86.873718"
         id="text1865"><tspan
           sodipodi:role="line"
           id="tspan1863"
           style="font-style:normal;font-variant:normal;font-weight:bold;font-stretch:normal;font-size:8.46667px;font-family:'Liberation Sans';-inkscape-font-specification:'Liberation Sans Bold';stroke-width:1.965"
           x="130.93701"
           y="86.873718">Semantics</tspan><tspan
           sodipodi:role="line"
           style="font-style:normal;font-variant:normal;font-weight:bold;font-stretch:normal;font-size:8.46667px;font-family:'Liberation Sans';-inkscape-font-specification:'Liberation Sans Bold';stroke-width:1.965"
           x="130.93701"
           y="97.457054"
           id="tspan1867">enabled </tspan><tspan
           sodipodi:role="line"
           style="font-style:normal;font-variant:normal;font-weight:bold;font-stretch:normal;font-size:8.46667px;font-family:'Liberation Sans';-inkscape-font-specification:'Liberation Sans Bold';stroke-width:1.965"
           x="130.93701"
           y="108.04039"
           id="tspan1869">machine learning</tspan></text>
    </g>
    <g
       id="g9735"
       transform="translate(-0.58637559,0.94950569)">
      <ellipse
         style="opacity:0.819381;fill:#3ac511;fill-opacity:0.945098;stroke:#3ac511;stroke-width:2.56862;stroke-dasharray:none;stroke-opacity:0.945098"
         id="ellipse6338"
         cx="93.792145"
         cy="42.662651"
         rx="36.600674"
         ry="26.82592" />
      <text
         xml:space="preserve"
         style="font-style:normal;font-variant:normal;font-weight:bold;font-stretch:normal;font-size:11.2889px;font-family:'Liberation Sans';-inkscape-font-specification:'Liberation Sans Bold';opacity:0.819381;fill:#ffffff;fill-opacity:1;stroke:none;stroke-width:3;stroke-dasharray:none;stroke-opacity:1"
         x="64.304855"
         y="45.556534"
         id="text6998"><tspan
           sodipodi:role="line"
           id="tspan6996"
           style="font-size:11.2889px;fill:#ffffff;fill-opacity:1;stroke:none;stroke-width:3"
           x="64.304855"
           y="45.556534">Organisms</tspan></text>
    </g>
    <g
       id="g9740"
       transform="translate(-2.1655707,-2.1686705)">
      <ellipse
         style="opacity:0.819381;fill:#1147c5;fill-opacity:1;stroke:#1147c5;stroke-width:2.56862;stroke-dasharray:none;stroke-opacity:1"
         id="ellipse8333"
         cx="198.61031"
         cy="33.372894"
         rx="36.600674"
         ry="26.82592" />
      <text
         xml:space="preserve"
         style="font-style:normal;font-variant:normal;font-weight:bold;font-stretch:normal;font-size:11.2889px;font-family:'Liberation Sans';-inkscape-font-specification:'Liberation Sans Bold';opacity:0.819381;fill:#ffffff;fill-opacity:1;stroke:none;stroke-width:3;stroke-dasharray:none;stroke-opacity:1"
         x="177.30031"
         y="37.407795"
         id="text8337"><tspan
           sodipodi:role="line"
           id="tspan8335"
           style="font-size:11.2889px;fill:#ffffff;fill-opacity:1;stroke:none;stroke-width:3"
           x="177.30031"
           y="37.407795">Material</tspan></text>
    </g>
    <g
       id="g9745"
       transform="translate(-2.4472713,8.3673602)">
      <ellipse
         style="opacity:0.819381;fill:#b811c5;fill-opacity:1;stroke:#b811c5;stroke-width:2.56862;stroke-dasharray:none;stroke-opacity:1"
         id="ellipse8460"
         cx="272.0947"
         cy="78.451134"
         rx="36.600674"
         ry="26.82592" />
      <text
         xml:space="preserve"
         style="font-style:normal;font-variant:normal;font-weight:bold;font-stretch:normal;font-size:11.2889px;font-family:'Liberation Sans';-inkscape-font-specification:'Liberation Sans Bold';opacity:0.819381;fill:#ffffff;fill-opacity:1;stroke:none;stroke-width:3;stroke-dasharray:none;stroke-opacity:1"
         x="250.61105"
         y="81.36982"
         id="text8618"><tspan
           sodipodi:role="line"
           id="tspan8616"
           style="font-size:11.2889px;fill:#ffffff;fill-opacity:1;stroke:none;stroke-width:3"
           x="250.61105"
           y="81.36982">Physics</tspan></text>
    </g>
    <g
       id="g9750"
       transform="translate(-0.90814715,-0.25541192)">
      <ellipse
         style="opacity:0.819381;fill:#e40f0e;fill-opacity:1;stroke:#d90908;stroke-width:2.56862;stroke-dasharray:none;stroke-opacity:1"
         id="ellipse8614"
         cx="236.814"
         cy="152.41692"
         rx="36.600674"
         ry="26.82592" />
      <text
         xml:space="preserve"
         style="font-style:normal;font-variant:normal;font-weight:bold;font-stretch:normal;font-size:11.2889px;font-family:'Liberation Sans';-inkscape-font-specification:'Liberation Sans Bold';opacity:0.819381;fill:#ffffff;fill-opacity:1;stroke:none;stroke-width:3;stroke-dasharray:none;stroke-opacity:1"
         x="205.19901"
         y="156.45181"
         id="text8464"><tspan
           sodipodi:role="line"
           id="tspan8462"
           style="font-size:11.2889px;fill:#ffffff;fill-opacity:1;stroke:none;stroke-width:3"
           x="205.19901"
           y="156.45181">Substances</tspan></text>
    </g>
    <g
       id="g9755"
       transform="translate(0.52360456,0.66075896)">
      <ellipse
         style="opacity:0.819381;fill:#e4920e;fill-opacity:1;stroke:#e4880e;stroke-width:2.56862;stroke-dasharray:none;stroke-opacity:1"
         id="ellipse9448"
         cx="129.91965"
         cy="159.63609"
         rx="36.600674"
         ry="26.82592" />
      <text
         xml:space="preserve"
         style="font-style:normal;font-variant:normal;font-weight:bold;font-stretch:normal;font-size:11.2889px;font-family:'Liberation Sans';-inkscape-font-specification:'Liberation Sans Bold';opacity:0.819381;fill:#ffffff;fill-opacity:1;stroke:none;stroke-width:3;stroke-dasharray:none;stroke-opacity:1"
         x="102.55721"
         y="163.43991"
         id="text9452"><tspan
           sodipodi:role="line"
           id="tspan9450"
           style="font-size:11.2889px;fill:#ffffff;fill-opacity:1;stroke:none;stroke-width:3"
           x="102.55721"
           y="163.43991">Reactions</tspan></text>
    </g>
    <g
       id="g9698"
       transform="translate(-3.9539787,-4.3535314)">
      <ellipse
         style="opacity:0.819381;fill:#f4e325;fill-opacity:1;stroke:#f4e325;stroke-width:2.56862;stroke-dasharray:none;stroke-opacity:1"
         id="ellipse9556"
         cx="68.914505"
         cy="112.03316"
         rx="36.600674"
         ry="26.82592" />
      <text
         xml:space="preserve"
         style="font-style:normal;font-variant:normal;font-weight:bold;font-stretch:normal;font-size:11.2889px;font-family:'Liberation Sans';-inkscape-font-specification:'Liberation Sans Bold';opacity:0.819381;fill:#000000;fill-opacity:1;stroke:none;stroke-width:3;stroke-dasharray:none;stroke-opacity:1"
         x="40.524132"
         y="115.86135"
         id="text9560"><tspan
           sodipodi:role="line"
           id="tspan9558"
           style="font-size:11.2889px;fill:#000000;fill-opacity:1;stroke:none;stroke-width:3"
           x="40.524132"
           y="115.86135">Processes</tspan></text>
    </g>
    <path
       style="opacity:0.819381;fill:#f4e325;fill-opacity:1;stroke:#3ac411;stroke-width:3;stroke-linecap:round;stroke-dasharray:none;stroke-opacity:0.776471"
       d="m 130.93478,71.834806 -8.30519,-7.610889"
       id="path9818"
       sodipodi:nodetypes="cc" />
    <path
       style="opacity:0.819381;fill:#f4e325;fill-opacity:1;stroke:#3ac411;stroke-width:3;stroke-linecap:round;stroke-dasharray:none;stroke-opacity:0.776471"
       d="m 181.05894,62.657468 1.46681,-2.961804"
       id="path9820"
       sodipodi:nodetypes="cc" />
    <path
       style="opacity:0.819381;fill:#f4e325;fill-opacity:1;stroke:#3ac411;stroke-width:3;stroke-linecap:round;stroke-dasharray:none;stroke-opacity:0.776471"
       d="m 213.08643,90.911106 c 22.56314,-3.274501 15.50848,-1.494941 15.50848,-1.494941"
       id="path9822"
       sodipodi:nodetypes="cc" />
    <path
       style="opacity:0.819381;fill:#f4e325;fill-opacity:1;stroke:#3ac411;stroke-width:3;stroke-linecap:round;stroke-dasharray:none;stroke-opacity:0.776471"
       d="m 199.5653,120.32749 c 9.7711,12.17 6.567,8.25699 6.567,8.25699"
       id="path9824"
       sodipodi:nodetypes="cc" />
    <path
       style="opacity:0.819381;fill:#f4e325;fill-opacity:1;stroke:#3ac411;stroke-width:3;stroke-linecap:round;stroke-dasharray:none;stroke-opacity:0.776471"
       d="m 144.74299,126.01353 -2.85307,5.79998"
       id="path9826"
       sodipodi:nodetypes="cc" />
    <path
       style="opacity:0.819381;fill:#f4e325;fill-opacity:1;stroke:#3ac411;stroke-width:3;stroke-linecap:round;stroke-dasharray:none;stroke-opacity:0.776471"
       d="m 119.05753,102.4095 -13.6736,2.0427"
       id="path9828"
       sodipodi:nodetypes="cc" />
  </g>
</svg>
