0 0.15546875 0.6635416666666667 0.05859375 0.19166666666666668
0 0.36875 0.9625 0.04375 0.075
0 0.40703125 0.16979166666666667 0.14921875 0.07604166666666666
0 0.53515625 0.31354166666666666 0.13203125 0.10520833333333333
0 0.71484375 0.3072916666666667 0.09921875 0.14583333333333334
0 0.60234375 0.246875 0.0625 0.16666666666666666
0 0.48828125 0.23229166666666667 0.07421875 0.14270833333333333
0 0.46953125 0.21770833333333334 0.084375 0.159375
0 0.61640625 0.9395833333333333 0.1359375 0.12083333333333333
0 0.71875 0.8208333333333333 0.1125 0.16354166666666667