0 0.69921875 0.5010416666666667 0.128125 0.0875
0 0.60390625 0.465625 0.06875 0.175
0 0.57421875 0.3625 0.140625 0.041666666666666664
0 0.6203125 0.25625 0.034375 0.18333333333333332
0 0.540625 0.27291666666666664 0.10625 0.15416666666666667
0 0.25 0.2552083333333333 0.115625 0.15
0 0.33203125 0.23958333333333334 0.1375 0.0875
0 0.53515625 0.19166666666666668 0.15 0.09583333333333334
0 0.4015625 0.146875 0.1375 0.06666666666666667
0 0.42890625 0.321875 0.05 0.10833333333333334