0 0.5890625 0.23020833333333332 0.11796875 0.08958333333333333
0 0.4671875 0.51875 0.11484375 0.09375
0 0.43984375 0.965625 0.1359375 0.053125
0 0.65078125 0.50625 0.02890625 0.17291666666666666
0 0.2453125 0.8114583333333333 0.08671875 0.15625
0 0.2640625 0.7979166666666667 0.0859375 0.15625
0 0.75078125 0.6135416666666667 0.04609375 0.16979166666666667
0 0.7625 0.571875 0.046875 0.17083333333333334
0 0.221875 0.559375 0.08515625 0.16354166666666667
0 0.36796875 0.759375 0.06015625 0.035416666666666666
0 0.73203125 0.7770833333333333 0.08515625 0.14895833333333333
0 0.2296875 0.43333333333333335 0.075 0.15208333333333332
0 0.43046875 0.43854166666666666 0.08046875 0.08020833333333334