0 0.51171875 0.12604166666666666 0.13046875 0.090625
0 0.2015625 0.7104166666666667 0.14453125 0.12395833333333334
0 0.67734375 0.23645833333333333 0.11875 0.16145833333333334
0 0.7625 0.4114583333333333 0.07265625 0.17083333333333334
0 0.5484375 0.6260416666666667 0.10703125 0.15416666666666667
0 0.45234375 0.609375 0.11640625 0.140625
0 0.45390625 0.578125 0.12734375 0.12916666666666668
0 0.62890625 0.5875 0.07421875 0.058333333333333334