0 0.42421875 0.090625 0.125 0.0625
0 0.203125 0.3489583333333333 0.08125 0.14166666666666666
0 0.53203125 0.40520833333333334 0.109375 0.10833333333333334
0 0.615625 0.14479166666666668 0.115625 0.10833333333333334
0 0.56796875 0.140625 0.103125 0.14166666666666666
0 0.5296875 0.13125 0.096875 0.1375
0 0.740625 0.3770833333333333 0.046875 0.17083333333333334
0 0.19296875 0.609375 0.065625 0.15416666666666667
0 0.3515625 0.828125 0.121875 0.09166666666666666
0 0.76328125 0.91875 0.0875 0.13333333333333333
0 0.3484375 0.41770833333333335 0.06875 0.1
0 0.6828125 0.6708333333333333 0.096875 0.15416666666666667
0 0.6734375 0.7270833333333333 0.09375 0.14166666666666666
0 0.54375 0.8135416666666667 0.128125 0.03333333333333333