0 0.25078125 0.384375 0.13671875 0.103125
0 0.3765625 0.503125 0.06171875 0.1125
0 0.56640625 0.20729166666666668 0.05 0.075
0 0.23359375 0.7927083333333333 0.1125 0.15729166666666666
0 0.50859375 0.8458333333333333 0.08046875 0.196875
0 0.41171875 0.921875 0.14609375 0.078125
0 0.6453125 0.871875 0.12578125 0.12083333333333333
0 0.77890625 0.7677083333333333 0.03125 0.12916666666666668
0 0.740625 0.7197916666666667 0.05 0.0625