0 0.2078125 0.6614583333333334 0.096875 0.16666666666666666
0 0.6875 0.659375 0.11875 0.13333333333333333
0 0.74609375 0.4427083333333333 0.140625 0.078125
0 0.31328125 0.7979166666666667 0.125 0.10729166666666666
0 0.45703125 0.7822916666666667 0.02890625 0.19270833333333334
0 0.4796875 0.7822916666666667 0.021875 0.196875
0 0.38203125 0.10520833333333333 0.08046875 0.17395833333333333
0 0.65078125 0.07083333333333333 0.11640625 0.11666666666666667
0 0.55625 0.11770833333333333 0.07734375 0.17395833333333333
0 0.50390625 0.03125 0.134375 0.0625
0 0.1578125 0.4010416666666667 0.04453125 0.1125
0 0.409375 0.42604166666666665 0.03984375 0.125
0 0.76640625 0.25 0.08203125 0.175