0 0.15546875 0.725 0.0609375 0.19166666666666668
0 0.371875 0.7510416666666667 0.05625 0.22083333333333333
0 0.4609375 0.659375 0.14375 0.05416666666666667
0 0.50703125 0.4427083333333333 0.034375 0.1875
0 0.396875 0.515625 0.121875 0.11666666666666667
0 0.35078125 0.38645833333333335 0.0875 0.17083333333333334
0 0.315625 0.18645833333333334 0.134375 0.1125
0 0.38515625 0.17083333333333334 0.13125 0.10833333333333334