0 0.33125 0.8239583333333333 0.13125 0.10520833333333333
0 0.29140625 0.7145833333333333 0.13828125 0.0375
0 0.309375 0.746875 0.1375 0.057291666666666664
0 0.35703125 0.6791666666666667 0.11171875 0.046875
0 0.70078125 0.7072916666666667 0.09140625 0.153125
0 0.75390625 0.41458333333333336 0.04296875 0.16770833333333332
0 0.67890625 0.20104166666666667 0.1 0.13854166666666667
0 0.57109375 0.1125 0.11953125 0.08645833333333333
0 0.84296875 0.8947916666666667 0.12265625 0.12083333333333333