0 0.20078125 0.7177083333333333 0.14140625 0.115625
0 0.6921875 0.7864583333333334 0.11796875 0.15104166666666666
0 0.73671875 0.35 0.08046875 0.18020833333333333
0 0.29453125 0.39375 0.14453125 0.065625
0 0.22265625 0.409375 0.08203125 0.058333333333333334
0 0.6359375 0.28541666666666665 0.134375 0.134375
0 0.6390625 0.315625 0.11953125 0.13020833333333334
0 0.63359375 0.5947916666666667 0.06875 0.058333333333333334