0 0.675 0.8447916666666667 0.13359375 0.15520833333333334
0 0.60703125 0.5114583333333333 0.10078125 0.15729166666666666
0 0.5796875 0.6072916666666667 0.09921875 0.15520833333333334
0 0.60859375 0.6072916666666667 0.09765625 0.1625