0 0.23359375 0.778125 0.0828125 0.17291666666666666
0 0.528125 0.23020833333333332 0.08359375 0.14895833333333333
0 0.4953125 0.21979166666666666 0.0859375 0.14166666666666666
0 0.31796875 0.74375 0.09375 0.03854166666666667
0 0.3203125 0.8854166666666666 0.140625 0.071875
0 0.5109375 0.86875 0.13046875 0.071875
0 0.546875 0.8 0.04453125 0.165625
0 0.4953125 0.7822916666666667 0.09453125 0.05520833333333333
0 0.30234375 0.44479166666666664 0.08046875 0.10104166666666667
0 0.60703125 0.8104166666666667 0.10234375 0.159375
0 0.65859375 0.715625 0.10234375 0.17604166666666668
0 0.65703125 0.7645833333333333 0.08515625 0.13958333333333334