0 0.6765625 0.26666666666666666 0.078125 0.17291666666666666
0 0.728125 0.9395833333333333 0.09375 0.12083333333333333
0 0.59453125 0.7697916666666667 0.109375 0.125
0 0.37109375 0.8520833333333333 0.128125 0.07291666666666667
0 0.21171875 0.7385416666666667 0.109375 0.13541666666666666
0 0.59453125 0.21458333333333332 0.0625 0.17083333333333334
0 0.14921875 0.5916666666666667 0.046875 0.16666666666666666
0 0.60859375 0.240625 0.0671875 0.1625
0 0.3109375 0.365625 0.065625 0.10416666666666667