0 0.30078125 0.47291666666666665 0.1125 0.15833333333333333
0 0.21796875 0.609375 0.0375 0.1875
0 0.42109375 0.16354166666666667 0.134375 0.09166666666666666
0 0.70546875 0.5010416666666667 0.053125 0.1125
0 0.76796875 0.378125 0.15 0.041666666666666664
0 0.7109375 0.26979166666666665 0.046875 0.19166666666666668