0 0.33046875 0.36041666666666666 0.05625 0.17916666666666667
0 0.50546875 0.146875 0.13125 0.08333333333333333
0 0.678125 0.259375 0.115625 0.15833333333333333
0 0.7515625 0.43645833333333334 0.0640625 0.17916666666666667
0 0.115625 0.5447916666666667 0.0546875 0.12083333333333333
0 0.63046875 0.603125 0.090625 0.07291666666666667
0 0.15234375 0.7604166666666666 0.0875 0.17916666666666667