0 0.421875 0.028125 0.125 0.05625
0 0.69609375 0.5552083333333333 0.12734375 0.10104166666666667
0 0.18828125 0.30416666666666664 0.053125 0.16666666666666666
0 0.27578125 0.384375 0.03984375 0.14583333333333334
0 0.23359375 0.2125 0.03828125 0.16979166666666667
0 0.28046875 0.259375 0.09609375 0.14583333333333334
0 0.25859375 0.18854166666666666 0.046875 0.16770833333333332
0 0.55390625 0.7572916666666667 0.12265625 0.06979166666666667
0 0.19921875 0.3875 0.06953125 0.18020833333333333
0 0.28828125 0.5541666666666667 0.034375 0.18020833333333333
0 0.2109375 0.478125 0.05546875 0.16979166666666667
0 0.41171875 0.6177083333333333 0.03984375 0.17083333333333334
0 0.31796875 0.728125 0.11640625 0.10104166666666667
0 0.30703125 0.6791666666666667 0.11640625 0.11354166666666667
0 0.40703125 0.7135416666666666 0.096875 0.14583333333333334
0 0.42890625 0.334375 0.08828125 0.096875
0 0.4328125 0.23854166666666668 0.06328125 0.090625