0 0.32109375 0.2947916666666667 0.08203125 0.16354166666666667
0 0.665625 0.24270833333333333 0.11484375 0.13020833333333334
0 0.309375 0.940625 0.14296875 0.11875
0 0.53125 0.903125 0.0453125 0.19270833333333334
0 0.50078125 0.909375 0.0546875 0.18125
0 0.7125 0.8270833333333333 0.11640625 0.17291666666666666
0 0.7421875 0.725 0.1 0.15729166666666666