0 0.78671875 0.465625 0.040625 0.19166666666666668
0 0.71796875 0.4375 0.125 0.10416666666666667
0 0.20078125 0.396875 0.1375 0.10833333333333334
0 0.3 0.503125 0.0875 0.16666666666666666
0 0.20078125 0.6677083333333333 0.103125 0.175
0 0.465625 0.7375 0.059375 0.18333333333333332
0 0.60078125 0.7989583333333333 0.103125 0.15
0 0.46953125 0.8375 0.15 0.0625
0 0.384375 0.8489583333333334 0.14375 0.08125
0 0.42734375 0.678125 0.04375 0.1125