0 0.225 0.41458333333333336 0.128125 0.12083333333333333
0 0.1828125 0.30833333333333335 0.05390625 0.165625
0 0.2234375 0.21354166666666666 0.04921875 0.16458333333333333
0 0.32734375 0.08125 0.1203125 0.071875
0 0.38828125 0.728125 0.13125 0.07395833333333333
0 0.3671875 0.75 0.1265625 0.07604166666666666
0 0.53828125 0.759375 0.11953125 0.06354166666666666
0 0.65859375 0.6697916666666667 0.10859375 0.13229166666666667
0 0.6515625 0.6375 0.10390625 0.12708333333333333
0 0.74609375 0.42291666666666666 0.0625 0.15
0 0.7359375 0.5260416666666666 0.0703125 0.16875
0 0.71953125 0.259375 0.10078125 0.13333333333333333
0 0.721875 0.2 0.08515625 0.14479166666666668
0 0.41640625 0.028125 0.12265625 0.05520833333333333
0 0.5828125 0.03333333333333333 0.11328125 0.065625
0 0.55390625 0.040625 0.1203125 0.07916666666666666
0 0.55390625 0.090625 0.103125 0.11145833333333334
0 0.3609375 0.5541666666666667 0.08828125 0.036458333333333336
0 0.43359375 0.234375 0.0671875 0.08229166666666667