0 0.37734375 0.14166666666666666 0.071875 0.171875
0 0.35078125 0.30625 0.08671875 0.08229166666666667
0 0.31484375 0.49375 0.10078125 0.0375
0 0.2828125 0.48854166666666665 0.021875 0.11354166666666667
0 0.340625 0.6208333333333333 0.08125 0.08333333333333333
0 0.42578125 0.7989583333333333 0.146875 0.06979166666666667
0 0.48984375 0.6625 0.11875 0.15833333333333333
0 0.74375 0.13854166666666667 0.10390625 0.15416666666666667
0 0.76796875 0.228125 0.096875 0.15
0 0.67578125 0.43645833333333334 0.03984375 0.11145833333333334
0 0.51953125 0.7333333333333333 0.02890625 0.18854166666666666
0 0.54140625 0.7291666666666666 0.02578125 0.18854166666666666
0 0.67109375 0.7041666666666667 0.09765625 0.146875
0 0.76171875 0.5958333333333333 0.09921875 0.16145833333333334
0 0.74765625 0.5520833333333334 0.08515625 0.14895833333333333
0 0.41875 0.38333333333333336 0.05 0.11979166666666667
0 0.640625 0.022916666666666665 0.09375 0.04583333333333333
0 0.165625 0.3302083333333333 0.05 0.078125