0 0.4609375 0.7052083333333333 0.11875 0.14583333333333334
0 0.33359375 0.165625 0.140625 0.125
0 0.3953125 0.7427083333333333 0.125 0.14166666666666666
0 0.38359375 0.7145833333333333 0.121875 0.14583333333333334