0 0.5890625 0.1875 0.10703125 0.153125
0 0.40703125 0.384375 0.10546875 0.14895833333333333
0 0.51171875 0.7479166666666667 0.13125 0.11770833333333333
0 0.75234375 0.725 0.09140625 0.18645833333333334