0 0.15234375 0.7291666666666666 0.0875 0.2
0 0.33359375 0.9052083333333333 0.09375 0.178125
0 0.49765625 0.778125 0.0875 0.071875
0 0.71875 0.7822916666666667 0.09765625 0.165625
0 0.75 0.46770833333333334 0.06015625 0.18020833333333333
0 0.7609375 0.4239583333333333 0.05546875 0.17916666666666667