0 0.79296875 0.2677083333333333 0.06640625 0.1875
0 0.45078125 0.803125 0.14921875 0.06979166666666667
0 0.68984375 0.6635416666666667 0.14453125 0.09270833333333334
0 0.66875 0.03854166666666667 0.10625 0.07708333333333334
0 0.55390625 0.109375 0.07890625 0.16979166666666667
0 0.53359375 0.7302083333333333 0.03203125 0.19895833333333332
0 0.58828125 0.7072916666666667 0.07890625 0.175
0 0.61171875 0.7 0.07109375 0.171875
0 0.615625 0.6135416666666667 0.02109375 0.1375
0 0.31796875 0.058333333333333334 0.10859375 0.11666666666666667
0 0.16171875 0.33229166666666665 0.04609375 0.14270833333333333
0 0.40625 0.38958333333333334 0.03515625 0.10729166666666666
0 0.5265625 0.06458333333333334 0.11796875 0.12916666666666668
0 0.6875 0.2760416666666667 0.0375 0.184375
0 0.66484375 0.24895833333333334 0.03125 0.17916666666666667