0 0.34765625 0.07916666666666666 0.0921875 0.15833333333333333
0 0.21640625 0.634375 0.11484375 0.15833333333333333
0 0.1890625 0.5302083333333333 0.109375 0.16979166666666667
0 0.67578125 0.4322916666666667 0.03046875 0.121875
0 0.60859375 0.5645833333333333 0.15 0.034375
0 0.7015625 0.6 0.146875 0.04479166666666667
0 0.37265625 0.7822916666666667 0.13515625 0.09479166666666666
0 0.27890625 0.6614583333333334 0.07890625 0.18020833333333333
0 0.40625 0.3802083333333333 0.0375 0.11770833333333333
0 0.69609375 0.696875 0.128125 0.14479166666666668
0 0.79609375 0.2760416666666667 0.053125 0.175
0 0.79296875 0.39166666666666666 0.04765625 0.18645833333333334
0 0.6671875 0.6916666666666667 0.11796875 0.13020833333333334
0 0.16171875 0.346875 0.053125 0.15416666666666667