0 0.33046875 0.41770833333333335 0.115625 0.15416666666666667
0 0.50703125 0.9385416666666667 0.140625 0.08333333333333333
0 0.59296875 0.6177083333333333 0.090625 0.041666666666666664
0 0.76484375 0.540625 0.075 0.17083333333333334
0 0.75546875 0.334375 0.05625 0.18333333333333332
0 0.69765625 0.17604166666666668 0.125 0.12083333333333333
0 0.78515625 0.22708333333333333 0.11875 0.1375
0 0.78828125 0.18541666666666667 0.115625 0.12916666666666668
0 0.62734375 0.9520833333333333 0.090625 0.0625
0 0.84609375 0.56875 0.05625 0.13333333333333333
0 0.84609375 0.51875 0.05625 0.14583333333333334