0 0.31171875 0.2760416666666667 0.096875 0.15416666666666667
0 0.80234375 0.484375 0.1453125 0.04375
0 0.82109375 0.78125 0.0984375 0.18541666666666667
0 0.4625 0.140625 0.134375 0.075
0 0.6328125 0.29791666666666666 0.13125 0.09375
0 0.615625 0.22291666666666668 0.125 0.11666666666666667
0 0.59296875 0.128125 0.1390625 0.058333333333333334
0 0.72890625 0.20208333333333334 0.1359375 0.13958333333333334