0 0.71484375 0.22604166666666667 0.11875 0.15520833333333334
0 0.259375 0.803125 0.14609375 0.09270833333333334
0 0.34765625 0.9145833333333333 0.14765625 0.09270833333333334
0 0.32265625 0.8635416666666667 0.14375 0.10416666666666667