0 0.34609375 0.26145833333333335 0.121875 0.10833333333333334
0 0.30703125 0.7208333333333333 0.096875 0.15416666666666667
0 0.83046875 0.24583333333333332 0.0890625 0.19166666666666668
0 0.80234375 0.5416666666666666 0.14375 0.06041666666666667
0 0.80703125 0.5010416666666667 0.1359375 0.07291666666666667
0 0.7453125 0.7833333333333333 0.1296875 0.15416666666666667
0 0.66875 0.8229166666666666 0.11875 0.13333333333333333