0 0.59609375 0.12291666666666666 0.128125 0.13333333333333333
0 0.20234375 0.26145833333333335 0.1328125 0.07916666666666666
0 0.7078125 0.3416666666666667 0.065625 0.18333333333333332
0 0.721875 0.5552083333333333 0.046875 0.20416666666666666
0 0.49140625 0.24895833333333334 0.034375 0.1375
0 0.41015625 0.39166666666666666 0.090625 0.07916666666666666
0 0.44921875 0.7364583333333333 0.0875 0.04583333333333333
0 0.6359375 0.6 0.071875 0.1875
0 0.371875 0.8739583333333333 0.1375 0.058333333333333334
0 0.3609375 0.9052083333333333 0.134375 0.06041666666666667
0 0.61796875 0.7645833333333333 0.109375 0.15
0 0.6296875 0.784375 0.1125 0.15416666666666667
0 0.3828125 0.053125 0.103125 0.075
0 0.26640625 0.8114583333333333 0.134375 0.07291666666666667
0 0.29375 0.8302083333333333 0.140625 0.06041666666666667