0 0.35390625 0.765625 0.09921875 0.036458333333333336
0 0.20546875 0.7447916666666666 0.07578125 0.16666666666666666
0 0.3703125 0.384375 0.02578125 0.125
0 0.54921875 0.2760416666666667 0.0875 0.13854166666666667
0 0.64296875 0.265625 0.10859375 0.125
0 0.18046875 0.475 0.05 0.16354166666666667
0 0.2609375 0.35 0.096875 0.128125
0 0.28203125 0.284375 0.08984375 0.109375
0 0.8265625 0.9666666666666667 0.090625 0.06666666666666667