0 0.21875 0.6760416666666667 0.1 0.16354166666666667
0 0.31953125 0.8020833333333334 0.13359375 0.12083333333333333
0 0.5 0.8260416666666667 0.14375 0.04583333333333333
0 0.45234375 0.8510416666666667 0.14609375 0.042708333333333334
0 0.38515625 0.046875 0.13515625 0.08020833333333334
0 0.40625 0.4270833333333333 0.04140625 0.11770833333333333
0 0.540625 0.30104166666666665 0.1 0.14270833333333333
0 0.62578125 0.4510416666666667 0.09453125 0.153125
0 0.58046875 0.10625 0.028125 0.17395833333333333
0 0.665625 0.13854166666666667 0.06640625 0.17916666666666667
0 0.70078125 0.30833333333333335 0.09609375 0.16979166666666667
0 0.16328125 0.38125 0.04375 0.10416666666666667