0 0.325 0.7354166666666667 0.1296875 0.10416666666666667
0 0.84140625 0.8041666666666667 0.1140625 0.12604166666666666
0 0.70234375 0.6260416666666667 0.09296875 0.146875
0 0.7640625 0.328125 0.0546875 0.17083333333333334
0 0.67890625 0.115625 0.1015625 0.14583333333333334
0 0.2859375 0.6260416666666667 0.12734375 0.084375
0 0.56875 0.03229166666666667 0.12421875 0.0625
0 0.30546875 0.6447916666666667 0.121875 0.08958333333333333
0 0.39921875 0.24791666666666667 0.07890625 0.0875