0 0.6796875 0.396875 0.078125 0.1
0 0.35859375 0.7708333333333334 0.140625 0.125
0 0.2453125 0.6395833333333333 0.096875 0.16666666666666666
0 0.18828125 0.4635416666666667 0.0546875 0.1875
0 0.26015625 0.109375 0.1046875 0.14583333333333334
0 0.3515625 0.04583333333333333 0.08125 0.08333333333333333