0 0.14921875 0.6322916666666667 0.046875 0.20833333333333334
0 0.26015625 0.8958333333333334 0.128125 0.1375
0 0.60546875 0.94375 0.134375 0.1125
0 0.7171875 0.821875 0.103125 0.175
0 0.77421875 0.65 0.0625 0.1875
0 0.63359375 0.2125 0.115625 0.1125
0 0.57265625 0.271875 0.03125 0.16666666666666666
0 0.51875 0.26875 0.075 0.16666666666666666
0 0.528125 0.19270833333333334 0.096875 0.1