0 0.44453125 0.45416666666666666 0.08984375 0.175
0 0.4890625 0.559375 0.13046875 0.11979166666666667
0 0.61015625 0.8802083333333334 0.146875 0.06145833333333333
0 0.49140625 0.9770833333333333 0.1484375 0.04583333333333333
0 0.4578125 0.9510416666666667 0.14453125 0.06979166666666667
0 0.5625 0.5760416666666667 0.14140625 0.11354166666666667
0 0.63046875 0.5989583333333334 0.07578125 0.08645833333333333
0 0.7234375 0.7708333333333334 0.096875 0.18645833333333334
0 0.68828125 0.7729166666666667 0.103125 0.1625