0 0.29140625 0.14479166666666668 0.1296875 0.11041666666666666
0 0.70234375 0.5375 0.1125 0.1125
0 0.71015625 0.49375 0.10625 0.11458333333333333
0 0.3171875 0.25729166666666664 0.028125 0.125
0 0.2109375 0.2604166666666667 0.053125 0.1875
0 0.2234375 0.5145833333333333 0.053125 0.175
0 0.275 0.5625 0.125 0.058333333333333334
0 0.28828125 0.49375 0.040625 0.125
0 0.54140625 0.23645833333333333 0.075 0.10833333333333334
0 0.2671875 0.6427083333333333 0.11875 0.1375
0 0.33828125 0.7114583333333333 0.13125 0.1375
0 0.3015625 0.709375 0.1046875 0.1125