0 0.7015625 0.6385416666666667 0.08125 0.17083333333333334
0 0.59140625 0.7145833333333333 0.059375 0.10416666666666667
0 0.490625 0.7864583333333334 0.084375 0.020833333333333332
0 0.35390625 0.7020833333333333 0.0625 0.1125
0 0.49140625 0.7489583333333333 0.0375 0.12916666666666668
0 0.41171875 0.621875 0.0875 0.04583333333333333
0 0.3828125 0.953125 0.090625 0.05
0 0.42890625 0.40520833333333334 0.059375 0.17916666666666667
0 0.3921875 0.09166666666666666 0.1375 0.04583333333333333
0 0.17734375 0.234375 0.096875 0.14166666666666666
0 0.19296875 0.34791666666666665 0.05 0.175
0 0.44921875 0.2677083333333333 0.0875 0.041666666666666664
0 0.62578125 0.40520833333333334 0.115625 0.13333333333333333
0 0.54140625 0.30416666666666664 0.1125 0.12916666666666668
0 0.709375 0.4635416666666667 0.065625 0.1875
0 0.62890625 0.29375 0.065625 0.1625
0 0.60546875 0.28229166666666666 0.08125 0.17916666666666667
0 0.7 0.35625 0.075 0.1875