0 0.16953125 0.5083333333333333 0.14375 0.036458333333333336
0 0.3 0.44583333333333336 0.07734375 0.1
0 0.45234375 0.190625 0.11953125 0.07604166666666666
0 0.571875 0.2989583333333333 0.09609375 0.13645833333333332
0 0.53203125 0.20625 0.10625 0.115625
0 0.52109375 0.534375 0.06875 0.153125
0 0.43125 0.8447916666666667 0.12734375 0.09270833333333334
0 0.35703125 0.753125 0.034375 0.11354166666666667
0 0.29765625 0.746875 0.10234375 0.03229166666666667
0 0.58984375 0.6697916666666667 0.03359375 0.171875
0 0.6171875 0.7072916666666667 0.02421875 0.165625
0 0.63515625 0.659375 0.02734375 0.17395833333333333
0 0.62890625 0.8114583333333333 0.09375 0.15729166666666666
0 0.6625 0.7395833333333334 0.07109375 0.12604166666666666