0 0.2921875 0.49895833333333334 0.053125 0.11666666666666667
0 0.74921875 0.2625 0.075 0.19583333333333333
0 0.53671875 0.8614583333333333 0.134375 0.075
0 0.61953125 0.7635416666666667 0.128125 0.09791666666666667
0 0.63828125 0.7802083333333333 0.125 0.09166666666666666