0 0.34609375 0.5520833333333334 0.11015625 0.15729166666666666
0 0.75078125 0.721875 0.09296875 0.1875
0 0.31796875 0.6395833333333333 0.10625 0.16770833333333332
0 0.3390625 0.6552083333333333 0.109375 0.16354166666666667