0 0.646875 0.7677083333333333 0.1390625 0.1
0 0.58203125 0.525 0.121875 0.09166666666666666
0 0.8125 0.55625 0.08125 0.1875
0 0.51171875 0.740625 0.0875 0.16875
0 0.6515625 0.30520833333333336 0.0875 0.07916666666666666
0 0.27421875 0.35833333333333334 0.134375 0.041666666666666664
0 0.19609375 0.35520833333333335 0.0328125 0.17083333333333334
0 0.32265625 0.440625 0.034375 0.10416666666666667
0 0.696875 0.6197916666666666 0.11875 0.15
0 0.68671875 0.4979166666666667 0.096875 0.05416666666666667
0 0.58828125 0.38125 0.040625 0.11666666666666667
0 0.321875 0.7125 0.1234375 0.13333333333333333
0 0.65859375 0.6166666666666667 0.078125 0.0875
0 0.21796875 0.5354166666666667 0.0796875 0.175
0 0.83828125 0.32708333333333334 0.0421875 0.10416666666666667
0 0.45390625 0.06770833333333333 0.0453125 0.13541666666666666
0 0.40078125 0.06979166666666667 0.05625 0.13333333333333333
0 0.4328125 0.06875 0.04375 0.1375