0 0.63828125 0.653125 0.15703125 0.06770833333333333
0 0.64921875 0.16145833333333334 0.11953125 0.12083333333333333
0 0.40703125 0.11354166666666667 0.13359375 0.075
0 0.24140625 0.440625 0.14375 0.10416666666666667
0 0.35 0.4375 0.1125 0.146875
0 0.33671875 0.840625 0.065625 0.065625
0 0.45234375 0.9322916666666666 0.14375 0.057291666666666664
0 0.59140625 0.9072916666666667 0.1375 0.08854166666666667
0 0.71015625 0.803125 0.11015625 0.15