0 0.36875 0.071875 0.1 0.14375
0 0.5453125 0.06875 0.059375 0.134375
0 0.65546875 0.05 0.0984375 0.1
0 0.25703125 0.6833333333333333 0.11640625 0.146875
0 0.41015625 0.790625 0.1375 0.071875
0 0.49765625 0.7572916666666667 0.14453125 0.040625
0 0.5546875 0.7927083333333333 0.14921875 0.06354166666666666
0 0.73359375 0.44583333333333336 0.14921875 0.071875
0 0.3140625 0.4895833333333333 0.09453125 0.042708333333333334
0 0.77578125 0.353125 0.08828125 0.16666666666666666
0 0.80234375 0.30104166666666665 0.0625 0.17083333333333334
0 0.41484375 0.38229166666666664 0.05390625 0.12916666666666668
0 0.16328125 0.3385416666666667 0.04453125 0.134375
0 0.20078125 0.2760416666666667 0.06953125 0.18020833333333333
0 0.67421875 0.434375 0.03671875 0.125