0 0.32578125 0.8875 0.14375 0.09791666666666667
0 0.20703125 0.640625 0.1375 0.1125
0 0.45234375 0.7052083333333333 0.034375 0.19166666666666668
0 0.4859375 0.6416666666666667 0.03125 0.19583333333333333
0 0.49921875 0.203125 0.04375 0.19583333333333333
0 0.44453125 0.20104166666666667 0.05 0.18333333333333332
0 0.28671875 0.24895833333333334 0.128125 0.15833333333333333
0 0.25625 0.24375 0.11875 0.14166666666666666