0 0.50625 0.07708333333333334 0.028125 0.15416666666666667
0 0.459375 0.23333333333333334 0.075 0.10416666666666667
0 0.26796875 0.43645833333333334 0.05625 0.15833333333333333
0 0.34921875 0.5958333333333333 0.103125 0.12916666666666668
0 0.2796875 0.5427083333333333 0.0875 0.14166666666666666
0 0.52578125 0.528125 0.115625 0.09166666666666666
0 0.75859375 0.4083333333333333 0.06875 0.17083333333333334
0 0.68984375 0.309375 0.084375 0.04583333333333333
0 0.68515625 0.23020833333333332 0.025 0.1375
0 0.62734375 0.6197916666666666 0.128125 0.04583333333333333
0 0.65546875 0.65625 0.125 0.03333333333333333
0 0.61953125 0.6802083333333333 0.13125 0.0375
0 0.73359375 0.671875 0.11875 0.125
0 0.6796875 0.7166666666666667 0.09375 0.09583333333333334