0 0.43671875 0.31354166666666666 0.14921875 0.065625
0 0.37265625 0.365625 0.140625 0.07708333333333334
0 0.61171875 0.8770833333333333 0.1453125 0.05520833333333333
0 0.49375 0.975 0.15078125 0.04895833333333333
0 0.4609375 0.9489583333333333 0.14296875 0.07708333333333334
0 0.7234375 0.775 0.09296875 0.17395833333333333
0 0.6296875 0.6072916666666667 0.0859375 0.07395833333333333
0 0.684375 0.771875 0.10625 0.15625