0 0.1796875 0.590625 0.07421875 0.178125
0 0.45390625 0.44895833333333335 0.12109375 0.13229166666666667
0 0.68828125 0.7552083333333334 0.12421875 0.14479166666666668
0 0.77109375 0.6072916666666667 0.08515625 0.17395833333333333
0 0.40703125 0.4270833333333333 0.03671875 0.11770833333333333
0 0.48984375 0.04895833333333333 0.13828125 0.053125
0 0.42578125 0.025 0.14453125 0.05
0 0.71015625 0.13229166666666667 0.11171875 0.1375
0 0.61640625 0.16145833333333334 0.10703125 0.15
0 0.63046875 0.11666666666666667 0.1125 0.15
0 0.64140625 0.090625 0.11171875 0.14479166666666668