0 0.578125 0.48333333333333334 0.13515625 0.09166666666666666
0 0.51171875 0.9447916666666667 0.14921875 0.059375
0 0.65546875 0.8770833333333333 0.125 0.1375
0 0.15 0.4947916666666667 0.04140625 0.090625