0 0.1890625 0.4322916666666667 0.090625 0.17916666666666667
0 0.40625 0.43020833333333336 0.0375 0.11666666666666667
0 0.66328125 0.684375 0.11875 0.15416666666666667
0 0.465625 0.8572916666666667 0.146875 0.041666666666666664
0 0.478125 0.821875 0.140625 0.04583333333333333
0 0.41640625 0.03229166666666667 0.1390625 0.06458333333333334
0 0.60859375 0.821875 0.1375 0.09583333333333334
0 0.58046875 0.7208333333333333 0.128125 0.14583333333333334
0 0.15703125 0.403125 0.040625 0.09583333333333334
0 0.21484375 0.29270833333333335 0.071875 0.19166666666666668
0 0.67421875 0.13333333333333333 0.034375 0.07916666666666666