0 0.52734375 0.31145833333333334 0.09296875 0.17395833333333333
0 0.74453125 0.4010416666666667 0.06796875 0.175
0 0.4453125 0.9833333333333333 0.146875 0.03333333333333333
0 0.225 0.7791666666666667 0.09375 0.18854166666666666
0 0.12265625 0.6635416666666667 0.05859375 0.18229166666666666
0 0.14296875 0.6364583333333333 0.05546875 0.19270833333333334
0 0.6296875 0.6083333333333333 0.090625 0.06666666666666667