0 0.85390625 0.6041666666666666 0.0421875 0.16666666666666666
0 0.45859375 0.23854166666666668 0.075 0.17083333333333334
0 0.646875 0.915625 0.125 0.07083333333333333
0 0.58671875 0.7989583333333333 0.109375 0.05416666666666667
0 0.715625 0.8552083333333333 0.128125 0.052083333333333336
0 0.68046875 0.7927083333333333 0.109375 0.12916666666666668
0 0.73359375 0.821875 0.125 0.0625
0 0.30703125 0.428125 0.053125 0.1625
0 0.584375 0.9010416666666666 0.134375 0.09375
0 0.459375 0.7822916666666667 0.134375 0.04583333333333333
0 0.51640625 0.8854166666666666 0.128125 0.075
0 0.41171875 0.6177083333333333 0.128125 0.05416666666666667
0 0.32890625 0.7427083333333333 0.075 0.15416666666666667
0 0.365625 0.7572916666666667 0.084375 0.15416666666666667
0 0.33984375 0.6239583333333333 0.109375 0.12916666666666668
0 0.62421875 0.5947916666666667 0.071875 0.11666666666666667
0 0.69609375 0.5895833333333333 0.06875 0.08333333333333333