0 0.3203125 0.396875 0.078125 0.10104166666666667
0 0.64140625 0.7708333333333334 0.140625 0.125
0 0.7546875 0.6395833333333333 0.096875 0.165625
0 0.81171875 0.4635416666666667 0.0546875 0.18854166666666666
0 0.73984375 0.109375 0.1046875 0.146875
0 0.6484375 0.04583333333333333 0.08046875 0.084375