0 0.44609375 0.5916666666666667 0.125 0.10416666666666667
0 0.50859375 0.8635416666666667 0.075 0.17916666666666667
0 0.70390625 0.4510416666666667 0.115625 0.1
0 0.71015625 0.7427083333333333 0.096875 0.13333333333333333
0 0.59609375 0.25416666666666665 0.065625 0.1875
0 0.19765625 0.8135416666666667 0.109375 0.17083333333333334
0 0.18359375 0.315625 0.09375 0.175
0 0.35234375 0.14479166666666668 0.1375 0.0875
0 0.53671875 0.140625 0.134375 0.09166666666666666