0 0.5125 0.6041666666666666 0.06875 0.17916666666666667
0 0.16640625 0.515625 0.04375 0.2
0 0.2171875 0.7072916666666667 0.103125 0.16666666666666666
0 0.50390625 0.03333333333333333 0.06875 0.05416666666666667