0 0.68359375 0.24895833333333334 0.1171875 0.14479166666666668
0 0.49765625 0.7760416666666666 0.08671875 0.07604166666666666
0 0.75546875 0.40208333333333335 0.0671875 0.18125
0 0.74296875 0.65625 0.09375 0.1875
0 0.72578125 0.7770833333333333 0.09296875 0.16041666666666668