0 0.334375 0.240625 0.1125 0.15
0 0.7765625 0.8572916666666667 0.13125 0.12083333333333333
0 0.58984375 0.86875 0.15 0.11666666666666667
0 0.66015625 0.9583333333333334 0.1625 0.08333333333333333
0 0.62890625 0.9458333333333333 0.146875 0.0875
0 0.37578125 0.6072916666666667 0.078125 0.07083333333333333
0 0.56171875 0.878125 0.134375 0.10416666666666667