0 0.1421875 0.39479166666666665 0.034375 0.2
0 0.21484375 0.7052083333333333 0.10625 0.15416666666666667
0 0.29375 0.4947916666666667 0.053125 0.1125
0 0.46171875 0.8645833333333334 0.140625 0.0375
0 0.5578125 0.778125 0.05625 0.1875
0 0.4953125 0.753125 0.08125 0.1875