0 0.46171875 0.5822916666666667 0.109375 0.12916666666666668
0 0.24140625 0.5385416666666667 0.05625 0.16666666666666666
0 0.54453125 0.04479166666666667 0.125 0.041666666666666664
0 0.52890625 0.33958333333333335 0.078125 0.08333333333333333
0 0.45234375 0.8864583333333333 0.13125 0.07916666666666666
0 0.76171875 0.7729166666666667 0.10625 0.14791666666666667
0 0.6453125 0.871875 0.121875 0.1125
0 0.728125 0.878125 0.1 0.04583333333333333
0 0.27109375 0.2791666666666667 0.08125 0.1375