0 0.6828125 0.428125 0.1375 0.07083333333333333
0 0.49609375 0.20833333333333334 0.075 0.1625
0 0.65859375 0.23854166666666668 0.078125 0.1625
0 0.51640625 0.9833333333333333 0.1609375 0.03333333333333333
0 0.5109375 0.95625 0.14375 0.041666666666666664
0 0.3 0.7395833333333334 0.1234375 0.14583333333333334
0 0.23984375 0.5645833333333333 0.065625 0.2
0 0.2234375 0.6260416666666667 0.05 0.19583333333333333
0 0.2828125 0.8197916666666667 0.096875 0.175