0 0.39609375 0.76875 0.12890625 0.109375
0 0.3390625 0.621875 0.078125 0.07916666666666666
0 0.28515625 0.4875 0.01640625 0.11354166666666667
0 0.3484375 0.30520833333333336 0.084375 0.08333333333333333
0 0.31328125 0.48854166666666665 0.09765625 0.04895833333333333
0 0.40859375 0.38229166666666664 0.03359375 0.115625
0 0.16015625 0.34375 0.03671875 0.12083333333333333
0 0.57109375 0.40520833333333334 0.13515625 0.07916666666666666
0 0.80625 0.35625 0.03359375 0.18229166666666666
0 0.69921875 0.06979166666666667 0.10703125 0.13020833333333334
0 0.6140625 0.090625 0.13203125 0.06770833333333333
0 0.67421875 0.4322916666666667 0.03203125 0.11770833333333333
0 0.57109375 0.6677083333333333 0.10078125 0.15416666666666667
0 0.646875 0.5552083333333333 0.09765625 0.15
0 0.52734375 0.7791666666666667 0.140625 0.08854166666666667
0 0.6546875 0.671875 0.121875 0.0875
0 0.66328125 0.640625 0.13515625 0.10729166666666666
0 0.6078125 0.7666666666666667 0.140625 0.1