{
  "templates": [
    {
      "id": "visitsweden-53",
      "label": {
        "en": "Type of store ",
        "sv": "Typ av butik"
      },
      "property": "http://schema.org/additionalType",
      "nodetype": "URI",
      "type": "choice",
      "cardinality": {
        "min": 1
      },
      "choices": [
        {
          "value": "http://schema.org/AutoPartsStore",
          "label": {
            "en": "Auto parts store",
            "sv": "Butik för bildelar"
          },
          "description": {
            "en": "An auto parts store.",
            "sv": "En butik för bildelar"
          }
        },
        {
          "value": "http://schema.org/FurnitureStore",
          "label": {
            "en": "Furniture store",
            "sv": "Möbelbutik"
          },
          "description": {
            "en": "A furniture store.",
            "sv": "En möbelbutik."
          }
        },
        {
          "value": "http://schema.org/GardenStore",
          "label": {
            "en": "Garden store",
            "sv": "Trädgårdsbutik"
          },
          "description": {
            "en": "A garden store.",
            "sv": "En trädgårdsbutik."
          }
        },
        {
          "value": "http://schema.org/GroceryStore",
          "label": {
            "en": "Grocery store",
            "sv": "Livsmedelsbutik"
          },
          "description": {
            "en": "A grocery store.",
            "sv": "En livsmedelsbutik. "
          }
        },
        {
          "value": "http://schema.org/HardwareStore",
          "label": {
            "en": "Hardware store",
            "sv": "Järnhandelsbutik"
          },
          "description": {
            "en": "A hardware store.",
            "sv": "En järnhandelsbutik."
          }
        },
        {
          "value": "http://schema.org/HobbyShop",
          "label": {
            "en": "Hobby shop",
            "sv": "Hobbybutik"
          },
          "description": {
            "en": "A store that sells materials useful or necessary for various hobbies.",
            "sv": "En butik som säljer material som är användbart eller nödvändigt för olika hobbyer."
          }
        },
        {
          "value": "http://schema.org/HomeGoodsStore",
          "label": {
            "en": "Home goods store",
            "sv": "Butik för hushållsartiklar"
          },
          "description": {
            "en": "A home goods store.",
            "sv": "En butik för hushållsartiklar"
          }
        },
        {
          "value": "http://schema.org/JewelryStore",
          "label": {
            "en": "Jewelry store",
            "sv": "Smyckesbutik"
          },
          "description": {
            "en": "A jewelry store.",
            "sv": "En smyckesbutik."
          }
        },
        {
          "value": "http://schema.org/LiquorStore",
          "label": {
            "en": "Liquor store",
            "sv": "Spritbutik"
          },
          "description": {
            "en": "A shop that sells alcoholic drinks such as wine, beer, whisky and other spirits.",
            "sv": "En butik som säljer alkoholhaltiga drycker som vin, öl, whisky och andra spritdrycker."
          }
        },
        {
          "value": "http://schema.org/MensClothingStore",
          "label": {
            "en": "Men's clothing store",
            "sv": "Butik för herrkläder"
          },
          "description": {
            "en": "A men's clothing store."
          }
        },
        {
          "value": "http://schema.org/MobilePhoneStore",
          "label": {
            "en": "Mobile phone store",
            "sv": "Mobilbutik"
          },
          "description": {
            "en": "A store that sells mobile phones and related accessories.",
            "sv": "En butik som säljer mobiltelefoner och tillhörande tillbehör."
          }
        },
        {
          "value": "http://schema.org/BookStore",
          "label": {
            "en": "Bookshop",
            "sv": "Bokhandel"
          },
          "description": {
            "en": "A bookshop."
          }
        },
        {
          "value": "http://schema.org/MovieRentalStore",
          "label": {
            "en": "Movie rental store",
            "sv": "Filmuthyrningsbutik"
          },
          "description": {
            "en": "A movie rental store.",
            "sv": "En filmuthyrningsbutik. "
          }
        },
        {
          "value": "http://schema.org/MusicStore",
          "label": {
            "en": "Music store",
            "sv": "Musikbutik"
          },
          "description": {
            "en": "A music store. ",
            "sv": "En musikbutik. "
          }
        },
        {
          "value": "http://schema.org/OfficeEquipmentStore",
          "label": {
            "en": "Office equipment store",
            "sv": "Butik för kontorsutrustning"
          },
          "description": {
            "en": "An office equipment store.",
            "sv": "En butik för kontorsutrustning."
          }
        },
        {
          "value": "http://schema.org/OutletStore",
          "label": {
            "en": "Outlet store",
            "sv": "Outletbutik"
          },
          "description": {
            "en": "An outlet store.",
            "sv": "En outletbutik."
          }
        },
        {
          "value": "http://schema.org/PawnShop",
          "label": {
            "en": "Pawn shop",
            "sv": "Pantbank"
          },
          "description": {
            "en": "A shop that will buy, or lend money against the security of, personal possessions.",
            "sv": "En butik som köper eller lånar ut pengar mot säkerhet för personliga ägodelar."
          }
        },
        {
          "value": "http://schema.org/PetStore",
          "label": {
            "en": "Pet store",
            "sv": "Djuraffär"
          },
          "description": {
            "en": "A pet store. ",
            "sv": "En djuraffär.  "
          }
        },
        {
          "value": "http://schema.org/ShoeStore",
          "label": {
            "en": "Shoe store",
            "sv": "Skobutik"
          },
          "description": {
            "en": "A shoe store. ",
            "sv": "En skobutik. "
          }
        },
        {
          "value": "http://schema.org/SportingGoodsStore",
          "label": {
            "en": "Sporting goods store",
            "sv": "Sportbutik"
          },
          "description": {
            "en": "A sporting goods store.",
            "sv": "En sportbutik. "
          }
        },
        {
          "value": "http://schema.org/TireShop",
          "label": {
            "en": "Tire shop",
            "sv": "Däckbutik"
          },
          "description": {
            "en": "A tire shop. ",
            "sv": "En däckbutik. "
          }
        },
        {
          "value": "http://schema.org/ToyStore",
          "label": {
            "en": "Toy store",
            "sv": "Leksaksbutik"
          },
          "description": {
            "sv": "En leksaksbutik.",
            "en": "A toy store. "
          }
        },
        {
          "value": "http://schema.org/BikeStore",
          "label": {
            "en": "Bike store",
            "sv": "Cykelbutik"
          },
          "description": {
            "en": "A bike store.",
            "sv": "En cykelbutik."
          }
        },
        {
          "value": "http://schema.org/WholesaleStore",
          "label": {
            "en": "Wholesale store",
            "sv": "Grossistbutik"
          },
          "description": {
            "sv": "En grossistbutik.",
            "en": "A wholesale store."
          }
        },
        {
          "value": "http://data.visitsweden.com/terms/FarmShop",
          "label": {
            "sv": "Gårdsbutik",
            "en": "Farm shop"
          }
        },
        {
          "value": "http://schema.org/ClothingStore",
          "label": {
            "en": "Clothing store",
            "sv": "Klädbutik"
          },
          "description": {
            "en": "A clothing store.",
            "sv": "En klädbutik."
          }
        },
        {
          "value": "http://schema.org/ComputerStore",
          "label": {
            "en": "Computer store",
            "sv": "Datorbutik"
          },
          "description": {
            "sv": "En datorbutik.",
            "en": "A computer store. "
          }
        },
        {
          "value": "http://schema.org/ConvenienceStore",
          "label": {
            "en": "Convenience store",
            "sv": "Närbutik"
          },
          "description": {
            "en": "A convenience store.",
            "sv": "En närbutik."
          }
        },
        {
          "value": "http://schema.org/DepartmentStore",
          "label": {
            "en": "Department store",
            "sv": "Varuhus"
          },
          "description": {
            "en": "A department store.",
            "sv": "Ett varuhus."
          }
        },
        {
          "value": "http://schema.org/ElectronicsStore",
          "label": {
            "en": "Electronics store",
            "sv": "Elektronikbutik"
          },
          "description": {
            "en": "En elektronikbutik."
          }
        },
        {
          "value": "http://schema.org/Florist",
          "label": {
            "en": "Florist",
            "sv": "Florist"
          },
          "description": {
            "en": "A florist.",
            "sv": "En florist. "
          }
        }
      ],
      "styles": [
        "strictmatch",
        "dropDown"
      ]
    },
    {
      "id": "visitsweden-87",
      "label": {
        "sv": "Betygsvärde",
        "en": "Rating value"
      },
      "description": {
        "sv": "Ange betygsvärdet för upplevelsen i intervallet 1-5.",
        "en": "Indicate the rating of the experience on a scale of 1-5."
      },
      "purpose": {
        "en": "schema:ratingValue for aggregateRating "
      },
      "property": "http://schema.org/ratingValue",
      "nodetype": "DATATYPE_LITERAL",
      "type": "text",
      "cardinality": {
        "pref": 1,
        "max": 1
      },
      "datatype": "http://www.w3.org/2001/XMLSchema#decimal"
    },
    {
      "id": "visitsweden-93",
      "label": {
        "en": "Review count",
        "sv": "Recensioner"
      },
      "description": {
        "en": "The count of total number of reviews.",
        "sv": "Antalet recensioner."
      },
      "purpose": {
        "en": "schema:reviewCount"
      },
      "property": "http://schema.org/reviewCount",
      "nodetype": "DATATYPE_LITERAL",
      "type": "text",
      "cardinality": {
        "pref": 1,
        "max": 1
      },
      "datatype": "http://www.w3.org/2001/XMLSchema#integer"
    },
    {
      "id": "visitsweden-92",
      "label": {
        "sv": "Medelbetyg",
        "en": "Aggregate rating"
      },
      "description": {
        "sv": "Det genomsnittliga betyget baserat på flera betyg eller recensioner.",
        "en": "The average rating based on multiple ratings or reviews."
      },
      "items": [
        "visitsweden-87",
        "visitsweden-93"
      ],
      "property": "http://schema.org/aggregateRating",
      "nodetype": "BLANK",
      "type": "group",
      "cardinality": {
        "pref": 1,
        "max": 1
      },
      "constraints": {
        "http://www.w3.org/1999/02/22-rdf-syntax-ns#type": "http://schema.org/AggregateRating"
      },
      "cls": [
        "cardgroup"
      ]
    },
    {
      "id": "visitsweden-17",
      "label": {
        "en": "Name",
        "sv": "Namn"
      },
      "description": {
        "en": "Enter the name of what you are describing.",
        "sv": "Ange namnet på det du beskriver"
      },
      "purpose": {
        "en": "schema:name for activities"
      },
      "property": "http://schema.org/name",
      "nodetype": "LANGUAGE_LITERAL",
      "type": "text",
      "cardinality": {
        "min": 1
      }
    },
    {
      "id": "visitsweden-18",
      "label": {
        "en": "Subheadline",
        "sv": "Rubrik"
      },
      "description": {
        "en": "Clear sentence of what your activity / offer is.",
        "sv": "Tydlig mening om vad er aktivitet/erbjudande är."
      },
      "purpose": {
        "en": "schema:alternateName"
      },
      "property": "http://schema.org/alternateName",
      "nodetype": "LANGUAGE_LITERAL",
      "type": "text",
      "cardinality": {
        "pref": 1
      }
    },
    {
      "id": "visitsweden-25",
      "label": {
        "en": "Homepage",
        "sv": "Hemsida"
      },
      "description": {
        "sv": "Länk till där man kan läsa mer och boka er aktivitet/erbjudande.",
        "en": "Link to where you can read more and book your activity / offer."
      },
      "purpose": {
        "en": "schema:url"
      },
      "property": "http://schema.org/url",
      "nodetype": "URI",
      "type": "text",
      "cardinality": {
        "pref": 1
      },
      "pattern": "^https?://.*$"
    },
    {
      "id": "visitsweden-65",
      "label": {
        "en": "Region",
        "sv": "Region"
      },
      "purpose": {
        "en": "dcterms:spatial pointing to administrative area"
      },
      "property": "http://purl.org/dc/terms/spatial",
      "nodetype": "URI",
      "type": "choice",
      "cardinality": {
        "min": 1,
        "max": 1
      },
      "constraints": {
        "http://www.w3.org/1999/02/22-rdf-syntax-ns#type": "http://schema.org/AdministrativeArea"
      }
    },
    {
      "id": "visitsweden-22",
      "label": {
        "en": "Body text",
        "sv": "Brödtext"
      },
      "description": {
        "sv": "En kort beskrivning av upplevelsen.",
        "en": "A short description of the experience."
      },
      "purpose": {
        "en": "schema:description"
      },
      "property": "http://schema.org/description",
      "nodetype": "LANGUAGE_LITERAL",
      "type": "text",
      "cardinality": {
        "pref": 1
      },
      "styles": [
        "multiline"
      ]
    },
    {
      "id": "visitsweden-24",
      "label": {
        "en": "Factsoriented text",
        "sv": "Faktatext"
      },
      "description": {
        "en": "Additional information that can be good to have and / or to think about if you want to book your experience.",
        "sv": "Ytterligare information som kan vara bra att ha och/eller att tänka på om man vill boka er upplevelse."
      },
      "purpose": {
        "en": "visit_facts using dcterms:abstract"
      },
      "property": "http://purl.org/dc/terms/abstract",
      "nodetype": "LANGUAGE_LITERAL",
      "type": "text",
      "cardinality": {
        "pref": 1
      },
      "styles": [
        "multiline"
      ]
    },
    {
      "id": "visitsweden-9",
      "label": {
        "en": "Opens",
        "sv": "Öppnar"
      },
      "purpose": {
        "en": "schema:opens"
      },
      "placeholder": {
        "en": "hh:mm",
        "sv": "hh:mm"
      },
      "property": "http://schema.org/opens",
      "nodetype": "ONLY_LITERAL",
      "type": "text",
      "cardinality": {
        "pref": 1,
        "max": 1
      },
      "pattern": "^\\d\\d:\\d\\d$"
    },
    {
      "id": "visitsweden-10",
      "label": {
        "en": "Closes",
        "sv": "Stänger"
      },
      "purpose": {
        "en": "schema:closes"
      },
      "placeholder": {
        "en": "hh:mm",
        "sv": "hh:mm"
      },
      "property": "http://schema.org/closes",
      "nodetype": "ONLY_LITERAL",
      "type": "text",
      "cardinality": {
        "pref": 1,
        "max": 1
      },
      "pattern": "^\\d\\d:\\d\\d$"
    },
    {
      "id": "visitsweden-13",
      "label": {
        "en": "Day of week",
        "sv": "Veckodag"
      },
      "purpose": {
        "en": "schema:dayOfWeek"
      },
      "property": "http://schema.org/dayOfWeek",
      "nodetype": "URI",
      "type": "choice",
      "cardinality": {
        "pref": 1
      },
      "choices": [
        {
          "value": "http://schema.org/Monday",
          "label": {
            "sv": "Måndag",
            "en": "Monday"
          },
          "description": {
            "sv": "Motsvarar alla icke röda måndagar i kalendern.",
            "en": "Corresponds to all Mondays that are not holidays in the calendar."
          }
        },
        {
          "value": "http://schema.org/Tuesday",
          "label": {
            "sv": "Tisdag",
            "en": "Tuesday"
          },
          "description": {
            "sv": "Motsvarar alla icke röda tisdagar i kalendern.",
            "en": "Corresponds to all Tuesdays that are not holidays in the calendar."
          }
        },
        {
          "value": "http://schema.org/Wednesday",
          "label": {
            "sv": "Onsdag",
            "en": "Wednesday"
          },
          "description": {
            "sv": "Motsvarar alla icke röda onsdagar i kalendern.",
            "en": "Corresponds to all Wednesdays that are not holidays in the calendar."
          }
        },
        {
          "value": "http://schema.org/Thursday",
          "label": {
            "sv": "Torsdag",
            "en": "Thursday"
          },
          "description": {
            "sv": "Motsvarar alla icke röda torsdagar i kalendern.",
            "en": "Corresponds to all Thursdays that are not holidays in the calendar."
          }
        },
        {
          "value": "http://schema.org/Friday",
          "label": {
            "sv": "Fredag",
            "en": "Friday"
          },
          "description": {
            "sv": "Motsvarar alla icke röda fredagar i kalendern.",
            "en": "Corresponds to all Fridays that are not holidays in the calendar."
          }
        },
        {
          "value": "http://schema.org/Saturday",
          "label": {
            "sv": "Lördag",
            "en": "Saturday"
          },
          "description": {
            "sv": "Motsvarar alla icke röda lördagar i kalendern.",
            "en": "Corresponds to all Saturdays that are not holidays in the calendar."
          }
        },
        {
          "value": "http://schema.org/Sunday",
          "label": {
            "sv": "Söndag",
            "en": "Sunday"
          },
          "description": {
            "sv": "Motsvarar alla söndagar i kalendern.",
            "en": "Corresponds to all Sundays that are not holidays in the calendar."
          }
        },
        {
          "value": "http://schema.org/PublicHolidays",
          "label": {
            "sv": "Övrig helgdag",
            "en": "Public holiday"
          },
          "description": {
            "sv": "Allmänna helgdagar är de dagar som är markerade som röda i kalendern utom söndagar (som har en egen markering).",
            "en": "Public holidays are the days marked in red in the calendar except for Sundays (which have their own marking)."
          }
        }
      ],
      "styles": [
        "preserveOrderOfChoices",
        "verticalCheckBoxes"
      ]
    },
    {
      "id": "visitsweden-11",
      "label": {
        "en": "Valid from",
        "sv": "Gäller från"
      },
      "purpose": {
        "en": "schema:validFrom with xsd:time"
      },
      "property": "http://schema.org/validFrom",
      "nodetype": "DATATYPE_LITERAL",
      "type": "text",
      "cardinality": {
        "pref": 1,
        "max": 1
      },
      "datatype": [
        "http://www.w3.org/2001/XMLSchema#gMonthDay",
        "http://www.w3.org/2001/XMLSchema#date"
      ]
    },
    {
      "id": "visitsweden-12",
      "label": {
        "en": "Valid to",
        "sv": "Gäller till"
      },
      "purpose": {
        "en": "schema:validTo with xsd:time"
      },
      "property": "http://schema.org/validTo",
      "nodetype": "DATATYPE_LITERAL",
      "type": "text",
      "cardinality": {
        "pref": 1,
        "max": 1
      },
      "datatype": [
        "http://www.w3.org/2001/XMLSchema#gMonthDay",
        "http://www.w3.org/2001/XMLSchema#date"
      ]
    },
    {
      "id": "visitsweden-23",
      "label": {
        "en": "Description",
        "sv": "Beskrivning"
      },
      "description": {
        "en": "A short description.",
        "sv": "En kort beskrivning."
      },
      "purpose": {
        "en": "schema:description for OpeningHours"
      },
      "property": "http://schema.org/description",
      "nodetype": "LANGUAGE_LITERAL",
      "type": "text",
      "styles": [
        "multiline"
      ]
    },
    {
      "id": "visitsweden-52",
      "label": {
        "en": "Opening hours",
        "sv": "Öppettider"
      },
      "items": [
        "visitsweden-9",
        "visitsweden-10",
        "visitsweden-13",
        "visitsweden-11",
        "visitsweden-12",
        "visitsweden-23"
      ],
      "property": "http://schema.org/openingHoursSpecification",
      "nodetype": "BLANK",
      "type": "group",
      "constraints": {
        "http://www.w3.org/1999/02/22-rdf-syntax-ns#type": "http://schema.org/OpeningHoursSpecification"
      },
      "cls": [
        "cardgroup"
      ]
    },
    {
      "id": "visitsweden-66",
      "label": {
        "en": "Street address",
        "sv": "Gatuadress "
      },
      "purpose": {
        "en": "schema:streetAddress"
      },
      "placeholder": {
        "sv": "Ange endast gatuadress, inget postnummer. "
      },
      "property": "http://schema.org/streetAddress",
      "nodetype": "ONLY_LITERAL",
      "type": "text",
      "cardinality": {
        "pref": 1,
        "max": 1
      }
    },
    {
      "id": "visitsweden-31",
      "label": {
        "en": "City",
        "sv": "Stad"
      },
      "description": {
        "sv": "Staden där er aktivitet/erbjudande finns.",
        "en": "The city where your activity / offer is located."
      },
      "purpose": {
        "en": "schema:addressLocality"
      },
      "property": "http://schema.org/addressLocality",
      "nodetype": "ONLY_LITERAL",
      "type": "text",
      "cardinality": {
        "min": 1,
        "max": 1
      }
    },
    {
      "id": "visitsweden-28",
      "label": {
        "en": "Country",
        "sv": "Land"
      },
      "property": "http://schema.org/addressCountry",
      "nodetype": "ONLY_LITERAL",
      "type": "choice",
      "cardinality": {
        "pref": 1
      },
      "choices": [
        {
          "value": "sweden",
          "label": {
            "en": "Sweden",
            "sv": "Sverige"
          }
        }
      ],
      "styles": [
        "invisible"
      ],
      "value": "sweden"
    },
    {
      "id": "visitsweden-27",
      "label": {
        "sv": "Adress",
        "en": "Address"
      },
      "items": [
        "visitsweden-66",
        "visitsweden-31",
        "visitsweden-28"
      ],
      "property": "http://schema.org/address",
      "nodetype": "BLANK",
      "type": "group",
      "cardinality": {
        "min": 1,
        "max": 1
      },
      "constraints": {
        "http://www.w3.org/1999/02/22-rdf-syntax-ns#type": "http://schema.org/PostalAddress"
      },
      "cls": [
        "cardgroup"
      ]
    },
    {
      "id": "visitsweden-58",
      "label": {
        "sv": "Plats",
        "en": "Location"
      },
      "description": {
        "en": "A location represented as a longitude and latitude.",
        "sv": "En plats representerad som en longitud och latitud. "
      },
      "editdescription": {
        "sv": "Sätt ut nålen på kartan, positionen kommer sparas som en longitud och latitud. Om ni vill justera koordinater därefter gör ni det i fälten till höger. ",
        "en": "Put the needle on the map, the position will be saved as a longitude and latitude. If you want to adjust the coordinates afterwards, do so in the fields on the right."
      },
      "property": "http://schema.org/latitude",
      "nodetype": "ONLY_LITERAL",
      "type": "text",
      "cardinality": {
        "min": 1,
        "max": 1
      },
      "styles": [
        "geoPoint",
        "showDescriptionInEdit"
      ]
    },
    {
      "id": "visitsweden-72",
      "label": {
        "sv": "Plats",
        "en": "Location"
      },
      "description": {
        "en": "The geographic coordinates of a place or event.",
        "sv": "De geografiska koordinaterna för en plats eller händelse."
      },
      "purpose": {
        "en": "The geographic coordinates of a place or event."
      },
      "items": [
        "visitsweden-58"
      ],
      "property": "http://schema.org/geo",
      "nodetype": "BLANK",
      "type": "group",
      "cardinality": {
        "pref": 1,
        "max": 1
      },
      "constraints": {
        "http://www.w3.org/1999/02/22-rdf-syntax-ns#type": "http://schema.org/GeoCoordinates"
      },
      "styles": [
        "invisibleGroup"
      ]
    },
    {
      "id": "visitsweden-14",
      "label": {
        "sv": "Huvudbild",
        "en": "Main image"
      },
      "description": {
        "sv": "En bild som representerar er samt ger ett bra och lockande första intryck.",
        "en": "An image that represents you and gives a good and attractive first impression."
      },
      "purpose": {
        "en": "schema_image"
      },
      "property": "http://schema.org/image",
      "nodetype": "URI",
      "type": "choice",
      "cardinality": {
        "min": 1,
        "max": 1
      },
      "constraints": {
        "http://www.w3.org/1999/02/22-rdf-syntax-ns#type": "http://schema.org/ImageObject"
      }
    },
    {
      "id": "visitsweden-16",
      "label": {
        "en": "Image",
        "sv": "Bild"
      },
      "description": {
        "sv": "Kompletterande bild för att sälja in er aktivitet eller erbjudande. ",
        "en": "Complementary image to promote your activity or offer. "
      },
      "purpose": {
        "en": "schema:photo"
      },
      "placeholder": {
        "sv": "Format tillåtna JPG och PNG",
        "en": " Formats allowed JPG and PNG"
      },
      "property": "http://schema.org/photo",
      "nodetype": "URI",
      "type": "choice",
      "cardinality": {
        "pref": 1
      },
      "constraints": {
        "http://www.w3.org/1999/02/22-rdf-syntax-ns#type": "http://schema.org/ImageObject"
      }
    },
    {
      "id": "visitsweden-20",
      "label": {
        "en": "Price range",
        "sv": "Prisindikation"
      },
      "description": {
        "en": "What your activity / offer is for the price level",
        "sv": "Hur är prisnivån i jämförelse med andra typer av liknande upplevelser?"
      },
      "help": {
        "sv": "Hur är kostnaden i jämförelse med andra typer av liknande upplevelser?"
      },
      "purpose": {
        "en": "schema:priceRange"
      },
      "property": "http://schema.org/priceRange",
      "nodetype": "ONLY_LITERAL",
      "type": "choice",
      "cardinality": {
        "max": 1
      },
      "choices": [
        {
          "value": "$",
          "label": {
            "sv": "$"
          },
          "description": {
            "sv": "Billigt"
          }
        },
        {
          "value": "$$",
          "label": {
            "sv": "$$"
          }
        },
        {
          "value": "$$$",
          "label": {
            "sv": "$$$"
          }
        },
        {
          "value": "$$$$",
          "label": {
            "sv": "$$$$"
          }
        },
        {
          "value": "$$$$$",
          "label": {
            "sv": "$$$$$"
          }
        }
      ],
      "styles": [
        "horizontalRadioButtons",
        "showDescriptionInEdit"
      ]
    },
    {
      "id": "visitsweden-77",
      "label": {
        "sv": "Medlem i organisation",
        "en": "Member of organization"
      },
      "description": {
        "en": "Specifies membership in an organization or an association.",
        "sv": "Del i en medlemsorganisation eller i en förening."
      },
      "purpose": {
        "sv": "schema:memberOf"
      },
      "placeholder": {
        "sv": "Ex. SCR",
        "en": "e.g SCR"
      },
      "property": "http://schema.org/memberOf",
      "nodetype": "URI",
      "type": "choice",
      "cardinality": {
        "pref": 1
      },
      "constraints": {
        "http://www.w3.org/1999/02/22-rdf-syntax-ns#type": "http://schema.org/Organization"
      }
    },
    {
      "id": "visitsweden-78",
      "label": {
        "sv": "Del i organisation",
        "en": "Part of organization"
      },
      "description": {
        "sv": "Del av en större organisation som exempelvis Scandic",
        "en": "Part of a larger organisation such as Scandic"
      },
      "purpose": {
        "sv": "schema:parentOrganization. Relation to an organization"
      },
      "placeholder": {
        "sv": "Ex. Scandic",
        "en": "e.g Scandic"
      },
      "property": "http://schema.org/parentOrganization",
      "nodetype": "URI",
      "type": "choice",
      "cardinality": {
        "pref": 1
      },
      "constraints": {
        "http://www.w3.org/1999/02/22-rdf-syntax-ns#type": "http://schema.org/Organization"
      }
    },
    {
      "id": "visitsweden-74",
      "label": {
        "sv": "Relationer",
        "en": "Relations"
      },
      "items": [
        "visitsweden-77",
        "visitsweden-78"
      ],
      "type": "group",
      "cardinality": {
        "pref": 1
      },
      "cls": [
        "cardgroup"
      ]
    },
    {
      "id": "visitsweden-106",
      "label": {
        "sv": "Certifiering",
        "en": "Certificate"
      },
      "purpose": {
        "en": "To define a specific certification for a restaurant (White Guide), a lodging establishment (Nature's best), environment in places (Green key).",
        "sv": "Att definiera en specifik certifiering för en restaurang (White Guide), ett logi (Nature's best), miljö på platser (Green key)."
      },
      "placeholder": {
        "sv": "White guide, Green Key",
        "en": "White guide, Green Key"
      },
      "property": "http://schema.org/hasCredential",
      "nodetype": "URI",
      "type": "choice",
      "cardinality": {
        "pref": 1
      },
      "constraints": {
        "http://www.w3.org/1999/02/22-rdf-syntax-ns#type": "http://schema.org/EducationalOccupationalCredential"
      }
    },
    {
      "id": "visitsweden-89",
      "label": {
        "en": "Contained in place",
        "sv": "Del av plats"
      },
      "purpose": {
        "en": "schema:containedInPlace"
      },
      "property": "http://schema.org/containedInPlace",
      "nodetype": "URI",
      "type": "choice",
      "cardinality": {
        "pref": 1
      },
      "constraints": {
        "http://www.w3.org/1999/02/22-rdf-syntax-ns#type": "http://schema.org/Place"
      }
    },
    {
      "id": "visitsweden-88",
      "label": {
        "sv": "Tillhörande plats",
        "en": "Associated place"
      },
      "description": {
        "sv": "Det grundläggande förhållandet mellan en plats och en annan plats som den innehåller.",
        "en": "The basic containment relation between a place and another that it contains."
      },
      "purpose": {
        "en": "To specify the relation between an experience occuring at a specific place."
      },
      "property": "http://schema.org/containsPlace",
      "nodetype": "URI",
      "type": "choice",
      "cardinality": {
        "pref": 1
      },
      "constraints": {
        "http://www.w3.org/1999/02/22-rdf-syntax-ns#type": "http://schema.org/Place, http://schema.org/LodgingBusiness, http://schema.org/FoodEstablishment, http://schema.org/Store"
      }
    },
    {
      "id": "visitsweden-147",
      "label": {
        "en": "Amenities",
        "sv": "Faciliteter"
      },
      "description": {
        "en": "An amenity feature (e.g. a characteristic or service) of the place.",
        "sv": "En bekvämlighetsdetalj (t.ex. en egenskap eller tjänst) på platsen."
      },
      "property": "http://schema.org/amenityFeature",
      "nodetype": "URI",
      "type": "choice",
      "constraints": {
        "http://schema.org/amenityFeature": "http://schema.org/LocationFeatureSpecification"
      }
    },
    {
      "id": "visitsweden-54",
      "label": {
        "sv": "Handel",
        "en": "Commerce"
      },
      "items": [
        "visitsweden-53",
        "visitsweden-92",
        "visitsweden-17",
        "visitsweden-18",
        "visitsweden-25",
        "visitsweden-65",
        "visitsweden-22",
        "visitsweden-24",
        "visitsweden-52",
        "visitsweden-27",
        "visitsweden-72",
        "visitsweden-14",
        "visitsweden-16",
        "visitsweden-20",
        "visitsweden-74",
        "visitsweden-106",
        "visitsweden-89",
        "visitsweden-88",
        "visitsweden-147"
      ],
      "nodetype": "URI",
      "type": "group",
      "constraints": {
        "http://www.w3.org/1999/02/22-rdf-syntax-ns#type": "http://schema.org/Store"
      }
    },
    {
      "id": "visitsweden-56",
      "label": {
        "sv": "Typ av evenemang",
        "en": "Type of event "
      },
      "property": "http://schema.org/additionalType",
      "nodetype": "URI",
      "type": "choice",
      "cardinality": {
        "min": 1
      },
      "choices": [
        {
          "value": "http://schema.org/BusinessEvent",
          "label": {
            "en": "Business event",
            "sv": "Företag"
          },
          "description": {
            "en": "Event type",
            "sv": "Typ av evenemang"
          }
        },
        {
          "value": "http://schema.org/FoodEvent",
          "label": {
            "en": "Food event",
            "sv": "Mat och dryck"
          },
          "description": {
            "en": "Event type",
            "sv": "Typ av evenemang"
          }
        },
        {
          "value": "http://schema.org/LiteraryEvent",
          "label": {
            "en": "Literary event",
            "sv": "Litterärt evenemang"
          },
          "description": {
            "en": "Event type",
            "sv": "Typ av evenemang"
          }
        },
        {
          "value": "http://schema.org/MusicEvent",
          "label": {
            "en": "Music event",
            "sv": "Musik"
          },
          "description": {
            "en": "Event type",
            "sv": "Typ av evenemang"
          }
        },
        {
          "value": "http://schema.org/PublicationEvent",
          "label": {
            "en": "Publication event",
            "sv": "Lanseringsevent"
          },
          "description": {
            "en": "A publication event corresponds indifferently to the event of publication for a CreativeWork of any type, e.g. a broadcast event, an on-demand event, a book/journal publication via a variety of delivery media.",
            "sv": "Ett lanserings händelse motsvarar oberoende av evenemanget för lansering av ett kreativt verk av vilken typ som helst, t.ex. en sändningshändelse, ett evenemang på begäran, en bok/tidskriftspublikation via en mängd olika leveransmedier."
          }
        },
        {
          "value": "http://schema.org/SaleEvent",
          "label": {
            "en": "Sale event",
            "sv": "Försäljning"
          },
          "description": {
            "en": "Event type",
            "sv": "Typ av evenemang"
          }
        },
        {
          "value": "http://schema.org/ScreeningEvent",
          "label": {
            "en": "Screening event",
            "sv": "Visning"
          },
          "description": {
            "en": "A screening of a movie or other video.",
            "sv": "En visning av en film eller annan video."
          }
        },
        {
          "value": "http://schema.org/SocialEvent",
          "label": {
            "en": "Social event",
            "sv": "Socialt"
          },
          "description": {
            "en": "Event type",
            "sv": "Typ av evenemang"
          }
        },
        {
          "value": "http://schema.org/SportsEvent",
          "label": {
            "sv": "Sport",
            "en": "Sports event"
          },
          "description": {
            "en": "Event type",
            "sv": "Typ av evenemang"
          }
        },
        {
          "value": "http://schema.org/TheaterEvent",
          "label": {
            "en": "Theater event",
            "sv": "Teater"
          },
          "description": {
            "en": "Theater performance.",
            "sv": "Teaterföreställning."
          }
        },
        {
          "value": "http://schema.org/VisualArtsEvent",
          "label": {
            "en": "Visual arts event",
            "sv": "Visuell konst"
          },
          "description": {
            "en": "An event with creative art whose products are to be appreciated by sight, such as painting, sculpture, and film.",
            "sv": "Ett evenemang med kreativ konst vars produkter uppskattas med synen, t.ex. måleri, skulptur och film."
          }
        },
        {
          "value": "http://schema.org/ChildrensEvent",
          "label": {
            "sv": "Barn",
            "en": "Childrens event"
          },
          "description": {
            "en": "Event type",
            "sv": "Typ av evenemang"
          }
        },
        {
          "value": "http://schema.org/ComedyEvent",
          "label": {
            "en": "Comedy event",
            "sv": "Stand-up"
          },
          "description": {
            "en": "Event type",
            "sv": "Typ av evenemang"
          }
        },
        {
          "value": "http://schema.org/CourseInstance",
          "label": {
            "en": "Course instance",
            "sv": "Kurstillfälle"
          },
          "description": {
            "en": "Event type",
            "sv": "Typ av evenemang"
          }
        },
        {
          "value": "http://schema.org/DanceEvent",
          "label": {
            "en": "Dance event",
            "sv": "Dans"
          },
          "description": {
            "en": "Event type",
            "sv": "Typ av evenemang"
          }
        },
        {
          "value": "http://schema.org/DeliveryEvent",
          "label": {
            "en": "Delivery event",
            "sv": "Leveranshändelse"
          },
          "description": {
            "en": "An event involving the delivery of an item.",
            "sv": "En händelse som innebär att en vara levereras."
          }
        },
        {
          "value": "http://schema.org/EducationEvent",
          "label": {
            "en": "Education event",
            "sv": "Utbildning"
          },
          "description": {
            "en": "Event type",
            "sv": "Typ av evenemang"
          }
        },
        {
          "value": "http://schema.org/ExhibitionEvent",
          "label": {
            "en": "Exhibition",
            "sv": "Utställning"
          },
          "description": {
            "en": "Event type",
            "sv": "Typ av evenemang"
          }
        },
        {
          "value": "http://schema.org/Festival",
          "label": {
            "en": "Festival",
            "sv": "Festival"
          },
          "description": {
            "en": "Event type",
            "sv": "Typ av evenemang"
          }
        }
      ],
      "styles": [
        "strictmatch",
        "dropDown"
      ]
    },
    {
      "id": "visitsweden-124",
      "label": {
        "en": "Capacity",
        "sv": "Kapacitet"
      },
      "description": {
        "en": "The total number of individuals that may attend an event or venue.",
        "sv": "Det totala antalet personer som kan delta i ett evenemang eller vara i en lokal."
      },
      "purpose": {
        "en": "schema:maximumAttendeeCapacity"
      },
      "property": "http://schema.org/maximumAttendeeCapacity",
      "nodetype": "DATATYPE_LITERAL",
      "type": "text",
      "cardinality": {
        "pref": 1
      },
      "datatype": "http://www.w3.org/2001/XMLSchema#integer"
    },
    {
      "id": "visitsweden-116",
      "label": {
        "sv": "Insläpp",
        "en": "Entrance"
      },
      "description": {
        "sv": "Anger start datum för det återkommande evenemanget. ",
        "en": "Indicates the start date of the recurring event."
      },
      "purpose": {
        "en": "schema:startDate for Event"
      },
      "property": "http://schema.org/startDate",
      "nodetype": "DATATYPE_LITERAL",
      "type": "text",
      "cardinality": {
        "pref": 1
      },
      "datatype": [
        "http://www.w3.org/2001/XMLSchema#date",
        "http://www.w3.org/2001/XMLSchema#dateTime"
      ]
    },
    {
      "id": "visitsweden-121",
      "label": {
        "en": "Duration",
        "sv": "Längd"
      },
      "purpose": {
        "en": "schema:duration for Events"
      },
      "property": "http://schema.org/duration",
      "nodetype": "DATATYPE_LITERAL",
      "type": "text",
      "cardinality": {
        "pref": 1
      },
      "datatype": "http://www.w3.org/2001/XMLSchema#duration"
    },
    {
      "id": "visitsweden-117",
      "label": {
        "en": "End date",
        "sv": "Slutdatum"
      },
      "description": {
        "sv": "Anger slutdatum för det återkommande evenemanget.",
        "en": "Indicates the end date of the recurring event."
      },
      "purpose": {
        "en": "schema:endDate for event"
      },
      "property": "http://schema.org/endDate",
      "nodetype": "DATATYPE_LITERAL",
      "type": "text",
      "cardinality": {
        "pref": 1,
        "max": 1
      },
      "datatype": "http://www.w3.org/2001/XMLSchema#date"
    },
    {
      "id": "visitsweden-115",
      "label": {
        "en": "Day of week",
        "sv": "Veckodag"
      },
      "description": {
        "sv": "Anger vilken eller vilka dagar upplevelsen inträffar återkommande.",
        "en": "Indicates on which day(s) the experience occurs recurrently."
      },
      "purpose": {
        "en": "schema:byDay for recurring Event. To specify which day the recurring event takes place"
      },
      "property": "http://schema.org/byDay",
      "nodetype": "URI",
      "type": "choice",
      "cardinality": {
        "pref": 1
      },
      "choices": [
        {
          "value": "http://schema.org/Monday",
          "label": {
            "sv": "Måndag",
            "en": "Monday"
          },
          "description": {
            "sv": "Motsvarar alla icke röda måndagar i kalendern.",
            "en": "Corresponds to all Mondays that are not holidays in the calendar."
          }
        },
        {
          "value": "http://schema.org/Tuesday",
          "label": {
            "sv": "Tisdag",
            "en": "Tuesday"
          },
          "description": {
            "sv": "Motsvarar alla icke röda tisdagar i kalendern.",
            "en": "Corresponds to all Tuesdays that are not holidays in the calendar."
          }
        },
        {
          "value": "http://schema.org/Wednesday",
          "label": {
            "sv": "Onsdag",
            "en": "Wednesday"
          },
          "description": {
            "sv": "Motsvarar alla icke röda onsdagar i kalendern.",
            "en": "Corresponds to all Wednesdays that are not holidays in the calendar."
          }
        },
        {
          "value": "http://schema.org/Thursday",
          "label": {
            "sv": "Torsdag",
            "en": "Thursday"
          },
          "description": {
            "sv": "Motsvarar alla icke röda torsdagar i kalendern.",
            "en": "Corresponds to all Thursdays that are not holidays in the calendar."
          }
        },
        {
          "value": "http://schema.org/Friday",
          "label": {
            "sv": "Fredag",
            "en": "Friday"
          },
          "description": {
            "sv": "Motsvarar alla icke röda fredagar i kalendern.",
            "en": "Corresponds to all Fridays that are not holidays in the calendar."
          }
        },
        {
          "value": "http://schema.org/Saturday",
          "label": {
            "sv": "Lördag",
            "en": "Saturday"
          },
          "description": {
            "sv": "Motsvarar alla icke röda lördagar i kalendern.",
            "en": "Corresponds to all Saturdays that are not holidays in the calendar."
          }
        },
        {
          "value": "http://schema.org/Sunday",
          "label": {
            "sv": "Söndag",
            "en": "Sunday"
          },
          "description": {
            "sv": "Motsvarar alla söndagar i kalendern.",
            "en": "Corresponds to all Sundays in the calendar."
          }
        },
        {
          "value": "http://schema.org/PublicHolidays",
          "label": {
            "sv": "Övrig helgdag",
            "en": "Public holiday"
          },
          "description": {
            "sv": "Allmänna helgdagar är de dagar som är markerade som röda i kalendern utom söndagar (som har en egen markering).",
            "en": "Public holidays are the days marked in red in the calendar except for Sundays (which have their own marking)."
          }
        }
      ],
      "styles": [
        "horizontalCheckBoxes"
      ]
    },
    {
      "id": "visitsweden-120",
      "label": {
        "sv": "Vecka",
        "en": "Week"
      },
      "description": {
        "sv": "Anger den eller de veckor i månaden då en återkommande händelse inträffar. Anges som ett heltal mellan 1-5.",
        "en": "Indicates the week(s) of the month when a recurrent event occurs. Specified as an integer between 1-5."
      },
      "purpose": {
        "sv": "schema:byMonthWeek for recurring events"
      },
      "property": "http://schema.org/byMonthWeek",
      "nodetype": "URI",
      "type": "choice",
      "cardinality": {
        "pref": 1,
        "max": 1
      },
      "choices": [
        {
          "value": "1",
          "label": {
            "sv": "1"
          },
          "description": {
            "sv": "Vecka 1 ",
            "en": "Week 1 "
          }
        },
        {
          "value": "2",
          "label": {
            "sv": "2"
          },
          "description": {
            "sv": "Vecka 2 ",
            "en": "Week 2"
          }
        },
        {
          "value": "3",
          "label": {
            "sv": "3",
            "en": "3"
          },
          "description": {
            "sv": "Vecka 3",
            "en": "Week 3"
          }
        },
        {
          "value": "4",
          "label": {
            "sv": "4"
          },
          "description": {
            "sv": "Vecka 4",
            "en": "Week 4"
          }
        },
        {
          "value": "5",
          "label": {
            "sv": "5",
            "en": "5"
          },
          "description": {
            "sv": "Vecka 5",
            "en": "Week 5"
          }
        }
      ],
      "styles": [
        "preserveOrderOfChoices",
        "strictmatch",
        "horizontalRadioButtons"
      ]
    },
    {
      "id": "visitsweden-118",
      "label": {
        "sv": "Tid",
        "en": "Time"
      },
      "description": {
        "sv": "Anger starttiden för evenemanget. ",
        "en": "Indicates the start time of the event."
      },
      "purpose": {
        "en": "schema:startTime for recurring events "
      },
      "property": "http://schema.org/startTime",
      "nodetype": "DATATYPE_LITERAL",
      "type": "text",
      "cardinality": {
        "pref": 1
      },
      "datatype": "http://www.w3.org/2001/XMLSchema#time"
    },
    {
      "id": "visitsweden-113",
      "label": {
        "sv": "Evenemangsschema",
        "en": "Event schedule"
      },
      "items": [
        "visitsweden-115",
        "visitsweden-120",
        "visitsweden-118",
        "visitsweden-116",
        "visitsweden-117",
        "visitsweden-23"
      ],
      "property": "http://schema.org/eventSchedule",
      "nodetype": "BLANK",
      "type": "group",
      "constraints": {
        "http://www.w3.org/1999/02/22-rdf-syntax-ns#type": "http://schema.org/Schedule"
      },
      "cls": [
        "cardgroup"
      ]
    },
    {
      "id": "visitsweden-94",
      "label": {
        "sv": "Pris",
        "en": "Price"
      },
      "description": {
        "sv": "Priset för upplevelsen i svenska kronor (SEK). ",
        "en": "The price of the experience in swedish kronor (SEK)."
      },
      "purpose": {
        "en": "schema:price"
      },
      "property": "http://schema.org/price",
      "nodetype": "DATATYPE_LITERAL",
      "type": "text",
      "cardinality": {
        "pref": 1,
        "max": 1
      },
      "datatype": "http://www.w3.org/2001/XMLSchema#decimal",
      "pattern": "^\\d+$"
    },
    {
      "id": "visitsweden-104",
      "label": {
        "sv": "Plats",
        "en": "Location"
      },
      "description": {
        "sv": "Om evenemanget hålls på en eller flera redan beskrivna platser kan ni med detta fält skapa en relation till den platsen. ",
        "en": "If the event is held in one or more locations already described, this field allows you to define a relation to that location."
      },
      "purpose": {
        "en": "schema:location for event"
      },
      "property": "http://schema.org/location",
      "nodetype": "URI",
      "type": "choice",
      "cardinality": {
        "pref": 1
      },
      "constraints": {
        "http://www.w3.org/1999/02/22-rdf-syntax-ns#type": "http://schema.org/Place"
      }
    },
    {
      "id": "visitsweden-86",
      "label": {
        "en": "Telephone",
        "sv": "Telefon"
      },
      "purpose": {
        "en": "schema:telephone "
      },
      "placeholder": {
        "sv": "Ange landskod först +46",
        "en": "Enter country code first +46"
      },
      "property": "http://schema.org/telephone",
      "nodetype": "LITERAL",
      "type": "text",
      "cardinality": {
        "pref": 1
      },
      "pattern": "^\\+(?:[0-9]●?){6,14}[0-9]$"
    },
    {
      "id": "visitsweden-125",
      "label": {
        "en": "Organizer",
        "sv": "Arrangör"
      },
      "purpose": {
        "en": "schema:organizer"
      },
      "property": "http://schema.org/organizer",
      "nodetype": "URI",
      "type": "choice",
      "cardinality": {
        "pref": 1
      },
      "constraints": {
        "http://www.w3.org/1999/02/22-rdf-syntax-ns#type": "http://schema.org/Organization"
      }
    },
    {
      "id": "visitsweden-83",
      "label": {
        "en": "Event",
        "sv": "Evenemang"
      },
      "items": [
        "visitsweden-56",
        "visitsweden-17",
        "visitsweden-22",
        "visitsweden-124",
        "visitsweden-25",
        "visitsweden-65",
        "visitsweden-24",
        "visitsweden-116",
        "visitsweden-121",
        "visitsweden-117",
        "visitsweden-113",
        "visitsweden-27",
        "visitsweden-72",
        "visitsweden-94",
        "visitsweden-14",
        "visitsweden-16",
        "visitsweden-104",
        "visitsweden-86",
        "visitsweden-125"
      ],
      "nodetype": "URI",
      "type": "group",
      "constraints": {
        "http://www.w3.org/1999/02/22-rdf-syntax-ns#type": "http://schema.org/Event"
      }
    },
    {
      "id": "visitsweden-158",
      "label": {
        "en": "Amount of places ",
        "sv": "Antal platser"
      },
      "nodetype": "DATATYPE_LITERAL",
      "type": "text",
      "cardinality": {
        "pref": 1,
        "max": 1
      },
      "datatype": "http://www.w3.org/2001/XMLSchema#integer"
    },
    {
      "id": "visitsweden-157",
      "label": {
        "en": "Harbor - depth",
        "sv": "Hamndjup"
      },
      "description": {
        "en": "Depth",
        "sv": "Djup"
      },
      "nodetype": "DATATYPE_LITERAL",
      "type": "text",
      "cardinality": {
        "pref": 1,
        "max": 1
      },
      "datatype": "http://www.w3.org/2001/XMLSchema#decimal"
    },
    {
      "id": "visitsweden-154",
      "label": {
        "sv": "Gästhamn",
        "en": "Guest Harbour"
      },
      "items": [
        "visitsweden-17",
        "visitsweden-25",
        "visitsweden-94",
        "visitsweden-147",
        "visitsweden-22",
        "visitsweden-24",
        "visitsweden-158",
        "visitsweden-157",
        "visitsweden-52",
        "visitsweden-66",
        "visitsweden-31",
        "visitsweden-58",
        "visitsweden-86",
        "visitsweden-89",
        "visitsweden-88"
      ],
      "nodetype": "URI",
      "type": "group",
      "constraints": {
        "http://www.w3.org/1999/02/22-rdf-syntax-ns#type": "http://www.wikidata.org/entity/Q283202"
      }
    },
    {
      "id": "visitsweden-8",
      "label": {
        "sv": "Typ av aktivitet",
        "en": "Type of activity"
      },
      "purpose": {
        "en": "activityCategory using schema:additionalType"
      },
      "property": "http://schema.org/additionalType",
      "nodetype": "URI",
      "type": "choice",
      "cardinality": {
        "min": 1
      },
      "choices": [
        {
          "value": "http://data.visitsweden.com/terms/NatureExperience",
          "label": {
            "sv": "Naturupplevelse",
            "en": "Nature experience"
          }
        },
        {
          "value": "http://schema.org/HealthAndBeautyBusiness",
          "label": {
            "sv": "Spa & wellness",
            "en": "Spa & wellness"
          }
        },
        {
          "value": "http://schema.org/ShoppingCenter",
          "label": {
            "sv": "Design & shopping",
            "en": "Design & shopping"
          }
        },
        {
          "value": "http://schema.org/Library",
          "label": {
            "sv": "Bibliotek",
            "en": "Library"
          }
        },
        {
          "value": "http://schema.org/LandmarksOrHistoricalBuildings",
          "label": {
            "sv": "Historisk byggnad",
            "en": "Historical building"
          },
          "description": {
            "sv": "Både landmärken och historiska byggnader kan anges med denna kategori. ",
            "en": "Both landmarks and historical buildings can be defined with this category."
          }
        },
        {
          "value": "http://schema.org/Zoo",
          "label": {
            "sv": "Zoo",
            "en": "Zoo"
          },
          "description": {
            "sv": "Ett zoo."
          }
        },
        {
          "value": "http://schema.org/Aquarium",
          "label": {
            "sv": "Akvarium",
            "en": "Aquarium"
          }
        },
        {
          "value": "http://schema.org/Park",
          "label": {
            "sv": "Park",
            "en": "Park"
          },
          "description": {
            "sv": "Exempelvis en botanisk trädgård eller en publik park. ",
            "en": "For example, a botanical garden or a public park."
          }
        },
        {
          "value": "http://schema.org/Museum",
          "label": {
            "sv": "Museum",
            "en": "Museum"
          }
        },
        {
          "value": "http://schema.org/BowlingAlley",
          "label": {
            "sv": "Bowling",
            "en": "Bowling"
          }
        },
        {
          "value": "http://schema.org/SkiResort",
          "label": {
            "sv": "Skidort",
            "en": "Ski resort"
          }
        },
        {
          "value": "http://data.visitsweden.com/terms/Cycling",
          "label": {
            "sv": "Cykling",
            "en": "Cycling"
          }
        },
        {
          "value": "http://schema.org/TennisComplex",
          "label": {
            "sv": "Tennis",
            "en": "Tennis"
          }
        },
        {
          "value": "http://data.visitsweden.com/terms/Snowmobile",
          "label": {
            "sv": "Snöskoter",
            "en": "Snowmobile"
          }
        },
        {
          "value": "http://schema.org/EventVenue",
          "label": {
            "en": "Event venue",
            "sv": "Eventlokal"
          }
        },
        {
          "value": "http://schema.org/MusicVenue",
          "label": {
            "en": "Music venue",
            "sv": "Musiklokal"
          }
        },
        {
          "value": "http://schema.org/MovieTheater",
          "label": {
            "en": "Movie theater",
            "sv": "Biograf"
          }
        },
        {
          "value": "http://schema.org/AmusementPark",
          "label": {
            "sv": "Nöjespark",
            "en": "Amusement park"
          },
          "description": {
            "sv": "En nöjespark.",
            "en": "An amusement park."
          }
        },
        {
          "value": "http://data.visitsweden.com/terms/Kayaking",
          "label": {
            "sv": "Paddling",
            "en": "Kayaking"
          }
        },
        {
          "value": "http://data.visitsweden.com/terms/Hiking",
          "label": {
            "sv": "Vandring",
            "en": "Hiking"
          }
        },
        {
          "value": "http://data.visitsweden.com/terms/Adventure",
          "label": {
            "sv": "Äventyr",
            "en": "Adventure"
          }
        },
        {
          "value": "http://data.visitsweden.com/terms/WinterActivity",
          "label": {
            "sv": "Vinteraktivitet",
            "en": "Winter activity"
          }
        },
        {
          "value": "http://data.visitsweden.com/terms/CulturalExperience",
          "label": {
            "sv": "Kulturupplevelse",
            "en": "Cultural experience"
          }
        },
        {
          "value": "http://schema.org/TouristAttraction",
          "label": {
            "sv": "Sevärdhet",
            "en": "Tourist attraction"
          }
        }
      ],
      "styles": [
        "HorizontalRadioButtons",
        "preserveOrderOfChoices",
        "strictmatch"
      ]
    },
    {
      "id": "visitsweden-128",
      "label": {
        "sv": "Led",
        "en": "Trail"
      },
      "description": {
        "sv": "Länk till en resurs (GPX, GML) för information om ledens sträckning, använd endast på lämplig aktiviteter som exempelvis vandring, cykling eller annat. ",
        "en": "Link to a resource (GPX, GML) for information on the route of the trail, use only on appropriate activities such as hiking, cycling or other."
      },
      "purpose": {
        "en": "lookup for trails "
      },
      "property": "http://schema.org/geoContains",
      "nodetype": "URI",
      "type": "choice",
      "cardinality": {
        "pref": 1
      },
      "constraints": {
        "http://www.w3.org/1999/02/22-rdf-syntax-ns#type": "https://odta.io/voc/Trail"
      }
    },
    {
      "id": "visitsweden-145",
      "label": {
        "en": "Event",
        "sv": "Evenemang"
      },
      "description": {
        "en": "Upcoming events associated with this place.",
        "sv": "Kommande evenemang som genomförs på denna plats."
      },
      "property": "http://schema.org/event",
      "nodetype": "URI",
      "type": "choice",
      "cardinality": {
        "pref": 1
      },
      "constraints": {
        "http://schema.org/event": "http://schema.org/Event"
      }
    },
    {
      "id": "visitsweden-3",
      "label": {
        "sv": "Aktiviteter",
        "en": "Activities"
      },
      "items": [
        "visitsweden-8",
        "visitsweden-17",
        "visitsweden-18",
        "visitsweden-25",
        "visitsweden-65",
        "visitsweden-22",
        "visitsweden-24",
        "visitsweden-52",
        "visitsweden-27",
        "visitsweden-72",
        "visitsweden-14",
        "visitsweden-16",
        "visitsweden-94",
        "visitsweden-106",
        "visitsweden-74",
        "visitsweden-128",
        "visitsweden-145",
        "visitsweden-89",
        "visitsweden-88",
        "visitsweden-147"
      ],
      "nodetype": "URI",
      "type": "group",
      "constraints": {
        "http://www.w3.org/1999/02/22-rdf-syntax-ns#type": "http://schema.org/Place"
      }
    },
    {
      "id": "visitsweden-7",
      "label": {
        "sv": "Typ av mat och dryck",
        "en": "Type of food and drink"
      },
      "editlabel": {
        "sv": "Kategori",
        "en": "Category"
      },
      "property": "http://schema.org/additionalType",
      "nodetype": "URI",
      "type": "choice",
      "cardinality": {
        "min": 1,
        "max": 1
      },
      "choices": [
        {
          "value": "http://schema.org/Restaurant",
          "label": {
            "sv": "Restaurang",
            "en": "Restaurant"
          }
        },
        {
          "value": "http://schema.org/IceCreamShop",
          "label": {
            "sv": "Glassbar",
            "en": "Ice cream shop "
          }
        },
        {
          "value": "http://schema.org/Bakery",
          "label": {
            "en": "Bakery",
            "sv": "Bageri"
          }
        },
        {
          "value": "http://schema.org/CafeOrCoffeeShop",
          "label": {
            "en": "Cafe",
            "sv": "Café"
          }
        },
        {
          "value": "http://schema.org/BarOrPub",
          "label": {
            "en": "Bar",
            "sv": "Bar"
          }
        },
        {
          "value": "http://schema.org/Brewery",
          "label": {
            "en": "Brewery",
            "sv": "Bryggeri"
          }
        }
      ],
      "styles": [
        "HorizontalRadioButtons",
        "preserveOrderOfChoices",
        "strictmatch"
      ]
    },
    {
      "id": "visitsweden-57",
      "label": {
        "en": "Menu",
        "sv": "Meny"
      },
      "description": {
        "en": "Enter the menu as a structured representation as text.",
        "sv": "Ange den menyn som en strukturerad representation som text."
      },
      "purpose": {
        "en": "Either the actual menu as a structured representation, as text, or a URL of the menu."
      },
      "placeholder": {
        "en": "Menu as text",
        "sv": "Meny som text"
      },
      "property": "http://schema.org/hasMenu",
      "nodetype": "LANGUAGE_LITERAL",
      "type": "text",
      "cardinality": {
        "pref": 1,
        "max": 1
      },
      "styles": [
        "multiline"
      ]
    },
    {
      "id": "visitsweden-68",
      "label": {
        "sv": "Adress",
        "en": "Address"
      },
      "description": {
        "en": "Provide a link to a webbpage where the menu is described in more detail.",
        "sv": "Tillhandhandahåll en länk till en webbsida där menyn beskrivs i detalj."
      },
      "purpose": {
        "en": "schema:hasMenu as URL"
      },
      "placeholder": {
        "en": "Meny som URL"
      },
      "property": "http://schema.org/hasMenu",
      "nodetype": "LITERAL",
      "type": "text",
      "cardinality": {
        "pref": 1,
        "max": 1
      },
      "pattern": "^https?://.*$"
    },
    {
      "id": "visitsweden-69",
      "label": {
        "en": "Menu",
        "sv": "Meny"
      },
      "description": {
        "en": "Provide a menu in structured text or as a link to an updated webpage.",
        "sv": "Tillhandahåll en meny i strukturerad text eller via en länk till en uppdaterad hemsida. "
      },
      "items": [
        "visitsweden-57",
        "visitsweden-68"
      ],
      "type": "group",
      "styles": [
        "showDescriptionInEdit"
      ],
      "cls": [
        "cardgroup"
      ]
    },
    {
      "id": "visitsweden-2",
      "label": {
        "sv": "Mat och dryck",
        "en": "Food and drinks"
      },
      "items": [
        "visitsweden-7",
        "visitsweden-92",
        {
          "extends": "visitsweden-17",
          "description": {
            "en": "Enter the name of what you are describing.",
            "sv": "Ange namnet på det du beskriver."
          }
        },
        {
          "extends": "visitsweden-18",
          "label": {
            "en": "Subheadline",
            "sv": "Rubrik"
          }
        },
        "visitsweden-25",
        "visitsweden-65",
        "visitsweden-52",
        "visitsweden-86",
        "visitsweden-27",
        "visitsweden-72",
        "visitsweden-22",
        "visitsweden-24",
        "visitsweden-14",
        "visitsweden-16",
        "visitsweden-20",
        "visitsweden-69",
        "visitsweden-106",
        "visitsweden-74",
        {
          "extends": "visitsweden-89",
          "label": {
            "en": "Contained in place",
            "sv": "Tillhör plats"
          }
        },
        "visitsweden-145",
        "visitsweden-147"
      ],
      "nodetype": "URI",
      "type": "group",
      "constraints": {
        "http://www.w3.org/1999/02/22-rdf-syntax-ns#type": "http://schema.org/FoodEstablishment"
      }
    },
    {
      "id": "visitsweden-6",
      "label": {
        "sv": "Typ av boende",
        "en": "Type of accommodation"
      },
      "property": "http://schema.org/additionalType",
      "nodetype": "URI",
      "type": "choice",
      "cardinality": {
        "min": 1,
        "max": 1
      },
      "choices": [
        {
          "value": "http://schema.org/Hotel",
          "label": {
            "sv": "Hotell",
            "en": "Hotel"
          }
        },
        {
          "value": "http://schema.org/BedAndBreakfast",
          "label": {
            "en": "Bed and Breakfast",
            "sv": "Bed and Breakfast"
          }
        },
        {
          "value": "http://data.visitsweden.com/terms/CastleAndMansion",
          "label": {
            "en": "Castle and Manors",
            "sv": "Slott och herrgårdar"
          }
        },
        {
          "value": "http://schema.org/Campground",
          "label": {
            "sv": "Camping",
            "en": "Camping"
          }
        },
        {
          "value": "http://schema.org/Hostel",
          "label": {
            "sv": "Vandrarhem",
            "en": "Hostel"
          }
        },
        {
          "value": "http://data.visitsweden.com/terms/Cabin",
          "label": {
            "en": "Cottages and Cabins",
            "sv": "Stugor"
          }
        }
      ],
      "styles": [
        "preserveOrderOfChoices",
        "strictmatch",
        "horizontalRadioButtons"
      ]
    },
    {
      "id": "visitsweden-102",
      "label": {
        "sv": "Betygsvärde",
        "en": "Rating value"
      },
      "description": {
        "sv": "Ange betygsvärdet för upplevelsen i intervallet 1-5.",
        "en": "Indicate the rating of the experience on a scale of 1-5."
      },
      "purpose": {
        "en": "schema:ratingValue integer for Rating"
      },
      "property": "http://schema.org/ratingValue",
      "nodetype": "LITERAL",
      "type": "choice",
      "cardinality": {
        "pref": 1,
        "max": 1
      },
      "choices": [
        {
          "value": "1",
          "label": {
            "sv": "1",
            "en": "1"
          }
        },
        {
          "value": "2",
          "label": {
            "sv": "2",
            "en": "2"
          }
        },
        {
          "value": "3",
          "label": {
            "sv": "3"
          }
        },
        {
          "value": "4",
          "label": {
            "sv": "4"
          }
        },
        {
          "value": "5",
          "label": {
            "sv": "5",
            "en": "5"
          }
        }
      ],
      "styles": [
        "strictmatch",
        "horizontalRadioButtons",
        "atMostOneChild"
      ]
    },
    {
      "id": "visitsweden-85",
      "label": {
        "sv": "Certifierat av ",
        "en": "Certified by"
      },
      "description": {
        "sv": "Organisationen som står bakom certifieringen",
        "en": "The organization behind the certification"
      },
      "purpose": {
        "en": "schema:author for starRating hotels"
      },
      "property": "http://schema.org/author",
      "nodetype": "URI",
      "type": "choice",
      "cardinality": {
        "pref": 1
      },
      "constraints": {
        "http://www.w3.org/1999/02/22-rdf-syntax-ns#type": "http://schema.org/Organization"
      }
    },
    {
      "id": "visitsweden-91",
      "label": {
        "en": "Star rating",
        "sv": "Antal stjärnor"
      },
      "description": {
        "en": "Enter the number of stars for the accomodation.",
        "sv": "Ange antal stjärnor för boendet."
      },
      "items": [
        "visitsweden-102",
        "visitsweden-85"
      ],
      "property": "http://schema.org/starRating",
      "nodetype": "BLANK",
      "type": "group",
      "cardinality": {
        "pref": 1,
        "max": 1
      },
      "constraints": {
        "http://www.w3.org/1999/02/22-rdf-syntax-ns#type": "http://schema.org/Rating"
      },
      "cls": [
        "cardgroup"
      ]
    },
    {
      "id": "visitsweden-122",
      "label": {
        "sv": "Incheckning",
        "en": "Check-in"
      },
      "purpose": {
        "en": "schema:checkInTime"
      },
      "property": "http://schema.org/checkInTime",
      "nodetype": "DATATYPE_LITERAL",
      "type": "text",
      "cardinality": {
        "pref": 1
      },
      "datatype": "http://www.w3.org/2001/XMLSchema#time"
    },
    {
      "id": "visitsweden-123",
      "label": {
        "sv": "Utcheckning",
        "en": "Check out"
      },
      "purpose": {
        "en": "schema:checkOutTime"
      },
      "property": "http://schema.org/checkOutTime",
      "nodetype": "DATATYPE_LITERAL",
      "type": "text",
      "cardinality": {
        "pref": 1
      },
      "datatype": "http://www.w3.org/2001/XMLSchema#time"
    },
    {
      "id": "visitsweden-96",
      "label": {
        "sv": "Plats relation",
        "en": "Place relation"
      },
      "items": [
        "visitsweden-88",
        "visitsweden-89"
      ],
      "type": "group",
      "cls": [
        "cardgroup"
      ]
    },
    {
      "id": "visitsweden-1",
      "label": {
        "en": "Lodging",
        "sv": "Boende"
      },
      "items": [
        "visitsweden-6",
        "visitsweden-17",
        "visitsweden-91",
        "visitsweden-18",
        "visitsweden-25",
        "visitsweden-65",
        "visitsweden-22",
        "visitsweden-24",
        "visitsweden-52",
        "visitsweden-122",
        "visitsweden-123",
        "visitsweden-86",
        "visitsweden-27",
        "visitsweden-72",
        "visitsweden-14",
        "visitsweden-16",
        "visitsweden-20",
        "visitsweden-92",
        "visitsweden-106",
        "visitsweden-74",
        "visitsweden-96",
        "visitsweden-145",
        "visitsweden-147",
        "visitsweden-88",
        "visitsweden-89"
      ],
      "nodetype": "URI",
      "type": "group",
      "constraints": {
        "http://www.w3.org/1999/02/22-rdf-syntax-ns#type": "http://schema.org/LodgingBusiness"
      }
    },
    {
      "id": "visitsweden-144",
      "label": {
        "en": "Landform",
        "sv": "Landform"
      },
      "property": "http://schema.org/additionalType",
      "nodetype": "ONLY_LITERAL",
      "type": "choice",
      "cardinality": {
        "min": 1,
        "max": 1
      },
      "choices": [
        {
          "value": "http://schema.org/Canal",
          "label": {
            "en": "Canal",
            "sv": "Kanal"
          }
        },
        {
          "value": "http://schema.org/LakeBodyOfWater",
          "label": {
            "en": "Lake",
            "sv": "Sjö"
          }
        },
        {
          "value": "http://schema.org/RiverBodyOfWater",
          "label": {
            "en": "River",
            "sv": "Flod"
          }
        },
        {
          "value": "http://schema.org/Pond",
          "label": {
            "en": "Pond",
            "sv": "Damm"
          }
        },
        {
          "value": "http://schema.org/Waterfall",
          "label": {
            "en": "Waterfall",
            "sv": "Vattenfall"
          }
        },
        {
          "value": "http://schema.org/Mountain",
          "label": {
            "en": "Mountain",
            "sv": "Berg"
          }
        }
      ],
      "styles": [
        "horizontalRadioButtons"
      ]
    },
    {
      "id": "visitsweden-143",
      "label": {
        "en": "Landform",
        "sv": "Landform"
      },
      "items": [
        "visitsweden-17",
        "visitsweden-144",
        "visitsweden-72",
        "visitsweden-88",
        "visitsweden-16"
      ],
      "nodetype": "URI",
      "type": "group",
      "constraints": {
        "http://www.w3.org/1999/02/22-rdf-syntax-ns#type": "http://schema.org/Landform"
      }
    },
    {
      "id": "visitsweden-151",
      "label": {
        "sv": "Värde",
        "en": "Value"
      },
      "property": "http://schema.org/value",
      "nodetype": "DATATYPE_LITERAL",
      "type": "text",
      "cardinality": {
        "pref": 1,
        "max": 1
      },
      "datatype": "http://www.w3.org/2001/XMLSchema#boolean",
      "pattern": "^(?:true|false)$"
    },
    {
      "id": "visitsweden-149",
      "label": {
        "en": "Amenities",
        "sv": "Faciliteter"
      },
      "description": {
        "en": "Specifies a location feature by providing a structured value representing a feature of a place as a property-value pair of varying degrees of formality.",
        "sv": "Anger en platsegenskap genom att tillhandahålla ett strukturerat värde som representerar en egenskap hos en plats som ett par av egenskap och värde med varierande grad av formalitet."
      },
      "items": [
        "visitsweden-17",
        "visitsweden-151"
      ],
      "nodetype": "URI",
      "type": "group",
      "constraints": {
        "http://www.w3.org/1999/02/22-rdf-syntax-ns#type": "http://schema.org/LocationFeatureSpecification"
      }
    },
    {
      "id": "visitsweden-139",
      "label": {
        "en": "Type of trip",
        "sv": "Typ av resa"
      },
      "property": "http://schema.org/additionalType",
      "nodetype": "URI",
      "type": "choice",
      "cardinality": {
        "pref": 1,
        "max": 0
      },
      "choices": [
        {
          "value": "http://schema.org/BoatTrip",
          "label": {
            "sv": "Båt",
            "en": "Boat"
          }
        },
        {
          "value": "http://schema.org/TrainTrip",
          "label": {
            "sv": "Tåg",
            "en": "Train"
          }
        },
        {
          "value": "http://schema.org/BusTrip",
          "label": {
            "sv": "Buss",
            "en": "Bus"
          }
        },
        {
          "value": "http://schema.org/TouristTrip",
          "label": {
            "sv": "Sevärdheter",
            "en": "Tourist attractions"
          }
        }
      ],
      "styles": [
        "horizontalCheckBoxes"
      ]
    },
    {
      "id": "visitsweden-109",
      "label": {
        "sv": "Resemål",
        "en": "Destinations"
      },
      "purpose": {
        "en": "schema:itinerary for Trip"
      },
      "property": "http://schema.org/itinerary",
      "nodetype": "URI",
      "type": "choice",
      "cardinality": {
        "pref": 1
      },
      "constraints": {
        "http://www.w3.org/1999/02/22-rdf-syntax-ns#type": "http://schema.org/Place, http://schema.org/LodgingBusiness, http://schema.org/FoodEstablishment, http://schema.org/Store, http://schema.org/Event"
      }
    },
    {
      "id": "visitsweden-110",
      "label": {
        "sv": "Researrangör",
        "en": "Tour operator"
      },
      "purpose": {
        "en": "schema:provider for Trip"
      },
      "property": "http://schema.org/provider",
      "nodetype": "URI",
      "type": "choice",
      "cardinality": {
        "pref": 1,
        "max": 1
      },
      "constraints": {
        "http://www.w3.org/1999/02/22-rdf-syntax-ns#type": "http://schema.org/Organization"
      }
    },
    {
      "id": "visitsweden-111",
      "label": {
        "sv": "Upplevelsepaket",
        "en": "Experience "
      },
      "description": {
        "sv": "Definierar en resa eller ett paket som består av flera olika upplevelser.",
        "en": "Defines a trip or package consisting of several different experiences."
      },
      "purpose": {
        "en": "To define a trip or package consisting of several different experiences "
      },
      "items": [
        "visitsweden-139",
        "visitsweden-109",
        "visitsweden-17",
        "visitsweden-22",
        "visitsweden-110",
        "visitsweden-25"
      ],
      "nodetype": "URI",
      "type": "group",
      "constraints": {
        "http://www.w3.org/1999/02/22-rdf-syntax-ns#type": "http://schema.org/Trip"
      }
    },
    {
      "id": "visitsweden-129",
      "label": {
        "en": "Format",
        "sv": "Format"
      },
      "purpose": {
        "en": "format for trail resources"
      },
      "property": "http://purl.org/dc/terms/format",
      "nodetype": "URI",
      "type": "choice",
      "cardinality": {
        "pref": 1,
        "max": 1
      },
      "choices": [
        {
          "value": "https://www.topografix.com/gpx/1/1/gpx.xsd",
          "label": {
            "en": "GPX",
            "sv": "GPX"
          }
        },
        {
          "value": "https://www.iana.org/assignments/media-types/text/vnd.gml",
          "label": {
            "en": "GML",
            "sv": "GML"
          }
        },
        {
          "value": "https://www.iana.org/assignments/media-types/application/geo+json",
          "label": {
            "sv": "GEOJSON",
            "en": "GEOJSON"
          }
        }
      ],
      "styles": [
        "horizontalRadioButtons"
      ]
    },
    {
      "id": "visitsweden-127",
      "label": {
        "sv": "Led",
        "en": "Trail"
      },
      "items": [
        "visitsweden-17",
        "visitsweden-129"
      ],
      "nodetype": "URI",
      "type": "group",
      "constraints": {
        "http://www.w3.org/1999/02/22-rdf-syntax-ns#type": "https://odta.io/voc/Trail"
      }
    },
    {
      "id": "visitsweden-98",
      "label": {
        "sv": "Typ",
        "en": "Point of interest"
      },
      "property": "http://schema.org/additionalType",
      "nodetype": "URI",
      "type": "choice",
      "cardinality": {
        "pref": 1,
        "max": 1
      },
      "choices": [
        {
          "value": "http://schema.org/TouristInformationCenter",
          "label": {
            "sv": "Turistinformation",
            "en": "Tourist information center"
          }
        },
        {
          "value": "http://schema.org/EmergencyService",
          "label": {
            "en": "Emergency service",
            "sv": "Nödservice"
          }
        },
        {
          "value": "http://schema.org/TrainStation",
          "label": {
            "sv": "Tågstation",
            "en": "Train station"
          }
        },
        {
          "value": "http://schema.org/PublicToilet",
          "label": {
            "sv": "Toalett",
            "en": "Public toilet"
          }
        },
        {
          "value": "http://schema.org/RecyclingCenter",
          "label": {
            "sv": "Återvinning",
            "en": "Recycling center"
          }
        },
        {
          "value": "http://schema.org/AutomatedTeller",
          "label": {
            "sv": "Bankomat",
            "en": "ATM"
          }
        },
        {
          "value": "http://schema.org/Pharmacy",
          "label": {
            "sv": "Apotek",
            "en": "Pharmacy"
          }
        },
        {
          "value": "http://schema.org/Dentist",
          "label": {
            "sv": "Tandläkare",
            "en": "Dentist"
          }
        },
        {
          "value": "http://schema.org/Hospital",
          "label": {
            "sv": "Sjukhus",
            "en": "Hospital"
          }
        },
        {
          "value": "http://schema.org/PoliceStation",
          "label": {
            "sv": "Polisstation",
            "en": "Police station"
          }
        },
        {
          "value": "https://schema.org/TaxiStand",
          "label": {
            "en": "Taxi stand",
            "sv": "Taxi"
          }
        },
        {
          "value": "http://schema.org/ParkingFacility",
          "label": {
            "sv": "Parkering",
            "en": "Parking "
          }
        }
      ],
      "styles": [
        "strictmatch",
        "horizontalRadioButtons"
      ]
    },
    {
      "id": "visitsweden-100",
      "label": {
        "en": "Name",
        "sv": "Name"
      },
      "purpose": {
        "en": "schema:name for POI "
      },
      "property": "http://schema.org/name",
      "nodetype": "LANGUAGE_LITERAL",
      "type": "text",
      "cardinality": {
        "pref": 1
      }
    },
    {
      "id": "visitsweden-99",
      "label": {
        "en": "Point of interest",
        "sv": "Point of interest"
      },
      "items": [
        "visitsweden-98",
        "visitsweden-100",
        "visitsweden-22",
        "visitsweden-72",
        "visitsweden-27",
        "visitsweden-16",
        "visitsweden-89"
      ],
      "nodetype": "URI",
      "type": "group",
      "constraints": {
        "http://www.w3.org/1999/02/22-rdf-syntax-ns#type": "http://schema.org/Place"
      }
    },
    {
      "id": "visitsweden-63",
      "label": {
        "en": "Name",
        "sv": "Namn"
      },
      "purpose": {
        "en": "schema:name for administrative area"
      },
      "property": "http://schema.org/name",
      "nodetype": "LANGUAGE_LITERAL",
      "type": "text",
      "cardinality": {
        "min": 1
      }
    },
    {
      "id": "visitsweden-64",
      "label": {
        "en": "Homepage",
        "sv": "Hemsida"
      },
      "purpose": {
        "en": "schema:url for administrative area"
      },
      "property": "http://schema.org/url",
      "nodetype": "URI",
      "type": "text",
      "cardinality": {
        "min": 1
      },
      "pattern": "^https?://.*$"
    },
    {
      "id": "visitsweden-62",
      "label": {
        "sv": "Region",
        "en": "Administrative area"
      },
      "items": [
        "visitsweden-63",
        "visitsweden-64"
      ],
      "nodetype": "URI",
      "type": "group",
      "constraints": {
        "http://www.w3.org/1999/02/22-rdf-syntax-ns#type": "http://schema.org/AdministrativeArea"
      }
    },
    {
      "id": "visitsweden-76",
      "label": {
        "sv": "Logga",
        "en": "Logo"
      },
      "purpose": {
        "en": "schema:logo"
      },
      "property": "http://schema.org/logo",
      "nodetype": "URI",
      "type": "choice",
      "cardinality": {
        "pref": 1
      },
      "constraints": {
        "http://www.w3.org/1999/02/22-rdf-syntax-ns#type": "http://schema.org/ImageObject"
      }
    },
    {
      "id": "visitsweden-107",
      "label": {
        "sv": "Märkning",
        "en": "Label"
      },
      "description": {
        "sv": "En certifiering, kvalifikation, märkning etc. som kan tilldelas en person eller annan enhet som uppfyller de krav som fastställts av utfärdaren av referenser.",
        "en": "A certification, qualification, badge, etc., that may be awarded to a person or other entity that meets the requirements defined by the credentialer."
      },
      "items": [
        "visitsweden-17",
        "visitsweden-22",
        "visitsweden-25",
        "visitsweden-76"
      ],
      "nodetype": "URI",
      "type": "group",
      "constraints": {
        "http://www.w3.org/1999/02/22-rdf-syntax-ns#type": "http://schema.org/EducationalOccupationalCredential"
      }
    },
    {
      "id": "visitsweden-73",
      "label": {
        "sv": "Organisationsnamn",
        "en": "Organization name"
      },
      "purpose": {
        "en": "schema:legalName"
      },
      "property": "http://schema.org/legalName",
      "nodetype": "LANGUAGE_LITERAL",
      "type": "text",
      "cardinality": {
        "pref": 1
      }
    },
    {
      "id": "visitsweden-75",
      "label": {
        "en": "Organization",
        "sv": "Organisation"
      },
      "items": [
        "visitsweden-73",
        "visitsweden-22",
        "visitsweden-25",
        "visitsweden-76",
        "visitsweden-74"
      ],
      "nodetype": "URI",
      "type": "group",
      "constraints": {
        "http://www.w3.org/1999/02/22-rdf-syntax-ns#type": "http://schema.org/Organization"
      }
    },
    {
      "id": "visitsweden-19",
      "label": {
        "en": "Credits",
        "sv": "Upphovsperson"
      },
      "description": {
        "en": "The name of the photo agency / photographer if it is required.",
        "sv": "Bildbyråns/fotografens namn om det behöver stå med."
      },
      "purpose": {
        "en": "schema:creditText"
      },
      "property": "http://schema.org/creditText",
      "nodetype": "LANGUAGE_LITERAL",
      "type": "text",
      "cardinality": {
        "pref": 1
      }
    },
    {
      "id": "visitsweden-4",
      "label": {
        "en": "Image",
        "sv": "Bild"
      },
      "items": [
        "visitsweden-17",
        "visitsweden-19"
      ],
      "nodetype": "URI",
      "type": "group",
      "cardinality": {
        "min": 1,
        "max": 1
      },
      "constraints": {
        "http://www.w3.org/1999/02/22-rdf-syntax-ns#type": "http://schema.org/ImageObject"
      }
    }
  ],
  "namespaces": {
    "schema": "http://schema.org/",
    "rdf": "http://www.w3.org/1999/02/22-rdf-syntax-ns#",
    "wd": "http://www.wikidata.org/entity/"
  }
}