{
  "@context": [
    "http://www.w3.org/ns/csvw",
    {
      "@language": "sv",
      "dc:title": "CSV schema för XX",
      "dcat:keyword": ["xx"],
      "schema": "http://schema.org/",
      "dct": "http://purl.org/dc/terms/",
      "rdf": "http://www.w3.org/1999/02/22-rdf-syntax-ns#"  
    }
  ],
  "dc:license": {"@id": "http://opendefinition.org/licenses/cc-by/"},
  "dc:modified": {"@value": "2023-MM-DD", "@type": "xsd:date"},
  "tableSchema": {
    "columns": [
{
        "name": "id",
        "titles": ["Objektidentitet"],
        "dc:description": "Identifier",
        "datatype": "string",
        "required": true, 
        "propertyUrl" : "dct:identifier"
      },
      {
        "name": "source",
        "titles": "Källa",
        "dc:description": "Organisationsnummer för organisationen",
        "datatype": "integer",
        "required": true
      },
      {
        "name": "type",
        "titles": "Typ av ",
        "dc:description": "Entitetens typ.",
        "datatype": {
          "base": "string", 
          "format": "Type A|Type B|"
        },
        "required": true
      }, 
      {
        "name": "latitude",
        "titles": "Latitud",
        "dc:description": "Latitud enligt WGS84.",
        "datatype": "decimal",
        "required": true,
        "propertyUrl": "schema:latitude"
      },
      {
        "name": "longitude",
        "titles": "Longitude",
        "dc:description": "Longitud enligt WGS84.",
        "datatype": "decimal",
        "required": true, 
        "propertyUrl": "schema:longitude"
      },
      {
        "name": "description",
        "titles": "Beskrivning",
        "dc:description": "Beskrivning av entiteten.",
        "datatype": "string",
        "propertyUrl" : "dct:description"
      },
      {
        "name": "street",
        "titles": "Gatuadress",
        "datatype": "string",
        "propertyUrl": "schema:streetAddress"
      },
      {
        "name": "postalcode",
        "titles": "Postnummer",
        "dc:description": "Postnummer för entiteten.",
        "datatype": {
          "base": "integer",
          "minimum": 10000,
          "maximum": 99999
          },
        "propertyUrl": "schema:postalCode"  
      },
      {
        "name": "city",
        "titles": "Postort",
        "dc:description": "Postort för entiteten.",
        "datatype": "string", 
        "propertyUrl": "schema:addressLocality"
      },
      {
        "name": "email",
        "titles": "Email",
        "dc:description": "Mejladress för vidare kontakt.",
        "datatype": "string",
        "propertyUrl": "schema:email"
      },
      {
        "name": "URL",
        "titles": "Ingångssida",
        "dc:description": "Ingångssida för entiteten.",
        "datatype": "url",
        "propertyUrl":"schema:url"
      },
      {
        "name": "resource",
        "titles": "Resurs",
        "dc:description": "Länk till resurser för entiteten.",
        "datatype": "url",
        "propertyUrl":""
      }
    ],
    "primaryKey": "id",
    "aboutUrl": "#gid-{id}"
  }
}
