{
  "id": "LT2567026",
  "guid": "4f697f05-a479-4926-91e8-04c82d53e5a7",
  "balance": 2713,
  "numberOfFriends": 3,
  "registered": "2021-02-27T04:32:59",
  "lastActive": "2022-02-11T16:06:15"
}






