Division,WeightClassKg,Place,Name,Team,BodyweightKg,Best3SquatKg,Best3BenchKg,Best3DeadliftKg,TotalKg,Equipment,Event,Sex,BirthDate
Boys,51.71,1,Sam O'Brien,Clyde,51.44,92.99,58.97,122.47,274.42,Single-ply,SBD,M,
Boys,51.71,2,Jake Stone,Clyde,39.19,79.38,56.7,54.43,190.51,Single-ply,SBD,M,
Boys,55.79,1,Wyatt Kofoed,Merkel,55.61,131.54,72.57,136.08,340.19,Single-ply,SBD,M,
Boys,55.79,2,Christian Rodriguez,Tuscola Jim Ned,55.38,127.01,68.04,131.54,326.59,Single-ply,SBD,M,
Boys,55.79,3,Ethan Stallings,Hawley,55.43,113.4,70.31,113.4,297.1,Single-ply,SBD,M,
Boys,59.87,1,Tristen Thompson,Merkel,59.78,185.97,113.4,188.24,487.61,Single-ply,SBD,M,
Boys,59.87,2,Cory Rodriguez,Tuscola Jim Ned,56.84,133.81,63.5,142.88,340.19,Single-ply,SBD,M,
Boys,67.13,1,Jim Fish,Clyde,67.13,161.03,115.67,172.37,449.06,Single-ply,SBD,M,
Boys,67.13,2,Kayden Garcia,Breckenridge,61.23,179.17,102.06,158.76,439.98,Single-ply,SBD,M,
Boys,67.13,3,Oscar Montoya,Merkel,67.09,158.76,90.72,163.29,412.77,Single-ply,SBD,M,
Boys,67.13,4,Fabian Gomez,Clyde,61.96,156.49,90.72,149.69,396.89,Single-ply,SBD,M,
Boys,67.13,5,Gareth Portillo,Tuscola Jim Ned,65.05,129.27,70.31,174.63,374.21,Single-ply,SBD,M,
Boys,67.13,6,Harry Cooper,Hawley,67.09,129.27,90.72,131.54,351.53,Single-ply,SBD,M,
Boys,67.13,7,Richard Mathieu,Anson,65.95,111.13,61.23,124.74,297.1,Single-ply,SBD,M,
Boys,74.84,1,Don Bridges,Tuscola Jim Ned,74.8,206.38,129.27,231.33,566.99,Single-ply,SBD,M,
Boys,74.84,2,Alex Carey,Hawley,73.62,188.24,102.06,183.7,474,Single-ply,SBD,M,
Boys,74.84,3,Garhett Bingham,Clyde,70.94,167.83,102.06,192.78,462.66,Single-ply,SBD,M,
Boys,74.84,4,Julian Eutimio,Breckenridge,72.12,149.69,106.59,158.76,415.04,Single-ply,SBD,M,
Boys,74.84,5,Ethan Estes,Tuscola Jim Ned,73.75,174.63,92.99,142.88,410.5,Single-ply,SBD,M,
Boys,74.84,6,Ronnie Kellam,Merkel,70.49,142.88,70.31,154.22,367.41,Single-ply,SBD,M,
Boys,74.84,7,Elijah Olivares,Merkel,69.9,138.35,68.04,154.22,360.61,Single-ply,SBD,M,
Boys,74.84,8,Evan Mier,Merkel,69.58,145.15,70.31,127.01,342.46,Single-ply,SBD,M,
Boys,82.1,1,Cj Stamper,Anson,76.11,165.56,106.59,174.63,446.79,Single-ply,SBD,M,
Boys,82.1,2,John Powell,Clyde,77.29,147.42,115.67,176.9,439.98,Single-ply,SBD,M,
Boys,82.1,3,Evan Bryan,Clyde,76.38,156.49,88.45,167.83,412.77,Single-ply,SBD,M,
Boys,82.1,4,Rylan Dabney,Breckenridge,80.2,147.42,104.33,133.81,385.55,Single-ply,SBD,M,
Boys,82.1,5,Gio Moranta,Tuscola Jim Ned,81.33,136.08,83.91,142.88,362.87,Single-ply,SBD,M,
Boys,89.81,1,Corley Williams,Hawley,89.81,204.12,142.88,204.12,551.11,Single-ply,SBD,M,
Boys,89.81,2,Morgan Bryan,Clyde,88.54,197.31,102.06,185.97,485.34,Single-ply,SBD,M,
Boys,89.81,3,Fabien Lopez,Breckenridge,87.82,156.49,117.93,183.7,458.13,Single-ply,SBD,M,
Boys,89.81,4,Caiden Marin,Breckenridge,86.27,165.56,108.86,170.1,444.52,Single-ply,SBD,M,
Boys,89.81,5,Alexander Silva,Breckenridge,88.27,167.83,106.59,170.1,444.52,Single-ply,SBD,M,
Boys,89.81,6,Lucas Moreno,Hawley,89.45,142.88,95.25,158.76,396.89,Single-ply,SBD,M,
Boys,89.81,7,Adam Carreon,Tuscola Jim Ned,83.32,136.08,81.65,165.56,383.29,Single-ply,SBD,M,
Boys,99.79,1,Elijah Dudley,Clyde,97.98,206.38,136.08,240.4,582.87,Single-ply,SBD,M,
Boys,99.79,2,Hez Parker,Hawley,90.36,204.12,142.88,185.97,532.97,Single-ply,SBD,M,
Boys,99.79,3,Trace Thompson,Breckenridge,99.25,183.7,117.93,174.63,476.27,Single-ply,SBD,M,
Boys,99.79,4,Adan Navarrette,Merkel,93.35,185.97,102.06,185.97,474,Single-ply,SBD,M,
Boys,99.79,5,Gustavo Velasquez,Clyde,98.79,181.44,106.59,179.17,467.2,Single-ply,SBD,M,
Boys,99.79,6,Eddie Poen,Clyde,91.9,151.95,120.2,172.37,444.52,Single-ply,SBD,M,
Boys,109.77,1,Jonathan Trejo,Breckenridge,109.32,231.33,136.08,249.48,616.89,Single-ply,SBD,M,
Boys,109.77,2,Noah Powell,Tuscola Jim Ned,105.41,215.46,108.86,213.19,537.51,Single-ply,SBD,M,
Boys,109.77,3,Ayden Reyes,Breckenridge,104.05,197.31,140.61,195.04,532.97,Single-ply,SBD,M,
Boys,109.77,4,Joe Galvan,Anson,100.33,192.78,115.67,201.85,510.29,Single-ply,SBD,M,
Boys,109.77,5,Elijah Flores,Merkel,104.42,183.7,131.54,190.51,505.76,Single-ply,SBD,M,
Boys,124.74,1,Bo Thompson,Hawley,112.67,272.16,204.12,249.48,725.75,Single-ply,SBD,M,
Boys,124.74,2,Isaak Eutimio,Breckenridge,111.36,206.38,167.83,206.38,580.6,Single-ply,SBD,M,
Boys,124.74,3,Connor Fitzgerald,Tuscola Jim Ned,114.85,204.12,111.13,206.38,521.63,Single-ply,SBD,M,
Boys,124.74,4,Jerry Rodriguez,Merkel,122.74,183.7,108.86,174.63,467.2,Single-ply,SBD,M,
Boys,124.74,5,Benny Escobedo,Breckenridge,122.11,136.08,90.72,124.74,351.53,Single-ply,SBD,M,
Boys,124.74,6,Gatlyn Cooper,Tuscola Jim Ned,110.27,213.19,,,213.19,Single-ply,S,M,
Boys,139.71,1,Camron Price,Clyde,128,231.33,136.08,215.46,582.87,Single-ply,SBD,M,
Boys,139.71,2,Kade Miller,Tuscola Jim Ned,125.24,192.78,90.72,188.24,471.74,Single-ply,SBD,M,
Boys,139.71+,1,Nathaniel Aguillar,Breckenridge,143.97,197.31,117.93,170.1,485.34,Single-ply,SBD,M,
