Division,WeightClassKg,Place,Name,Team,BodyweightKg,Best3SquatKg,Best3BenchKg,Best3DeadliftKg,TotalKg,Equipment,Event,Sex,BirthDate
Boys,55.79,1,Avery Gordon,Farmersville,55.29,88.45,68.04,111.13,267.62,Single-ply,SBD,M,
Boys,59.87,1,Dylan Smith,Princeton,57.38,108.86,70.31,142.88,322.05,Single-ply,SBD,M,
Boys,59.87,2,Adrian Araiza,Bishop Lynch,57.83,92.99,61.23,97.52,251.74,Single-ply,SBD,M,
Boys,67.13,1,Warren Ruiz-Demaree,Anna,65.45,183.7,108.86,192.78,485.34,Single-ply,SBD,M,
Boys,67.13,2,Cash Whitsell,Farmersville,66.41,165.56,102.06,151.95,419.57,Single-ply,SBD,M,
Boys,67.13,3,Colton Monroe,Bishop Lynch,65.91,154.22,79.38,156.49,390.09,Single-ply,SBD,M,
Boys,67.13,4,Roberto Fernandez,Bishop Lynch,64.36,147.42,74.84,145.15,367.41,Single-ply,SBD,M,
Boys,67.13,5,Brandon Haliburton,Anna,64.32,133.81,72.57,131.54,337.93,Single-ply,SBD,M,
Boys,67.13,6,Ryland Medina,Anna,67.04,129.27,86.18,122.47,337.93,Single-ply,SBD,M,
Boys,67.13,7,Cesar Reyes,Mesquite Horn,64.95,117.93,63.5,142.88,324.32,Single-ply,SBD,M,
Boys,67.13,8,Caleb Garcia,Mesquite Horn,66.54,113.4,65.77,136.08,315.25,Single-ply,SBD,M,
Boys,74.84,1,Jacob Tull,Farmersville,72.76,195.04,124.74,199.58,519.36,Single-ply,SBD,M,
Boys,74.84,2,Gabe Clark,Anna,71.4,190.51,104.33,195.04,489.88,Single-ply,SBD,M,
Boys,74.84,3,Nolan Blackmon,Princeton,74.8,142.88,102.06,158.76,403.7,Single-ply,SBD,M,
Boys,74.84,4,Brennan Bates,Sherman,73.03,167.83,77.11,151.95,396.89,Single-ply,SBD,M,
Boys,74.84,5,Greg Davidson,Princeton,73.48,127.01,77.11,142.88,347,Single-ply,SBD,M,
Boys,82.1,1,Colby Stinedurf,Farmersville,78.15,281.23,183.7,244.94,709.87,Single-ply,SBD,M,
Boys,82.1,2,Jacob Davis,Bishop Lynch,79.42,199.58,102.06,195.04,496.68,Single-ply,SBD,M,
Boys,82.1,3,Guillermo Medlin,Mesquite Horn,79.06,163.29,111.13,158.76,433.18,Single-ply,SBD,M,
Boys,82.1,4,Robert Hudson,Mesquite Horn,76.52,158.76,104.33,167.83,430.91,Single-ply,SBD,M,
Boys,82.1,5,Diego Capetillo,Farmersville,81.15,156.49,83.91,174.63,415.04,Single-ply,SBD,M,
Boys,82.1,6,John Larson,Mesquite Horn,78.79,149.69,83.91,161.03,394.63,Single-ply,SBD,M,
Boys,82.1,7,Drew Purser,Princeton,76.75,65.77,49.9,102.06,217.72,Single-ply,SBD,M,
Boys,89.81,1,Caden Joyce,Anna,88.41,226.8,131.54,204.12,562.45,Single-ply,SBD,M,
Boys,89.81,2,Haden Keils,Mesquite Horn,86.86,163.29,129.27,161.03,453.59,Single-ply,SBD,M,
Boys,89.81,3,Billy Barrera,Anna,87.5,158.76,102.06,188.24,449.06,Single-ply,SBD,M,
Boys,89.81,4,Graham Akoh,Princeton,83.37,165.56,83.91,165.56,415.04,Single-ply,SBD,M,
Boys,99.79,1,Jose Perez,Anna,95.66,188.24,142.88,215.46,546.58,Single-ply,SBD,M,
Boys,99.79,2,Logan Monroe,Bishop Lynch,97.89,204.12,111.13,192.78,508.02,Single-ply,SBD,M,
Boys,99.79,3,Philip Kamanda,Mesquite Horn,99.11,199.58,108.86,154.22,462.66,Single-ply,SBD,M,
Boys,99.79,4,Jacob Field,Anna,99.7,174.63,111.13,174.63,460.4,Single-ply,SBD,M,
Boys,99.79,5,Tyler Dorris,Sherman,91.63,142.88,97.52,147.42,387.82,Single-ply,SBD,M,
Boys,99.79,6,Jatniel Algarin,Princeton,98.7,111.13,63.5,138.35,312.98,Single-ply,SBD,M,
Boys,109.77,1,Emmanuel Fernandez,Bishop Lynch,101.83,172.37,133.81,167.83,474,Single-ply,SBD,M,
Boys,109.77,2,Sam Thorton,Sherman,106.64,151.95,104.33,165.56,421.84,Single-ply,SBD,M,
Boys,109.77,3,Darrian Minor,Sherman,102.65,86.18,72.57,133.81,292.57,Single-ply,SBD,M,
Boys,124.74,1,Nate Lasby,Bishop Lynch,122.29,208.65,129.27,190.51,528.44,Single-ply,SBD,M,
Boys,124.74,2,Tito Chavez,Sherman,114.62,192.78,124.74,204.12,521.63,Single-ply,SBD,M,
Boys,124.74,3,Jeremy Chairez,Farmersville,110.72,163.29,113.4,188.24,464.93,Single-ply,SBD,M,
Boys,124.74,4,Julian Rodriguez,Princeton,119.79,176.9,127.01,154.22,458.13,Single-ply,SBD,M,
Boys,124.74,5,Nathaniel Kumler,Sherman,114.08,97.52,77.11,136.08,310.71,Single-ply,SBD,M,
Boys,124.74,6,Parker Morgan,Princeton,122.47,92.99,61.23,111.13,265.35,Single-ply,SBD,M,
