Division,WeightClassKg,Place,Name,Team,BodyweightKg,Best3SquatKg,Best3BenchKg,Best3DeadliftKg,TotalKg,Equipment,Event,Sex,BirthDate
Boys,55.79,1,Rhett Hutchins,Whitehouse,55.16,136.08,79.38,129.27,344.73,Single-ply,SBD,M,
Boys,55.79,2,Chase White,Tyler Chapel Hill,55.7,111.13,68.04,145.15,324.32,Single-ply,SBD,M,
Boys,59.87,1,Quintin Taylor,Troup,58.06,147.42,86.18,149.69,383.29,Single-ply,SBD,M,
Boys,59.87,2,Aaron Nguyen,Whitehouse,56.43,104.33,61.23,97.52,263.08,Single-ply,SBD,M,
Boys,59.87,3,Joshua Hermanns,Tyler Chapel Hill,57.61,61.23,56.7,90.72,208.65,Single-ply,SBD,M,
Boys,59.87,DQ,Dylan McGregor,Whitehouse,57.15,104.33,,,,Single-ply,SBD,M,
Boys,67.13,1,D'Cameron Walker,Henderson,66.95,222.26,142.88,181.44,546.58,Single-ply,SBD,M,
Boys,67.13,2,Braiden Mathews,Whitehouse,66.59,183.7,115.67,161.03,460.4,Single-ply,SBD,M,
Boys,67.13,3,Daniel Cabrera,Tyler Chapel Hill,65.68,167.83,99.79,183.7,451.32,Single-ply,SBD,M,
Boys,67.13,4,Nik Moody,Tyler Chapel Hill,65.5,142.88,92.99,174.63,410.5,Single-ply,SBD,M,
Boys,67.13,5,Tanner Keys,Troup,60.96,138.35,77.11,163.29,378.75,Single-ply,SBD,M,
Boys,67.13,6,Martin Camargo,Henderson,65.95,142.88,79.38,154.22,376.48,Single-ply,SBD,M,
Boys,67.13,7,Levi Thornton,Lindale,65.95,136.08,79.38,136.08,351.53,Single-ply,SBD,M,
Boys,67.13,8,Tysen Pierce,Henderson,60.96,129.27,70.31,147.42,347,Single-ply,SBD,M,
Boys,67.13,9,Wyatt Hurst,Troup,67.13,102.06,61.23,147.42,310.71,Single-ply,SBD,M,
Boys,67.13,10,Chadwick Hamlett,Whitehouse,67.13,104.33,65.77,106.59,276.69,Single-ply,SBD,M,
Boys,67.13,11,Christian Lopez,Lindale,61.23,92.99,68.04,111.13,272.16,Single-ply,SBD,M,
Boys,67.13,DQ,Josh Nitschke,Whitehouse,67.13,90.72,,,,Single-ply,SBD,M,
Boys,74.84,1,Gio Morales,Henderson,72.94,163.29,120.2,188.24,471.74,Single-ply,SBD,M,
Boys,74.84,2,Levi Crider,Whitehouse,74.12,156.49,108.86,161.03,426.38,Single-ply,SBD,M,
Boys,74.84,3,Corey Sanders,Lindale,74.66,147.42,88.45,149.69,385.55,Single-ply,SBD,M,
Boys,74.84,4,Elijah Sierra,Tyler Chapel Hill,71.76,124.74,70.31,142.88,337.93,Single-ply,SBD,M,
Boys,74.84,DQ,Blaine Thomas,Henderson,73.21,158.76,99.79,,,Single-ply,SBD,M,
Boys,82.1,1,Ya'Corus Porter,Henderson,76.48,210.92,138.35,240.4,589.67,Single-ply,SBD,M,
Boys,82.1,2,Jordon Slayton,Whitehouse,78.56,170.1,124.74,201.85,496.68,Single-ply,SBD,M,
Boys,82.1,3,Ace Bateman,Henderson,80.56,183.7,92.99,176.9,453.59,Single-ply,SBD,M,
Boys,82.1,4,Jeremiah Ramirez,Troup,78.29,163.29,102.06,158.76,424.11,Single-ply,SBD,M,
Boys,82.1,5,Joe Herrera,Henderson,81.28,136.08,72.57,131.54,340.19,Single-ply,SBD,M,
Boys,89.81,1,Jacob Baker,Troup,87.91,174.63,88.45,210.92,474,Single-ply,SBD,M,
Boys,89.81,2,Cameron Hicks,Lindale,86,142.88,81.65,158.76,383.29,Single-ply,SBD,M,
Boys,99.79,1,Caleb Bolay,Whitehouse,97.52,226.8,226.8,197.31,650.91,Single-ply,SBD,M,
Boys,99.79,2,Omar Weber,Lindale,93.98,204.12,120.2,226.8,551.11,Single-ply,SBD,M,
Boys,99.79,3,Jordan Jenkins,Lindale,94.17,197.31,124.74,215.46,537.51,Single-ply,SBD,M,
Boys,99.79,4,Ty Kelly,Lindale,97.61,176.9,113.4,197.31,487.61,Single-ply,SBD,M,
Boys,99.79,5,Joel Newman,Troup,97.43,190.51,111.13,181.44,483.08,Single-ply,SBD,M,
Boys,99.79,6,Bradley Adams,Troup,94.35,170.1,106.59,190.51,467.2,Single-ply,SBD,M,
Boys,99.79,7,Gabe Hart,Lindale,98.97,161.03,102.06,176.9,439.98,Single-ply,SBD,M,
Boys,99.79,DQ,Caleb Jones,Whitehouse,92.8,,,,,Single-ply,SBD,M,
Boys,109.77,1,Pablo Martinez,Tyler Chapel Hill,103.24,183.7,104.33,181.44,469.47,Single-ply,SBD,M,
Boys,109.77,2,Joseph Salgado,Troup,107.05,179.17,83.91,192.78,455.86,Single-ply,SBD,M,
Boys,124.74,1,Eujayvion McAlister,Henderson,110.59,260.82,151.95,210.92,623.69,Single-ply,SBD,M,
Boys,124.74,2,Trey Hudson,Tyler Chapel Hill,120.56,226.8,151.95,231.33,610.08,Single-ply,SBD,M,
Boys,124.74,3,Jd Reazin,Tyler Chapel Hill,110.77,226.8,138.35,238.14,603.28,Single-ply,SBD,M,
Boys,124.74,4,Lance Deal,Whitehouse,114.67,219.99,149.69,231.33,601.01,Single-ply,SBD,M,
Boys,124.74,5,Aiden Simmons,Troup,117.84,183.7,124.74,210.92,519.36,Single-ply,SBD,M,
Boys,124.74,6,Raul Duran,Lindale,118.21,185.97,102.06,181.44,469.47,Single-ply,SBD,M,
Boys,124.74,7,Casey Poe,Lindale,111.49,151.95,95.25,195.04,442.25,Single-ply,SBD,M,
Boys,124.74,8,Brock Johnson,Henderson,110.95,136.08,106.59,181.44,424.11,Single-ply,SBD,M,
Boys,139.71,1,Devin Fields,Henderson,126.01,242.67,161.03,235.87,639.57,Single-ply,SBD,M,
Boys,139.71,2,Luke Sandifer,Lindale,128.82,215.46,140.61,215.46,571.53,Single-ply,SBD,M,
Boys,139.71,3,Caleb Power,Whitehouse,128.73,197.31,129.27,208.65,535.24,Single-ply,SBD,M,
Boys,139.71,4,Joel Richard,Lindale,126.46,199.58,99.79,197.31,496.68,Single-ply,SBD,M,
