Division,WeightClassKg,Place,Name,Team,BodyweightKg,Best3SquatKg,Best3BenchKg,Best3DeadliftKg,TotalKg,Equipment,Event,Sex,BirthDate
Boys,51.71,1,Landon Caudle,Maud,50.35,90.72,54.43,102.06,247.21,Single-ply,SBD,M,
Boys,51.71,2,James Day,Simms Bowie,49.35,83.91,45.36,104.33,233.6,Single-ply,SBD,M,
Boys,55.79,1,Kadin Daniels,Maud,55.79,142.88,81.65,158.76,383.29,Single-ply,SBD,M,
Boys,59.87,1,Mason Windham,Redwater,59.33,136.08,86.18,149.69,371.95,Single-ply,SBD,M,
Boys,59.87,2,Michael Lane,Linden-Kildare,58.24,136.08,72.57,136.08,344.73,Single-ply,SBD,M,
Boys,67.13,1,Gavin Rhea,Simms Bowie,66.13,154.22,92.99,161.03,408.23,Single-ply,SBD,M,
Boys,67.13,2,Jaxon Minter,Redwater,65.14,158.76,99.79,145.15,403.7,Single-ply,SBD,M,
Boys,67.13,3,Austin Walker,New Boston,62.6,136.08,74.84,158.76,369.68,Single-ply,SBD,M,
Boys,67.13,4,Jordan Harrison,New Boston,60.24,122.47,61.23,124.74,308.44,Single-ply,SBD,M,
Boys,74.84,1,Cruz Hernandez,De Kalb,72.12,210.92,113.4,188.24,512.56,Single-ply,SBD,M,
Boys,74.84,2,David McKeever,Redwater,70.58,179.17,108.86,181.44,469.47,Single-ply,SBD,M,
Boys,74.84,3,Bradrion Conkleton,Maud,72.3,161.03,102.06,188.24,451.32,Single-ply,SBD,M,
Boys,74.84,4,Orlando Vaughn,New Boston,68.04,163.29,79.38,190.51,433.18,Single-ply,SBD,M,
Boys,74.84,5,Brent White,Linden-Kildare,73.3,147.42,86.18,197.31,430.91,Single-ply,SBD,M,
Boys,74.84,6,Charles Warren,New Boston,68.22,167.83,79.38,172.37,419.57,Single-ply,SBD,M,
Boys,74.84,7,Ethan Estes,Simms Bowie,72.39,140.61,88.45,156.49,385.55,Single-ply,SBD,M,
Boys,74.84,8,Korben Singletary,Redwater,72.57,158.76,68.04,149.69,376.48,Single-ply,SBD,M,
Boys,74.84,DQ,Tristin Lee,Maud,74.62,174.63,95.25,,,Single-ply,SBD,M,
Boys,82.1,1,Dalton Daniels,New Boston,82.01,242.67,113.4,208.65,564.72,Single-ply,SBD,M,
Boys,82.1,2,Dylan Brown,New Boston,80.56,204.12,136.08,206.38,546.58,Single-ply,SBD,M,
Boys,82.1,3,Paul Leal,De Kalb,79.11,197.31,131.54,188.24,517.1,Single-ply,SBD,M,
Boys,82.1,4,Jonah Sanchez,New Boston,81.92,176.9,106.59,183.7,467.2,Single-ply,SBD,M,
Boys,82.1,5,Andrew White,Redwater,80.29,163.29,108.86,174.63,446.79,Single-ply,SBD,M,
Boys,82.1,6,Blade Green,Simms Bowie,81.74,170.1,86.18,161.03,417.3,Single-ply,SBD,M,
Boys,82.1,7,Logan Brock,Redwater,79.74,158.76,102.06,151.95,412.77,Single-ply,SBD,M,
Boys,89.81,1,Amar Love,De Kalb,87.27,260.82,145.15,249.48,655.44,Single-ply,SBD,M,
Boys,89.81,2,Dawson Daffern,Maud,87.91,195.04,120.2,204.12,519.36,Single-ply,SBD,M,
Boys,89.81,3,Tyler Thomas,Texarkana Texas,83.64,142.88,120.2,195.04,458.13,Single-ply,SBD,M,
Boys,89.81,4,Jackson Kerr,Linden-Kildare,85.37,142.88,83.91,149.69,376.48,Single-ply,SBD,M,
Boys,89.81,5,Camden Green,Simms Bowie,87.18,131.54,70.31,129.27,331.12,Single-ply,SBD,M,
Boys,99.79,1,Payton Yandle,De Kalb,92.8,233.6,140.61,215.46,589.67,Single-ply,SBD,M,
Boys,99.79,2,Braxton White,Texarkana Texas,97.7,188.24,124.74,183.7,496.68,Single-ply,SBD,M,
Boys,99.79,3,Kameron Thomas,Texarkana Texas,92.62,151.95,104.33,183.7,439.98,Single-ply,SBD,M,
Boys,99.79,4,Lawton Nichols,Texarkana Texas,99.79,115.67,61.23,117.93,294.84,Single-ply,SBD,M,
Boys,109.77,1,Tarik Hussien,Redwater,107.59,240.4,170.1,233.6,644.1,Single-ply,SBD,M,
Boys,109.77,2,Jawad Hussien,Redwater,107.5,235.87,136.08,217.72,589.67,Single-ply,SBD,M,
Boys,109.77,3,John Owens,Redwater,109.13,199.58,136.08,181.44,517.1,Single-ply,SBD,M,
Boys,109.77,4,Antonio Tyson,Texarkana Texas,107.41,190.51,104.33,199.58,494.42,Single-ply,SBD,M,
Boys,109.77,5,Robert Weaver,Texarkana Texas,109.41,181.44,106.59,183.7,471.74,Single-ply,SBD,M,
Boys,109.77,6,Eli Barrett,New Boston,108.14,145.15,77.11,147.42,369.68,Single-ply,SBD,M,
Boys,124.74,1,Branden Obenoskey,Simms Bowie,116.03,215.46,129.27,215.46,560.19,Single-ply,SBD,M,
Boys,124.74,2,Handsford Storey,Simms Bowie,114.85,181.44,111.13,213.19,505.76,Single-ply,SBD,M,
Boys,124.74,3,Trevor Balk,Maud,118.66,181.44,131.54,192.78,505.76,Single-ply,SBD,M,
Boys,124.74,4,Rylee Culpepper,Maud,124.19,158.76,88.45,176.9,424.11,Single-ply,SBD,M,
Boys,124.74,5,Jayden Watkins,Texarkana Texas,113.31,158.76,70.31,154.22,383.29,Single-ply,SBD,M,
Boys,124.74,6,Matthew Lingle,Texarkana Texas,121.93,117.93,74.84,129.27,322.05,Single-ply,SBD,M,
Boys,124.74,DQ,Landon Liles,Linden-Kildare,123.92,229.06,147.42,,,Single-ply,SBD,M,
Boys,139.71,1,Qu'Shawn McCulloch,Texarkana Texas,135.62,226.8,136.08,192.78,555.65,Single-ply,SBD,M,
Boys,139.71,2,Briley Barron,Maud,126.19,192.78,117.93,204.12,514.83,Single-ply,SBD,M,
Boys,139.71,3,John Jack,Texarkana Texas,127.64,183.7,104.33,181.44,469.47,Single-ply,SBD,M,
Boys,139.71+,1,Nicholas Batton,Texarkana Texas,150.59,215.46,142.88,188.24,546.58,Single-ply,SBD,M,
Boys,139.71+,2,Rhett Tucker,Simms Bowie,140.52,179.17,102.06,174.63,455.86,Single-ply,SBD,M,
Boys,139.71+,3,Temarcus Brown,Texarkana Texas,156.49,172.37,97.52,158.76,428.64,Single-ply,SBD,M,
