Division,WeightClassKg,Place,Name,Team,BodyweightKg,Best3SquatKg,Best3BenchKg,Best3DeadliftKg,TotalKg,Equipment,Event,Sex,BirthDate
Boys,51.71,1,Alex Kim,Graham,51.26,102.06,56.7,111.13,269.89,Single-ply,SBD,M,
Boys,51.71,2,Aiden Guzman,Mineral Wells,51.26,92.99,56.7,102.06,251.74,Single-ply,SBD,M,
Boys,59.87,1,Zandon White,Bridgeport,58.51,133.81,70.31,117.93,322.05,Single-ply,SBD,M,
Boys,67.13,1,Colton Rudder,Bridgeport,60.78,138.35,74.84,156.49,369.68,Single-ply,SBD,M,
Boys,74.84,1,Elijah Vasquez,Bridgeport,74.84,145.15,70.31,142.88,358.34,Single-ply,SBD,M,
Boys,74.84,2,Augustus Arnold,Bridgeport,74.39,127.01,68.04,136.08,331.12,Single-ply,SBD,M,
Boys,74.84,3,Michael Young,Graham,74.39,115.67,61.23,142.88,319.78,Single-ply,SBD,M,
Boys,74.84,DQ,Landon Gregg,Bridgeport,74.84,,,,,Single-ply,SBD,M,
Boys,74.84,DQ,Gabriel Jiminez,Graham,73.94,,,,,Single-ply,SBD,M,
Boys,82.1,1,Lucas Cross,Mineral Wells,82.1,124.74,83.91,133.81,342.46,Single-ply,SBD,M,
Boys,89.81,1,James Vela,Graham,88.45,192.78,102.06,170.1,464.93,Single-ply,SBD,M,
Boys,89.81,2,Cayden Scobee,Graham,88.9,136.08,74.84,140.61,351.53,Single-ply,SBD,M,
Boys,89.81,3,Angel Posada,Mineral Wells,89.36,120.2,63.5,102.06,285.76,Single-ply,SBD,M,
Boys,89.81,4,Braydon Morrow,Bridgeport,83.46,92.99,61.23,124.74,278.96,Single-ply,SBD,M,
Boys,89.81,DQ,Jackson Van Hoose,Bridgeport,89.81,,,,,Single-ply,SBD,M,
Boys,99.79,1,Talan Yowell,Graham,98.88,136.08,81.65,142.88,360.61,Single-ply,SBD,M,
Boys,99.79,2,Jacob Butler,Mineral Wells,92.99,124.74,83.91,124.74,333.39,Single-ply,SBD,M,
Boys,99.79,3,Lawson Marin,Graham,98.43,111.13,79.38,129.27,319.78,Single-ply,SBD,M,
Boys,99.79,DQ,Devon Castro,Graham,98.88,115.67,,,,Single-ply,SBD,M,
Boys,99.79,DQ,Angelo Stonecheck,Bridgeport,98.43,,,,,Single-ply,SBD,M,
Boys,124.74,1,Travis Horne,Bridgeport,120.2,113.4,79.38,113.4,306.17,Single-ply,SBD,M,
Boys,139.71,1,Steven Brown,Graham,136.08,156.49,83.91,181.44,421.84,Single-ply,SBD,M,
Boys,139.71+,1,Cayson Wells,Mineral Wells,162.84,158.76,92.99,142.88,394.63,Single-ply,SBD,M,
