Division,WeightClassKg,Place,Name,Team,BodyweightKg,Best3SquatKg,Best3BenchKg,Best3DeadliftKg,TotalKg,Equipment,Event,Sex,BirthDate
Girls,44.23,1,Mia Carr,Crandall,42.27,43.09,24.95,65.77,133.81,Single-ply,SBD,F,
Girls,51.94,1,Abby Canada,Crandall,50.8,58.97,31.75,81.65,172.37,Single-ply,SBD,F,
Girls,56.02,1,Ainsley Wherry,Crandall,52.25,27.22,22.68,34.02,83.91,Single-ply,SBD,F,
Girls,60.1,1,Anna Koller,Crandall,59.87,97.52,47.63,106.59,251.74,Single-ply,SBD,F,
Girls,75.07,1,Ryan Barnett,Crandall,71.85,108.86,54.43,122.47,285.76,Single-ply,SBD,F,
Girls,82.33,1,Guadalupe Garcia,Eustace,81.47,122.47,63.5,120.2,306.17,Single-ply,SBD,F,
Girls,82.33,2,Jordan Garcia #2,Crandall,81.1,70.31,29.48,113.4,213.19,Single-ply,SBD,F,
Girls,100.02,1,Virginia Romo,Eustace,91.08,104.33,63.5,108.86,276.69,Single-ply,SBD,F,
Girls,100.02,2,Sheyna Zamarron,Crandall,91.99,102.06,54.43,113.4,269.89,Single-ply,SBD,F,
Girls,100.02,3,Terrianna Slocum,Eustace,95.07,108.86,63.5,95.25,267.62,Single-ply,SBD,F,
Girls,100.02,4,Dainyra Pelaez,Crandall,93.98,65.77,24.95,83.91,174.63,Single-ply,SBD,F,
Girls,117.71,1,Abby Larry,Crandall,103.42,136.08,79.38,145.15,360.61,Single-ply,SBD,F,
Girls,117.71,2,Brooklyn Irby,Crandall,111.13,113.4,58.97,122.47,294.84,Single-ply,SBD,F,
Girls,117.71+,1,Javin Crawford,Crandall,129.82,113.4,81.65,149.69,344.73,Single-ply,SBD,F,
Girls,117.71+,2,Madison Lene,Crandall,117.75,56.7,38.56,65.77,161.03,Single-ply,SBD,F,
