Division,WeightClassKg,Place,Name,Team,BodyweightKg,Best3SquatKg,Best3BenchKg,Best3DeadliftKg,TotalKg,Equipment,Event,Sex,BirthDate
Boys,67.13,1,Robert Ellis,Galveston Ball,66.22,226.8,113.4,219.99,560.19,Single-ply,SBD,M,
Boys,67.13,2,Jed Bruce,Freeport Brazosport,64.5,122.47,86.18,149.69,358.34,Single-ply,SBD,M,
Boys,74.84,1,Alan Vega,Needville,69.04,129.27,88.45,136.08,353.8,Single-ply,SBD,M,
Boys,74.84,2,Juan Briones,Freeport Brazosport,70.85,106.59,90.72,136.08,333.39,Single-ply,SBD,M,
Boys,74.84,3,Joshua Murphy,Needville,73.62,102.06,54.43,104.33,260.82,Single-ply,SBD,M,
Boys,74.84,DQ,Darius Turner,Galveston Ball,68.04,127.01,,,,Single-ply,SBD,M,
Boys,74.84,DQ,Tai Ngo,Galveston Ball,74.39,165.56,,,,Single-ply,SBD,M,
Boys,82.1,1,Alex Leija,Freeport Brazosport,81.83,183.7,120.2,179.17,483.08,Single-ply,SBD,M,
Boys,82.1,2,Elim Castro,Freeport Brazosport,79.65,129.27,79.38,158.76,367.41,Single-ply,SBD,M,
Boys,82.1,3,Chance Courville,Galveston Ball,78.93,124.74,81.65,142.88,349.27,Single-ply,SBD,M,
Boys,82.1,4,Andreas McGlotha,Galveston Ball,80.29,61.23,38.56,111.13,210.92,Single-ply,SBD,M,
Boys,89.81,1,Sebastian Briones,Freeport Brazosport,86.73,190.51,111.13,215.46,517.1,Single-ply,SBD,M,
Boys,89.81,2,Hunter Brewster,Needville,89.81,185.97,113.4,183.7,483.08,Single-ply,SBD,M,
Boys,89.81,3,Marco Hernandez,Needville,88.27,151.95,83.91,154.22,390.09,Single-ply,SBD,M,
Boys,89.81,4,Enrique Ortiz,Needville,83.28,122.47,81.65,124.74,328.85,Single-ply,SBD,M,
Boys,89.81,DQ,Sawyer Goode,Galveston Ball,88,,,,,Single-ply,SBD,M,
Boys,99.79,1,Matthew Torres,Needville,90.26,192.78,115.67,174.63,483.08,Single-ply,SBD,M,
Boys,99.79,2,Ryan Zeigler,Galveston Ball,99.79,158.76,68.04,183.7,410.5,Single-ply,SBD,M,
Boys,99.79,3,William Watts,Galveston Ball,98.43,142.88,65.77,149.69,358.34,Single-ply,SBD,M,
Boys,109.77,1,Tate Gustavus,Needville,109.77,179.17,115.67,158.76,453.59,Single-ply,SBD,M,
Boys,124.74,1,Landon Henke,Needville,121.2,306.17,181.44,254.01,741.62,Single-ply,SBD,M,
Boys,124.74,2,Jose Cuevas,Galveston Ball,117.93,226.8,127.01,183.7,537.51,Single-ply,SBD,M,
Boys,124.74,3,Victor Muniz,Needville,112.58,136.08,90.72,145.15,371.95,Single-ply,SBD,M,
Boys,139.71,DQ,Devin Dunlap,Freeport Brazosport,133.17,,,,,Single-ply,SBD,M,
Boys,139.71+,1,Bj Moore,Freeport Brazosport,158.85,317.51,161.03,233.6,712.14,Single-ply,SBD,M,
Boys,139.71+,2,Blake Boenisch,Needville,159.21,272.16,183.7,249.48,705.34,Single-ply,SBD,M,
