Division,WeightClassKg,Place,Name,Team,BodyweightKg,Best3SquatKg,Best3BenchKg,Best3DeadliftKg,TotalKg,Equipment,Event,Sex,BirthDate
Boys,51.71,1,Isaac Rios,Killeen Ellison,50.44,142.88,86.18,124.74,353.8,Single-ply,SBD,M,
Boys,51.71,2,Anthony Gonzales,Luling,48.17,115.67,65.77,129.27,310.71,Single-ply,SBD,M,
Boys,51.71,3,David Zamora,Luling,48.08,106.59,63.5,115.67,285.76,Single-ply,SBD,M,
Boys,55.79,1,Brayden Bromonsky,Kyle Lehman,54.79,233.6,97.52,233.6,564.72,Single-ply,SBD,M,
Boys,55.79,2,Alex Yanez,Buda Hays,52.25,74.84,49.9,90.72,215.46,Single-ply,SBD,M,
Boys,59.87,1,Jacob Vasquez,Kyle Lehman,59.51,229.06,111.13,238.14,578.33,Single-ply,SBD,M,
Boys,59.87,2,Eric Esquivel,Kyle Lehman,59.6,183.7,95.25,197.31,476.27,Single-ply,SBD,M,
Boys,59.87,3,Jose Rios,Kyle Lehman,59.69,156.49,92.99,163.29,412.77,Single-ply,SBD,M,
Boys,59.87,4,Tanner Tucker,Luling,59.69,138.35,83.91,156.49,378.75,Single-ply,SBD,M,
Boys,67.13,1,Christian Jeanes,Kyle Lehman,66.59,185.97,117.93,199.58,503.49,Single-ply,SBD,M,
Boys,67.13,2,Gabriel Vargas,Killeen Ellison,65.77,201.85,108.86,167.83,478.54,Single-ply,SBD,M,
Boys,67.13,3,Garrett Schlottman,Kyle Lehman,67.13,179.17,86.18,183.7,449.06,Single-ply,SBD,M,
Boys,67.13,DQ,Jarian Green,Killeen Ellison,62.05,136.08,,,,Single-ply,SBD,M,
Boys,74.84,1,Diego Macedo,Kyle Lehman,74.75,265.35,133.81,208.65,607.81,Single-ply,SBD,M,
Boys,74.84,2,Kevin Garza,Kyle Lehman,74.8,199.58,117.93,188.24,505.76,Single-ply,SBD,M,
Boys,74.84,3,Joseph James,Killeen Ellison,74.84,192.78,127.01,185.97,505.76,Single-ply,SBD,M,
Boys,74.84,4,Noah Zelazny,Kyle Lehman,74.66,179.17,120.2,201.85,501.22,Single-ply,SBD,M,
Boys,74.84,5,Jacob Cullen,Buda Hays,69.67,133.81,106.59,158.76,399.16,Single-ply,SBD,M,
Boys,74.84,DQ,Rafeal Boyd,Killeen Ellison,74.84,172.37,97.52,,,Single-ply,SBD,M,
Boys,82.1,1,Konnor Peronto,Killeen Ellison,81.1,199.58,133.81,195.04,528.44,Single-ply,SBD,M,
Boys,82.1,2,Kolby Peronto,Killeen Ellison,81.56,197.31,113.4,199.58,510.29,Single-ply,SBD,M,
Boys,82.1,3,Aidan Sanchez,Luling,80.2,183.7,102.06,190.51,476.27,Single-ply,SBD,M,
Boys,82.1,4,Adrian Crumley,Luling,82.1,165.56,106.59,167.83,439.98,Single-ply,SBD,M,
Boys,82.1,5,Joel Torres,Luling,81.56,133.81,92.99,138.35,365.14,Single-ply,SBD,M,
Boys,82.1,6,Jace Thomas,Buda Hays,80.47,115.67,72.57,136.08,324.32,Single-ply,SBD,M,
Boys,82.1,7,Jacob Crosby,Buda Hays,77.29,81.65,49.9,72.57,204.12,Single-ply,SBD,M,
Boys,89.81,1,Caleb Esparza,Kyle Lehman,87.18,306.17,145.15,222.26,673.58,Single-ply,SBD,M,
Boys,99.79,1,James Williams,Killeen Ellison,99.16,272.16,129.27,233.6,635.03,Single-ply,SBD,M,
Boys,99.79,2,Marcos Reyes,Kyle Lehman,99.16,231.33,122.47,208.65,562.45,Single-ply,SBD,M,
Boys,99.79,3,Antonio Gomez,Luling,90.81,174.63,111.13,161.03,446.79,Single-ply,SBD,M,
Boys,109.77,1,Zeke Sheridan,Killeen Ellison,101.79,265.35,129.27,263.08,657.71,Single-ply,SBD,M,
Boys,109.77,2,Armando Molina,Killeen Ellison,109.77,231.33,142.88,219.99,594.21,Single-ply,SBD,M,
Boys,109.77,3,Nick Luna,Kyle Lehman,109.72,206.38,115.67,206.38,528.44,Single-ply,SBD,M,
Boys,109.77,4,Rafael Santamaria,Luling,105.51,190.51,111.13,190.51,492.15,Single-ply,SBD,M,
Boys,109.77,DQ,Amir Soliman,Killeen Ellison,100.7,,,,,Single-ply,SBD,M,
Boys,124.74,1,Jalen Miller,Kyle Lehman,122.56,226.8,124.74,235.87,587.4,Single-ply,SBD,M,
Boys,124.74,2,Joseph Leal,Buda Hays,114.94,172.37,86.18,185.97,444.52,Single-ply,SBD,M,
Boys,124.74,3,Tanner Fisher,Buda Hays,117.03,129.27,86.18,145.15,360.61,Single-ply,SBD,M,
Boys,139.71+,1,Keanu Ramirez,Killeen Ellison,156.76,294.84,181.44,240.4,716.68,Single-ply,SBD,M,
Boys,139.71+,2,Jaxson Langford,Killeen Ellison,209.74,267.62,138.35,219.99,625.96,Single-ply,SBD,M,
