Division,WeightClassKg,Place,Name,Team,BodyweightKg,Best3SquatKg,Best3BenchKg,Best3DeadliftKg,TotalKg,Equipment,Event,Sex,BirthDate
Girls,44.23,1,LeighAnn Sitzman,Decatur,43.64,108.86,68.04,113.4,290.3,Single-ply,SBD,F,
Girls,47.85,1,Brianna Gonzalez,Mineral Wells,47.45,79.38,31.75,68.04,179.17,Single-ply,SBD,F,
Girls,51.94,1,Kiana Allen,Peaster,51.17,102.06,58.97,113.4,274.42,Single-ply,SBD,F,
Girls,51.94,2,Andrea Banegas,Mineral Wells,48.17,90.72,45.36,97.52,233.6,Single-ply,SBD,F,
Girls,51.94,3,Chloe Shackelford,Weatherford,50.08,90.72,47.63,90.72,229.06,Single-ply,SBD,F,
Girls,51.94,4,Julyssa Cantu,Decatur,49.08,90.72,43.09,92.99,226.8,Single-ply,SBD,F,
Girls,51.94,5,Callie Shirley,Breckenridge,50.35,90.72,36.29,95.25,222.26,Single-ply,SBD,F,
Girls,51.94,6,Scarlett Brown,Weatherford,50.71,88.45,45.36,79.38,213.19,Single-ply,SBD,F,
Girls,51.94,7,Victoria Martinez,Decatur,50.89,83.91,34.02,83.91,201.85,Single-ply,SBD,F,
Girls,51.94,8,Avery Decker,Weatherford,51.8,61.23,29.48,86.18,176.9,Single-ply,SBD,F,
Girls,56.02,1,Tanner Bussey,Weatherford,55.97,111.13,63.5,99.79,274.42,Single-ply,SBD,F,
Girls,56.02,2,Laney Carroll,Graham,55.79,120.2,43.09,90.72,254.01,Single-ply,SBD,F,
Girls,56.02,3,Emma Reeves,Decatur,55.7,90.72,56.7,97.52,244.94,Single-ply,SBD,F,
Girls,56.02,4,Loralee Edmonson,Peaster,53.8,81.65,43.09,83.91,208.65,Single-ply,SBD,F,
Girls,60.1,1,Sabrina Kirk,Lake Worth,56.25,115.67,58.97,115.67,290.3,Single-ply,SBD,F,
Girls,60.1,2,Bree Rundle,Decatur,59.24,115.67,49.9,113.4,278.96,Single-ply,SBD,F,
Girls,60.1,3,Aimee Toliver,Breckenridge,60.06,104.33,49.9,104.33,258.55,Single-ply,SBD,F,
Girls,60.1,4,Jacqueline Guillen,Breckenridge,60.06,106.59,45.36,102.06,254.01,Single-ply,SBD,F,
Girls,67.36,1,Kira Harrell,Lake Worth,67.31,133.81,61.23,129.27,324.32,Single-ply,SBD,F,
Girls,67.36,2,Haigan Thompson,Breckenridge,66.95,124.74,54.43,120.2,299.37,Single-ply,SBD,F,
Girls,67.36,3,Sydney Nelson,Weatherford,67.31,104.33,68.04,127.01,299.37,Single-ply,SBD,F,
Girls,67.36,4,Grace Kemp,Peaster,64.95,102.06,47.63,113.4,263.08,Single-ply,SBD,F,
Girls,67.36,5,Grace Sinquefield,Weatherford,60.51,95.25,52.16,113.4,260.82,Single-ply,SBD,F,
Girls,67.36,6,McKenna Samples,Decatur,65.5,111.13,61.23,83.91,256.28,Single-ply,SBD,F,
Girls,67.36,7,Olivia Cavazos,Weatherford,62.87,90.72,49.9,88.45,229.06,Single-ply,SBD,F,
Girls,67.36,DQ,Roslyn Fontenot,Weatherford,61.6,79.38,40.82,,,Single-ply,SBD,F,
Girls,75.07,1,Madison Hines,Weatherford,75.02,172.37,90.72,129.27,392.36,Single-ply,SBD,F,
Girls,75.07,2,Kyene Harris,Decatur,74.48,127.01,72.57,133.81,333.39,Single-ply,SBD,F,
Girls,75.07,3,Alexis McCune,Weatherford,74.93,117.93,79.38,120.2,317.51,Single-ply,SBD,F,
Girls,75.07,4,Mallory Floyd,Weatherford,74.84,120.2,68.04,92.99,281.23,Single-ply,SBD,F,
Girls,75.07,5,Grace Donaldson,Weatherford,74.84,81.65,49.9,95.25,226.8,Single-ply,SBD,F,
Girls,82.33,1,Bella Dillard,Weatherford,78.93,124.74,65.77,111.13,301.64,Single-ply,SBD,F,
Girls,82.33,2,Alissa Acosta,Mineral Wells,80.92,127.01,49.9,120.2,297.1,Single-ply,SBD,F,
Girls,82.33,3,Rylee Schaefgen,Bridgeport,81.1,108.86,61.23,106.59,276.69,Single-ply,SBD,F,
Girls,82.33,4,Alexcia Allen,Mineral Wells,82.1,108.86,43.09,102.06,254.01,Single-ply,SBD,F,
Girls,90.04,1,Fatima Cansino,Weatherford,89.72,199.58,79.38,138.35,417.3,Single-ply,SBD,F,
Girls,90.04,2,Hannah McCune,Weatherford,89.18,74.84,52.16,74.84,201.85,Single-ply,SBD,F,
Girls,100.02,1,Alyvia Thomas,Weatherford,96.89,190.51,92.99,154.22,437.72,Single-ply,SBD,F,
Girls,100.02,2,Desiree Garcia,Mineral Wells,97.79,145.15,70.31,142.88,358.34,Single-ply,SBD,F,
Girls,100.02,3,Ireland Beaty,Graham,97.79,133.81,56.7,131.54,322.05,Single-ply,SBD,F,
Girls,100.02,4,Kaylie Stacy,Decatur,94.17,120.2,68.04,120.2,308.44,Single-ply,SBD,F,
Girls,100.02,5,Layla Frances,Weatherford,93.44,117.93,61.23,122.47,301.64,Single-ply,SBD,F,
Girls,117.71,1,Maggie Hamm,Decatur,108.41,142.88,88.45,156.49,387.82,Single-ply,SBD,F,
Girls,117.71,2,Preslee Scarbro,Peaster,108.77,138.35,88.45,127.01,353.8,Single-ply,SBD,F,
Girls,117.71,3,Carolina Tejada,Mineral Wells,100.43,140.61,56.7,127.01,324.32,Single-ply,SBD,F,
Girls,117.71,4,Natalia Sanchez,Lake Worth,104.14,129.27,54.43,129.27,312.98,Single-ply,SBD,F,
Girls,117.71+,1,Abby Walker,Weatherford,124.74,102.06,68.04,99.79,269.89,Single-ply,SBD,F,
