Name,WeightClassKg,Division,AgeRange,Sex,Best3SquatKg,Best3BenchKg,Best3DeadliftKg,TotalKg,Event,Equipment,Place
Laura Proulx,44,O,,F,,63.5,,63.5,B,Multi-ply,1
Laura Proulx,44,O,,F,,61.24,,61.24,B,Raw,1
Padgett,67.5,60-69,60-69,M,,74.84,,74.84,B,Raw,1
Farrell,75,40-49,40-49,M,,104.33,,104.33,B,Multi-ply,1
Farrell,75,40-49,40-49,M,,99.79,,99.79,B,Raw,1
Campbell,82.5,O,,M,,201.85,,201.85,B,Multi-ply,1
Rutherford,82.5,O,,M,,170.1,,170.1,B,Multi-ply,2
Ryan Hicks,82.5,O,,M,,142.88,,142.88,B,Multi-ply,3
Rutherford,82.5,JR,20-23,M,,170.1,,170.1,B,Multi-ply,1
Ryan Hicks,82.5,JR,20-23,M,,142.88,,142.88,B,Multi-ply,2
Berard,82.5,70-79,70-79,M,,108.86,,108.86,B,Multi-ply,1
Berard,82.5,70-79,70-79,M,,,,,B,Raw,DQ
Morzella,90,O,,M,,154.22,,154.22,B,Multi-ply,1
Barnwell,90,O,,M,,138.35,,138.35,B,Multi-ply,2
Barnwell,90,O,,M,,124.74,,124.74,B,Raw,1
Morzella,90,SM,33-39,M,,154.22,,154.22,B,Multi-ply,1
Gaskin,90,40-49,40-49,M,,145.15,,145.15,B,Raw,1
Duane Drisdom,100,O,,M,,208.65,,208.65,B,Multi-ply,1
Duane Drisdom,100,SM,33-39,M,,208.65,,208.65,B,Multi-ply,1
Pedro Hollingsworth,100,40-49,40-49,M,,167.83,,167.83,B,Multi-ply,1
Martin,110,O,,M,,229.06,,229.06,B,Multi-ply,1
Dave Silverbloom,125,O,,M,,149.69,,149.69,B,Raw,1
Molay,125,SM,33-39,M,,190.51,,190.51,B,Multi-ply,1
Molay,125,PFM,,M,,190.51,,190.51,B,Multi-ply,1
Robert Jackson,125,40-49,40-49,M,,208.65,,208.65,B,Raw,1
Dave Silverbloom,125,40-49,40-49,M,,149.69,,149.69,B,Raw,2
Romero,125,70-79,70-79,M,,108.86,,108.86,B,Raw,1
DeAndre Ferguson,125+,O,,M,,206.38,,206.38,B,Multi-ply,1
Rodberg,125+,O,,M,,156.49,,156.49,B,Multi-ply,2
DeAndre Ferguson,125+,SM,33-39,M,,206.38,,206.38,B,Multi-ply,1
Rodberg,125+,SM,33-39,M,,156.49,,156.49,B,Multi-ply,2
Chris Dixon,125+,SM,33-39,M,,213.19,,213.19,B,Raw,1
Chris Dixon,125+,O,,M,,213.19,,213.19,B,Raw,1
Quinn,125+,40-49,40-49,M,,199.58,,199.58,B,Multi-ply,1
Rusty Irby,125+,40-49,40-49,M,,208.65,,208.65,B,Raw,1
Clarke,67.5,O,,M,,,,,D,Raw,DQ
Clarke,67.5,PFM,,M,,,,,D,Raw,DQ
Padgett,67.5,60-69,60-69,M,,,113.4,113.4,D,Raw,1
Lewis #10,75,40-49,40-49,M,,,170.1,170.1,D,Raw,1
Ray,90,SM,33-39,M,,,272.16,272.16,D,Multi-ply,1
Young,90,SM,33-39,M,,,219.99,219.99,D,Multi-ply,2
Ray,90,O,,M,,,272.16,272.16,D,Multi-ply,1
Martin,110,O,,M,,,281.23,281.23,D,Multi-ply,1
Padgett,110,SM,33-39,M,,,288.03,288.03,D,Raw,1
Hageman,110,40-49,40-49,M,,,174.63,174.63,D,Raw,1
Ray Pelis,125+,40-49,40-49,M,,,276.69,276.69,D,Multi-ply,1
Wright,56,SM,33-39,M,113.4,65.77,133.81,312.98,SBD,Wraps,1
Ken Snell,52,O,,M,158.76,106.59,188.24,453.59,SBD,Single-ply,1
Ken Snell,52,40-49,40-49,M,158.76,106.59,188.24,453.59,SBD,Single-ply,1
Barnett,52,14-16,14-16,M,99.79,65.77,127.01,292.57,SBD,Multi-ply,1
Allen Whigham,60,O,,M,208.65,108.86,226.8,544.31,SBD,Multi-ply,1
Jones,60,14-16,14-16,M,111.13,77.11,156.49,344.73,SBD,Multi-ply,1
Brown,67.5,O,,M,224.53,117.93,215.46,557.92,SBD,Multi-ply,1
Brown,67.5,40-49,40-49,M,224.53,117.93,215.46,557.92,SBD,Multi-ply,1
Tony Caprari,75,17-19,17-19,M,249.48,163.29,299.37,712.14,SBD,Multi-ply,1
Waldron,75,17-19,17-19,M,181.44,113.4,224.53,519.36,SBD,Multi-ply,2
Allen,75,17-19,17-19,M,90.72,83.91,122.47,297.1,SBD,Multi-ply,3
Tony Caprari,75,O,,M,249.48,163.29,299.37,712.14,SBD,Multi-ply,1
Russ Metivier,75,O,,M,183.71,133.81,217.72,535.24,SBD,Multi-ply,2
Lewis #10,75,40-49,40-49,M,,,,,SBD,Multi-ply,DQ
Haralson,82.5,14-16,14-16,M,204.12,124.74,254.01,582.87,SBD,Multi-ply,1
Cameron,82.5,17-19,17-19,M,226.8,124.74,240.4,591.94,SBD,Multi-ply,1
Barry LaFoy,82.5,O,,M,269.89,185.97,292.57,748.43,SBD,Multi-ply,1
Alday,82.5,O,,M,249.48,174.63,251.74,675.85,SBD,Multi-ply,2
Campbell,82.5,O,,M,260.82,201.85,192.78,655.44,SBD,Multi-ply,3
Pickens,90,17-19,17-19,M,204.12,120.2,240.4,564.72,SBD,Multi-ply,1
Rod Watkins,90,O,,M,251.74,165.56,251.74,669.05,SBD,Multi-ply,1
Ray,90,O,,M,226.8,158.76,272.16,657.71,SBD,Multi-ply,2
Ray,90,SM,33-39,M,226.8,158.76,272.16,657.71,SBD,Multi-ply,1
Young,90,SM,33-39,M,188.24,127.01,219.99,535.24,SBD,Multi-ply,2
Trevorah,90,60-69,60-69,M,199.58,113.4,204.12,517.1,SBD,Multi-ply,1
Hamilton #1,100,14-16,14-16,M,204.12,122.47,170.1,496.68,SBD,Multi-ply,1
Keating,100,17-19,17-19,M,206.38,136.08,226.8,569.26,SBD,Raw,1
Keith Klayhold,100,O,,M,306.18,181.44,249.48,737.09,SBD,Multi-ply,1
Berry #2,100,O,,M,249.48,165.56,251.74,666.78,SBD,Multi-ply,2
Darr,100,50-59,50-59,M,145.15,154.22,190.51,489.88,SBD,Multi-ply,1
Noland,110,JR,20-23,M,258.55,165.56,274.42,698.53,SBD,Multi-ply,1
Billy Warren,110,JR,20-23,M,226.8,208.65,238.14,673.59,SBD,Multi-ply,2
Padgett,110,JR,20-23,M,204.12,158.76,288.03,650.91,SBD,Multi-ply,3
Hageman,110,40-49,40-49,M,158.76,122.47,174.63,455.86,SBD,Raw,1
Robert Bolster,110,50-59,50-59,M,181.44,104.33,195.04,480.81,SBD,Multi-ply,1
Dirk Pounds,125,O,,M,215.46,172.37,226.8,614.62,SBD,Raw,1
Dirk Pounds,125,SM,33-39,M,215.46,172.37,226.8,614.62,SBD,Raw,1
Ray Pelis,125+,40-49,40-49,M,233.6,195.04,276.69,705.34,SBD,Multi-ply,1
