Division,WeightClassKg,Place,Name,Team,BodyweightKg,Best3SquatKg,Best3BenchKg,Best3DeadliftKg,TotalKg,Equipment,Event,Sex,BirthDate
Boys,59.87,1,JR Hernandez,Brownsville Rivera,59.06,183.7,106.59,183.7,474,Single-ply,SBD,M,
Boys,59.87,DQ,Joseph Ramirez,Brownsville Veterans Memorial,57.29,129.27,,,,Single-ply,SBD,M,
Boys,67.13,1,Robert Stone,Brownsville Veterans Memorial,65.68,145.15,104.33,170.1,419.57,Single-ply,SBD,M,
Boys,67.13,2,Anthony Ayala,Brownsville Veterans Memorial,66.45,142.88,120.2,151.95,415.04,Single-ply,SBD,M,
Boys,74.84,1,Jose E Hernandez,Brownsville Rivera,71.3,185.97,106.59,197.31,489.88,Single-ply,SBD,M,
Boys,74.84,2,Oscar Gonzalez,Brownsville Rivera,72.48,151.95,70.31,138.35,360.61,Single-ply,SBD,M,
Boys,82.1,1,Javier Trevino,Brownsville Veterans Memorial,78.47,124.74,81.65,133.81,340.19,Single-ply,SBD,M,
Boys,89.81,1,Josh Madrazo,Brownsville Veterans Memorial,89.45,233.6,145.15,224.53,603.28,Single-ply,SBD,M,
Boys,89.81,2,Luis Cacayoren,Brownsville Veterans Memorial,84.37,229.06,120.2,197.31,546.58,Single-ply,SBD,M,
Boys,99.79,1,Jesus Hernandez,Brownsville Rivera,99.16,195.04,124.74,215.46,535.24,Single-ply,SBD,M,
Boys,109.77,1,Jesus Salas,Brownsville Rivera,108.95,199.58,115.67,176.9,492.15,Single-ply,SBD,M,
Boys,124.74,1,Tomas Garcia,Brownsville Veterans Memorial,120.66,151.95,90.72,158.76,401.43,Single-ply,SBD,M,
Boys,139.71,1,Ray Holloman,Brownsville Veterans Memorial,128.14,233.6,133.81,204.12,571.53,Single-ply,SBD,M,
Boys,139.71,2,Abraham Lozano,Brownsville Rivera,129.27,163.29,70.31,208.65,442.25,Single-ply,SBD,M,
Boys,139.71,3,Luis Rosales,Brownsville Veterans Memorial,129.91,142.88,102.06,158.76,403.7,Single-ply,SBD,M,
Boys,139.71,4,Zeke Torres,Brownsville Rivera,125.74,124.74,72.57,106.59,303.91,Single-ply,SBD,M,
