Division,WeightClassKg,Place,Name,Team,BodyweightKg,Best3SquatKg,Best3BenchKg,Best3DeadliftKg,TotalKg,Equipment,Event,Sex,BirthDate
Boys,51.71,1,Nathan Stevens,Wichita Falls City View,45,111.13,56.7,111.13,278.96,Single-ply,SBD,M,
Boys,51.71,2,Nay Moo,Vernon,51.3,88.45,61.23,120.2,269.89,Single-ply,SBD,M,
Boys,51.71,3,Benjamin Marin,Wichita Falls,48.72,102.06,52.16,111.13,265.35,Single-ply,SBD,M,
Boys,51.71,4,Jace Yarbrough,Iowa Park,42.64,88.45,45.36,97.52,231.33,Single-ply,SBD,M,
Boys,51.71,5,Monte Kerr,Iowa Park,46.27,79.38,45.36,95.25,219.99,Single-ply,SBD,M,
Boys,55.79,1,Ivory Kelley,Wichita Falls,54.43,136.08,68.04,151.95,356.07,Single-ply,SBD,M,
Boys,55.79,2,Ryan Reader,Iowa Park,53.98,104.33,70.31,113.4,288.03,Single-ply,SBD,M,
Boys,59.87,1,Francisco Balderas,Vernon,59.1,158.76,104.33,181.44,444.52,Single-ply,SBD,M,
Boys,59.87,2,Aiden Barker,Iowa Park,59.65,117.93,74.84,127.01,319.78,Single-ply,SBD,M,
Boys,59.87,3,Abel Perigrino,Iowa Park,58.06,102.06,68.04,113.4,283.5,Single-ply,SBD,M,
Boys,59.87,4,Adrian Lanier,Wichita Falls Hirschi,58.06,92.99,56.7,117.93,267.62,Single-ply,SBD,M,
Boys,59.87,5,Stephen Harris,Burkburnett,58.51,104.33,54.43,106.59,265.35,Single-ply,SBD,M,
Boys,67.13,1,Don Todd,Iowa Park,66.22,165.56,102.06,172.37,439.98,Single-ply,SBD,M,
Boys,67.13,2,Blake Rogers,Wichita Falls Rider,63.78,147.42,88.45,136.08,371.95,Single-ply,SBD,M,
Boys,67.13,3,Htoo Wah,Vernon,61.69,120.2,83.91,142.88,347,Single-ply,SBD,M,
Boys,67.13,4,Ivy D Kelley,Wichita Falls,60.78,122.47,77.11,145.15,344.73,Single-ply,SBD,M,
Boys,67.13,5,Shawn Mills,Burkburnett,66.68,81.65,61.23,111.13,254.01,Single-ply,SBD,M,
Boys,74.84,1,Chris Graham,Wichita Falls City View,69.04,260.82,136.08,233.6,630.49,Single-ply,SBD,M,
Boys,74.84,2,Christopher Laxamana,Wichita Falls Hirschi,68.95,199.58,102.06,226.8,528.44,Single-ply,SBD,M,
Boys,74.84,3,Logan Leal,Iowa Park,68.49,201.85,124.74,190.51,517.1,Single-ply,SBD,M,
Boys,74.84,4,Keiran Shaw,Wichita Falls Rider,74.12,192.78,102.06,172.37,467.2,Single-ply,SBD,M,
Boys,74.84,5,Niko Tinsley,Wichita Falls City View,71.67,181.44,92.99,190.51,464.93,Single-ply,SBD,M,
Boys,74.84,6,Tin Nguyen,Wichita Falls City View,72.57,170.1,79.38,190.51,439.98,Single-ply,SBD,M,
Boys,74.84,7,Brigman Steward,Wichita Falls,71.67,174.63,88.45,170.1,433.18,Single-ply,SBD,M,
Boys,74.84,8,Ismael Trejo,Vernon,69.81,151.95,88.45,158.76,399.16,Single-ply,SBD,M,
Boys,74.84,9,Cooper Kidwell,Iowa Park,73.03,142.88,102.06,154.22,399.16,Single-ply,SBD,M,
Boys,74.84,10,Joseph Hickey,Petrolia,69.85,124.74,92.99,140.61,358.34,Single-ply,SBD,M,
Boys,74.84,DQ,Austin Groth,Wichita Falls Rider,69.58,,,,,Single-ply,SBD,M,
Boys,82.1,1,Coleman Bledsoe,Wichita Falls Rider,81.92,229.06,136.08,215.46,580.6,Single-ply,SBD,M,
Boys,82.1,2,Logan Rex,Wichita Falls Rider,81.47,210.92,120.2,174.63,505.76,Single-ply,SBD,M,
Boys,82.1,3,Nick Leon,Wichita Falls Hirschi,77.34,181.44,117.93,199.58,498.95,Single-ply,SBD,M,
Boys,82.1,4,Antowne Willis,Wichita Falls Rider,76.66,195.04,90.72,192.78,478.54,Single-ply,SBD,M,
Boys,82.1,5,Amari'a Wiley,Wichita Falls Hirschi,80.88,195.04,90.72,192.78,478.54,Single-ply,SBD,M,
Boys,82.1,6,Wade Colley,Petrolia,81.65,170.1,102.06,163.29,435.45,Single-ply,SBD,M,
Boys,82.1,7,Joshua Gaitan,Iowa Park,81.65,142.88,106.59,158.76,408.23,Single-ply,SBD,M,
Boys,82.1,8,Kaw Moo,Vernon,80.06,124.74,115.67,149.69,390.09,Single-ply,SBD,M,
Boys,82.1,9,Jesse Franklin,Wichita Falls City View,81.65,142.88,74.84,158.76,376.48,Single-ply,SBD,M,
Boys,82.1,10,Cayden Resendez,Wichita Falls Hirschi,78.06,138.35,74.84,136.08,349.27,Single-ply,SBD,M,
Boys,89.81,1,Tinaye Mubvumba,Vernon,88.45,233.6,142.88,249.48,625.96,Single-ply,SBD,M,
Boys,89.81,2,Jordain Durham,Wichita Falls City View,89.81,229.06,124.74,235.87,589.67,Single-ply,SBD,M,
Boys,89.81,3,Kirk Finnell,Wichita Falls Rider,89.49,210.92,117.93,174.63,503.49,Single-ply,SBD,M,
Boys,89.81,4,Larmye Koerth,Wichita Falls City View,86.18,124.74,102.06,163.29,390.09,Single-ply,SBD,M,
Boys,89.81,DQ,Jacobey Clay,Wichita Falls,85.73,,,,,Single-ply,SBD,M,
Boys,99.79,1,Tristan Perez,Wichita Falls Hirschi,93.08,256.28,142.88,215.46,614.62,Single-ply,SBD,M,
Boys,99.79,2,Chase Stafford,Wichita Falls Rider,90.95,226.8,113.4,233.6,573.79,Single-ply,SBD,M,
Boys,99.79,3,Luke Short,Petrolia,97.98,190.51,124.74,185.97,501.22,Single-ply,SBD,M,
Boys,99.79,4,Cory Whitman,Wichita Falls,92.99,172.37,95.25,174.63,442.25,Single-ply,SBD,M,
Boys,99.79,5,Levi Jones,Wichita Falls City View,95.25,131.54,68.04,147.42,347,Single-ply,SBD,M,
Boys,99.79,6,Ethan Bainbridge,Burkburnett,99.79,124.74,68.04,145.15,337.93,Single-ply,SBD,M,
Boys,99.79,7,Brian Cropper,Burkburnett,92.08,115.67,70.31,120.2,306.17,Single-ply,SBD,M,
Boys,99.79,8,Logan Alpers,Burkburnett,90.26,72.57,61.23,102.06,235.87,Single-ply,SBD,M,
Boys,99.79,DQ,Javian Frazier,Wichita Falls Hirschi,89.95,,,,,Single-ply,SBD,M,
Boys,109.77,1,Zach Clark,Iowa Park,100.7,240.4,192.78,226.8,659.98,Single-ply,SBD,M,
Boys,109.77,2,Coby Arledge,Iowa Park,103.42,240.4,158.76,226.8,625.96,Single-ply,SBD,M,
Boys,109.77,3,Kelsey Scott,Wichita Falls Hirschi,105.91,208.65,154.22,204.12,566.99,Single-ply,SBD,M,
Boys,109.77,4,Gideon Perez,Wichita Falls Rider,104.05,190.51,108.86,161.03,460.4,Single-ply,SBD,M,
Boys,109.77,5,Emanuel Huerta,Wichita Falls City View,105.23,156.49,83.91,167.83,408.23,Single-ply,SBD,M,
Boys,109.77,6,Robert Crump,Wichita Falls Hirschi,105.73,154.22,74.84,147.42,376.48,Single-ply,SBD,M,
Boys,109.77,7,Sebastian Rodriguez,Wichita Falls Hirschi,104.05,108.86,95.25,149.69,353.8,Single-ply,SBD,M,
Boys,109.77,DQ,Cameron Dandridge,Wichita Falls City View,107.95,,,,,Single-ply,SBD,M,
Boys,124.74,1,Mason Hill,Wichita Falls City View,119.29,260.82,127.01,242.67,630.49,Single-ply,SBD,M,
Boys,124.74,2,Hayden Meng,Burkburnett,114.03,226.8,124.74,240.4,591.94,Single-ply,SBD,M,
Boys,124.74,3,Aj Valdez,Wichita Falls,115.21,226.8,102.06,226.8,555.65,Single-ply,SBD,M,
Boys,124.74,4,Luke Gambs,Wichita Falls Rider,123.2,215.46,111.13,204.12,530.7,Single-ply,SBD,M,
Boys,124.74,5,Shaun Royalty,Wichita Falls Hirschi,121.25,165.56,124.74,204.12,494.42,Single-ply,SBD,M,
Boys,124.74,6,Ashton Dickinson,Vernon,111.58,170.1,108.86,176.9,455.86,Single-ply,SBD,M,
Boys,124.74,7,Josh Valverde,Wichita Falls Hirschi,112.9,108.86,88.45,129.27,326.59,Single-ply,SBD,M,
Boys,124.74,DQ,Uriah Bates-Hollowell,Petrolia,122.47,,,,,Single-ply,SBD,M,
Boys,124.74,DQ,Jonathan Eddleton,Petrolia,111.58,,,,,Single-ply,SBD,M,
Boys,139.71,1,Jayden Parsons,Iowa Park,129.27,249.48,206.38,251.74,707.6,Single-ply,SBD,M,
Boys,139.71,2,Harley Vogel,Burkburnett,139.71,142.88,70.31,147.42,360.61,Single-ply,SBD,M,
Boys,139.71+,1,Brett Briscoe,Petrolia,154.22,249.48,136.08,181.44,566.99,Single-ply,SBD,M,
Boys,139.71+,2,Mekhi Robinson,Wichita Falls Rider,144.33,235.87,136.08,170.1,542.04,Single-ply,SBD,M,
Boys,139.71+,3,Robert Mash,Burkburnett,147.15,208.65,111.13,170.1,489.88,Single-ply,SBD,M,
