Division,WeightClassKg,Place,Name,Team,BodyweightKg,Best3SquatKg,Best3BenchKg,Best3DeadliftKg,TotalKg,Equipment,Event,Sex,BirthDate
Boys,51.71,1,Sam Collier,Lake Dallas,51.71,136.08,92.99,147.42,376.48,Single-ply,SBD,M,
Boys,51.71,2,Donovan Carter #3,Carrollton Ranchview,49.44,81.65,47.63,90.72,219.99,Single-ply,SBD,M,
Boys,55.79,1,John Tran,Carrollton Creekview,53.98,165.56,88.45,183.7,437.72,Single-ply,SBD,M,
Boys,55.79,2,Peyton Knight,Melissa,53.98,154.22,97.52,161.03,412.77,Single-ply,SBD,M,
Boys,59.87,1,Jose Perraza,Carrollton Smith,59.87,147.42,102.06,161.03,410.5,Single-ply,SBD,M,
Boys,59.87,2,Jeffrey Boyd,Melissa,58.51,142.88,83.91,151.95,378.75,Single-ply,SBD,M,
Boys,59.87,3,Andrew Mast,Carrollton Creekview,59.87,138.35,88.45,149.69,376.48,Single-ply,SBD,M,
Boys,59.87,4,Myles Williams,Melissa,58.51,136.08,74.84,151.95,362.87,Single-ply,SBD,M,
Boys,59.87,5,Nathan Staubus,Lake Dallas,59.87,115.67,70.31,124.74,310.71,Single-ply,SBD,M,
Boys,67.13,1,Aaron Cyrus,Carrollton Creekview,67.13,199.58,102.06,204.12,505.76,Single-ply,SBD,M,
Boys,67.13,2,Donovan Smith,Carrollton Turner,67.13,174.63,106.59,181.44,462.66,Single-ply,SBD,M,
Boys,67.13,3,Jonovan Eichelberger,Carrollton Ranchview,65.77,172.37,97.52,183.7,453.59,Single-ply,SBD,M,
Boys,67.13,4,Kasey Nguyen,Carrollton Creekview,67.13,185.97,97.52,170.1,453.59,Single-ply,SBD,M,
Boys,67.13,5,James Gatson,Melissa,62.14,158.76,79.38,181.44,419.57,Single-ply,SBD,M,
Boys,67.13,6,Rory Smith,Carrollton Ranchview,65.77,127.01,79.38,154.22,360.61,Single-ply,SBD,M,
Boys,67.13,7,James Washington,Carrollton Ranchview,64.41,129.27,74.84,145.15,349.27,Single-ply,SBD,M,
Boys,67.13,8,Evan Gepner,Melissa,66.22,138.35,61.23,142.88,342.46,Single-ply,SBD,M,
Boys,67.13,9,Ashton Nguyen,Carrollton Creekview,67.13,136.08,56.7,136.08,328.85,Single-ply,SBD,M,
Boys,67.13,10,Gavin Majdan,Melissa,63.05,124.74,79.38,122.47,326.59,Single-ply,SBD,M,
Boys,67.13,11,Ben Pfeil,Carrollton Creekview,60.78,111.13,74.84,136.08,322.05,Single-ply,SBD,M,
Boys,67.13,12,Lucas Seraine,Carrollton Creekview,67.13,104.33,74.84,102.06,281.23,Single-ply,SBD,M,
Boys,74.84,1,Isai Pena,Carrollton Creekview,70.31,215.46,120.2,226.8,562.45,Single-ply,SBD,M,
Boys,74.84,2,Rickie Brown,Carrollton Creekview,71.21,158.76,124.74,161.03,444.52,Single-ply,SBD,M,
Boys,74.84,3,Drew McKinney,Lake Dallas,70.31,163.29,102.06,174.63,439.98,Single-ply,SBD,M,
Boys,74.84,4,Jesse Izquierdo,Melissa,74.39,181.44,104.33,151.95,437.72,Single-ply,SBD,M,
Boys,74.84,5,Joseph Taylor,Lake Dallas,71.67,156.49,102.06,174.63,433.18,Single-ply,SBD,M,
Boys,74.84,6,Josh Toyphommarath,Carrollton Creekview,73.94,138.35,102.06,147.42,387.82,Single-ply,SBD,M,
Boys,74.84,7,Elijah Kendrick,Carrollton Smith,73.48,124.74,92.99,136.08,353.8,Single-ply,SBD,M,
Boys,74.84,8,Calvin Nguyen,Carrollton Creekview,72.12,136.08,65.77,136.08,337.93,Single-ply,SBD,M,
Boys,74.84,9,Elijah Penny,Carrollton Ranchview,68.95,122.47,61.23,151.95,335.66,Single-ply,SBD,M,
Boys,74.84,10,Jack Nelson,Carrollton Creekview,74.84,115.67,70.31,124.74,310.71,Single-ply,SBD,M,
Boys,74.84,11,Kenneth Parra,Carrollton Turner,74.39,102.06,83.91,90.72,276.69,Single-ply,SBD,M,
Boys,74.84,12,James Parker,Carrollton Ranchview,68.95,102.06,47.63,113.4,263.08,Single-ply,SBD,M,
Boys,74.84,13,Bobby Shewandagne,Carrollton Creekview,73.48,79.38,52.16,74.84,206.38,Single-ply,SBD,M,
Boys,82.1,1,Parker Jack,Melissa,81.65,208.65,108.86,188.24,505.76,Single-ply,SBD,M,
Boys,82.1,2,Caden Nordberg,Melissa,79.38,192.78,102.06,183.7,478.54,Single-ply,SBD,M,
Boys,82.1,3,Raja Singh,Lake Dallas,82.1,174.63,113.4,183.7,471.74,Single-ply,SBD,M,
Boys,82.1,4,Julian Areyalo,Carrollton Turner,81.65,156.49,104.33,170.1,430.91,Single-ply,SBD,M,
Boys,82.1,5,Patrick Wenger,Lake Dallas,82.1,165.56,92.99,170.1,428.64,Single-ply,SBD,M,
Boys,82.1,6,Nelson Viera,Carrollton Turner,79.38,165.56,102.06,158.76,426.38,Single-ply,SBD,M,
Boys,82.1,7,Hunter Parker,Carrollton Turner,81.65,158.76,102.06,158.76,419.57,Single-ply,SBD,M,
Boys,82.1,8,Joseph Puckett,Lake Dallas,80.29,170.1,61.23,170.1,401.43,Single-ply,SBD,M,
Boys,82.1,9,Dylan Mann,Melissa,82.1,170.1,74.84,142.88,387.82,Single-ply,SBD,M,
Boys,82.1,10,Heynar Berrios,Carrollton Creekview,78.02,138.35,79.38,165.56,383.29,Single-ply,SBD,M,
Boys,82.1,11,Matthew Jean-Francois,Carrollton Ranchview,80.29,133.81,72.57,113.4,319.78,Single-ply,SBD,M,
Boys,82.1,12,Jason Contreras,Carrollton Creekview,79.38,113.4,70.31,117.93,301.64,Single-ply,SBD,M,
Boys,89.81,1,Dax Ogden,Melissa,85.28,229.06,115.67,210.92,555.65,Single-ply,SBD,M,
Boys,89.81,2,Jayvin Rodriguez,Melissa,88,210.92,131.54,176.9,519.36,Single-ply,SBD,M,
Boys,89.81,3,Nick Webber,Carrollton Smith,88.45,188.24,106.59,165.56,460.4,Single-ply,SBD,M,
Boys,89.81,4,Keoian Harongsemal,Carrollton Creekview,89.81,156.49,95.25,161.03,412.77,Single-ply,SBD,M,
Boys,89.81,5,Lance Riley,Melissa,82.55,158.76,86.18,158.76,403.7,Single-ply,SBD,M,
Boys,89.81,6,Gerald Beck,Lake Dallas,88.9,138.35,102.06,158.76,399.16,Single-ply,SBD,M,
Boys,89.81,7,Joshua Sanchez,Lake Dallas,88,136.08,90.72,147.42,374.21,Single-ply,SBD,M,
Boys,89.81,8,Shun Mizuno,Carrollton Ranchview,88.9,183.7,95.25,,278.96,Single-ply,SB,M,
Boys,99.79,1,Corey Wyatt,Carrollton Smith,92.53,215.46,129.27,215.46,560.19,Single-ply,SBD,M,
Boys,99.79,2,Jonathen Synoground,Lake Dallas,92.99,210.92,147.42,201.85,560.19,Single-ply,SBD,M,
Boys,99.79,3,Josiah Robinson,Carrollton Creekview,97.52,185.97,117.93,176.9,480.81,Single-ply,SBD,M,
Boys,99.79,4,Isaiah Cabrialias,Carrollton Turner,99.34,192.78,120.2,167.83,480.81,Single-ply,SBD,M,
Boys,99.79,5,Jackson Berry,Lake Dallas,91.17,163.29,106.59,170.1,439.98,Single-ply,SBD,M,
Boys,99.79,6,Brandon Theopotte,Carrollton Smith,95.25,165.56,99.79,167.83,433.18,Single-ply,SBD,M,
Boys,99.79,7,Anthony Marquez,Carrollton Creekview,99.79,142.88,83.91,161.03,387.82,Single-ply,SBD,M,
Boys,99.79,8,Brandon Amaya,Carrollton Turner,97.98,149.69,61.23,158.76,369.68,Single-ply,SBD,M,
Boys,109.77,1,Brandon Dominguez,Carrollton Smith,107.05,195.04,113.4,181.44,489.88,Single-ply,SBD,M,
Boys,109.77,2,Nathan Paik,Carrollton Ranchview,101.6,188.24,108.86,190.51,487.61,Single-ply,SBD,M,
Boys,109.77,3,Jayden Lunkley,Carrollton Ranchview,105.23,133.81,102.06,149.69,385.55,Single-ply,SBD,M,
Boys,124.74,1,Zander Gonzales,Melissa,122.47,238.14,117.93,185.97,542.04,Single-ply,SBD,M,
Boys,124.74,2,Junior Juarez,Carrollton Smith,115.21,219.99,111.13,181.44,512.56,Single-ply,SBD,M,
Boys,124.74,3,Tony Baker,Carrollton Creekview,111.58,192.78,120.2,185.97,498.95,Single-ply,SBD,M,
Boys,124.74,4,Efrain Guereca,Carrollton Turner,123.83,188.24,127.01,181.44,496.68,Single-ply,SBD,M,
Boys,124.74,5,Aiden McCann,Carrollton Ranchview,124.74,208.65,102.06,185.97,496.68,Single-ply,SBD,M,
Boys,124.74,6,Deven Holder,Lake Dallas,111.58,183.7,104.33,195.04,483.08,Single-ply,SBD,M,
Boys,124.74,7,Derick Vera,Carrollton Creekview,120.2,163.29,106.59,204.12,474,Single-ply,SBD,M,
Boys,124.74,8,Anderson Shields,Lake Dallas,118.39,158.76,99.79,174.63,433.18,Single-ply,SBD,M,
Boys,124.74,9,Noah Sanchez,Carrollton Creekview,111.13,147.42,111.13,172.37,430.91,Single-ply,SBD,M,
Boys,124.74,10,Cam Oliver,Carrollton Smith,112.94,170.1,111.13,145.15,426.38,Single-ply,SBD,M,
Boys,124.74+,1,Brandon Ward,Melissa,126.55,265.35,111.13,204.12,580.6,Single-ply,SBD,M,
Boys,124.74+,2,Dalton Ross,Carrollton Creekview,144.24,163.29,124.74,174.63,462.66,Single-ply,SBD,M,
Boys,124.74+,3,Carson Sarrett,Melissa,133.36,181.44,97.52,147.42,426.38,Single-ply,SBD,M,
Boys,124.74+,4,Alek Llanes,Carrollton Ranchview,148.32,163.29,79.38,183.7,426.38,Single-ply,SBD,M,
Boys,124.74+,5,Jeremiah Bruner,Lake Dallas,139.71,165.56,83.91,167.83,417.3,Single-ply,SBD,M,
Boys,,NS,John McMahon,Lake Dallas,,,,,,Single-ply,SBD,M,
Boys,,NS,Carson Brockenbush,Lake Dallas,,,,,,Single-ply,SBD,M,
Boys,,NS,Kevon Avery,Carrollton Smith,,,,,,Single-ply,SBD,M,
Boys,,NS,Victor Nguyen,Carrollton Turner,,,,,,Single-ply,SBD,M,
Boys,,NS,Jeremiah Cummings,Carrollton Smith,,,,,,Single-ply,SBD,M,
