Division,WeightClassKg,Place,Name,Team,BodyweightKg,Best3SquatKg,Best3BenchKg,Best3DeadliftKg,TotalKg,Equipment,Event,Sex,BirthDate
Boys,51.71,1,Tomas Elizondo,San Diego,51.07,151.95,92.99,188.24,433.18,Single-ply,SBD,M,
Boys,51.71,2,Michael Longoria,San Diego,51.07,136.08,97.52,156.49,390.09,Single-ply,SBD,M,
Boys,51.71,3,Romulo Torres,San Diego,49.99,124.74,70.31,124.74,319.78,Single-ply,SBD,M,
Boys,55.79,1,Rolando Martinez,Hebbronville,53.16,120.2,63.5,127.01,310.71,Single-ply,SBD,M,
Boys,55.79,2,Noah Solis,Hebbronville,55.43,113.4,65.77,122.47,301.64,Single-ply,SBD,M,
Boys,59.87,1,Cristian Cantu,Hebbronville,56.34,90.72,54.43,88.45,233.6,Single-ply,SBD,M,
Boys,67.13,1,Austin Mendez,San Diego,66.41,208.65,124.74,249.48,582.87,Single-ply,SBD,M,
Boys,67.13,2,Seth Solis,Hebbronville,66.68,170.1,104.33,174.63,449.06,Single-ply,SBD,M,
Boys,67.13,3,Diego Rodriguez,Hebbronville,66.5,154.22,102.06,172.37,428.64,Single-ply,SBD,M,
Boys,74.84,1,Lukas Salaiz,San Diego,74.12,238.14,158.76,238.14,635.03,Single-ply,SBD,M,
Boys,82.1,1,Jason Rodriguez,San Diego,80.74,213.19,131.54,217.72,562.45,Single-ply,SBD,M,
Boys,82.1,2,Jaime Salinas,San Diego,78.47,233.6,129.27,192.78,555.65,Single-ply,SBD,M,
Boys,82.1,3,Regino Molina,San Diego,78.2,136.08,72.57,174.63,383.29,Single-ply,SBD,M,
Boys,89.81,1,Jose Torres,San Diego,87.54,210.92,149.69,199.58,560.19,Single-ply,SBD,M,
Boys,99.79,1,Alejandro Gómez,Hebbronville,98.88,276.69,172.37,226.8,675.85,Single-ply,SBD,M,
Boys,99.79,2,Mario Gonzalez,Hebbronville,99.79,136.08,63.5,136.08,335.66,Single-ply,SBD,M,
Boys,124.74,1,Eric Garcia,San Diego,117.21,219.99,149.69,183.7,553.38,Single-ply,SBD,M,
Boys,124.74,DQ,Jorge Guerra,San Diego,113.58,235.87,133.81,,,Single-ply,SBD,M,
Boys,139.71,1,Louis Pena,San Diego,132,226.8,129.27,199.58,555.65,Single-ply,SBD,M,
Boys,139.71,2,Jayden Valderas,Hebbronville,130.63,163.29,108.86,165.56,437.72,Single-ply,SBD,M,
Boys,,NS,Andres Garza,San Diego,,,,,,Single-ply,SBD,M,
