Division,WeightClassKg,Place,Name,Team,BodyweightKg,Best3SquatKg,Best3BenchKg,Best3DeadliftKg,TotalKg,Equipment,Event,Sex,BirthDate
Boys,51.71,1,Jose Zamora,Dumas,51.71,106.59,70.31,122.47,299.37,Single-ply,SBD,M,
Boys,55.79,1,Jesus Vega,Perryton,54.88,115.67,81.65,154.22,351.53,Single-ply,SBD,M,
Boys,55.79,2,Brandon Smith,Dumas,52.48,142.88,83.91,120.2,347,Single-ply,SBD,M,
Boys,59.87,1,Jonathan Jaso,Dumas,59.15,170.1,79.38,151.95,401.43,Single-ply,SBD,M,
Boys,67.13,1,Emmanuel Ibanez,Dumas,66.54,167.83,95.25,170.1,433.18,Single-ply,SBD,M,
Boys,67.13,2,Alex Penton,Dalhart,65.41,120.2,68.04,122.47,310.71,Single-ply,SBD,M,
Boys,74.84,1,Sabien Perry,Dumas,74.84,235.87,120.2,222.26,578.33,Single-ply,SBD,M,
Boys,74.84,2,James Bednorz,Dumas,74.71,215.46,133.81,201.85,551.11,Single-ply,SBD,M,
Boys,74.84,3,Jagger Puga,Dalhart,74.8,210.92,138.35,170.1,519.36,Single-ply,SBD,M,
Boys,74.84,4,Jonathan Espino,Perryton,74.84,199.58,102.06,163.29,464.93,Single-ply,SBD,M,
Boys,74.84,5,Izaiah Vasquez,Perryton,73.94,170.1,122.47,170.1,462.66,Single-ply,SBD,M,
Boys,74.84,6,Isreal Gabriel,Perryton,73.57,183.7,90.72,183.7,458.13,Single-ply,SBD,M,
Boys,74.84,7,Salvador Ortiz,Dalhart,73.66,176.9,88.45,165.56,430.91,Single-ply,SBD,M,
Boys,74.84,8,Rodolfo Delgado,Perryton,74.39,165.56,108.86,151.95,426.38,Single-ply,SBD,M,
Boys,74.84,9,Zane Holland,Dumas,69.4,142.88,102.06,151.95,396.89,Single-ply,SBD,M,
Boys,74.84,DQ,Bradley Franks,Dumas,74.16,,,,,Single-ply,SBD,M,
Boys,82.1,1,Cannon Speck,Dumas,82.1,204.12,133.81,204.12,542.04,Single-ply,SBD,M,
Boys,82.1,2,Damien Gonzales,Perryton,80.56,208.65,136.08,192.78,537.51,Single-ply,SBD,M,
Boys,82.1,3,Dalton L'Esperance,Perryton,80.74,170.1,108.86,185.97,464.93,Single-ply,SBD,M,
Boys,82.1,4,Exavier Burks,Dalhart,81.01,129.27,81.65,151.95,362.87,Single-ply,SBD,M,
Boys,89.81,1,Angel Quiroz,Dumas,88.5,251.74,147.42,208.65,607.81,Single-ply,SBD,M,
Boys,89.81,2,Mark Hernandez,Dumas,89.81,206.38,138.35,204.12,548.85,Single-ply,SBD,M,
Boys,89.81,3,Damion Murga,Dumas,87.77,213.19,140.61,185.97,539.77,Single-ply,SBD,M,
Boys,89.81,4,Alberto Sanchez,Dumas,88.36,185.97,99.79,190.51,476.27,Single-ply,SBD,M,
Boys,89.81,5,Gavin Groll,Dalhart,85.73,190.51,113.4,163.29,467.2,Single-ply,SBD,M,
Boys,89.81,6,Jose Ramirez,Perryton,87.72,97.52,58.97,122.47,278.96,Single-ply,SBD,M,
Boys,99.79,1,Dalton Leven,Dumas,97.3,226.8,136.08,204.12,566.99,Single-ply,SBD,M,
Boys,99.79,2,Bryan Chacon,Perryton,99.25,206.38,106.59,226.8,539.77,Single-ply,SBD,M,
Boys,99.79,3,Arnoldo Hernandez,Dumas,98.43,181.44,113.4,181.44,476.27,Single-ply,SBD,M,
Boys,99.79,4,David Castro,Dalhart,99.79,163.29,113.4,163.29,439.98,Single-ply,SBD,M,
Boys,109.77,1,Karlo Sanchez,Dumas,100.92,272.16,170.1,231.33,673.58,Single-ply,SBD,M,
Boys,109.77,2,Yostin Villagomez,Dalhart,108.36,263.08,172.37,219.99,655.44,Single-ply,SBD,M,
Boys,109.77,3,Jacob Raissez,Perryton,103.24,219.99,122.47,204.12,546.58,Single-ply,SBD,M,
Boys,124.74,1,Hector Pando,Dumas,114.17,226.8,113.4,215.46,555.65,Single-ply,SBD,M,
Boys,124.74,2,Cristian Salinas,Dalhart,111.9,204.12,131.54,165.56,501.22,Single-ply,SBD,M,
Boys,124.74,3,Dakota Pearson,Perryton,113.94,204.12,106.59,161.03,471.74,Single-ply,SBD,M,
Boys,124.74,4,Andres Ramirez,Dumas,119.02,163.29,106.59,149.69,419.57,Single-ply,SBD,M,
Boys,139.71,DQ,Lucas Martinez,Dumas,132.27,,,,,Single-ply,SBD,M,
Boys,139.71+,1,Ben Turner,Dalhart,152.32,204.12,124.74,181.44,510.29,Single-ply,SBD,M,
