Division,WeightClassKg,Place,Name,Team,BodyweightKg,Best3SquatKg,Best3BenchKg,Best3DeadliftKg,TotalKg,Equipment,Event,Sex,BirthDate
Boys,55.79,1,Payton Cole,Bells,54.48,142.88,92.99,147.42,383.29,Single-ply,SBD,M,
Boys,67.13,1,Jeffery Boyd,Bells,67.13,190.51,115.67,192.78,498.95,Single-ply,SBD,M,
Boys,67.13,2,Eduardo Carillo,Bells,63.23,163.29,108.86,181.44,453.59,Single-ply,SBD,M,
Boys,67.13,3,Dakota Tinker,Howe,64.36,113.4,72.57,140.61,326.59,Single-ply,SBD,M,
Boys,67.13,4,Aj Partridge,Bells,65.68,104.33,81.65,120.2,306.17,Single-ply,SBD,M,
Boys,67.13,5,Blayze Massey,Bells,66.77,115.67,54.43,127.01,297.1,Single-ply,SBD,M,
Boys,74.84,1,Ethan Beason,Blue Ridge,73.94,190.51,133.81,192.78,517.1,Single-ply,SBD,M,
Boys,74.84,DQ,Brett Long,Van Alstyne,72.35,199.58,92.99,,,Single-ply,SBD,M,
Boys,82.1,1,Ayden Burris,Howe,79.33,129.27,74.84,140.61,344.73,Single-ply,SBD,M,
Boys,89.81,1,Raul Hernandez,Howe,89.68,219.99,129.27,210.92,560.19,Single-ply,SBD,M,
Boys,89.81,2,Josh Powell,Blue Ridge,89.72,181.44,83.91,165.56,430.91,Single-ply,SBD,M,
Boys,99.79,1,Shane Davis,Whitewright,99.56,254.01,176.9,226.8,657.71,Single-ply,SBD,M,
Boys,99.79,2,Landon Nelson,Bells,99.65,256.28,145.15,233.6,635.03,Single-ply,SBD,M,
Boys,99.79,3,Ryan Rodriquez,Blue Ridge,91.67,204.12,136.08,192.78,532.97,Single-ply,SBD,M,
Boys,99.79,4,Christian Mena,Bells,90.63,206.38,127.01,192.78,526.17,Single-ply,SBD,M,
Boys,99.79,5,Jax Gage,Whitewright,99.56,190.51,113.4,176.9,480.81,Single-ply,SBD,M,
Boys,99.79,6,Kasey Sanders,Whitewright,91.13,185.97,122.47,170.1,478.54,Single-ply,SBD,M,
Boys,99.79,7,Landon Grier,Blue Ridge,95.66,120.2,83.91,161.03,365.14,Single-ply,SBD,M,
Boys,109.77,1,Marc Anthony Gonzales,Whitewright,108.23,199.58,124.74,213.19,537.51,Single-ply,SBD,M,
Boys,109.77,2,Jackson Adkins,Howe,105.69,208.65,138.35,181.44,528.44,Single-ply,SBD,M,
Boys,109.77,3,Wyatt Langwell,Blue Ridge,103.83,188.24,102.06,185.97,476.27,Single-ply,SBD,M,
Boys,124.74,1,Brandon Woods,Whitewright,112.22,258.55,167.83,229.06,655.44,Single-ply,SBD,M,
Boys,124.74,2,Luke Jackson,Howe,119.16,210.92,102.06,183.7,496.68,Single-ply,SBD,M,
Boys,124.74,DQ,Kellen Rollins,Blue Ridge,118.07,,,,,Single-ply,SBD,M,
