Division,WeightClassKg,Place,Name,Team,BodyweightKg,Best3SquatKg,Best3BenchKg,Best3DeadliftKg,TotalKg,Equipment,Event,Sex,BirthDate
Girls,44.23,DQ,Jolie Sanchez,College Station A&M Cons,44,,,,,Single-ply,SBD,F,
Girls,51.94,1,Anna Scarborough,College Station,51.8,127.01,68.04,117.93,312.98,Single-ply,SBD,F,
Girls,56.02,1,Emma Hagerman,College Station,54.93,102.06,47.63,99.79,249.48,Single-ply,SBD,F,
Girls,56.02,2,Lexi Schwartz,Robinson,55.34,95.25,47.63,106.59,249.48,Single-ply,SBD,F,
Girls,56.02,3,Daisy Torres,College Station A&M Cons,55.88,72.57,43.09,92.99,208.65,Single-ply,SBD,F,
Girls,56.02,4,Mar Rodriguez,Robinson,55.16,72.57,43.09,86.18,201.85,Single-ply,SBD,F,
Girls,56.02,5,Kaitlyn Mahder,Robinson,55.84,77.11,38.56,86.18,201.85,Single-ply,SBD,F,
Girls,56.02,DQ,Alyssa Garza,Robinson,53.52,,,,,Single-ply,SBD,F,
Girls,56.02,DQ,Keileigh Bowie,College Station,55.66,,,,,Single-ply,SBD,F,
Girls,60.1,1,Madi Kimes,College Station,59.78,158.76,72.57,124.74,356.07,Single-ply,SBD,F,
Girls,60.1,2,Reese Sigler,College Station,57.29,129.27,65.77,136.08,331.12,Single-ply,SBD,F,
Girls,60.1,3,Hayoung Lee,College Station A&M Cons,58.97,106.59,45.36,115.67,267.62,Single-ply,SBD,F,
Girls,60.1,4,Autumn Simons,Robinson,59.51,61.23,29.48,88.45,179.17,Single-ply,SBD,F,
Girls,67.36,1,Sidney Shipley,College Station,64.77,165.56,68.04,136.08,369.68,Single-ply,SBD,F,
Girls,67.36,2,Madison Barber,College Station,64.55,117.93,58.97,138.35,315.25,Single-ply,SBD,F,
Girls,67.36,3,Taseia Rashid,College Station A&M Cons,63.5,120.2,54.43,120.2,294.84,Single-ply,SBD,F,
Girls,67.36,4,Rebeka Falcon,Robinson,60.78,77.11,47.63,115.67,240.4,Single-ply,SBD,F,
Girls,67.36,5,Naomi McManus,College Station A&M Cons,65.86,90.72,52.16,90.72,233.6,Single-ply,SBD,F,
Girls,67.36,6,Amy Delgado,Robinson,60.92,90.72,45.36,90.72,226.8,Single-ply,SBD,F,
Girls,67.36,7,Breanna Woytek,College Station A&M Cons,67.13,86.18,49.9,79.38,215.46,Single-ply,SBD,F,
Girls,67.36,8,Marleen Aguilar,Robinson,61.23,79.38,38.56,90.72,208.65,Single-ply,SBD,F,
Girls,67.36,DQ,Kaitlynn Mendez,Robinson,61.14,,,,,Single-ply,SBD,F,
Girls,75.07,1,Fayth Ham,College Station,69.49,201.85,95.25,158.76,455.86,Single-ply,SBD,F,
Girls,75.07,2,Addie Pfeiffer,College Station A&M Cons,73.94,115.67,56.7,111.13,283.5,Single-ply,SBD,F,
Girls,82.33,1,Hanah Scott,College Station,76.79,158.76,70.31,145.15,374.21,Single-ply,SBD,F,
Girls,82.33,2,Joy Jones,College Station A&M Cons,82.1,117.93,61.23,117.93,297.1,Single-ply,SBD,F,
Girls,82.33,3,Avery Alexander,Robinson,79.38,63.5,36.29,79.38,179.17,Single-ply,SBD,F,
Girls,82.33,DQ,JiMaria Lipscomb,College Station A&M Cons,78.02,88.45,,,,Single-ply,SBD,F,
Girls,90.04,1,Tara Hines,College Station A&M Cons,89.81,90.72,61.23,111.13,263.08,Single-ply,SBD,F,
Girls,90.04,2,Kim Rodriguez,College Station A&M Cons,89.81,86.18,47.63,81.65,215.46,Single-ply,SBD,F,
Girls,100.02,1,Brook Ragan,College Station,93.53,176.9,99.79,142.88,419.57,Single-ply,SBD,F,
Girls,100.02,2,Emily Thompson,College Station,92.17,151.95,81.65,142.88,376.48,Single-ply,SBD,F,
Girls,100.02,3,Lillian Mayfield,Robinson,99.52,92.99,49.9,113.4,256.28,Single-ply,SBD,F,
Girls,100.02,4,Adrionna Wimberley,Robinson,97.98,54.43,34.02,79.38,167.83,Single-ply,SBD,F,
