Division,WeightClassKg,Place,Name,Team,BodyweightKg,Best3SquatKg,Best3BenchKg,Best3DeadliftKg,TotalKg,Equipment,Event,Sex,BirthDate
Boys,51.71,1,Eric Valencia,Olton,50.17,142.88,72.57,131.54,347,Single-ply,SBD,M,
Boys,59.87,1,Aidon Olivas,Sundown,58.88,163.29,90.72,163.29,417.3,Single-ply,SBD,M,
Boys,59.87,2,Brayden Sanders,Sundown,58.42,151.95,68.04,170.1,390.09,Single-ply,SBD,M,
Boys,59.87,3,Joshua Granillo,Olton,58.6,129.27,72.57,140.61,342.46,Single-ply,SBD,M,
Boys,59.87,4,Reice Hixon,Sundown,57.61,115.67,72.57,131.54,319.78,Single-ply,SBD,M,
Boys,59.87,5,Kyndle Esparza,Seagraves,57.42,122.47,63.5,129.27,315.25,Single-ply,SBD,M,
Boys,59.87,DQ,Jason Granillo,Olton,59.42,117.93,74.84,,,Single-ply,SBD,M,
Boys,67.13,1,Pablo Mendoza,Sundown,66.77,199.58,106.59,199.58,505.76,Single-ply,SBD,M,
Boys,67.13,2,Carlos Perez,Sundown,63.23,165.56,90.72,181.44,437.72,Single-ply,SBD,M,
Boys,67.13,3,Rickey Melendez,Sundown,64.05,161.03,99.79,154.22,415.04,Single-ply,SBD,M,
Boys,67.13,4,Xavier Rodriguez,Olton,67.13,127.01,90.72,154.22,371.95,Single-ply,SBD,M,
Boys,67.13,5,Koy Torres,Sundown,62.69,149.69,70.31,145.15,365.14,Single-ply,SBD,M,
Boys,67.13,6,Thomas Sullivan,Tahoka,63.5,108.86,68.04,161.03,337.93,Single-ply,SBD,M,
Boys,67.13,7,Baldo Garcia,Olton,66.95,104.33,83.91,147.42,335.66,Single-ply,SBD,M,
Boys,67.13,8,Landon Sehon,Sundown,67.13,120.2,74.84,124.74,319.78,Single-ply,SBD,M,
Boys,67.13,9,Paxtyn Gwin,Tahoka,62.41,104.33,79.38,102.06,285.76,Single-ply,SBD,M,
Boys,67.13,DQ,Marcos Hernandez,Sundown,61.96,165.56,,,,Single-ply,SBD,M,
Boys,74.84,1,Mark Reyna,Sundown,68.49,174.63,90.72,185.97,451.32,Single-ply,SBD,M,
Boys,74.84,2,Jc Camacho,Sundown,73.3,142.88,81.65,163.29,387.82,Single-ply,SBD,M,
Boys,74.84,3,Adiryn Herevia,Tahoka,69.85,124.74,72.57,142.88,340.19,Single-ply,SBD,M,
Boys,74.84,4,Kodee Roque,Olton,69.94,113.4,68.04,142.88,324.32,Single-ply,SBD,M,
Boys,74.84,DQ,Christian Chancey,Olton,70.13,,,,,Single-ply,SBD,M,
Boys,82.1,1,Kevin Garcia,Sundown,80.47,210.92,140.61,226.8,578.33,Single-ply,SBD,M,
Boys,82.1,2,Diego Hernandez,Sundown,80.83,217.72,127.01,222.26,566.99,Single-ply,SBD,M,
Boys,82.1,3,Aldo Vasquez,Olton,79.38,226.8,124.74,208.65,560.19,Single-ply,SBD,M,
Boys,82.1,4,EJ Hernandez,Sundown,77.75,192.78,120.2,206.38,519.36,Single-ply,SBD,M,
Boys,82.1,5,Omar Rodriguez,Sundown,81.65,188.24,131.54,190.51,510.29,Single-ply,SBD,M,
Boys,82.1,6,Damian Marquez,Olton,78.83,142.88,113.4,163.29,419.57,Single-ply,SBD,M,
Boys,82.1,7,Hunter Tindol,Sundown,75.57,142.88,88.45,163.29,394.63,Single-ply,SBD,M,
Boys,82.1,8,Isiah Flores,Sundown,81.01,156.49,92.99,145.15,394.63,Single-ply,SBD,M,
Boys,82.1,9,Logan Boggs,Sundown,79.65,136.08,92.99,147.42,376.48,Single-ply,SBD,M,
Boys,89.81,1,Dylan Quintero,Tahoka,84.37,145.15,102.06,174.63,421.84,Single-ply,SBD,M,
Boys,99.79,1,Jonathon Golightly,Sundown,95.98,204.12,136.08,195.04,535.24,Single-ply,SBD,M,
Boys,99.79,2,Alex Tew,Tahoka,89.99,158.76,95.25,206.38,460.4,Single-ply,SBD,M,
Boys,99.79,3,Diego Romero,Sundown,92.26,142.88,106.59,158.76,408.23,Single-ply,SBD,M,
Boys,109.77,1,Jadon McAdams,Sundown,107.14,149.69,104.33,147.42,401.43,Single-ply,SBD,M,
Boys,124.74,1,Andy Castillo,Sundown,111.86,247.21,131.54,233.6,612.35,Single-ply,SBD,M,
Boys,124.74,2,Jeffery Rodriguez,Sundown,114.49,204.12,113.4,208.65,526.17,Single-ply,SBD,M,
Boys,124.74,3,Chris Castillo,Sundown,121.38,183.7,127.01,183.7,494.42,Single-ply,SBD,M,
Boys,124.74,4,Dekota Golightly,Sundown,117.03,190.51,124.74,167.83,483.08,Single-ply,SBD,M,
Boys,139.71,1,Nico Rodriguez,Sundown,131.36,249.48,163.29,210.92,623.69,Single-ply,SBD,M,
Boys,139.71,2,Kade Hurt,Tahoka,138.98,172.37,70.31,179.17,421.84,Single-ply,SBD,M,
Boys,139.71+,1,Konar Alaman,Sundown,173.27,183.7,142.88,156.49,483.08,Single-ply,SBD,M,
Boys,,NS,Grady Roberts,Olton,,,,,,Single-ply,SBD,M,
Boys,,NS,Zephan Schuessler,Tahoka,,,,,,Single-ply,SBD,M,
