Division,WeightClassKg,Place,Name,Team,BodyweightKg,Best3SquatKg,Best3BenchKg,Best3DeadliftKg,TotalKg,Equipment,Event,Sex,BirthDate
Girls,44.23,1,Melanie Hernandez,Columbus,43.64,77.11,36.29,81.65,195.04,Single-ply,SBD,F,
Girls,47.85,1,Vanessa Marquez,Altair Rice,46.72,117.93,43.09,108.86,269.89,Single-ply,SBD,F,
Girls,51.94,1,Brook Grifith,Hallettsville,49.71,79.38,36.29,86.18,201.85,Single-ply,SBD,F,
Girls,56.02,1,Raegan Nelson,Altair Rice,55.16,124.74,58.97,122.47,306.17,Single-ply,SBD,F,
Girls,60.1,1,Bradi Freeman,Altair Rice,59.87,142.88,61.23,124.74,328.85,Single-ply,SBD,F,
Girls,60.1,2,Alexia Rico,Altair Rice,56.88,99.79,38.56,92.99,231.33,Single-ply,SBD,F,
Girls,67.36,1,Diamond Flores,Altair Rice,65.77,122.47,54.43,117.93,294.84,Single-ply,SBD,F,
Girls,67.36,2,Jessica Gracia,Altair Rice,66.41,81.65,45.36,95.25,222.26,Single-ply,SBD,F,
Girls,67.36,DQ,Delaney Gray,Altair Rice,67.13,,54.43,120.2,,Single-ply,SBD,F,
Girls,75.07,1,Summer Castro,Altair Rice,68.49,151.95,65.77,142.88,360.61,Single-ply,SBD,F,
Girls,75.07,2,Patricia Ellis,Altair Rice,74.84,142.88,45.36,131.54,319.78,Single-ply,SBD,F,
Girls,75.07,3,Andrea Davidson,Altair Rice,70.22,90.72,38.56,124.74,254.01,Single-ply,SBD,F,
Girls,75.07,4,Julissa Barboza,Altair Rice,72.71,54.43,34.02,86.18,174.63,Single-ply,SBD,F,
Girls,82.33,1,Lexi Ybarra,Columbus,81.56,90.72,45.36,86.18,222.26,Single-ply,SBD,F,
Girls,90.04,1,Haleigh Johnke,Hallettsville,82.74,102.06,47.63,120.2,269.89,Single-ply,SBD,F,
Girls,100.02,1,Claire Class,Altair Rice,92.99,65.77,31.75,97.52,195.04,Single-ply,SBD,F,
Girls,117.71,1,Samantha Ferguson,Altair Rice,106.59,145.15,49.9,115.67,310.71,Single-ply,SBD,F,
Girls,117.71,DQ,Siriah Rodriguez,Altair Rice,105.01,,,,,Single-ply,SBD,F,
Girls,117.71+,1,Carolina Brown,Hallettsville,143.34,115.67,63.5,129.27,308.44,Single-ply,SBD,F,
Girls,,NS,Zoe Pore,Columbus,,,,,,Single-ply,SBD,F,
