Division,WeightClassKg,Place,Name,Team,BodyweightKg,Best3SquatKg,Best3BenchKg,Best3DeadliftKg,TotalKg,Equipment,Event,Sex,BirthDate
Girls,44.23,1,Savannah Ramirez,San Antonio Southwest Legacy,42.32,92.99,38.56,102.06,233.6,Single-ply,SBD,F,
Girls,51.94,1,Stacey Hartmann,Marion,51.89,88.45,49.9,111.13,249.48,Single-ply,SBD,F,
Girls,51.94,2,Sunny Knight,Marion,50.85,77.11,43.09,92.99,213.19,Single-ply,SBD,F,
Girls,56.02,1,Abigail Ramos,San Antonio Southwest Legacy,55.75,136.08,61.23,133.81,331.12,Single-ply,SBD,F,
Girls,56.02,2,Aurianna Rich,Pleasanton,53.34,111.13,72.57,133.81,317.51,Single-ply,SBD,F,
Girls,56.02,3,Savannah Dickey,Marion,55.43,117.93,52.16,129.27,299.37,Single-ply,SBD,F,
Girls,56.02,4,Autumn Guerra,Pleasanton,54.75,108.86,58.97,115.67,283.5,Single-ply,SBD,F,
Girls,56.02,5,Natalie Muniz,Pleasanton,55.79,115.67,56.7,106.59,278.96,Single-ply,SBD,F,
Girls,60.1,1,Fe Vielma,Pleasanton,58.01,97.52,52.16,104.33,254.01,Single-ply,SBD,F,
Girls,60.1,DQ,Brinley Murphy,Marion,60.1,90.72,,,,Single-ply,SBD,F,
Girls,67.36,1,Shelby Sczepanik,Pleasanton,65.09,115.67,49.9,136.08,301.64,Single-ply,SBD,F,
Girls,67.36,2,Angel Gonzales,San Antonio Southwest Legacy,62.05,108.86,61.23,124.74,294.84,Single-ply,SBD,F,
Girls,67.36,3,Hailey Chalico,Blanco,62.28,86.18,47.63,88.45,222.26,Single-ply,SBD,F,
Girls,67.36,4,Marissa Ruiz,Blanco,60.24,81.65,45.36,90.72,217.72,Single-ply,SBD,F,
Girls,75.07,1,Crystal Altamirano,San Antonio Southwest Legacy,68.9,133.81,72.57,111.13,317.51,Single-ply,SBD,F,
Girls,75.07,2,Sam Sanchez #2,Marion,72.3,106.59,56.7,115.67,278.96,Single-ply,SBD,F,
Girls,75.07,3,Alex Hartman,Blanco,72.12,104.33,63.5,106.59,274.42,Single-ply,SBD,F,
Girls,82.33,1,Emily Windham,Blanco,78.88,115.67,74.84,127.01,317.51,Single-ply,SBD,F,
Girls,82.33,2,Delaney Gonzalez,Blanco,77.47,86.18,49.9,92.99,229.06,Single-ply,SBD,F,
Girls,82.33,3,Liah Villareal,Marion,79.56,65.77,29.48,74.84,170.1,Single-ply,SBD,F,
Girls,82.33,DQ,Sofia Aguilar,Pleasanton,75.66,,,,,Single-ply,SBD,F,
Girls,90.04,1,Kiley Elrod,Blanco,89.95,170.1,99.79,138.35,408.23,Single-ply,SBD,F,
Girls,90.04,2,Jackie Fly,Marion,88.86,145.15,72.57,138.35,356.07,Single-ply,SBD,F,
Girls,90.04,3,Karina Martinez,Pleasanton,84.87,102.06,68.04,111.13,281.23,Single-ply,SBD,F,
Girls,100.02,1,Kayla Salazar,Pleasanton,95.25,136.08,63.5,147.42,347,Single-ply,SBD,F,
Girls,117.71,1,Samantha Salazar,Pleasanton,101.33,129.27,56.7,140.61,326.59,Single-ply,SBD,F,
