Division,WeightClassKg,Place,Name,Team,BodyweightKg,Best3SquatKg,Best3BenchKg,Best3DeadliftKg,TotalKg,Equipment,Event,Sex,BirthDate
Boys,55.79,1,Andrew Santoyo,Rice,55.52,136.08,61.23,133.81,331.12,Single-ply,SBD,M,
Boys,67.13,1,Krissangel Lopez,Rice,65.32,149.69,61.23,158.76,369.68,Single-ply,SBD,M,
Boys,67.13,2,Chance Cox,Rice,65.14,142.88,90.72,120.2,353.8,Single-ply,SBD,M,
Boys,74.84,1,Noah Cabrera,Palmer,72.57,151.95,102.06,167.83,421.84,Single-ply,SBD,M,
Boys,74.84,2,Cutter Burrow,Palmer,73.03,142.88,79.38,142.88,365.14,Single-ply,SBD,M,
Boys,74.84,DQ,Carson Selman,Rice,71.03,149.69,90.72,,,Single-ply,SBD,M,
Boys,74.84,DQ,Tommy Bernal,Rice,74.53,,,,,Single-ply,SBD,M,
Boys,82.1,1,Arturo Gonzales,Palmer,76.2,176.9,111.13,181.44,469.47,Single-ply,SBD,M,
Boys,82.1,2,Juan Paredes,Rice,81.65,183.7,102.06,183.7,469.47,Single-ply,SBD,M,
Boys,82.1,3,Collin Graves,Palmer,80.29,142.88,113.4,183.7,439.98,Single-ply,SBD,M,
Boys,82.1,4,Ivan Chavez,Palmer,80.74,165.56,90.72,158.76,415.04,Single-ply,SBD,M,
Boys,82.1,5,Nate Foshee,Palmer,80.74,124.74,65.77,151.95,342.46,Single-ply,SBD,M,
Boys,89.81,1,Chris Guevara,Rice,88,136.08,61.23,147.42,344.73,Single-ply,SBD,M,
Boys,89.81,DQ,Marcus Diaz,Rice,88.99,,,,,Single-ply,SBD,M,
Boys,99.79,1,Jerry Montgomery,Rice,95.44,249.48,149.69,204.12,603.28,Single-ply,SBD,M,
Boys,99.79,2,Anthony Ovalle,Rice,99.16,161.03,97.52,158.76,417.3,Single-ply,SBD,M,
Boys,124.74,1,Jett Maxwell,Palmer,114.31,158.76,92.99,158.76,410.5,Single-ply,SBD,M,
Boys,124.74,2,Adrian Ramirez,Palmer,118.39,124.74,90.72,165.56,381.02,Single-ply,SBD,M,
