Division,WeightClassKg,Place,Name,Team,BodyweightKg,Best3SquatKg,Best3BenchKg,Best3DeadliftKg,TotalKg,Equipment,Event,Sex,BirthDate
Boys,51.71,1,Keegan Mantanona,Salado,51.44,129.27,70.31,117.93,317.51,Single-ply,SBD,M,
Boys,51.71,2,Collin Gascon,Belton,47.63,97.52,54.43,102.06,254.01,Single-ply,SBD,M,
Boys,55.79,1,Hunter Kazmir,Caldwell,55.7,108.86,61.23,115.67,285.76,Single-ply,SBD,M,
Boys,55.79,DQ,David Price,College Station A&M Cons,55.57,102.06,40.82,111.13,,Single-ply,SBD,M,
Boys,67.13,1,Ladavon Springs-Hargrove,Waco,67.13,174.63,124.74,190.51,489.88,Single-ply,SBD,M,
Boys,67.13,2,Matthew Martin,College Station A&M Cons,67.13,181.44,115.67,172.37,469.47,Single-ply,SBD,M,
Boys,67.13,3,Gavin Martinez,College Station A&M Cons,64.05,124.74,65.77,122.47,312.98,Single-ply,SBD,M,
Boys,74.84,1,Tanner Lightsey,College Station A&M Cons,73.98,204.12,102.06,176.9,483.08,Single-ply,SBD,M,
Boys,74.84,2,Cooper Scott,Salado,74.12,176.9,111.13,163.29,451.32,Single-ply,SBD,M,
Boys,74.84,DQ,Cason Garner,College Station A&M Cons,70.9,129.27,83.91,151.95,,Single-ply,SBD,M,
Boys,82.1,1,Dj May,College Station A&M Cons,82.05,254.01,120.2,195.04,569.26,Single-ply,SBD,M,
Boys,82.1,2,Cooper Carroll,Salado,76.84,208.65,108.86,201.85,519.36,Single-ply,SBD,M,
Boys,82.1,3,Braydon Sumners,Salado,76.75,170.1,113.4,167.83,451.32,Single-ply,SBD,M,
Boys,82.1,4,Ashton Jasperson,College Station A&M Cons,77.66,163.29,92.99,185.97,442.25,Single-ply,SBD,M,
Boys,82.1,5,Paxson Berkey,College Station A&M Cons,81.92,163.29,90.72,165.56,419.57,Single-ply,SBD,M,
Boys,82.1,DQ,Darius Turner,College Station A&M Cons,78.97,172.37,90.72,151.95,,Single-ply,SBD,M,
Boys,89.81,1,Brock Slaydon,College Station A&M Cons,82.37,244.94,149.69,226.8,621.42,Single-ply,SBD,M,
Boys,89.81,2,Omarion Delao,Waco,88.81,206.38,124.74,199.58,530.7,Single-ply,SBD,M,
Boys,89.81,3,Jayten Burt,Salado,89.63,199.58,129.27,190.51,519.36,Single-ply,SBD,M,
Boys,89.81,4,Wayon Padleski,Salado,83.91,199.58,124.74,188.24,512.56,Single-ply,SBD,M,
Boys,89.81,5,Austin Compte,College Station A&M Cons,88.99,190.51,113.4,190.51,494.42,Single-ply,SBD,M,
Boys,89.81,DQ,Tristan White,College Station A&M Cons,89.54,206.38,136.08,192.78,,Single-ply,SBD,M,
Boys,99.79,1,Aiden Wilson,Salado,95.44,231.33,133.81,233.6,598.74,Single-ply,SBD,M,
Boys,99.79,2,Jonah Myers,Belton,94.35,231.33,140.61,204.12,576.06,Single-ply,SBD,M,
Boys,99.79,3,Blake Volk,Salado,92.35,204.12,136.08,204.12,544.31,Single-ply,SBD,M,
Boys,99.79,3,Darren Paul,Waco,98.88,213.19,133.81,199.58,546.58,Single-ply,SBD,M,
Boys,99.79,4,Dray McLane,Salado,97.52,208.65,120.2,204.12,532.97,Single-ply,SBD,M,
Boys,99.79,DQ,Christian Waters,College Station A&M Cons,99.43,213.19,106.59,201.85,,Single-ply,SBD,M,
Boys,109.77,1,Klayton Sheffield,College Station A&M Cons,106.19,233.6,140.61,206.38,580.6,Single-ply,SBD,M,
Boys,109.77,2,Kyle Greer,College Station A&M Cons,108.05,240.4,133.81,197.31,571.53,Single-ply,SBD,M,
Boys,109.77,4,Beau Hill,Salado,109.04,204.12,124.74,183.7,512.56,Single-ply,SBD,M,
Boys,109.77,5,Micah Moore,Waco,108.41,183.7,127.01,190.51,501.22,Single-ply,SBD,M,
Boys,109.77,6,Hudson House,College Station A&M Cons,104.78,192.78,106.59,192.78,492.15,Single-ply,SBD,M,
Boys,109.77,7,Garrett Combs,Salado,106.23,185.97,115.67,185.97,487.61,Single-ply,SBD,M,
Boys,124.74,1,Gavyn Keyser,Salado,124.65,238.14,158.76,201.85,598.74,Single-ply,SBD,M,
Boys,124.74,2,Ryan Brodauss,Caldwell,115.67,192.78,136.08,190.51,519.36,Single-ply,SBD,M,
Boys,124.74,3,JaKai Bams,College Station A&M Cons,115.71,185.97,117.93,195.04,498.95,Single-ply,SBD,M,
Boys,124.74,4,Javon Bryant,Waco,116.75,167.83,77.11,136.08,381.02,Single-ply,SBD,M,
Boys,124.74,5,Isaac Rivera,Waco,118.02,158.76,81.65,140.61,381.02,Single-ply,SBD,M,
Boys,124.74,DQ,Luke Grant,Waco,118.3,,90.72,131.54,,Single-ply,SBD,M,
Boys,139.71,1,Joey Lightfoot,College Station A&M Cons,127.05,240.4,145.15,213.19,598.74,Single-ply,SBD,M,
Boys,139.71,2,Garrett Tittle,Caldwell,126.01,238.14,142.88,192.78,573.79,Single-ply,SBD,M,
Boys,139.71,3,Timothy Chandler,College Station A&M Cons,127.5,226.8,117.93,156.49,501.22,Single-ply,SBD,M,
Boys,139.71,4,Gerardo Garcia,Waco,132.45,174.63,70.31,158.76,403.7,Single-ply,SBD,M,
Boys,139.71+,1,Delvin Morris,Caldwell,142.97,188.24,115.67,204.12,508.02,Single-ply,SBD,M,
Boys,139.71+,2,Angel Longoria #4,Belton,187.33,183.7,113.4,197.31,494.42,Single-ply,SBD,M,
Boys,,NS,Cayden Maxwell,Caldwell,,161.03,102.06,161.03,,Single-ply,SBD,M,
Boys,,NS,Julian Watkins,Waco,,163.29,83.91,165.56,,Single-ply,SBD,M,
Boys,,NS,Marvin Huitt,Waco,,163.29,111.13,165.56,,Single-ply,SBD,M,
Boys,,NS,J'Kyrin Flentroy,Hearne,,142.88,95.25,183.7,,Single-ply,SBD,M,
