Division,WeightClassKg,Place,Name,Team,BodyweightKg,Best3SquatKg,Best3BenchKg,Best3DeadliftKg,TotalKg,Equipment,Event,Sex,BirthDate
Boys,59.87,1,Christian Castro,Bryan,56.25,149.69,88.45,158.76,396.89,Single-ply,SBD,M,
Boys,59.87,2,Nick Villarreal,Bryan Rudder,59.42,102.06,56.7,136.08,294.84,Single-ply,SBD,M,
Boys,67.13,1,Ladavon Springs-Hargrove,Waco,66.68,165.56,120.2,183.7,469.47,Single-ply,SBD,M,
Boys,67.13,2,Michael Lister,Bryan Rudder,65.77,83.91,106.59,106.59,297.1,Single-ply,SBD,M,
Boys,74.84,1,Trace Emola,Bryan Rudder,74.84,142.88,79.38,142.88,365.14,Single-ply,SBD,M,
Boys,74.84,2,George Nunez,Bryan,71.21,117.93,83.91,131.54,333.39,Single-ply,SBD,M,
Boys,82.1,1,Marcus Heard,Bryan Rudder,79.83,172.37,108.86,183.7,464.93,Single-ply,SBD,M,
Boys,82.1,2,Jamarion West,Bryan Rudder,81.65,99.79,86.18,158.76,344.73,Single-ply,SBD,M,
Boys,89.81,1,Ej Ezar,Bryan Rudder,89.36,215.46,136.08,206.38,557.92,Single-ply,SBD,M,
Boys,89.81,2,Omarion Delao,Waco,87.09,181.44,111.13,183.7,476.27,Single-ply,SBD,M,
Boys,89.81,3,Hunter McGary,Bryan Rudder,88.9,161.03,88.45,154.22,403.7,Single-ply,SBD,M,
Boys,99.79,1,Darren Paul,Waco,98.88,208.65,127.01,199.58,535.24,Single-ply,SBD,M,
Boys,99.79,2,JaMarcus Jones,Bryan Rudder,92.08,195.04,124.74,201.85,521.63,Single-ply,SBD,M,
Boys,99.79,3,Cole Hopkins,Bryan Rudder,91.17,188.24,99.79,206.38,494.42,Single-ply,SBD,M,
Boys,99.79,4,Jayden Williams,Bryan Rudder,99.34,188.24,102.06,183.7,474,Single-ply,SBD,M,
Boys,99.79,5,Ryne Hutchinson,Bryan Rudder,93.44,102.06,79.38,142.88,324.32,Single-ply,SBD,M,
Boys,109.77,1,Ishmeal Ealoms,Bryan,103.87,206.38,129.27,210.92,546.58,Single-ply,SBD,M,
Boys,109.77,2,Xavier Camero,Bryan Rudder,109.32,197.31,129.27,183.7,510.29,Single-ply,SBD,M,
Boys,109.77,3,Micah Moore,Waco,105.69,183.7,113.4,190.51,487.61,Single-ply,SBD,M,
Boys,124.74,1,JonTavion Workman,Bryan,122.02,217.72,145.15,254.01,616.89,Single-ply,SBD,M,
Boys,124.74,2,Austin Pennington,Bryan,122.47,238.14,129.27,235.87,603.28,Single-ply,SBD,M,
Boys,124.74,3,Jaron Jackson,Bryan,122.47,217.72,131.54,210.92,560.19,Single-ply,SBD,M,
Boys,124.74,4,Jason Batiste,Bryan Rudder,120.2,215.46,104.33,185.97,505.76,Single-ply,SBD,M,
Boys,124.74,5,Isaac Rivera,Waco,116.12,158.76,77.11,140.61,376.48,Single-ply,SBD,M,
Boys,124.74,6,Luke Grant,Waco,117.48,131.54,90.72,131.54,353.8,Single-ply,SBD,M,
