{
  "name": "<%= name %>",
  "version": "<%= version %>",
  "description" : "<%= description %>",
  "repository" : "",
  "author": "Iurii Kyian <kyyany@yahoo.com>",
  "license": "MIT",
  "private" : true,
  "dependencies": {},
  "devDependencies": {
    "grunt": "~0.4.5",
    "grunt-browserify" : "^5.0.0",
    "grunt-browserify-jst" : "^1.0.1",
    "grunt-contrib-clean": "^1.0.0",
    "grunt-contrib-compass": "^1.0.3",
    "grunt-contrib-jshint": "^1.0.0",
    "grunt-contrib-watch": "^1.0.0",
    "grunt-serve": "~0.1.6",
    "underscore" : "~1.8.3",
    "jquery" : "~2.2.3",
    "backbone" : "~1.3.3"
  }
}
