^C:\USERS\OIER\DESKTOP\MU\PBLA\CLASH_OF_TANKS\PROJECT1\FUNTZIOAK\APPLICATION.C
/c /IC:\USERS\OIER\DESKTOP\MU\PBLA\CLASH_OF_TANKS\PACKAGES\SDL2.NUGET.2.0.14\BUILD\NATIVE\../..//BUILD/NATIVE/INCLUDE/ /IC:\USERS\OIER\DESKTOP\MU\PBLA\CLASH_OF_TANKS\PACKAGES\SDL2_MIXER.NUGET.2.0.4\BUILD\NATIVE\../..//BUILD/NATIVE/INCLUDE/ /IC:\USERS\OIER\DESKTOP\MU\PBLA\CLASH_OF_TANKS\PACKAGES\SDL2_TTF.NUGET.2.0.15\BUILD\NATIVE\../..//BUILD/NATIVE/INCLUDE/ /IC:\USERS\OIER\DESKTOP\MU\PBLA\CLASH_OF_TANKS\PACKAGES\SDL2_IMAGE.NUGET.2.0.5\BUILD\NATIVE\../..//BUILD/NATIVE/INCLUDE/ /IC:\USERS\OIER\DESKTOP\MU\PBLA\CLASH_OF_TANKS\PACKAGES\SDL2.2.0.5\BUILD\NATIVE\../..//BUILD/NATIVE/INCLUDE/ /ZI /JMC /nologo /W3 /WX- /diagnostics:column /sdl /Od /Oy- /D HAS_SDL2 /D HAS_SDL2 /D HAS_SDL2 /D HAS_SDL2 /D HAS_SDL2 /D WIN32 /D _DEBUG /D _CONSOLE /D _UNICODE /D UNICODE /Gm- /EHsc /RTC1 /MDd /GS /fp:precise /permissive- /Zc:wchar_t /Zc:forScope /Zc:inline /Fo"DEBUG\\" /Fd"DEBUG\VC142.PDB" /Gd /TC /analyze- /FC C:\USERS\OIER\DESKTOP\MU\PBLA\CLASH_OF_TANKS\PROJECT1\FUNTZIOAK\APPLICATION.C
^C:\USERS\OIER\DESKTOP\MU\PBLA\CLASH_OF_TANKS\PROJECT1\FUNTZIOAK\BOTOIAK.C
/c /IC:\USERS\OIER\DESKTOP\MU\PBLA\CLASH_OF_TANKS\PACKAGES\SDL2.NUGET.2.0.14\BUILD\NATIVE\../..//BUILD/NATIVE/INCLUDE/ /IC:\USERS\OIER\DESKTOP\MU\PBLA\CLASH_OF_TANKS\PACKAGES\SDL2_MIXER.NUGET.2.0.4\BUILD\NATIVE\../..//BUILD/NATIVE/INCLUDE/ /IC:\USERS\OIER\DESKTOP\MU\PBLA\CLASH_OF_TANKS\PACKAGES\SDL2_TTF.NUGET.2.0.15\BUILD\NATIVE\../..//BUILD/NATIVE/INCLUDE/ /IC:\USERS\OIER\DESKTOP\MU\PBLA\CLASH_OF_TANKS\PACKAGES\SDL2_IMAGE.NUGET.2.0.5\BUILD\NATIVE\../..//BUILD/NATIVE/INCLUDE/ /IC:\USERS\OIER\DESKTOP\MU\PBLA\CLASH_OF_TANKS\PACKAGES\SDL2.2.0.5\BUILD\NATIVE\../..//BUILD/NATIVE/INCLUDE/ /ZI /JMC /nologo /W3 /WX- /diagnostics:column /sdl /Od /Oy- /D HAS_SDL2 /D HAS_SDL2 /D HAS_SDL2 /D HAS_SDL2 /D HAS_SDL2 /D WIN32 /D _DEBUG /D _CONSOLE /D _UNICODE /D UNICODE /Gm- /EHsc /RTC1 /MDd /GS /fp:precise /permissive- /Zc:wchar_t /Zc:forScope /Zc:inline /Fo"DEBUG\\" /Fd"DEBUG\VC142.PDB" /Gd /TC /analyze- /FC C:\USERS\OIER\DESKTOP\MU\PBLA\CLASH_OF_TANKS\PROJECT1\FUNTZIOAK\BOTOIAK.C
^C:\USERS\OIER\DESKTOP\MU\PBLA\CLASH_OF_TANKS\PROJECT1\FUNTZIOAK\BULLET.C
/c /IC:\USERS\OIER\DESKTOP\MU\PBLA\CLASH_OF_TANKS\PACKAGES\SDL2.NUGET.2.0.14\BUILD\NATIVE\../..//BUILD/NATIVE/INCLUDE/ /IC:\USERS\OIER\DESKTOP\MU\PBLA\CLASH_OF_TANKS\PACKAGES\SDL2_MIXER.NUGET.2.0.4\BUILD\NATIVE\../..//BUILD/NATIVE/INCLUDE/ /IC:\USERS\OIER\DESKTOP\MU\PBLA\CLASH_OF_TANKS\PACKAGES\SDL2_TTF.NUGET.2.0.15\BUILD\NATIVE\../..//BUILD/NATIVE/INCLUDE/ /IC:\USERS\OIER\DESKTOP\MU\PBLA\CLASH_OF_TANKS\PACKAGES\SDL2_IMAGE.NUGET.2.0.5\BUILD\NATIVE\../..//BUILD/NATIVE/INCLUDE/ /IC:\USERS\OIER\DESKTOP\MU\PBLA\CLASH_OF_TANKS\PACKAGES\SDL2.2.0.5\BUILD\NATIVE\../..//BUILD/NATIVE/INCLUDE/ /ZI /JMC /nologo /W3 /WX- /diagnostics:column /sdl /Od /Oy- /D HAS_SDL2 /D HAS_SDL2 /D HAS_SDL2 /D HAS_SDL2 /D HAS_SDL2 /D WIN32 /D _DEBUG /D _CONSOLE /D _UNICODE /D UNICODE /Gm- /EHsc /RTC1 /MDd /GS /fp:precise /permissive- /Zc:wchar_t /Zc:forScope /Zc:inline /Fo"DEBUG\\" /Fd"DEBUG\VC142.PDB" /Gd /TC /analyze- /FC C:\USERS\OIER\DESKTOP\MU\PBLA\CLASH_OF_TANKS\PROJECT1\FUNTZIOAK\BULLET.C
^C:\USERS\OIER\DESKTOP\MU\PBLA\CLASH_OF_TANKS\PROJECT1\FUNTZIOAK\COLLISIONS.C
/c /IC:\USERS\OIER\DESKTOP\MU\PBLA\CLASH_OF_TANKS\PACKAGES\SDL2.NUGET.2.0.14\BUILD\NATIVE\../..//BUILD/NATIVE/INCLUDE/ /IC:\USERS\OIER\DESKTOP\MU\PBLA\CLASH_OF_TANKS\PACKAGES\SDL2_MIXER.NUGET.2.0.4\BUILD\NATIVE\../..//BUILD/NATIVE/INCLUDE/ /IC:\USERS\OIER\DESKTOP\MU\PBLA\CLASH_OF_TANKS\PACKAGES\SDL2_TTF.NUGET.2.0.15\BUILD\NATIVE\../..//BUILD/NATIVE/INCLUDE/ /IC:\USERS\OIER\DESKTOP\MU\PBLA\CLASH_OF_TANKS\PACKAGES\SDL2_IMAGE.NUGET.2.0.5\BUILD\NATIVE\../..//BUILD/NATIVE/INCLUDE/ /IC:\USERS\OIER\DESKTOP\MU\PBLA\CLASH_OF_TANKS\PACKAGES\SDL2.2.0.5\BUILD\NATIVE\../..//BUILD/NATIVE/INCLUDE/ /ZI /JMC /nologo /W3 /WX- /diagnostics:column /sdl /Od /Oy- /D HAS_SDL2 /D HAS_SDL2 /D HAS_SDL2 /D HAS_SDL2 /D HAS_SDL2 /D WIN32 /D _DEBUG /D _CONSOLE /D _UNICODE /D UNICODE /Gm- /EHsc /RTC1 /MDd /GS /fp:precise /permissive- /Zc:wchar_t /Zc:forScope /Zc:inline /Fo"DEBUG\\" /Fd"DEBUG\VC142.PDB" /Gd /TC /analyze- /FC C:\USERS\OIER\DESKTOP\MU\PBLA\CLASH_OF_TANKS\PROJECT1\FUNTZIOAK\COLLISIONS.C
^C:\USERS\OIER\DESKTOP\MU\PBLA\CLASH_OF_TANKS\PROJECT1\FUNTZIOAK\JOKALARIAK.C
/c /IC:\USERS\OIER\DESKTOP\MU\PBLA\CLASH_OF_TANKS\PACKAGES\SDL2.NUGET.2.0.14\BUILD\NATIVE\../..//BUILD/NATIVE/INCLUDE/ /IC:\USERS\OIER\DESKTOP\MU\PBLA\CLASH_OF_TANKS\PACKAGES\SDL2_MIXER.NUGET.2.0.4\BUILD\NATIVE\../..//BUILD/NATIVE/INCLUDE/ /IC:\USERS\OIER\DESKTOP\MU\PBLA\CLASH_OF_TANKS\PACKAGES\SDL2_TTF.NUGET.2.0.15\BUILD\NATIVE\../..//BUILD/NATIVE/INCLUDE/ /IC:\USERS\OIER\DESKTOP\MU\PBLA\CLASH_OF_TANKS\PACKAGES\SDL2_IMAGE.NUGET.2.0.5\BUILD\NATIVE\../..//BUILD/NATIVE/INCLUDE/ /IC:\USERS\OIER\DESKTOP\MU\PBLA\CLASH_OF_TANKS\PACKAGES\SDL2.2.0.5\BUILD\NATIVE\../..//BUILD/NATIVE/INCLUDE/ /ZI /JMC /nologo /W3 /WX- /diagnostics:column /sdl /Od /Oy- /D HAS_SDL2 /D HAS_SDL2 /D HAS_SDL2 /D HAS_SDL2 /D HAS_SDL2 /D WIN32 /D _DEBUG /D _CONSOLE /D _UNICODE /D UNICODE /Gm- /EHsc /RTC1 /MDd /GS /fp:precise /permissive- /Zc:wchar_t /Zc:forScope /Zc:inline /Fo"DEBUG\\" /Fd"DEBUG\VC142.PDB" /Gd /TC /analyze- /FC C:\USERS\OIER\DESKTOP\MU\PBLA\CLASH_OF_TANKS\PROJECT1\FUNTZIOAK\JOKALARIAK.C
^C:\USERS\OIER\DESKTOP\MU\PBLA\CLASH_OF_TANKS\PROJECT1\FUNTZIOAK\MAPS.C
/c /IC:\USERS\OIER\DESKTOP\MU\PBLA\CLASH_OF_TANKS\PACKAGES\SDL2.NUGET.2.0.14\BUILD\NATIVE\../..//BUILD/NATIVE/INCLUDE/ /IC:\USERS\OIER\DESKTOP\MU\PBLA\CLASH_OF_TANKS\PACKAGES\SDL2_MIXER.NUGET.2.0.4\BUILD\NATIVE\../..//BUILD/NATIVE/INCLUDE/ /IC:\USERS\OIER\DESKTOP\MU\PBLA\CLASH_OF_TANKS\PACKAGES\SDL2_TTF.NUGET.2.0.15\BUILD\NATIVE\../..//BUILD/NATIVE/INCLUDE/ /IC:\USERS\OIER\DESKTOP\MU\PBLA\CLASH_OF_TANKS\PACKAGES\SDL2_IMAGE.NUGET.2.0.5\BUILD\NATIVE\../..//BUILD/NATIVE/INCLUDE/ /IC:\USERS\OIER\DESKTOP\MU\PBLA\CLASH_OF_TANKS\PACKAGES\SDL2.2.0.5\BUILD\NATIVE\../..//BUILD/NATIVE/INCLUDE/ /ZI /JMC /nologo /W3 /WX- /diagnostics:column /sdl /Od /Oy- /D HAS_SDL2 /D HAS_SDL2 /D HAS_SDL2 /D HAS_SDL2 /D HAS_SDL2 /D WIN32 /D _DEBUG /D _CONSOLE /D _UNICODE /D UNICODE /Gm- /EHsc /RTC1 /MDd /GS /fp:precise /permissive- /Zc:wchar_t /Zc:forScope /Zc:inline /Fo"DEBUG\\" /Fd"DEBUG\VC142.PDB" /Gd /TC /analyze- /FC C:\USERS\OIER\DESKTOP\MU\PBLA\CLASH_OF_TANKS\PROJECT1\FUNTZIOAK\MAPS.C
^C:\USERS\OIER\DESKTOP\MU\PBLA\CLASH_OF_TANKS\PROJECT1\GAME.C
/c /IC:\USERS\OIER\DESKTOP\MU\PBLA\CLASH_OF_TANKS\PACKAGES\SDL2.NUGET.2.0.14\BUILD\NATIVE\../..//BUILD/NATIVE/INCLUDE/ /IC:\USERS\OIER\DESKTOP\MU\PBLA\CLASH_OF_TANKS\PACKAGES\SDL2_MIXER.NUGET.2.0.4\BUILD\NATIVE\../..//BUILD/NATIVE/INCLUDE/ /IC:\USERS\OIER\DESKTOP\MU\PBLA\CLASH_OF_TANKS\PACKAGES\SDL2_TTF.NUGET.2.0.15\BUILD\NATIVE\../..//BUILD/NATIVE/INCLUDE/ /IC:\USERS\OIER\DESKTOP\MU\PBLA\CLASH_OF_TANKS\PACKAGES\SDL2_IMAGE.NUGET.2.0.5\BUILD\NATIVE\../..//BUILD/NATIVE/INCLUDE/ /IC:\USERS\OIER\DESKTOP\MU\PBLA\CLASH_OF_TANKS\PACKAGES\SDL2.2.0.5\BUILD\NATIVE\../..//BUILD/NATIVE/INCLUDE/ /ZI /JMC /nologo /W3 /WX- /diagnostics:column /sdl /Od /Oy- /D HAS_SDL2 /D HAS_SDL2 /D HAS_SDL2 /D HAS_SDL2 /D HAS_SDL2 /D WIN32 /D _DEBUG /D _CONSOLE /D _UNICODE /D UNICODE /Gm- /EHsc /RTC1 /MDd /GS /fp:precise /permissive- /Zc:wchar_t /Zc:forScope /Zc:inline /Fo"DEBUG\\" /Fd"DEBUG\VC142.PDB" /Gd /TC /analyze- /FC C:\USERS\OIER\DESKTOP\MU\PBLA\CLASH_OF_TANKS\PROJECT1\GAME.C
^C:\USERS\OIER\DESKTOP\MU\PBLA\CLASH_OF_TANKS\PROJECT1\MAIN.C
/c /IC:\USERS\OIER\DESKTOP\MU\PBLA\CLASH_OF_TANKS\PACKAGES\SDL2.NUGET.2.0.14\BUILD\NATIVE\../..//BUILD/NATIVE/INCLUDE/ /IC:\USERS\OIER\DESKTOP\MU\PBLA\CLASH_OF_TANKS\PACKAGES\SDL2_MIXER.NUGET.2.0.4\BUILD\NATIVE\../..//BUILD/NATIVE/INCLUDE/ /IC:\USERS\OIER\DESKTOP\MU\PBLA\CLASH_OF_TANKS\PACKAGES\SDL2_TTF.NUGET.2.0.15\BUILD\NATIVE\../..//BUILD/NATIVE/INCLUDE/ /IC:\USERS\OIER\DESKTOP\MU\PBLA\CLASH_OF_TANKS\PACKAGES\SDL2_IMAGE.NUGET.2.0.5\BUILD\NATIVE\../..//BUILD/NATIVE/INCLUDE/ /IC:\USERS\OIER\DESKTOP\MU\PBLA\CLASH_OF_TANKS\PACKAGES\SDL2.2.0.5\BUILD\NATIVE\../..//BUILD/NATIVE/INCLUDE/ /ZI /JMC /nologo /W3 /WX- /diagnostics:column /sdl /Od /Oy- /D HAS_SDL2 /D HAS_SDL2 /D HAS_SDL2 /D HAS_SDL2 /D HAS_SDL2 /D WIN32 /D _DEBUG /D _CONSOLE /D _UNICODE /D UNICODE /Gm- /EHsc /RTC1 /MDd /GS /fp:precise /permissive- /Zc:wchar_t /Zc:forScope /Zc:inline /Fo"DEBUG\\" /Fd"DEBUG\VC142.PDB" /Gd /TC /analyze- /FC C:\USERS\OIER\DESKTOP\MU\PBLA\CLASH_OF_TANKS\PROJECT1\MAIN.C
^C:\USERS\OIER\DESKTOP\MU\PBLA\CLASH_OF_TANKS\PROJECT1\SIMPLESDLWRAPPER\EBENTOAK.C
/c /IC:\USERS\OIER\DESKTOP\MU\PBLA\CLASH_OF_TANKS\PACKAGES\SDL2.NUGET.2.0.14\BUILD\NATIVE\../..//BUILD/NATIVE/INCLUDE/ /IC:\USERS\OIER\DESKTOP\MU\PBLA\CLASH_OF_TANKS\PACKAGES\SDL2_MIXER.NUGET.2.0.4\BUILD\NATIVE\../..//BUILD/NATIVE/INCLUDE/ /IC:\USERS\OIER\DESKTOP\MU\PBLA\CLASH_OF_TANKS\PACKAGES\SDL2_TTF.NUGET.2.0.15\BUILD\NATIVE\../..//BUILD/NATIVE/INCLUDE/ /IC:\USERS\OIER\DESKTOP\MU\PBLA\CLASH_OF_TANKS\PACKAGES\SDL2_IMAGE.NUGET.2.0.5\BUILD\NATIVE\../..//BUILD/NATIVE/INCLUDE/ /IC:\USERS\OIER\DESKTOP\MU\PBLA\CLASH_OF_TANKS\PACKAGES\SDL2.2.0.5\BUILD\NATIVE\../..//BUILD/NATIVE/INCLUDE/ /ZI /JMC /nologo /W3 /WX- /diagnostics:column /sdl /Od /Oy- /D HAS_SDL2 /D HAS_SDL2 /D HAS_SDL2 /D HAS_SDL2 /D HAS_SDL2 /D WIN32 /D _DEBUG /D _CONSOLE /D _UNICODE /D UNICODE /Gm- /EHsc /RTC1 /MDd /GS /fp:precise /permissive- /Zc:wchar_t /Zc:forScope /Zc:inline /Fo"DEBUG\\" /Fd"DEBUG\VC142.PDB" /Gd /TC /analyze- /FC C:\USERS\OIER\DESKTOP\MU\PBLA\CLASH_OF_TANKS\PROJECT1\SIMPLESDLWRAPPER\EBENTOAK.C
^C:\USERS\OIER\DESKTOP\MU\PBLA\CLASH_OF_TANKS\PROJECT1\SIMPLESDLWRAPPER\GRAPHICS.C
/c /IC:\USERS\OIER\DESKTOP\MU\PBLA\CLASH_OF_TANKS\PACKAGES\SDL2.NUGET.2.0.14\BUILD\NATIVE\../..//BUILD/NATIVE/INCLUDE/ /IC:\USERS\OIER\DESKTOP\MU\PBLA\CLASH_OF_TANKS\PACKAGES\SDL2_MIXER.NUGET.2.0.4\BUILD\NATIVE\../..//BUILD/NATIVE/INCLUDE/ /IC:\USERS\OIER\DESKTOP\MU\PBLA\CLASH_OF_TANKS\PACKAGES\SDL2_TTF.NUGET.2.0.15\BUILD\NATIVE\../..//BUILD/NATIVE/INCLUDE/ /IC:\USERS\OIER\DESKTOP\MU\PBLA\CLASH_OF_TANKS\PACKAGES\SDL2_IMAGE.NUGET.2.0.5\BUILD\NATIVE\../..//BUILD/NATIVE/INCLUDE/ /IC:\USERS\OIER\DESKTOP\MU\PBLA\CLASH_OF_TANKS\PACKAGES\SDL2.2.0.5\BUILD\NATIVE\../..//BUILD/NATIVE/INCLUDE/ /ZI /JMC /nologo /W3 /WX- /diagnostics:column /sdl /Od /Oy- /D HAS_SDL2 /D HAS_SDL2 /D HAS_SDL2 /D HAS_SDL2 /D HAS_SDL2 /D WIN32 /D _DEBUG /D _CONSOLE /D _UNICODE /D UNICODE /Gm- /EHsc /RTC1 /MDd /GS /fp:precise /permissive- /Zc:wchar_t /Zc:forScope /Zc:inline /Fo"DEBUG\\" /Fd"DEBUG\VC142.PDB" /Gd /TC /analyze- /FC C:\USERS\OIER\DESKTOP\MU\PBLA\CLASH_OF_TANKS\PROJECT1\SIMPLESDLWRAPPER\GRAPHICS.C
^C:\USERS\OIER\DESKTOP\MU\PBLA\CLASH_OF_TANKS\PROJECT1\SIMPLESDLWRAPPER\IMAGEN.C
/c /IC:\USERS\OIER\DESKTOP\MU\PBLA\CLASH_OF_TANKS\PACKAGES\SDL2.NUGET.2.0.14\BUILD\NATIVE\../..//BUILD/NATIVE/INCLUDE/ /IC:\USERS\OIER\DESKTOP\MU\PBLA\CLASH_OF_TANKS\PACKAGES\SDL2_MIXER.NUGET.2.0.4\BUILD\NATIVE\../..//BUILD/NATIVE/INCLUDE/ /IC:\USERS\OIER\DESKTOP\MU\PBLA\CLASH_OF_TANKS\PACKAGES\SDL2_TTF.NUGET.2.0.15\BUILD\NATIVE\../..//BUILD/NATIVE/INCLUDE/ /IC:\USERS\OIER\DESKTOP\MU\PBLA\CLASH_OF_TANKS\PACKAGES\SDL2_IMAGE.NUGET.2.0.5\BUILD\NATIVE\../..//BUILD/NATIVE/INCLUDE/ /IC:\USERS\OIER\DESKTOP\MU\PBLA\CLASH_OF_TANKS\PACKAGES\SDL2.2.0.5\BUILD\NATIVE\../..//BUILD/NATIVE/INCLUDE/ /ZI /JMC /nologo /W3 /WX- /diagnostics:column /sdl /Od /Oy- /D HAS_SDL2 /D HAS_SDL2 /D HAS_SDL2 /D HAS_SDL2 /D HAS_SDL2 /D WIN32 /D _DEBUG /D _CONSOLE /D _UNICODE /D UNICODE /Gm- /EHsc /RTC1 /MDd /GS /fp:precise /permissive- /Zc:wchar_t /Zc:forScope /Zc:inline /Fo"DEBUG\\" /Fd"DEBUG\VC142.PDB" /Gd /TC /analyze- /FC C:\USERS\OIER\DESKTOP\MU\PBLA\CLASH_OF_TANKS\PROJECT1\SIMPLESDLWRAPPER\IMAGEN.C
^C:\USERS\OIER\DESKTOP\MU\PBLA\CLASH_OF_TANKS\PROJECT1\SIMPLESDLWRAPPER\SOINUA.C
/c /IC:\USERS\OIER\DESKTOP\MU\PBLA\CLASH_OF_TANKS\PACKAGES\SDL2.NUGET.2.0.14\BUILD\NATIVE\../..//BUILD/NATIVE/INCLUDE/ /IC:\USERS\OIER\DESKTOP\MU\PBLA\CLASH_OF_TANKS\PACKAGES\SDL2_MIXER.NUGET.2.0.4\BUILD\NATIVE\../..//BUILD/NATIVE/INCLUDE/ /IC:\USERS\OIER\DESKTOP\MU\PBLA\CLASH_OF_TANKS\PACKAGES\SDL2_TTF.NUGET.2.0.15\BUILD\NATIVE\../..//BUILD/NATIVE/INCLUDE/ /IC:\USERS\OIER\DESKTOP\MU\PBLA\CLASH_OF_TANKS\PACKAGES\SDL2_IMAGE.NUGET.2.0.5\BUILD\NATIVE\../..//BUILD/NATIVE/INCLUDE/ /IC:\USERS\OIER\DESKTOP\MU\PBLA\CLASH_OF_TANKS\PACKAGES\SDL2.2.0.5\BUILD\NATIVE\../..//BUILD/NATIVE/INCLUDE/ /ZI /JMC /nologo /W3 /WX- /diagnostics:column /sdl /Od /Oy- /D HAS_SDL2 /D HAS_SDL2 /D HAS_SDL2 /D HAS_SDL2 /D HAS_SDL2 /D WIN32 /D _DEBUG /D _CONSOLE /D _UNICODE /D UNICODE /Gm- /EHsc /RTC1 /MDd /GS /fp:precise /permissive- /Zc:wchar_t /Zc:forScope /Zc:inline /Fo"DEBUG\\" /Fd"DEBUG\VC142.PDB" /Gd /TC /analyze- /FC C:\USERS\OIER\DESKTOP\MU\PBLA\CLASH_OF_TANKS\PROJECT1\SIMPLESDLWRAPPER\SOINUA.C
^C:\USERS\OIER\DESKTOP\MU\PBLA\CLASH_OF_TANKS\PROJECT1\SIMPLESDLWRAPPER\TEXT.C
/c /IC:\USERS\OIER\DESKTOP\MU\PBLA\CLASH_OF_TANKS\PACKAGES\SDL2.NUGET.2.0.14\BUILD\NATIVE\../..//BUILD/NATIVE/INCLUDE/ /IC:\USERS\OIER\DESKTOP\MU\PBLA\CLASH_OF_TANKS\PACKAGES\SDL2_MIXER.NUGET.2.0.4\BUILD\NATIVE\../..//BUILD/NATIVE/INCLUDE/ /IC:\USERS\OIER\DESKTOP\MU\PBLA\CLASH_OF_TANKS\PACKAGES\SDL2_TTF.NUGET.2.0.15\BUILD\NATIVE\../..//BUILD/NATIVE/INCLUDE/ /IC:\USERS\OIER\DESKTOP\MU\PBLA\CLASH_OF_TANKS\PACKAGES\SDL2_IMAGE.NUGET.2.0.5\BUILD\NATIVE\../..//BUILD/NATIVE/INCLUDE/ /IC:\USERS\OIER\DESKTOP\MU\PBLA\CLASH_OF_TANKS\PACKAGES\SDL2.2.0.5\BUILD\NATIVE\../..//BUILD/NATIVE/INCLUDE/ /ZI /JMC /nologo /W3 /WX- /diagnostics:column /sdl /Od /Oy- /D HAS_SDL2 /D HAS_SDL2 /D HAS_SDL2 /D HAS_SDL2 /D HAS_SDL2 /D WIN32 /D _DEBUG /D _CONSOLE /D _UNICODE /D UNICODE /Gm- /EHsc /RTC1 /MDd /GS /fp:precise /permissive- /Zc:wchar_t /Zc:forScope /Zc:inline /Fo"DEBUG\\" /Fd"DEBUG\VC142.PDB" /Gd /TC /analyze- /FC C:\USERS\OIER\DESKTOP\MU\PBLA\CLASH_OF_TANKS\PROJECT1\SIMPLESDLWRAPPER\TEXT.C
