<svg width="30" height="28" viewBox="0 0 30 28" fill="none" xmlns="http://www.w3.org/2000/svg">
<g id="bright">
<path id="Vector" d="M15.0227 6.36429C9.95636 6.36429 5.82996 10.4907 5.82996 15.557C5.82996 16.2104 6.36868 16.7491 7.02203 16.7491H23.0119C23.6652 16.7491 24.2039 16.2104 24.2039 15.557C24.2154 10.4792 20.089 6.36429 15.0227 6.36429ZM15.0227 8.74843C18.3353 8.74843 21.155 11.1326 21.7166 14.3535H8.31726C8.89037 11.1326 11.7101 8.74843 15.0227 8.74843Z" fill="#939597"/>
<path id="Vector_2" d="M15.023 5.01173C15.6763 5.01173 16.2151 4.473 16.2151 3.81965V1.88253C16.2151 1.22919 15.6763 0.69046 15.023 0.69046C14.3697 0.69046 13.8309 1.22919 13.8309 1.88253V3.80819C13.8195 4.473 14.3582 5.01173 15.023 5.01173Z" fill="#939597"/>
<path id="Vector_3" d="M8.11097 5.98604C8.32875 6.35283 8.71846 6.58207 9.14257 6.58207C9.57813 6.58207 9.95639 6.35283 10.1742 5.98604C10.392 5.60778 10.392 5.16076 10.1742 4.79396L9.21134 3.12048C9.05087 2.84538 8.7987 2.65052 8.48922 2.55883C8.17974 2.47859 7.8588 2.51298 7.5837 2.67345C7.30861 2.83392 7.11375 3.08609 7.02205 3.39557C6.94182 3.70505 6.9762 4.02599 7.13667 4.30109L8.11097 5.98604Z" fill="#939597"/>
<path id="Vector_4" d="M2.58624 9.75711L4.25973 10.7199C4.44313 10.8231 4.64945 10.8804 4.85577 10.8804C4.95893 10.8804 5.06209 10.8689 5.16525 10.8346C5.47473 10.7543 5.7269 10.5595 5.88737 10.2729C6.21977 9.6998 6.02491 8.96622 5.4518 8.64527L3.77832 7.68245C3.50322 7.52197 3.18228 7.47613 2.8728 7.56782C2.56332 7.64806 2.31115 7.84292 2.15068 8.12947C1.99021 8.40457 1.94436 8.72551 2.03605 9.03499C2.11629 9.33301 2.31115 9.59664 2.58624 9.75711Z" fill="#939597"/>
<path id="Vector_5" d="M25.1897 10.8804C25.5221 10.8804 25.6023 10.8346 26.5881 10.2614C26.8173 10.1239 27.1039 9.96342 27.4592 9.7571C28.0323 9.4247 28.2272 8.69111 27.8948 8.12946C27.7343 7.85437 27.4821 7.65951 27.1727 7.56781C26.8632 7.48758 26.5422 7.53343 26.2671 7.68244L24.5936 8.64527C24.1237 8.92036 23.8944 9.45908 24.0435 9.98635C24.181 10.5251 24.6395 10.8804 25.1897 10.8804Z" fill="#939597"/>
<path id="Vector_6" d="M20.8916 6.58205C21.3157 6.58205 21.7169 6.3528 21.9232 5.98601L22.886 4.31253C23.0465 4.03743 23.0923 3.71649 23.0006 3.40701C22.9204 3.09753 22.7255 2.84536 22.439 2.68489C22.1639 2.52442 21.8429 2.47857 21.5335 2.57026C21.224 2.6505 20.9718 2.84536 20.8113 3.13191L19.8485 4.8054C19.6307 5.18366 19.6307 5.63068 19.8485 5.99747C20.0663 6.3528 20.456 6.58205 20.8916 6.58205Z" fill="#939597"/>
<path id="Vector_7" d="M26.9779 19.8554H24.5823C23.7112 18.8008 22.4388 18.1933 21.0634 18.1933C19.6879 18.1933 18.4156 18.8008 17.5445 19.8554H3.0562C1.45148 19.8554 0.15625 21.1621 0.15625 22.7553C0.15625 24.36 1.46295 25.6552 3.0562 25.6552H17.5559C18.4271 26.7098 19.6994 27.3173 21.0748 27.3173C22.4503 27.3173 23.7226 26.7098 24.5938 25.6552H26.9779C28.5826 25.6552 29.8778 24.3486 29.8778 22.7553C29.8778 21.1506 28.5826 19.8554 26.9779 19.8554ZM25.6024 22.2395H26.9779C27.2645 22.2395 27.4937 22.4687 27.4937 22.7553C27.4937 23.0419 27.2645 23.2711 26.9779 23.2711H25.6024C25.6368 22.9272 25.6368 22.5834 25.6024 22.2395ZM23.1151 23.5003C22.7369 24.5549 21.8084 24.9331 21.0748 24.9331C20.3413 24.9331 19.4128 24.5549 19.0346 23.5003C18.7939 22.8241 18.8856 22.102 19.2982 21.5174C19.7108 20.9213 20.3642 20.5889 21.0748 20.5889C21.7855 20.5889 22.4388 20.9328 22.8515 21.5174C23.2641 22.102 23.3558 22.8241 23.1151 23.5003ZM16.5358 23.2711H3.0562C2.76964 23.2711 2.5404 23.0419 2.5404 22.7553C2.5404 22.4687 2.76964 22.2395 3.0562 22.2395H16.5358C16.5014 22.5834 16.5014 22.9272 16.5358 23.2711Z" fill="#939597"/>
</g>
</svg>
