<svg width="26" height="26" viewBox="0 0 26 26" fill="none" xmlns="http://www.w3.org/2000/svg">
<path id="Vector222" d="M22.2671 0H3.27705C1.46447 0 0 1.46447 0 3.27705V17.1415C0 18.942 1.46447 20.4185 3.27705 20.4185H6.16997V22.2791C6.16997 24.0797 7.63444 25.5562 9.44702 25.5562H16.1211C17.9217 25.5562 19.3982 24.0917 19.3982 22.2791V20.4065H22.2911C24.0917 20.4065 25.5682 18.942 25.5682 17.1295V3.27705C25.5442 1.46447 24.0797 0 22.2671 0ZM3.27705 17.9697C2.8209 17.9697 2.44878 17.5976 2.44878 17.1415V3.27705C2.44878 2.8209 2.8209 2.44878 3.27705 2.44878H11.5477V17.9817H3.27705V17.9697ZM16.9494 22.2671C16.9494 22.7233 16.5773 23.0954 16.1211 23.0954H9.43501C8.97887 23.0954 8.60675 22.7233 8.60675 22.2671V20.4065H16.9494V22.2671ZM23.1074 17.1415C23.1074 17.5976 22.7353 17.9697 22.2791 17.9697H14.0085V2.43678H22.2791C22.7353 2.43678 23.1074 2.8089 23.1074 3.26504V17.1415Z" fill="#939597"/>
</svg>
