<svg width="37" height="36" viewBox="0 0 37 36" fill="none" xmlns="http://www.w3.org/2000/svg">
<g id="closeBtn">
<circle id="Ellipse 4" cx="18.2217" cy="18" r="18" fill="white" fill-opacity="0.1"/>
<rect id="Rectangle 157" x="10.4435" y="24.3641" width="20" height="2" rx="1" transform="rotate(-45 10.4435 24.3641)" fill="#A4ACAC"/>
<rect id="Rectangle 159" x="11.8575" y="10.2219" width="20" height="2" rx="1" transform="rotate(45 11.8575 10.2219)" fill="#A4ACAC"/>
</g>
</svg>
