<svg width="37" height="36" viewBox="0 0 37 36" fill="none" xmlns="http://www.w3.org/2000/svg">
<g id="maximize">
<circle id="Ellipse 5" cx="18.2217" cy="18" r="18" fill="white" fill-opacity="0.1"/>
<path id="Rectangle 155" d="M16.481 14.0026L16.481 12.2217C16.481 11.1171 17.3764 10.2217 18.481 10.2217L22.6031 10.2217C23.7076 10.2217 24.6031 11.1171 24.6031 12.2217L24.6031 16.3438C24.6031 17.4484 23.7076 18.3438 22.6031 18.3438L20.4968 18.3438" stroke="#17B9AF" stroke-width="2" stroke-linecap="round"/>
<rect id="Rectangle 161" x="10.8398" y="14.3718" width="9.62675" height="9.62675" rx="1" stroke="#17B9AF" stroke-width="2" stroke-linejoin="bevel"/>
</g>
</svg>
