<svg width="48" height="13" viewBox="0 0 48 13" fill="none" xmlns="http://www.w3.org/2000/svg">
<path d="M0.568182 2.35469H4.13068V11.9626H6.5625V2.35469H10.125V0.326283H0.568182V2.35469ZM15.8807 12.1217C18.4716 12.1217 20.233 10.4342 20.2273 8.08196C20.233 5.85469 18.6761 4.25242 16.5795 4.25242C15.5568 4.25242 14.6761 4.67856 14.267 5.25242H14.1989L14.5 2.33765H19.5852V0.326283H12.4716L11.9205 6.46265L14.108 6.85469C14.4659 6.37174 15.1591 6.0706 15.8466 6.0706C17.017 6.07628 17.858 6.92287 17.858 8.14446C17.858 9.35469 17.0341 10.1899 15.8807 10.1899C14.9034 10.1899 14.1136 9.57628 14.0568 8.67287H11.6705C11.7159 10.6842 13.4716 12.1217 15.8807 12.1217ZM27.4034 5.18424H22.0966V7.10469H27.4034V5.18424ZM40.2045 6.14446C40.2045 2.33765 37.8409 0.167192 34.7557 0.167192C31.6534 0.167192 29.3068 2.33765 29.3068 6.14446C29.3068 9.93424 31.6534 12.1217 34.7557 12.1217C37.8409 12.1217 40.2045 9.95128 40.2045 6.14446ZM37.7102 6.14446C37.7102 8.61037 36.5398 9.9456 34.7557 9.9456C32.9659 9.9456 31.8011 8.61037 31.8011 6.14446C31.8011 3.67856 32.9659 2.34333 34.7557 2.34333C36.5398 2.34333 37.7102 3.67856 37.7102 6.14446ZM47.0213 0.326283H44.7088L41.8281 2.15015V4.33196L44.4929 2.66151H44.5611V11.9626H47.0213V0.326283Z" fill="#5B5B5B"/>
</svg>
