<svg width="49" height="13" viewBox="0 0 49 13" fill="none" xmlns="http://www.w3.org/2000/svg">
<path d="M0.568182 2.78096H4.13068V12.3889H6.5625V2.78096H10.125V0.752552H0.568182V2.78096ZM15.9318 12.548C18.5455 12.548 20.4148 11.1105 20.4091 9.12187C20.4148 7.67301 19.4943 6.63892 17.7841 6.42301V6.3321C19.0852 6.09914 19.983 5.17869 19.9773 3.87187C19.983 2.03664 18.375 0.593461 15.9659 0.593461C13.5795 0.593461 11.7841 1.99119 11.75 4.00255H14.108C14.1364 3.11619 14.9489 2.54233 15.9545 2.54233C16.9489 2.54233 17.6136 3.1446 17.608 4.0196C17.6136 4.93437 16.8352 5.55369 15.7159 5.55369H14.6307V7.36051H15.7159C17.0341 7.36051 17.858 8.0196 17.8523 8.9571C17.858 9.88323 17.0625 10.5196 15.9375 10.5196C14.8523 10.5196 14.0398 9.95142 13.9943 9.09914H11.517C11.5568 11.1332 13.375 12.548 15.9318 12.548ZM27.6378 5.61051H22.331V7.53096H27.6378V5.61051ZM28.8338 2.78096H32.3963V12.3889H34.8281V2.78096H38.3906V0.752552H28.8338V2.78096ZM44.1463 12.548C46.7372 12.548 48.4986 10.8605 48.4929 8.50823C48.4986 6.28096 46.9418 4.67869 44.8452 4.67869C43.8224 4.67869 42.9418 5.10483 42.5327 5.67869H42.4645L42.7656 2.76392H47.8509V0.752552H40.7372L40.1861 6.88892L42.3736 7.28096C42.7315 6.79801 43.4247 6.49687 44.1122 6.49687C45.2827 6.50255 46.1236 7.34914 46.1236 8.57073C46.1236 9.78096 45.2997 10.6162 44.1463 10.6162C43.169 10.6162 42.3793 10.0026 42.3224 9.09914H39.9361C39.9815 11.1105 41.7372 12.548 44.1463 12.548Z" fill="#5B5B5B"/>
</svg>
