<svg width="56" height="13" viewBox="0 0 56 13" fill="none" xmlns="http://www.w3.org/2000/svg">
<path d="M0.0113636 12.0903H2.47159V7.28351H7.20455V5.2551H2.47159V2.48238H7.71591V0.453968H0.0113636V12.0903ZM9.37074 12.0903H11.831V8.3176H13.8991C16.5753 8.3176 18.1321 6.72101 18.1321 4.39715C18.1321 2.08465 16.6037 0.453968 13.9616 0.453968H9.37074V12.0903ZM11.831 6.34601V2.46533H13.4901C14.9105 2.46533 15.598 3.23806 15.598 4.39715C15.598 5.55056 14.9105 6.34601 13.5014 6.34601H11.831ZM19.6619 12.0903H27.9574V10.079H23.071V9.99942L24.7699 8.33465C27.1619 6.15283 27.804 5.06192 27.804 3.73806C27.804 1.72101 26.1562 0.294877 23.6619 0.294877C21.2188 0.294877 19.5426 1.7551 19.5483 4.0392H21.8835C21.8778 2.92556 22.5824 2.24374 23.6449 2.24374C24.6676 2.24374 25.429 2.8801 25.429 3.90283C25.429 4.82897 24.8608 5.46533 23.804 6.48238L19.6619 10.3176V12.0903ZM35.2003 5.31192H29.8935V7.23238H35.2003V5.31192ZM37.3082 12.0903H39.7685V7.28351H44.5014V5.2551H39.7685V2.48238H45.0128V0.453968H37.3082V12.0903ZM46.4233 10.0449H52.0085V12.0903H54.3608V10.0449H55.804V8.07329H54.3608V0.453968H51.2812L46.4233 8.10738V10.0449ZM52.054 8.07329H48.9006V7.98238L51.9631 3.13579H52.054V8.07329Z" fill="#5B5B5B"/>
</svg>
