<svg width="24" height="24" viewBox="0 0 24 24" fill="none" xmlns="http://www.w3.org/2000/svg">
<path d="M11.2428 24H12.7478C13.9668 24 14.956 23.0109 14.956 21.7922V21.2812C15.4718 21.1172 15.9781 20.9062 16.461 20.6578L16.822 21.0187C17.6988 21.8953 19.0959 21.8672 19.9492 21.0187L21.0135 19.9547C21.8621 19.1063 21.8902 17.7047 21.0135 16.8281L20.6525 16.4672C20.901 15.9844 21.1119 15.4828 21.276 14.9625H21.7918C23.0107 14.9625 24 13.9734 24 12.7547V11.25C24 10.0312 23.0107 9.04219 21.7918 9.04219H21.2807C21.1166 8.52656 20.9056 8.02031 20.6572 7.5375L21.0182 7.17656C21.8949 6.30469 21.8715 4.90313 21.0182 4.05L19.9539 2.98594C19.1006 2.13281 17.7035 2.11406 16.8267 2.98594L16.4657 3.34688C15.9828 3.09844 15.4811 2.8875 14.9607 2.72344V2.20781C14.9607 0.989062 13.9715 0 12.7525 0H11.2475C10.0285 0 9.03927 0.989062 9.03927 2.20781V2.71875C8.52354 2.88281 8.01719 3.09375 7.53428 3.34219L7.17328 2.98125C6.29654 2.10469 4.89939 2.13281 4.0461 2.98125L2.98183 4.04531C2.13323 4.89375 2.1051 6.29531 2.98183 7.17188L3.34284 7.53281C3.09435 8.01562 2.88338 8.51719 2.71928 9.0375H2.20824C0.989256 9.0375 0 10.0266 0 11.2453V12.75C0 13.9688 0.989256 14.9578 2.20824 14.9578H2.71459C2.87869 15.4734 3.08967 15.9797 3.33815 16.4625L2.97714 16.8234C2.10041 17.6953 2.12385 19.0969 2.97714 19.95L4.04141 21.0141C4.8947 21.8672 6.29185 21.8859 7.16859 21.0141L7.5296 20.6531C8.0125 20.9016 8.51416 21.1125 9.03458 21.2766V21.7875C9.03458 23.0109 10.0238 24 11.2428 24ZM16.2313 19.1813C15.5609 19.5797 14.8388 19.8797 14.084 20.0719C13.7746 20.1516 13.5542 20.4328 13.5542 20.7516V21.7875C13.5542 22.2281 13.1932 22.5891 12.7525 22.5891H11.2475C10.8068 22.5891 10.4458 22.2281 10.4458 21.7875V20.7516C10.4458 20.4328 10.2301 20.1516 9.916 20.0719C9.16116 19.875 8.43915 19.575 7.7687 19.1813C7.49209 19.0172 7.14046 19.0641 6.91541 19.2891L6.17933 20.025C5.86052 20.3438 5.35417 20.3344 5.04474 20.025L3.98046 18.9609C3.67103 18.6516 3.66165 18.1453 3.98046 17.8266L4.71655 17.0906C4.94159 16.8656 4.98847 16.5141 4.82438 16.2375C4.42587 15.5672 4.12581 14.8453 3.93358 14.0906C3.85388 13.7812 3.57257 13.5609 3.25376 13.5609H2.21762C1.77691 13.5609 1.4159 13.2 1.4159 12.7594V11.2547C1.4159 10.8141 1.77691 10.4531 2.21762 10.4531H3.25376C3.57257 10.4531 3.85388 10.2375 3.93358 9.92344C4.1305 9.16875 4.43055 8.44687 4.82438 7.77656C4.98847 7.5 4.94159 7.14844 4.71655 6.92344L3.98046 6.1875C3.66165 5.86875 3.67103 5.3625 3.98046 5.05313L5.04474 3.98906C5.35417 3.67969 5.86521 3.67031 6.17933 3.98906L6.91541 4.725C7.14046 4.95 7.49678 4.99687 7.7687 4.83281C8.43915 4.43437 9.16116 4.13438 9.916 3.94219C10.2254 3.8625 10.4458 3.58125 10.4458 3.2625V2.20781C10.4458 1.76719 10.8068 1.40625 11.2475 1.40625H12.7525C13.1932 1.40625 13.5542 1.76719 13.5542 2.20781V3.24375C13.5542 3.5625 13.7699 3.84375 14.084 3.92344C14.8388 4.12031 15.5609 4.42031 16.2313 4.81406C16.5079 4.97812 16.8595 4.93125 17.0846 4.70625L17.8207 3.97031C18.1395 3.65156 18.6458 3.66094 18.9553 3.97031L20.0195 5.03438C20.329 5.34375 20.3383 5.85 20.0195 6.16875L19.2835 6.90469C19.0584 7.12969 19.0115 7.48125 19.1756 7.75781C19.5741 8.42813 19.8742 9.15 20.0664 9.90469C20.1461 10.2141 20.4274 10.4344 20.7462 10.4344H21.7918C22.2325 10.4344 22.5935 10.7953 22.5935 11.2359V12.7406C22.5935 13.1812 22.2325 13.5422 21.7918 13.5422H20.7556C20.4368 13.5422 20.1555 13.7578 20.0758 14.0719C19.8789 14.8266 19.5788 15.5484 19.185 16.2188C19.0209 16.4953 19.0678 16.8469 19.2928 17.0719L20.0289 17.8078C20.3477 18.1266 20.3383 18.6328 20.0289 18.9422L18.9646 20.0062C18.6552 20.3156 18.1442 20.325 17.83 20.0062L17.094 19.2703C16.9205 19.1203 16.5689 18.9797 16.2313 19.1813Z" fill="#7E77B8"/>
<path d="M12.2224 17.4437C15.1011 17.4437 17.4453 15.1 17.4453 12.2219C17.4453 9.34375 15.1011 7 12.2224 7C9.34373 7 6.99952 9.34375 6.99952 12.2219C6.99952 15.1 9.34373 17.4437 12.2224 17.4437ZM12.2224 8.40625C14.3275 8.40625 16.0388 10.1172 16.0388 12.2219C16.0388 14.3266 14.3275 16.0375 12.2224 16.0375C10.1173 16.0375 8.40605 14.3266 8.40605 12.2219C8.40605 10.1172 10.1173 8.40625 12.2224 8.40625Z" fill="#7E77B8"/>
</svg>
