<svg width="46" height="13" viewBox="0 0 46 13" fill="none" xmlns="http://www.w3.org/2000/svg">
<path d="M0.0113636 12.7798H2.47159V7.97297H7.20455V5.94456H2.47159V3.17183H7.71591V1.14342H0.0113636V12.7798ZM9.76278 12.7798H12.3026L17.1321 3.18319V1.14342H8.96733V3.15479H14.5866V3.23433L9.76278 12.7798ZM24.2784 6.00138H18.9716V7.92183H24.2784V6.00138ZM25.4744 3.17183H29.0369V12.7798H31.4688V3.17183H35.0312V1.14342H25.4744V3.17183ZM40.8381 12.9389C43.4517 12.9389 45.321 11.5014 45.3153 9.51274C45.321 8.06388 44.4006 7.02979 42.6903 6.81388V6.72297C43.9915 6.49001 44.8892 5.56956 44.8835 4.26274C44.8892 2.42751 43.2812 0.98433 40.8722 0.98433C38.4858 0.98433 36.6903 2.38206 36.6562 4.39342H39.0142C39.0426 3.50706 39.8551 2.93319 40.8608 2.93319C41.8551 2.93319 42.5199 3.53547 42.5142 4.41047C42.5199 5.32524 41.7415 5.94456 40.6222 5.94456H39.5369V7.75138H40.6222C41.9403 7.75138 42.7642 8.41047 42.7585 9.34797C42.7642 10.2741 41.9688 10.9105 40.8438 10.9105C39.7585 10.9105 38.946 10.3423 38.9006 9.49001H36.4233C36.4631 11.5241 38.2812 12.9389 40.8381 12.9389Z" fill="#5B5B5B"/>
</svg>
