<svg width="500" height="500" viewBox="0 0 500 500" fill="none" xmlns="http://www.w3.org/2000/svg">
<path d="M234.225 500H265.579C290.975 500 311.584 479.395 311.584 454.004V443.359C322.329 439.941 332.878 435.547 342.938 430.371L350.459 437.891C368.724 456.152 397.832 455.566 415.609 437.891L437.781 415.723C455.46 398.047 456.046 368.848 437.781 350.586L430.26 343.066C435.437 333.008 439.832 322.559 443.251 311.719H453.995C479.391 311.719 500 291.113 500 265.723V234.375C500 208.984 479.391 188.379 453.995 188.379H443.348C439.93 177.637 435.534 167.09 430.357 157.031L437.878 149.512C456.144 131.348 455.655 102.148 437.878 84.375L415.706 62.207C397.929 44.4336 368.822 44.043 350.557 62.207L343.036 69.7266C332.975 64.5508 322.524 60.1562 311.682 56.7383V45.9961C311.682 20.6055 291.072 0 265.677 0H234.323C208.928 0 188.318 20.6055 188.318 45.9961V56.6406C177.574 60.0586 167.025 64.4531 156.964 69.6289L149.443 62.1094C131.178 43.8477 102.071 44.4336 84.2938 62.1094L62.1215 84.2773C44.4423 101.953 43.8562 131.152 62.1215 149.414L69.6425 156.934C64.4657 166.992 60.0703 177.441 56.6517 188.281H46.0051C20.6095 188.281 -5.4765e-06 208.887 -5.4765e-06 234.277V265.625C-5.4765e-06 291.016 20.6095 311.621 46.0051 311.621H56.554C59.9726 322.363 64.368 332.91 69.5448 342.969L62.0238 350.488C43.7585 368.652 44.2469 397.852 62.0238 415.625L84.1961 437.793C101.973 455.566 131.08 455.957 149.346 437.793L156.867 430.273C166.927 435.449 177.378 439.844 188.22 443.262V453.906C188.22 479.395 208.83 500 234.225 500ZM338.152 399.609C324.184 407.91 309.142 414.16 293.417 418.164C286.97 419.824 282.379 425.684 282.379 432.324V453.906C282.379 463.086 274.858 470.605 265.677 470.605H234.323C225.142 470.605 217.621 463.086 217.621 453.906V432.324C217.621 425.684 213.128 419.824 206.583 418.164C190.858 414.063 175.816 407.813 161.848 399.609C156.085 396.191 148.76 397.168 144.071 401.855L128.736 417.188C122.094 423.828 111.545 423.633 105.099 417.188L82.9263 395.02C76.4798 388.574 76.2844 378.027 82.9263 371.387L98.2614 356.055C102.95 351.367 103.927 344.043 100.508 338.281C92.2055 324.316 85.9543 309.277 81.9496 293.555C80.2891 287.109 74.4286 282.52 67.7867 282.52H46.2004C37.0189 282.52 29.4979 275 29.4979 265.82V234.473C29.4979 225.293 37.0189 217.773 46.2004 217.773H67.7867C74.4286 217.773 80.2891 213.281 81.9496 206.738C86.052 191.016 92.3032 175.977 100.508 162.012C103.927 156.25 102.95 148.926 98.2614 144.238L82.9263 128.906C76.2844 122.266 76.4798 111.719 82.9263 105.273L105.099 83.1055C111.545 76.6602 122.192 76.4648 128.736 83.1055L144.071 98.4375C148.76 103.125 156.183 104.102 161.848 100.684C175.816 92.3828 190.858 86.1328 206.583 82.1289C213.03 80.4687 217.621 74.6094 217.621 67.9687V45.9961C217.621 36.8164 225.142 29.2969 234.323 29.2969H265.677C274.858 29.2969 282.379 36.8164 282.379 45.9961V67.5781C282.379 74.2187 286.872 80.0781 293.417 81.7383C309.142 85.8398 324.184 92.0898 338.152 100.293C343.915 103.711 351.24 102.734 355.929 98.0469L371.264 82.7148C377.906 76.0742 388.455 76.2695 394.901 82.7148L417.074 104.883C423.52 111.328 423.716 121.875 417.074 128.516L401.739 143.848C397.05 148.535 396.073 155.859 399.492 161.621C407.794 175.586 414.046 190.625 418.05 206.348C419.711 212.793 425.571 217.383 432.213 217.383H453.995C463.176 217.383 470.697 224.902 470.697 234.082V265.43C470.697 274.609 463.176 282.129 453.995 282.129H432.409C425.767 282.129 419.906 286.621 418.246 293.164C414.143 308.887 407.892 323.926 399.687 337.891C396.269 343.652 397.246 350.977 401.934 355.664L417.269 370.996C423.911 377.637 423.716 388.184 417.269 394.629L395.097 416.797C388.65 423.242 378.004 423.437 371.459 416.797L356.124 401.465C352.51 398.34 345.185 395.41 338.152 399.609Z" fill="#7E77B8"/>
<path d="M254.634 363.411C314.606 363.411 363.444 314.583 363.444 254.622C363.444 194.661 314.606 145.833 254.634 145.833C194.661 145.833 145.823 194.661 145.823 254.622C145.823 314.583 194.661 363.411 254.634 363.411ZM254.634 175.13C298.49 175.13 334.141 210.775 334.141 254.622C334.141 298.47 298.49 334.114 254.634 334.114C210.778 334.114 175.126 298.47 175.126 254.622C175.126 210.775 210.778 175.13 254.634 175.13Z" fill="#7E77B8"/>
</svg>
