<svg width="30" height="30" viewBox="0 0 30 30" fill="none" xmlns="http://www.w3.org/2000/svg">
<path d="M14.5106 19.4887C18.5603 19.4887 21.8566 22.7857 21.8566 26.8361C21.8566 27.0684 21.8453 27.3006 21.8226 27.5329C19.6307 28.8188 17.1217 29.5043 14.5106 29.5043C11.8996 29.5043 9.3962 28.8188 7.19863 27.5329C7.17597 27.3063 7.16465 27.074 7.16465 26.8361C7.16465 22.78 10.461 19.4887 14.5106 19.4887Z" fill="#DEE0E3"/>
<path d="M4.25882 4.74285C6.99445 2.00101 10.6363 0.494141 14.5104 0.494141C18.3844 0.494141 22.0263 2.00101 24.7619 4.74285C27.4975 7.48468 29.0098 11.1216 29.0098 14.9964C29.0098 18.8712 27.5032 22.5138 24.7619 25.2499C24.3711 25.6408 23.9633 26.0034 23.5385 26.3433C23.3459 22.78 21.0917 19.7606 17.9426 18.4633C19.6701 17.336 20.8142 15.3873 20.8142 13.1723C20.8142 9.694 17.9823 6.86153 14.5047 6.86153C11.0271 6.86153 8.19518 9.694 8.19518 13.1723C8.19518 15.3873 9.33928 17.336 11.0667 18.4633C7.92332 19.7606 5.66345 22.78 5.47088 26.3433C5.04609 26.0034 4.63829 25.6408 4.24749 25.2499C1.5062 22.5081 -0.000385284 18.8712 -0.000385284 14.9964C0.0109425 11.1216 1.51752 7.47901 4.25882 4.74285Z" fill="#DEE0E3"/>
<path d="M9.89989 13.1779C9.89989 10.6344 11.9672 8.56665 14.5102 8.56665C17.0533 8.56665 19.1206 10.6344 19.1206 13.1779C19.1206 15.7215 17.0533 17.7892 14.5102 17.7892C11.9672 17.7892 9.89989 15.7215 9.89989 13.1779Z" fill="#DEE0E3"/>
</svg>
