<svg width="50" height="13" viewBox="0 0 50 13" fill="none" xmlns="http://www.w3.org/2000/svg">
<path d="M0.0113636 12.1025H2.47159V8.32981H4.53977C7.21591 8.32981 8.77273 6.73322 8.77273 4.40936C8.77273 2.09686 7.24432 0.466175 4.60227 0.466175H0.0113636V12.1025ZM2.47159 6.35822V2.47754H4.13068C5.55114 2.47754 6.23864 3.25027 6.23864 4.40936C6.23864 5.56277 5.55114 6.35822 4.14205 6.35822H2.47159ZM10.1264 10.0571H15.7116V12.1025H18.0639V10.0571H19.5071V8.08549H18.0639V0.466175H14.9844L10.1264 8.11958V10.0571ZM15.7571 8.08549H12.6037V7.99458L15.6662 3.14799H15.7571V8.08549ZM26.6065 5.32413H21.2997V7.24458H26.6065V5.32413ZM39.4077 6.28436C39.4077 2.47754 37.044 0.307084 33.9588 0.307084C30.8565 0.307084 28.5099 2.47754 28.5099 6.28436C28.5099 10.0741 30.8565 12.2616 33.9588 12.2616C37.044 12.2616 39.4077 10.0912 39.4077 6.28436ZM36.9134 6.28436C36.9134 8.75027 35.7429 10.0855 33.9588 10.0855C32.169 10.0855 31.0043 8.75027 31.0043 6.28436C31.0043 3.81845 32.169 2.48322 33.9588 2.48322C35.7429 2.48322 36.9134 3.81845 36.9134 6.28436ZM41.1619 12.1025H49.4574V10.0912H44.571V10.0116L46.2699 8.34686C48.6619 6.16504 49.304 5.07413 49.304 3.75027C49.304 1.73322 47.6562 0.307084 45.1619 0.307084C42.7188 0.307084 41.0426 1.76731 41.0483 4.0514H43.3835C43.3778 2.93777 44.0824 2.25595 45.1449 2.25595C46.1676 2.25595 46.929 2.89231 46.929 3.91504C46.929 4.84118 46.3608 5.47754 45.304 6.49458L41.1619 10.3298V12.1025Z" fill="#5B5B5B"/>
</svg>
