{
    "key": "group_62a606dacc136",
    "title": "Cấu hình website",
    "fields": [
        {
            "key": "field_62a606ff3773b",
            "label": "Nhận diện website",
            "name": "",
            "type": "tab",
            "instructions": "",
            "required": 0,
            "conditional_logic": 0,
            "wrapper": {
                "width": "",
                "class": "",
                "id": ""
            },
            "placement": "top",
            "endpoint": 0
        },
        {
            "key": "field_62a607433773d",
            "label": "Favicon",
            "name": "favicon",
            "type": "image",
            "instructions": "Là file không nền hình vuông, kích thước tối ưu nhất 512x512px",
            "required": 0,
            "conditional_logic": 0,
            "wrapper": {
                "width": "",
                "class": "",
                "id": ""
            },
            "return_format": "url",
            "preview_size": "thumbnail",
            "library": "all",
            "min_width": "",
            "min_height": "",
            "min_size": "",
            "max_width": "",
            "max_height": "",
            "max_size": "",
            "mime_types": ""
        },
        {
            "key": "field_62a607253773c",
            "label": "Logo",
            "name": "logo",
            "type": "image",
            "instructions": "",
            "required": 0,
            "conditional_logic": 0,
            "wrapper": {
                "width": "",
                "class": "",
                "id": ""
            },
            "return_format": "url",
            "preview_size": "thumbnail",
            "library": "all",
            "min_width": "",
            "min_height": "",
            "min_size": "",
            "max_width": "",
            "max_height": "",
            "max_size": "",
            "mime_types": ""
        },
        {
            "key": "field_62a607a4e81a7",
            "label": "Tông màu",
            "name": "pallete",
            "type": "group",
            "instructions": "",
            "required": 0,
            "conditional_logic": 0,
            "wrapper": {
                "width": "",
                "class": "",
                "id": ""
            },
            "layout": "table",
            "sub_fields": [
                {
                    "key": "field_62a607cde81a8",
                    "label": "Màu chủ đạo",
                    "name": "primary",
                    "type": "color_picker",
                    "instructions": "Mặc định: #007bff",
                    "required": 0,
                    "conditional_logic": 0,
                    "wrapper": {
                        "width": "",
                        "class": "",
                        "id": ""
                    },
                    "default_value": "#007bff"
                },
                {
                    "key": "field_62a607dce81a9",
                    "label": "Màu warning",
                    "name": "warning",
                    "type": "color_picker",
                    "instructions": "Mặc định: #ffc107",
                    "required": 0,
                    "conditional_logic": 0,
                    "wrapper": {
                        "width": "",
                        "class": "",
                        "id": ""
                    },
                    "default_value": "#ffc107"
                },
                {
                    "key": "field_62a607ebe81aa",
                    "label": "Màu danger",
                    "name": "danger",
                    "type": "color_picker",
                    "instructions": "Mặc định: #dc3545",
                    "required": 0,
                    "conditional_logic": 0,
                    "wrapper": {
                        "width": "",
                        "class": "",
                        "id": ""
                    },
                    "default_value": "#dc3545"
                },
                {
                    "key": "field_62a609d63160d",
                    "label": "Màu success",
                    "name": "success",
                    "type": "color_picker",
                    "instructions": "Mặc định: #28a745",
                    "required": 0,
                    "conditional_logic": 0,
                    "wrapper": {
                        "width": "",
                        "class": "",
                        "id": ""
                    },
                    "default_value": "#28a745"
                },
                {
                    "key": "field_62a609e83160e",
                    "label": "Màu orange",
                    "name": "orange",
                    "type": "color_picker",
                    "instructions": "Mặc định: #fd7e14",
                    "required": 0,
                    "conditional_logic": 0,
                    "wrapper": {
                        "width": "",
                        "class": "",
                        "id": ""
                    },
                    "default_value": "#fd7e14"
                }
            ]
        },
        {
            "key": "field_62a6084acab60",
            "label": "Cấu hình gửi mail SMTP (Bắt buộc)",
            "name": "",
            "type": "tab",
            "instructions": "",
            "required": 0,
            "conditional_logic": 0,
            "wrapper": {
                "width": "",
                "class": "",
                "id": ""
            },
            "placement": "top",
            "endpoint": 0
        },
        {
            "key": "field_62a62c90a665c",
            "label": "Tiêu đề email thông báo",
            "name": "mail_title",
            "type": "text",
            "instructions": "",
            "required": 0,
            "conditional_logic": 0,
            "wrapper": {
                "width": "",
                "class": "",
                "id": ""
            },
            "default_value": "",
            "placeholder": "",
            "prepend": "",
            "append": "",
            "maxlength": ""
        },
        {
            "key": "field_62a60958ac632",
            "label": "Email & mật khẩu ứng dụng",
            "name": "smtp_account",
            "type": "group",
            "instructions": "",
            "required": 0,
            "conditional_logic": 0,
            "wrapper": {
                "width": "",
                "class": "",
                "id": ""
            },
            "layout": "table",
            "sub_fields": [
                {
                    "key": "field_62a60973ac633",
                    "label": "Địa chỉ Gmail",
                    "name": "gmail",
                    "type": "text",
                    "instructions": "",
                    "required": 0,
                    "conditional_logic": 0,
                    "wrapper": {
                        "width": "",
                        "class": "",
                        "id": ""
                    },
                    "default_value": "",
                    "placeholder": "",
                    "prepend": "",
                    "append": "",
                    "maxlength": ""
                },
                {
                    "key": "field_62a6097dac634",
                    "label": "Mật khẩu ứng dụng",
                    "name": "pass_app",
                    "type": "password",
                    "instructions": "",
                    "required": 0,
                    "conditional_logic": 0,
                    "wrapper": {
                        "width": "",
                        "class": "",
                        "id": ""
                    },
                    "placeholder": "",
                    "prepend": "",
                    "append": ""
                }
            ]
        },
        {
            "key": "field_62a608a338775",
            "label": "Chú thích",
            "name": "",
            "type": "message",
            "instructions": "",
            "required": 0,
            "conditional_logic": 0,
            "wrapper": {
                "width": "",
                "class": "",
                "id": ""
            },
            "message": "- Để website có thể tự động gửi mail về gmail của admin sau khi có ai đó điền thông tin vào form, admin bắt buộc phải cấu hình thông tin SMTP. \r\n\r\n- Để lấy mật khẩu ứng dụng, admin vui lòng truy cập vào đây: <a href=\"https:\/\/wpseo.vn\/huong-dan-lay-mat-khau-gmail-smtp\/\" target=\"_blank\"> Cách lấy mật khẩu SMTP <\/a>\r\n\r\n- Mật khẩu ứng dụng SMTP không ảnh hướng đến tài khoản Google của admin, mọi thông tin đều được mã hóa.",
            "new_lines": "wpautop",
            "esc_html": 0
        },
        {
            "key": "field_62a606e83773a",
            "label": "Thông tin cơ bản",
            "name": "",
            "type": "tab",
            "instructions": "",
            "required": 0,
            "conditional_logic": 0,
            "wrapper": {
                "width": "",
                "class": "",
                "id": ""
            },
            "placement": "top",
            "endpoint": 0
        },
        {
            "key": "field_62a60a4d5d5b4",
            "label": "Tên doanh nghiệp",
            "name": "cty_name",
            "type": "text",
            "instructions": "",
            "required": 0,
            "conditional_logic": 0,
            "wrapper": {
                "width": "",
                "class": "",
                "id": ""
            },
            "default_value": "",
            "placeholder": "",
            "prepend": "",
            "append": "",
            "maxlength": ""
        },
        {
            "key": "field_62a60a605d5b5",
            "label": "Địa chỉ doanh nghiệp",
            "name": "cty_add",
            "type": "text",
            "instructions": "",
            "required": 0,
            "conditional_logic": 0,
            "wrapper": {
                "width": "",
                "class": "",
                "id": ""
            },
            "default_value": "",
            "placeholder": "",
            "prepend": "",
            "append": "",
            "maxlength": ""
        },
        {
            "key": "field_62a60a37a66cb",
            "label": "Số hotline",
            "name": "hotline",
            "type": "text",
            "instructions": "",
            "required": 0,
            "conditional_logic": 0,
            "wrapper": {
                "width": "",
                "class": "",
                "id": ""
            },
            "default_value": "",
            "placeholder": "",
            "prepend": "",
            "append": "",
            "maxlength": ""
        },
        {
            "key": "field_62a60a725d5b6",
            "label": "Email",
            "name": "email",
            "type": "text",
            "instructions": "",
            "required": 0,
            "conditional_logic": 0,
            "wrapper": {
                "width": "",
                "class": "",
                "id": ""
            },
            "default_value": "",
            "placeholder": "",
            "prepend": "",
            "append": "",
            "maxlength": ""
        },
        {
            "key": "field_62a60a8a5d5b7",
            "label": "Thông tin GPKD",
            "name": "cty_cert",
            "type": "text",
            "instructions": "",
            "required": 0,
            "conditional_logic": 0,
            "wrapper": {
                "width": "",
                "class": "",
                "id": ""
            },
            "default_value": "",
            "placeholder": "",
            "prepend": "",
            "append": "",
            "maxlength": ""
        },
        {
            "key": "field_62a62e745c265",
            "label": "Mạng xã hội",
            "name": "",
            "type": "tab",
            "instructions": "",
            "required": 0,
            "conditional_logic": 0,
            "wrapper": {
                "width": "",
                "class": "",
                "id": ""
            },
            "placement": "top",
            "endpoint": 0
        },
        {
            "key": "field_62a62e7e5c266",
            "label": "Fanpage",
            "name": "fanpage",
            "type": "url",
            "instructions": "",
            "required": 0,
            "conditional_logic": 0,
            "wrapper": {
                "width": "",
                "class": "",
                "id": ""
            },
            "default_value": "",
            "placeholder": ""
        },
        {
            "key": "field_62a62e885c267",
            "label": "Messenger",
            "name": "messenger",
            "type": "url",
            "instructions": "",
            "required": 0,
            "conditional_logic": 0,
            "wrapper": {
                "width": "",
                "class": "",
                "id": ""
            },
            "default_value": "",
            "placeholder": ""
        },
        {
            "key": "field_62a62e8f5c268",
            "label": "Zalo",
            "name": "zalo",
            "type": "text",
            "instructions": "",
            "required": 0,
            "conditional_logic": 0,
            "wrapper": {
                "width": "",
                "class": "",
                "id": ""
            },
            "default_value": "",
            "placeholder": "",
            "prepend": "",
            "append": "",
            "maxlength": ""
        },
        {
            "key": "field_62a776ab94b57",
            "label": "Chèn mã theo dõi",
            "name": "",
            "type": "tab",
            "instructions": "",
            "required": 0,
            "conditional_logic": 0,
            "wrapper": {
                "width": "",
                "class": "",
                "id": ""
            },
            "placement": "top",
            "endpoint": 0
        },
        {
            "key": "field_62a776c794b58",
            "label": "Chèn mã giữa cặp thẻ &lt;head>",
            "name": "code_embed_head",
            "type": "textarea",
            "instructions": "",
            "required": 0,
            "conditional_logic": 0,
            "wrapper": {
                "width": "",
                "class": "",
                "id": ""
            },
            "default_value": "",
            "placeholder": "",
            "maxlength": "",
            "rows": "",
            "new_lines": ""
        },
        {
            "key": "field_62a7773394b59",
            "label": "Chèn mã bên dưới thẻ mở &lt;body>",
            "name": "code_after_body_open",
            "type": "textarea",
            "instructions": "",
            "required": 0,
            "conditional_logic": 0,
            "wrapper": {
                "width": "",
                "class": "",
                "id": ""
            },
            "default_value": "",
            "placeholder": "",
            "maxlength": "",
            "rows": "",
            "new_lines": ""
        },
        {
            "key": "field_62a777a694b5a",
            "label": "Chèn mã bên trên thẻ đóng &lt;\/body>",
            "name": "code_before_body_close",
            "type": "textarea",
            "instructions": "",
            "required": 0,
            "conditional_logic": 0,
            "wrapper": {
                "width": "",
                "class": "",
                "id": ""
            },
            "default_value": "",
            "placeholder": "",
            "maxlength": "",
            "rows": "",
            "new_lines": ""
        }
    ],
    "location": [
        [
            {
                "param": "options_page",
                "operator": "==",
                "value": "theme-general-settings"
            }
        ]
    ],
    "menu_order": 0,
    "position": "normal",
    "style": "default",
    "label_placement": "top",
    "instruction_placement": "label",
    "hide_on_screen": "",
    "active": true,
    "description": "",
    "modified": 1655143883
}