{
  "values": [
    "supertools:copper_chestplate",
    "supertools:lapis_chestplate",
    "supertools:quartz_chestplate",
    "supertools:obsidian_chestplate",
    "supertools:emerald_chestplate"
  ]
}