{
  "type": "minecraft:crafting_shaped",
  "category": "misc",
  "key": {
    "#": {
      "item": "minecraft:quartz"
    }
  },
  "pattern": [
    "###",
    "# #",
    "   "
  ],
  "result": {
    "count": 1,
    "id": "supertools:quartz_helmet"
  }
}