{
  "type": "minecraft:crafting_shaped",
  "category": "misc",
  "key": {
    "#": {
      "item": "minecraft:obsidian"
    },
    "S": {
      "item": "minecraft:stick"
    }
  },
  "pattern": [
    "#",
    "#",
    "S"
  ],
  "result": {
    "count": 1,
    "id": "supertools:obsidian_sword"
  }
}