{
  "type": "minecraft:crafting_shaped",
  "category": "misc",
  "key": {
    "A": {
      "item": "supertools:adarum"
    },
    "B": {
      "item": "minecraft:blaze_rod"
    },
    "G": {
      "item": "minecraft:gold_ingot"
    }
  },
  "pattern": [
    " G ",
    "  G",
    "BA "
  ],
  "result": {
    "count": 1,
    "id": "supertools:super_sickle"
  }
}