{
  "type": "minecraft:crafting_shaped",
  "category": "misc",
  "key": {
    "B": {
      "item": "minecraft:blaze_rod"
    },
    "C": {
      "item": "supertools:cup"
    },
    "D": {
      "item": "minecraft:diamond"
    },
    "G": {
      "item": "minecraft:gold_ingot"
    },
    "N": {
      "item": "minecraft:nether_star"
    }
  },
  "pattern": [
    "GNG",
    "BCB",
    "DDD"
  ],
  "result": {
    "count": 1,
    "id": "supertools:special_cup"
  }
}