{
  "type": "minecraft:crafting_shaped",
  "category": "misc",
  "key": {
    "#": {
      "item": "minecraft:emerald"
    },
    "S": {
      "item": "minecraft:stick"
    }
  },
  "pattern": [
    " ##",
    " S ",
    " S "
  ],
  "result": {
    "count": 1,
    "id": "supertools:emerald_hoe"
  }
}