{
  "type": "minecraft:crafting_shaped",
  "category": "misc",
  "key": {
    "#": {
      "item": "minecraft:copper_ingot"
    },
    "S": {
      "item": "minecraft:stick"
    }
  },
  "pattern": [
    "###",
    " S ",
    " S "
  ],
  "result": {
    "count": 1,
    "id": "supertools:copper_pickaxe"
  }
}