{
  "parent": "minecraft:recipes/root",
  "criteria": {
    "has_adarum": {
      "conditions": {
        "items": [
          {
            "items": "supertools:adarum"
          }
        ]
      },
      "trigger": "minecraft:inventory_changed"
    },
    "has_the_recipe": {
      "conditions": {
        "recipe": "supertools:super_hoe"
      },
      "trigger": "minecraft:recipe_unlocked"
    }
  },
  "requirements": [
    [
      "has_the_recipe",
      "has_adarum"
    ]
  ],
  "rewards": {
    "recipes": [
      "supertools:super_hoe"
    ]
  }
}