{
  "type": "minecraft:crafting_shaped",
  "category": "misc",
  "key": {
    "#": {
      "tag": "minecraft:planks"
    },
    "S": {
      "item": "minecraft:stick"
    }
  },
  "pattern": [
    " # ",
    "  #",
    "S# "
  ],
  "result": {
    "count": 1,
    "id": "supertools:wooden_sickle"
  }
}