﻿newmtl /Game/Material__260_Material__260
	map_Kd Material__260_Material__260_D.bmp
	map_Ks Material__260_Material__260_S.bmp
	bump Material__260_Material__260_N.bmp

newmtl /Game/Material__469_Material__469
	map_Kd Material__469_Material__469_D.bmp
	map_Ks Material__469_Material__469_S.bmp
	bump Material__469_Material__469_N.bmp

newmtl /Game/Plasctic_Plasctic
	map_Kd Plasctic_Plasctic_D.bmp
	map_Ks Plasctic_Plasctic_S.bmp
	bump Plasctic_Plasctic_N.bmp

newmtl /Game/Windown_Mask_Windown_Mask
	map_Kd Windown_Mask_Windown_Mask_D.bmp
	map_Ks Windown_Mask_Windown_Mask_S.bmp
	bump Windown_Mask_Windown_Mask_N.bmp

newmtl /Game/glass_MTL_glass_MTL
	map_Kd glass_MTL_glass_MTL_D.bmp
	map_Ks glass_MTL_glass_MTL_S.bmp
	bump glass_MTL_glass_MTL_N.bmp

newmtl /Game/Beton_Beton
	map_Kd Beton_Beton_D.bmp
	map_Ks Beton_Beton_S.bmp
	bump Beton_Beton_N.bmp

newmtl /Game/StarterContent/Materials/M_Metal_Chrome_M_Metal_Chrome
	map_Kd M_Metal_Chrome_M_Metal_Chrome_D.bmp
	map_Ks M_Metal_Chrome_M_Metal_Chrome_S.bmp
	bump M_Metal_Chrome_M_Metal_Chrome_N.bmp

newmtl /Game/Metl_black_Metl_black
	map_Kd Metl_black_Metl_black_D.bmp
	map_Ks Metl_black_Metl_black_S.bmp
	bump Metl_black_Metl_black_N.bmp

