X,Truth
1.002848600413748,1.002848600413748
1.0288383431461494,1.0288383431461494
1.144015747447771,1.144015747447771
1.133550952195146,1.133550952195146
1.4158780434738643,1.4158780434738643
1.5388944248239207,1.5388944248239207
1.403209060726217,1.403209060726217
1.4817701073960359,1.4817701073960359
1.7311177497737655,1.7311177497737655
1.766185501897941,1.766185501897941
1.55758273197353,1.55758273197353
1.8727259597590822,1.8727259597590822
0.9153546872876999,1.8653658821481984
0.8240792746946037,1.8915057364463446
1.942169702075272,1.942169702075272
1.9129642903251383,1.9129642903251383
2.0407644823424205,2.0407644823424205
2.089219983148745,2.089219983148745
1.9401164252761463,1.9401164252761463
2.1185127835424766,2.1185127835424766
1.851923616919863,1.851923616919863
1.9662344238438947,1.9662344238438947
1.7040808891202206,1.7040808891202206
1.7174938200042666,1.7174938200042666
1.6277663411233456,1.6277663411233456
1.6542460517347388,1.6542460517347388
1.5355268337417045,1.5355268337417045
1.323507050919234,1.323507050919234
1.2931088660313537,1.2931088660313537
1.2565037205334093,1.2565037205334093
1.1660019088519866,1.1660019088519866
1.0061287938662258,1.0061287938662258
0.8771698871911818,0.8771698871911818
0.8059350157874586,0.8059350157874586
0.5714444826063731,0.5714444826063731
0.6317689735626013,0.6317689735626013
0.6277146026663325,0.6277146026663325
0.4275260619773942,0.4275260619773942
0.4348111865843988,0.4348111865843988
0.15823660526841232,0.15823660526841232
0.3376900970142082,0.3376900970142082
0.20438149250369883,0.20438149250369883
0.27501773248105793,0.27501773248105793
0.20491574040950467,0.20491574040950467
0.030244060623350267,0.030244060623350267
-0.044241294030379186,-0.044241294030379186
0.02710931143981481,0.02710931143981481
0.10550769449974329,0.10550769449974329
-0.015038331207768037,-0.015038331207768037
-0.08002409243289173,-0.08002409243289173
0.02103320225684877,0.02103320225684877
-0.01580628259239561,-0.01580628259239561
0.23323057101350958,0.23323057101350958
0.20209143869018098,0.20209143869018098
0.061894237059516355,0.061894237059516355
0.23199106343965,0.23199106343965
0.42805894493899577,0.42805894493899577
0.3063986699606338,0.3063986699606338
0.5365420704363029,0.5365420704363029
0.6454317863810913,0.6454317863810913
0.6665927549058974,0.6665927549058974
0.8386606596601126,0.8386606596601126
0.7480577543008664,0.7480577543008664
1.1418691683652828,1.1418691683652828
1.0388254684151106,1.0388254684151106
1.3315015902017342,1.3315015902017342
1.2732750779102768,1.2732750779102768
1.263668157057768,1.263668157057768
1.5757224110533852,1.5757224110533852
1.7592371063097003,1.7592371063097003
1.6175721028097048,1.6175721028097048
1.8186288958578762,1.8186288958578762
1.8628493345164587,1.8628493345164587
1.7057090862858983,1.7057090862858983
1.8969713254987295,1.8969713254987295
1.8609028126854816,1.8609028126854816
1.9526020808024416,1.9526020808024416
2.0382972494158436,2.0382972494158436
1.8500332162143538,1.8500332162143538
1.8608609666683547,1.8608609666683547
1.9132255834517935,1.9132255834517935
2.0251106357040483,2.0251106357040483
1.9139712502117927,1.9139712502117927
1.8289388943008213,1.8289388943008213
1.893788952779569,1.893788952779569
1.6480321259523747,1.6480321259523747
1.6433858732898723,1.6433858732898723
1.7687675717488995,1.7687675717488995
1.4232434932798579,1.4232434932798579
1.6663256678687386,1.6663256678687386
1.5130663470307348,1.5130663470307348
1.1984429234428382,1.1984429234428382
1.1277195507653326,1.1277195507653326
1.1494458446911455,1.1494458446911455
1.0442057265774884,1.0442057265774884
3.2548545227084036,1.1064179340146651
3.5765823299684976,0.9040281851547172
6.693302769503137,0.6284166550750188
0.7521709093420488,0.7521709093420488
0.49010281624941326,0.49010281624941326
0.3743665043966622,0.3743665043966622
0.42513463354813424,0.42513463354813424
0.5238665440054423,0.5238665440054423
0.3889225948886902,0.3889225948886902
0.179368351324948,0.179368351324948
0.10379207303662352,0.10379207303662352
0.07838464314140485,0.07838464314140485
0.0767970039853656,0.0767970039853656
-0.11748081989527251,-0.11748081989527251
0.17067981523696213,0.17067981523696213
-0.26110479462187014,-0.26110479462187014
-0.06303353052470488,-0.06303353052470488
0.15898834608016377,0.15898834608016377
0.03765255058370008,0.03765255058370008
0.1473284930135822,0.1473284930135822
0.1659517262999566,0.1659517262999566
0.11098200524400652,0.11098200524400652
2.5007606376361267,0.32623136822601256
2.1725178568722487,0.20440616252279137
0.28993632115239165,0.28993632115239165
0.46774675674648514,0.46774675674648514
0.6281230621061469,0.6281230621061469
0.5663984674263476,0.5663984674263476
0.8653123081532913,0.8653123081532913
0.7271724333470229,0.7271724333470229
1.0622568140557345,1.0622568140557345
2.240604344561053,0.9508514408113866
1.9014672064515161,1.0153209070249365
3.3356334011827573,1.157792950422428
1.3853417162278305,1.3853417162278305
1.3852273580194208,1.3852273580194208
1.4702309899160297,1.4702309899160297
1.3816825315404875,1.3816825315404875
1.6290932552670139,1.6290932552670139
0.2605811747553197,1.6203348892872556
1.9111668671234832,1.9111668671234832
1.73519617012158,1.73519617012158
1.711552420207399,1.711552420207399
1.9526092270260327,1.9526092270260327
2.0485725508111345,2.0485725508111345
1.9345249547178835,1.9345249547178835
1.874064895958483,1.874064895958483
1.8850236616254814,1.8850236616254814
1.9053984106979498,1.9053984106979498
1.872108771393139,1.872108771393139
1.8969489892194806,1.8969489892194806
1.9012448633570656,1.9012448633570656
1.8496547559801275,1.8496547559801275
1.793015823397988,1.793015823397988
1.636330414505467,1.636330414505467
1.5706661391154277,1.5706661391154277
1.506774787751162,1.506774787751162
1.551248081318744,1.551248081318744
1.5102108586389111,1.5102108586389111
1.2305496977309582,1.2305496977309582
1.4080765404906175,1.4080765404906175
1.1101124601014558,1.1101124601014558
1.1902054839462564,1.1902054839462564
0.7720043512422025,0.7720043512422025
0.667719740697923,0.667719740697923
0.550964096599508,0.550964096599508
0.795886102629106,0.795886102629106
0.4150299295097168,0.4150299295097168
0.43304916933004317,0.43304916933004317
0.3471846631653479,0.3471846631653479
0.34295538116019114,0.34295538116019114
0.3982802183899329,0.3982802183899329
0.12485033484862143,0.12485033484862143
0.18731188882552605,0.18731188882552605
0.2067694057103871,0.2067694057103871
0.06624718186363157,0.06624718186363157
-0.024612196818519554,-0.024612196818519554
-0.6019401350811501,-0.13785523376035227
-0.11822575380953715,-0.11822575380953715
0.008215916557578301,0.008215916557578301
0.16265352296264082,0.16265352296264082
0.07453420130079512,0.07453420130079512
0.03660244275780547,0.03660244275780547
0.40200952879669255,0.40200952879669255
0.31559697842647005,0.31559697842647005
0.14222739750940805,0.14222739750940805
0.20010884864897277,0.20010884864897277
0.31434400083936054,0.31434400083936054
0.44376830749174323,0.44376830749174323
0.6139582505681496,0.6139582505681496
0.6668063393144719,0.6668063393144719
0.9473010469070019,0.9473010469070019
0.8520090878181533,0.8520090878181533
1.0784766039346845,1.0784766039346845
1.1332615431410926,1.1332615431410926
1.0358642244943088,1.0358642244943088
1.1929332881897805,1.1929332881897805
1.3197290419294685,1.3197290419294685
1.4909448568363106,1.4909448568363106
1.4003772895255515,1.4003772895255515
1.4693527425808348,1.4693527425808348
5.333347515061724,1.6677597188765818
1.8899296938014234,1.8899296938014234
1.598752743138547,1.598752743138547
1.7015105994862292,1.7015105994862292
1.746444914764378,1.746444914764378
2.0433330620751917,2.0433330620751917
2.0767986790499955,2.0767986790499955
2.0300534464235165,2.0300534464235165
2.0259406184340487,2.0259406184340487
2.09219637701159,2.09219637701159
1.9330397884370965,1.9330397884370965
2.027878758813573,2.027878758813573
1.9210182590106928,1.9210182590106928
1.6813762386327173,1.6813762386327173
1.7978170918129077,1.7978170918129077
1.7016779280019223,1.7016779280019223
1.5699059896533591,1.5699059896533591
1.7069826582030292,1.7069826582030292
1.4219291667083305,1.4219291667083305
1.49597171266035,1.49597171266035
1.4195398682952276,1.4195398682952276
1.3537212793327,1.3537212793327
1.2315196367433872,1.2315196367433872
0.9963790488693336,0.9963790488693336
0.8795559645572879,0.8795559645572879
0.842074473571887,0.842074473571887
0.8797680134124704,0.8797680134124704
0.5157217969137777,0.5157217969137777
0.5980409925436109,0.5980409925436109
0.44380250248944053,0.44380250248944053
0.4296232820120236,0.4296232820120236
0.30654241349872297,0.30654241349872297
0.24679503149246498,0.24679503149246498
0.2000513291802848,0.2000513291802848
-0.008277434055019128,-0.008277434055019128
0.25528344301622496,0.25528344301622496
-0.12114316690351978,-0.12114316690351978
3.2757842918347158,-0.04407592034099915
-0.11726056187816786,-0.11726056187816786
0.01214237281446653,0.01214237281446653
0.0894148862178668,0.0894148862178668
-0.08992138582943562,-0.08992138582943562
-0.026639968933523078,-0.026639968933523078
-0.016853207098565387,-0.016853207098565387
0.13454019917836046,0.13454019917836046
2.4042462319212903,0.22916712696016567
0.19093321686715697,0.19093321686715697
0.23028763505843702,0.23028763505843702
0.2588891191130003,0.2588891191130003
0.3532251436143086,0.3532251436143086
0.6035781484945888,0.6035781484945888
0.5109312884690211,0.5109312884690211
0.7802157465452265,0.7802157465452265
0.6781369876501663,0.6781369876501663
0.9588489490585872,0.9588489490585872
0.8972951241173509,0.8972951241173509
1.1176816448092202,1.1176816448092202
1.320339603638541,1.320339603638541
1.2970108701335978,1.2970108701335978
1.3463175213496819,1.3463175213496819
1.7364864573009338,1.7364864573009338
1.5468202039687615,1.5468202039687615
1.51983384405399,1.51983384405399
1.6381275785866356,1.6381275785866356
1.7655740253310632,1.7655740253310632
1.7333753231825153,1.7333753231825153
1.5959973877934033,1.5959973877934033
1.9662631292143498,1.9662631292143498
1.8413605012962984,1.8413605012962984
1.9121865054445477,1.9121865054445477
1.9623529378928264,1.9623529378928264
1.9523101651667079,1.9523101651667079
-2.584281237121819,2.04749841170156
0.9972674334768301,2.005634177897761
-1.0485437912425157,1.9065313147345828
2.741553621501448,1.879952048120149
2.8255814151200576,1.8476386767440045
1.5858118026108237,1.5858118026108237
1.7240047008346107,1.7240047008346107
1.6169913412600019,1.6169913412600019
1.6417944717333994,1.6417944717333994
1.6210684131361401,1.6210684131361401
1.4948473504185558,1.4948473504185558
1.3768598235777485,1.3768598235777485
1.3161998012272584,1.3161998012272584
1.2034780082825995,1.2034780082825995
1.0387628208051505,1.0387628208051505
0.9062285767342464,0.9062285767342464
0.8654865578663116,0.8654865578663116
0.9080677238985316,0.9080677238985316
0.7953587636206992,0.7953587636206992
0.6249745090013225,0.6249745090013225
0.4159574830636692,0.4159574830636692
0.1819994200395771,0.1819994200395771
0.45314026744923647,0.45314026744923647
0.25798721577883504,0.25798721577883504
0.01506017972607232,0.01506017972607232
0.33737859331932624,0.33737859331932624
-0.027838598021093314,-0.027838598021093314
0.06199506133516579,0.06199506133516579
0.07667480272381133,0.07667480272381133
0.7571835814473101,0.013326313626586338
0.2575680770559762,-0.007792055767558714
-2.7588746821272694,0.20591034032513053
-4.87278484841808,-0.016880911888448175
0.11528499490947741,0.11528499490947741
0.01734479927580107,0.01734479927580107
0.06504376169164772,0.06504376169164772
0.08082422622855466,0.08082422622855466
0.13744040245112393,0.13744040245112393
0.16534020351036272,0.16534020351036272
0.42698880639630094,0.42698880639630094
0.44615322117770795,0.44615322117770795
0.4050788666291802,0.4050788666291802
0.6214670408497358,0.6214670408497358
0.7788555540811279,0.7788555540811279
0.8230461632326487,0.8230461632326487
0.7209459918171539,0.7209459918171539
1.0516411107136747,1.0516411107136747
1.1270258363858099,1.1270258363858099
1.0947451069856091,1.0947451069856091
1.3278568910857291,1.3278568910857291
1.5284073708540173,1.5284073708540173
1.6912393374080077,1.6912393374080077
1.2695556975566893,1.2695556975566893
1.6805745819993732,1.6805745819993732
1.6405253999673488,1.6405253999673488
1.807317958680863,1.807317958680863
1.8638934450183493,1.8638934450183493
1.8126615825519523,1.8126615825519523
1.7268272980975978,1.7268272980975978
1.8309013272946746,1.8309013272946746
2.1073222288696236,2.1073222288696236
1.9243804216358675,1.9243804216358675
2.078857842758967,2.078857842758967
1.9081435624187488,1.9081435624187488
1.9765634943509303,1.9765634943509303
1.887871999519953,1.887871999519953
1.861746543479361,1.861746543479361
1.8721007831933592,1.8721007831933592
1.9666220387273743,1.9666220387273743
1.8223761838617725,1.8223761838617725
1.6822797634874675,1.6822797634874675
1.6172266763937235,1.6172266763937235
1.5590703621341369,1.5590703621341369
1.385955496790805,1.385955496790805
1.1653775149448562,1.1653775149448562
1.3372983214957055,1.3372983214957055
1.150506764488993,1.150506764488993
1.0468891039525419,1.0468891039525419
1.0472344474758628,1.0472344474758628
0.9787837829613222,0.9787837829613222
0.7899579625142743,0.7899579625142743
0.4791461007909188,0.4791461007909188
0.7119182115932523,0.7119182115932523
0.5719110766642113,0.5719110766642113
0.5324067634507434,0.5324067634507434
0.3527495538238277,0.3527495538238277
0.04496925676196767,0.04496925676196767
0.1276521869058903,0.1276521869058903
0.20518686252143775,0.20518686252143775
0.1317061944041568,0.1317061944041568
0.020446339629162556,0.020446339629162556
-0.013209178734963252,-0.013209178734963252
-0.017082139322735015,-0.017082139322735015
-0.02155603221211773,-0.02155603221211773
-0.06857846529016005,-0.06857846529016005
-0.06783600783753774,-0.06783600783753774
0.005134993377306107,0.005134993377306107
0.1458995050039436,0.1458995050039436
0.0009018179063965542,0.0009018179063965542
0.02730778089066968,0.02730778089066968
0.27010573542289185,0.27010573542289185
0.2537469219739147,0.2537469219739147
-0.03928068756061037,0.3771040311759075
0.44970743729569024,0.44970743729569024
0.4830508524248504,0.4830508524248504
0.4642214753311049,0.4642214753311049
0.5526727723053134,0.5526727723053134
0.8605719973119331,0.8605719973119331
0.8793048916313829,0.8793048916313829
1.166806333315484,1.166806333315484
1.0732533980029952,1.0732533980029952
1.1600427339311132,1.1600427339311132
1.2284520652709645,1.2284520652709645
1.3670212792731689,1.3670212792731689
1.5815844606398792,1.5815844606398792
1.6081159276009482,1.6081159276009482
1.599290878431277,1.599290878431277
1.6603391952465503,1.6603391952465503
1.7604949795097267,1.7604949795097267
1.7300455151458256,1.7300455151458256
1.816531507832123,1.816531507832123
1.93856987198525,1.93856987198525
1.8894217515903715,1.8894217515903715
2.042995348015883,2.042995348015883
2.0204737116930014,2.0204737116930014
2.013683836629419,2.013683836629419
1.9535179447196318,1.9535179447196318
1.84935282534067,1.84935282534067
1.8638797556720874,1.8638797556720874
2.012610676098354,2.012610676098354
1.8549823294620076,1.8549823294620076
1.87329499231035,1.87329499231035
1.8414907582448619,1.8414907582448619
1.6350081996062789,1.6350081996062789
1.5530275264440085,1.5530275264440085
1.3677754692541915,1.3677754692541915
1.4472872395125447,1.4472872395125447
1.2720552818534765,1.2720552818534765
1.106989112899503,1.106989112899503
1.3382277560226363,1.3382277560226363
1.0775938947818182,1.0775938947818182
0.834268877602739,0.834268877602739
0.7274787744786367,0.7274787744786367
0.5852155878817157,0.5852155878817157
0.7016376043786842,0.7016376043786842
0.6099114136867341,0.6099114136867341
0.47137739212363144,0.47137739212363144
0.5050599653191409,0.5050599653191409
0.3957820382367622,0.3957820382367622
0.1660086843869221,0.1660086843869221
0.24807730140117867,0.24807730140117867
0.05774780721603505,0.05774780721603505
0.17188380033613587,0.17188380033613587
0.14118331707967913,0.14118331707967913
0.01811676695062437,0.01811676695062437
0.11380033959820016,0.11380033959820016
0.030081106834214822,0.030081106834214822
0.09206810318194963,0.09206810318194963
0.05231904180372458,0.05231904180372458
0.0530395412817906,0.0530395412817906
-0.033419840248503405,-0.033419840248503405
0.09956692025247713,0.09956692025247713
-0.00776462095063199,-0.00776462095063199
0.22124170813031335,0.22124170813031335
1.1704990028839073,0.27520564501438577
2.291239279022748,0.5185186106201678
2.6331797319716856,0.49230288590942445
0.6138983259539603,0.6138983259539603
0.7126347872794574,0.7126347872794574
0.8487734598889479,0.8487734598889479
0.737646021692718,0.737646021692718
1.0286196362744398,1.0286196362744398
0.9283705215014932,0.9283705215014932
1.0783631538930813,1.0783631538930813
1.0190517203404525,1.0190517203404525
1.37040590257509,1.37040590257509
1.3819798477967478,1.3819798477967478
1.591588679906362,1.591588679906362
1.5809977305600176,1.5809977305600176
1.7984758825955471,1.7984758825955471
1.7863335971922194,1.7863335971922194
1.7829289254741845,1.7829289254741845
1.7916148318545175,1.7916148318545175
1.7166281310166607,1.7166281310166607
1.8985500704102254,1.8985500704102254
1.8687026144942511,1.8687026144942511
1.9411688409301024,1.9411688409301024
2.034366779490839,2.034366779490839
1.9680449769568154,1.9680449769568154
2.0087813284492158,2.0087813284492158
2.001627888121843,2.001627888121843
1.897396709253806,1.897396709253806
2.0195188286806474,2.0195188286806474
1.9219239762607914,1.9219239762607914
1.988347361600327,1.988347361600327
1.6489179795928437,1.6489179795928437
1.5550242118817765,1.5550242118817765
1.6892163693351558,1.6892163693351558
1.58877280190447,1.58877280190447
1.4146746642819663,1.4146746642819663
1.4231862209550221,1.4231862209550221
1.382664063615742,1.382664063615742
1.1127609304271933,1.1127609304271933
0.9397991490841182,0.9397991490841182
1.0227416534404998,1.0227416534404998
0.7974873387487272,0.7974873387487272
-4.650544721594264,0.8217156179108703
-6.524634612013062,0.6585969278408698
0.5848174534075853,0.5848174534075853
0.4834575479160327,0.4834575479160327
0.24714600688129296,0.24714600688129296
0.24284275794180393,0.24284275794180393
0.14790908112663192,0.14790908112663192
1.5073661235945774,0.15983407243988781
0.22350854374664442,0.22350854374664442
0.1011244436512217,0.1011244436512217
0.09466854924135278,0.09466854924135278
-0.10813340627643916,-0.10813340627643916
0.03985132442823699,0.03985132442823699
-0.028128491071435113,-0.028128491071435113
-0.013244416654553587,-0.013244416654553587
0.021714438799487718,0.021714438799487718
0.11453386747794285,0.11453386747794285
0.04199635805329691,0.04199635805329691
0.024241470203906074,0.024241470203906074
0.5962484202404306,0.13043101262350273
-1.797727630685392,0.06774298960958386
0.39237905142632,0.44902418350986245
0.4307110873953095,0.4307110873953095
0.25389640722663787,0.25389640722663787
0.5455373490362091,0.5455373490362091
0.560078927151274,0.560078927151274
0.7001531302496299,0.7001531302496299
0.9051040619650169,0.9051040619650169
0.8776171969388049,0.8776171969388049
1.0536039095590661,1.0536039095590661
1.077735528708605,1.077735528708605
1.2565494722932753,1.2565494722932753
1.3869928274368464,1.3869928274368464
1.4351305261816545,1.4351305261816545
1.4671403013737923,1.4671403013737923
1.547273520836188,1.547273520836188
2.2669643823947507,1.6711625447701755
1.9483898807590236,1.667055535575151
4.200025478853796,1.7356109267226645
1.8654027879261006,1.8654027879261006
1.9672348306407015,1.9672348306407015
0.825591366919393,1.9197883552092954
-1.562549908661683,2.0066150064097665
1.0857137924050502,1.9868819175049988
2.2144692392593948,2.088267876494456
2.0919718385404167,2.0919718385404167
2.0428871129376565,2.0428871129376565
1.942645885365489,1.942645885365489
1.9413049032337293,1.9413049032337293
1.88688119250957,1.88688119250957
1.7468472586482504,1.7468472586482504
1.8166662390307846,1.8166662390307846
1.7144485942406176,1.7144485942406176
1.7735699032493422,1.7735699032493422
1.551121954530959,1.551121954530959
1.4326314400684705,1.4326314400684705
1.42931710077717,1.42931710077717
1.278140140961936,1.278140140961936
1.3067522826306188,1.3067522826306188
1.1734768984216915,1.1734768984216915
0.9670415606362911,0.9670415606362911
0.9303156521036459,0.9303156521036459
0.790426406885788,0.790426406885788
1.7928452626325346,0.6676291408146621
0.5412709148359826,0.5412709148359826
0.4664481073550991,0.4664481073550991
0.45270034482839355,0.45270034482839355
0.3174792087694464,0.3174792087694464
0.6198166450841129,0.6198166450841129
-5.20841978537409,0.15834467172203992
-2.205335839697634,0.533932547466604
-3.387819578049889,0.0334659538999532
-6.633230415904833,-0.030445884297025716
0.2026608315166848,0.2026608315166848
0.005634753479268813,0.005634753479268813
-0.007875512935096139,-0.007875512935096139
-0.13869940557077692,-0.13869940557077692
-0.10302621566267359,-0.10302621566267359
-0.049151830619460726,-0.049151830619460726
0.002807559524807539,0.002807559524807539
-0.01812137942831621,-0.01812137942831621
-0.027588560723661004,-0.027588560723661004
0.08073886321102608,0.08073886321102608
0.32020461055688937,0.32020461055688937
0.27900249165697394,0.27900249165697394
0.35740709261561826,0.35740709261561826
0.6468254607971013,0.6468254607971013
0.5406390035065622,0.5406390035065622
0.6532364154961768,0.6532364154961768
0.8708198970390594,0.8708198970390594
0.8362918161849752,0.8362918161849752
0.9444318205866353,0.9444318205866353
0.7924508707286404,0.7924508707286404
1.1727575966122539,1.1727575966122539
1.3960817460858903,1.3960817460858903
1.376267063540074,1.376267063540074
1.442781522972163,1.442781522972163
1.619571801780379,1.619571801780379
1.6380095560525827,1.6380095560525827
0.8282780863412829,1.7949749214107409
-2.5732697649139142,1.721955649803375
-1.442784769401775,1.8370000082341746
1.7179025989009766,1.7179025989009766
1.7251038826552758,1.7251038826552758
1.8247908546856473,1.8247908546856473
1.8875152013296972,1.8875152013296972
1.9656150672671069,1.9656150672671069
2.040956295527051,2.040956295527051
1.9895297710705921,1.9895297710705921
2.104562757774213,2.104562757774213
2.065806111173043,2.065806111173043
1.9198899768082252,1.9198899768082252
1.9607705606041543,1.9607705606041543
1.607507278068708,1.607507278068708
1.726764941415801,1.726764941415801
1.6865060037603463,1.6865060037603463
1.5658844222864012,1.5658844222864012
1.5700615393058268,1.5700615393058268
-2.514682113547557,1.5159756963356776
0.3083320587087215,1.4207513780730818
1.2396721467741298,1.2396721467741298
1.4108250439994694,1.4108250439994694
1.1499076866768085,1.1499076866768085
1.0325054692484377,1.0325054692484377
0.8761164708160664,0.8761164708160664
0.839092730997199,0.839092730997199
1.211191539668329,0.5751166955443141
3.68074158742719,0.6136423339910066
0.9835586835304038,0.49469047087825796
0.5707245180299029,0.5707245180299029
0.43471619981778975,0.43471619981778975
0.17174005418252,0.17174005418252
0.27255417118720954,0.27255417118720954
0.25893205878696907,0.25893205878696907
0.18668636125609056,0.18668636125609056
0.15536506632776048,0.15536506632776048
0.0448782034804163,0.0448782034804163
0.07970061611055919,0.07970061611055919
0.051992237881378356,0.051992237881378356
0.11504703826821344,0.11504703826821344
-3.139407372765814,0.01207519523574604
-2.7022851263981136,0.13462793247115068
1.6643909992087955,0.01253497054001848
-3.758404353615331,0.30306301528064816
-0.006215224540089909,-0.006215224540089909
-0.12138353143674147,0.40792076548311945
0.2697136744466962,0.2697136744466962
0.5019572556033769,0.5019572556033769
0.42973829794126006,0.42973829794126006
0.4428743683523513,0.4428743683523513
-1.7431511717124288,0.6864835740391929
0.6721260219212605,0.6721260219212605
0.6669071615506923,0.6669071615506923
0.6189762726742771,0.6189762726742771
1.1015463630187794,1.1015463630187794
1.1126366416773807,1.1126366416773807
1.0525539871885714,1.0525539871885714
1.3825034486699743,1.3825034486699743
1.4331900683647616,1.4331900683647616
1.4431409268240158,1.4431409268240158
1.5265131870368738,1.5265131870368738
1.4521029064218351,1.4521029064218351
1.7658380437405294,1.7658380437405294
1.7437108662700367,1.7437108662700367
1.8166029761737676,1.8166029761737676
1.7928275575646695,1.7928275575646695
1.94580641801808,1.94580641801808
1.9926172127589543,1.9926172127589543
2.273755567314545,2.273755567314545
1.9957759605677123,1.9957759605677123
2.0353899452104462,2.0353899452104462
2.1723466997811385,2.1723466997811385
3.4673920812897547,1.9648891990300197
2.1174342014750906,2.1174342014750906
2.061400627043873,2.061400627043873
1.9354194122577089,1.9354194122577089
1.9605140782348558,1.9605140782348558
1.7589653184587635,1.7589653184587635
1.694971579447518,1.694971579447518
1.6208343016799724,1.6208343016799724
1.660140555824946,1.660140555824946
1.4851287651711262,1.4851287651711262
1.3974643938759148,1.3974643938759148
1.2503059125443818,1.2503059125443818
1.1923482576182602,1.1923482576182602
1.1160052917285683,1.1160052917285683
1.0579847343566668,1.0579847343566668
0.8727291551563864,0.8727291551563864
0.7708505257479144,0.7708505257479144
0.671231293561297,0.671231293561297
0.5613886195333047,0.5613886195333047
0.599156592824166,0.599156592824166
0.43314261793513664,0.43314261793513664
0.3152699755867828,0.3152699755867828
0.3109316776625195,0.3109316776625195
0.1743085296508693,0.1743085296508693
0.3165514039197882,0.3165514039197882
-0.10956309464110225,-0.10956309464110225
0.0797907563522838,0.0797907563522838
0.13326961270679988,0.13326961270679988
-0.057562592367372364,-0.057562592367372364
0.022478206480493285,0.022478206480493285
-0.21150076337009036,-0.21150076337009036
-0.19989907261726936,-0.19989907261726936
0.01725056076601393,0.01725056076601393
0.11927556970201883,0.11927556970201883
0.2173023233984063,0.2173023233984063
0.16842519093779917,0.16842519093779917
0.14573682679687805,0.14573682679687805
0.2850584036133884,0.2850584036133884
0.5578306062569516,0.5578306062569516
0.4460545075424044,0.4460545075424044
0.43955803654685854,0.43955803654685854
5.58832067803204,0.708569911886457
5.48692590627091,0.6895760116970334
5.9942216538578625,0.8380952131631613
6.0085746480162765,0.8754154136171155
0.9833797155456444,0.9833797155456444
1.0806490822001296,1.0806490822001296
1.2681772441585917,1.2681772441585917
1.3184031857086642,1.3184031857086642
1.2371346047461929,1.2371346047461929
1.2291705060905893,1.2291705060905893
1.4791443845380523,1.4791443845380523
1.789640936935385,1.789640936935385
1.7807059462869423,1.7807059462869423
1.7334964152406411,1.7334964152406411
1.9837184679390802,1.9837184679390802
1.9077897791443426,1.9077897791443426
1.9892920457086727,1.9892920457086727
-0.08089895095401567,1.8904813695720077
1.3831787667804045,2.097970772772885
-1.765593321990156,1.9138194141208429
-1.1631079819311414,2.047186819462623
2.0038618391676177,2.0038618391676177
2.020715711756425,2.020715711756425
1.8723153661085563,1.8723153661085563
1.9544816959388056,1.9544816959388056
1.8490268370396081,1.8490268370396081
1.9812706163179545,1.9812706163179545
1.8321273886597724,1.8321273886597724
1.8597017608476745,1.8597017608476745
1.7929890787703469,1.7929890787703469
1.5755407600477407,1.5755407600477407
1.5030260510746443,1.5030260510746443
1.3029893131215864,1.3029893131215864
1.4470493308011518,1.4470493308011518
1.1259094310874365,1.1259094310874365
1.103876452195679,1.103876452195679
0.9562198967124114,0.9562198967124114
0.7168750542511813,0.7168750542511813
0.8051485196851405,0.8051485196851405
0.43750052256811056,0.43750052256811056
0.6144428017350189,0.6144428017350189
0.44744232623856206,0.44744232623856206
0.3455399984485136,0.3455399984485136
0.22339699359983267,0.22339699359983267
0.3159280350529916,0.3159280350529916
0.3561009052684154,0.3561009052684154
0.2226085044521932,0.2226085044521932
0.05427769751330484,0.05427769751330484
0.01296671683912659,0.01296671683912659
-0.02681224658901893,-0.02681224658901893
0.0792094452674189,0.0792094452674189
-0.06589159115246641,-0.06589159115246641
-0.06774010138536679,-0.06774010138536679
0.02922059169857619,0.02922059169857619
0.22450009558881656,0.22450009558881656
-0.019546573080825677,-0.019546573080825677
0.17906936494405046,0.17906936494405046
0.24305142130540058,0.24305142130540058
0.2579443096527562,0.2579443096527562
0.3193036923441248,0.3193036923441248
0.5420981934335363,0.5420981934335363
0.49976262570688895,0.49976262570688895
2.1895007921509357,0.655211094186766
-0.04100022520286273,0.7254185938311728
4.457147396892021,0.82186341139268
3.1626699403840806,0.7109504651567943
0.8170800145449335,0.8170800145449335
1.0954221647458575,1.0954221647458575
1.1383681423975354,1.1383681423975354
1.3143563030816487,1.3143563030816487
1.2994778075849163,1.2994778075849163
1.4154541297415897,1.4154541297415897
-2.758282271773359,1.3618913592926576
-0.09329381903556455,1.5853268559483655
-3.4008376805216263,1.5365618698169077
1.567397056636639,1.567397056636639
-2.4955211623699487,1.7924441677680614
1.940826931977913,1.940826931977913
2.079788397568824,2.079788397568824
2.047010217119455,2.047010217119455
1.9487898215425754,1.9487898215425754
1.9352253778619457,1.9352253778619457
1.8236250051497653,1.8236250051497653
1.958155966955747,1.958155966955747
2.0618157933525745,2.0618157933525745
1.8613394764672206,1.8613394764672206
1.8602808049997077,1.8602808049997077
1.9187163173710469,1.9187163173710469
1.8808948079688177,1.8808948079688177
1.8883360421084197,1.8883360421084197
1.8015563324378507,1.8015563324378507
1.628326773352336,1.628326773352336
1.566839760543878,1.566839760543878
1.5739558424221232,1.5739558424221232
0.352522787059647,1.439437470231473
1.896175561383245,1.3962499489457354
-0.9689475964220724,1.1075024276529002
1.1848383770154363,1.1848383770154363
0.9230979804597257,0.9230979804597257
0.9296012393822798,0.9296012393822798
-0.8196945747930453,0.8427375646590591
-0.7358697088836692,0.6295515935904625
-1.4275226902100515,0.7305664635360944
0.44864145831377006,0.44864145831377006
0.3256217057522449,0.3256217057522449
0.38233517555288693,0.38233517555288693
0.3094708453104482,0.3094708453104482
-0.7819017316093261,0.1603565503695962
0.30336716152081744,0.30336716152081744
0.05041560813529139,0.05041560813529139
-0.012141137790305331,-0.012141137790305331
-0.10826537568197,-0.10826537568197
0.07626018999268504,0.01512053220761776
0.056848715675239296,0.056848715675239296
-0.09436128551156767,-0.09436128551156767
0.003308238618501646,0.003308238618501646
1.9102545201776644,-0.1277233657413353
1.9289287362101661,0.07330978503667884
3.1735475165168867,0.13992799231164296
0.2006164831292268,0.2006164831292268
0.253103784634199,0.253103784634199
2.2188194001269688,0.30959874997418974
3.365088694569283,0.3712929757628077
2.909340671925316,0.38214659550856955
0.5542828862443683,0.5542828862443683
0.609435742077542,0.609435742077542
0.6265467092371352,0.6265467092371352
0.6672728981387155,0.6672728981387155
0.8142014354055523,0.8142014354055523
1.1061369791942752,1.1061369791942752
0.9797252661157605,0.9797252661157605
1.3323067104258017,1.3323067104258017
1.397002324080594,1.397002324080594
1.2618639642606935,1.2618639642606935
1.3167840842019414,1.3167840842019414
1.3214931839095776,1.3214931839095776
1.4850956752545446,1.4850956752545446
1.6207502394620024,1.6207502394620024
1.7597139194462934,1.7597139194462934
1.7319904651007698,1.7319904651007698
1.8605033676047762,1.8605033676047762
1.7584252775382052,1.7584252775382052
1.9422268849483664,1.9422268849483664
2.082556829346362,2.082556829346362
2.241087968086238,2.241087968086238
1.8499622083513896,1.8499622083513896
1.9643994275291006,1.9643994275291006
2.0886888281622893,2.0886888281622893
2.044867485626747,2.044867485626747
1.9928294049252122,1.9928294049252122
1.9877674038190072,1.9877674038190072
1.8330462831618257,1.8330462831618257
1.6401818360152451,1.6401818360152451
1.841557575261961,1.841557575261961
1.749722840386411,1.749722840386411
5.262497414178758,1.5446833580607613
1.4594182578241857,1.4594182578241857
1.2701124176095557,1.2701124176095557
1.300513115594449,1.300513115594449
1.2298212408537474,1.2298212408537474
1.11740591394532,1.11740591394532
1.216903039978411,1.216903039978411
0.8357726356693191,0.8357726356693191
0.9930104671606452,0.9930104671606452
0.6923369062658288,0.6923369062658288
0.49126749965878747,0.49126749965878747
0.6432023018775337,0.6432023018775337
0.4219560808177303,0.4219560808177303
0.3581362023371613,0.3581362023371613
0.3889900581311748,0.3889900581311748
0.1637120219429534,0.1637120219429534
0.15781852509528538,0.15781852509528538
0.16731407645051816,0.16731407645051816
0.02875264993111929,0.02875264993111929
0.0018802754158160073,0.0018802754158160073
0.03442217894921998,0.03442217894921998
0.08765488176364306,0.08765488176364306
0.09255159243669735,0.09255159243669735
0.043268928937557016,0.043268928937557016
-0.033048067366847594,-0.033048067366847594
0.10174793614584643,0.10174793614584643
0.07270904183957583,0.07270904183957583
0.1945513530583916,0.1945513530583916
0.014752640276403994,0.014752640276403994
-5.985281271361034,0.10765183669817177
0.19605175383201662,0.19605175383201662
0.44547887982954104,0.44547887982954104
0.388344500092884,0.388344500092884
0.5276199103505488,0.5276199103505488
0.6535057581418523,0.6535057581418523
0.7526906551731145,0.7526906551731145
0.8560767779574565,0.8560767779574565
1.6690577527045578,0.9134203261418642
-0.5730546510598666,1.026795914824794
1.101872362625089,1.101872362625089
1.179759690909315,1.179759690909315
1.2568989754945252,1.2568989754945252
1.3650791788812977,1.3650791788812977
1.3438930998067962,1.3438930998067962
1.6779164533871294,1.6779164533871294
1.5899216952378254,1.5899216952378254
1.7633557602372472,1.7633557602372472
1.7618235030182343,1.7618235030182343
2.0384927376236464,2.0384927376236464
1.8598288452079048,1.8598288452079048
1.9959663928019613,1.9959663928019613
2.1693740503161263,2.1693740503161263
2.0143520186065818,2.0143520186065818
2.0800661719471476,2.0800661719471476
2.021604711090171,2.021604711090171
1.9110589240197573,1.9110589240197573
1.9541995433781456,1.9541995433781456
1.8314233869013599,1.8314233869013599
1.8185870527658148,1.8185870527658148
1.8728773294731644,1.8728773294731644
1.7374327836622068,1.7374327836622068
1.7124307475121459,1.7124307475121459
1.6322645829270401,1.6322645829270401
1.6258516252957649,1.6258516252957649
1.4048528540417082,1.4048528540417082
1.3533495971796272,1.3533495971796272
1.125428757896623,1.125428757896623
1.0711100526013348,1.0711100526013348
0.9897592924920177,0.9897592924920177
1.0168506770159595,1.0168506770159595
0.7710423317919011,0.7710423317919011
0.7291879044236849,0.7291879044236849
0.5678372616888823,0.5678372616888823
0.5004939385517075,0.5004939385517075
0.4796414848295345,0.4796414848295345
0.49338449325545286,0.49338449325545286
0.45377756120469315,0.45377756120469315
0.18007294808137714,0.18007294808137714
0.22816140272535324,0.22816140272535324
-0.009768862152992497,-0.009768862152992497
0.3327300886736163,0.3327300886736163
-0.027455299385369628,-0.027455299385369628
0.27117352704784503,0.27117352704784503
-0.11877568231773336,-0.11877568231773336
0.015309175493354421,0.015309175493354421
-0.06465173974856651,-0.06465173974856651
2.622560278116258,-0.13591495910074108
0.05754533805275048,0.05754533805275048
-1.3743212025437108,0.05850835394382153
-1.273195932438374,0.07794904745283608
0.24742990077905505,0.24742990077905505
0.27098084751737944,0.27098084751737944
0.2628824745323517,0.2628824745323517
0.32952089814939156,0.32952089814939156
0.2548629889806211,0.2548629889806211
0.42880077833029107,0.42880077833029107
0.44587475032195595,0.44587475032195595
0.7858391587968729,0.7858391587968729
0.7760558731409287,0.7760558731409287
0.646221317282526,0.646221317282526
1.018082602851516,1.018082602851516
1.0176418328044747,1.0176418328044747
1.1756311705026647,1.1756311705026647
1.234756443490634,1.234756443490634
1.3526678985417868,1.3526678985417868
1.3066609207261908,1.3066609207261908
5.333333551439161,1.488071353893785
1.6769449302315587,1.6769449302315587
1.8678436717893903,1.8678436717893903
1.7496596443226022,1.7496596443226022
1.743127297218442,1.743127297218442
1.8911676705406297,1.8911676705406297
1.9728944498836127,1.9728944498836127
1.967533124953323,1.967533124953323
1.8934263148791093,1.8934263148791093
2.046896521800598,2.046896521800598
2.0182010849235477,2.0182010849235477
2.0989732759115936,2.0989732759115936
2.0580459126285433,2.0580459126285433
2.01651024873804,2.01651024873804
1.8795515304294232,1.8795515304294232
1.9237915386611295,1.9237915386611295
1.7789064762680826,1.7789064762680826
1.7055814158826914,1.7055814158826914
1.7191505062521768,1.7191505062521768
1.7876439247372984,1.7876439247372984
1.6044728137770197,1.6044728137770197
1.4451825315005775,1.4451825315005775
1.4725407998752187,1.4725407998752187
1.742718547420843,1.2151914506125674
3.5063686193160555,1.1363982767386835
1.5337564642165629,1.0384057662195691
3.4893602521860236,1.0518525739106621
0.9161316614408078,0.9161316614408078
0.6758785643692697,0.6758785643692697
0.5395751982305088,0.5395751982305088
0.7850011890176427,0.7850011890176427
0.44673620976466105,0.44673620976466105
-0.5557092363229623,0.3546631639411046
-0.7421653179120336,0.4428534448197244
0.18597136250949092,0.18597136250949092
0.2756772816153997,0.2756772816153997
0.2225042325659678,0.2225042325659678
0.010116379541645251,0.010116379541645251
0.09560681154209219,0.09560681154209219
0.0694956400088413,0.0694956400088413
0.024105467846398367,0.024105467846398367
0.6644566067018327,-0.03927977415475034
0.21778794198216012,0.04998246615833147
0.002503801450427945,-0.14842783143799154
-0.5367360976557808,0.08841451638433404
0.03556406543799521,0.03556406543799521
0.4261364280130029,0.4261364280130029
0.297903486494999,0.297903486494999
0.18889107013396544,0.18889107013396544
0.23072663007884386,0.23072663007884386
0.3266465229709718,0.3266465229709718
0.40974221027752666,0.40974221027752666
0.37977933142202575,0.37977933142202575
0.5295894613968343,0.5295894613968343
0.6431556555972906,0.6431556555972906
0.6340031434334248,0.6340031434334248
0.8212283466610619,0.8212283466610619
0.9295622314035195,0.9295622314035195
1.0840854105289588,1.0840854105289588
3.5458198085015518,1.1720549537457239
1.2645375504198377,1.2645375504198377
1.345908360861344,1.345908360861344
1.5669408691386046,1.5669408691386046
1.5953086117575963,1.5953086117575963
1.578344042095569,1.578344042095569
1.671978965926473,1.671978965926473
1.7105522097926238,1.7105522097926238
1.8504583739201286,1.8504583739201286
1.7454083586910245,1.7454083586910245
1.9119647347833513,1.9119647347833513
1.8630992899732237,1.8630992899732237
2.0145061441797023,2.0145061441797023
2.059313846158796,2.059313846158796
1.9594168074028278,1.9594168074028278
1.9783705763291288,1.9783705763291288
1.932562170558338,1.932562170558338
5.102048387754821,1.8064303416905172
3.7421293085239156,1.9529072361856015
2.0246858487157184,2.0246858487157184
1.7497323188689076,1.7497323188689076
1.8391753452807496,1.8391753452807496
1.8539571758636693,1.8539571758636693
1.6410594670088108,1.6410594670088108
1.443210061025015,1.443210061025015
1.4195501446662666,1.4195501446662666
1.388284312354572,1.388284312354572
1.1718416474347289,1.1718416474347289
1.2505833390900079,1.2505833390900079
1.54617484085992,1.1122631133505565
0.9568690712044929,0.9568690712044929
-2.1634710216369495,0.9801280884819057
1.0918375744161417,0.6429207606099104
0.7928058212084703,0.5649784464647294
0.592743330308382,0.592743330308382
0.3903621980218787,0.3903621980218787
0.3635929337613915,0.3635929337613915
0.3064620563179259,0.3064620563179259
0.36176337973289674,0.36176337973289674
0.06992110472251087,0.06992110472251087
0.14398772452847233,0.14398772452847233
0.21059427679335702,0.21059427679335702
0.0009236916333561218,0.0009236916333561218
-0.05390502852807008,-0.05390502852807008
0.13941646003175903,0.13941646003175903
-0.03052009938211421,-0.03052009938211421
0.021287240413699896,0.021287240413699896
-0.025548963829148924,0.12809238016053925
-0.0580855957587158,-0.0580855957587158
0.08136419254564195,0.08136419254564195
0.02214777576812345,0.02214777576812345
0.14996870954155292,0.14996870954155292
0.13422823329522562,0.13422823329522562
0.13285745544808752,0.13285745544808752
0.23985054885838208,0.23985054885838208
0.3058081397568999,0.3058081397568999
0.6474694495934082,0.6474694495934082
0.6007813877702048,0.6007813877702048
0.5458581334960573,0.5458581334960573
0.7644033069772389,0.7644033069772389
0.8468510350721213,0.8468510350721213
0.94880556120865,0.94880556120865
1.1131722492527485,1.1131722492527485
1.1965252187655033,1.1965252187655033
1.1557298614174192,1.1557298614174192
1.3789502450790083,1.3789502450790083
1.4107053141461778,1.4107053141461778
1.5158782163561524,1.5158782163561524
1.6894590535685883,1.6894590535685883
1.7761543379693234,1.7761543379693234
1.7291203573590814,1.7291203573590814
1.7818618131379653,1.7818618131379653
1.7712050447511434,1.7712050447511434
1.9275687117992442,1.9275687117992442
1.8124891735593522,1.8124891735593522
1.9367380985244882,1.9367380985244882
2.004059392832216,2.004059392832216
2.052045600166057,2.052045600166057
2.075756162411964,2.075756162411964
2.0202270960744166,2.0202270960744166
2.0471878891687685,2.0471878891687685
1.8484703294538254,1.8484703294538254
1.7678265117985517,1.7678265117985517
1.9338460348648971,1.9338460348648971
1.7153750280270788,1.7153750280270788
1.5779997944937176,1.5779997944937176
1.4207761562565493,1.4207761562565493
1.625289774113648,1.625289774113648
-1.232348777583304,1.3378405260538768
1.4728726139716364,1.4728726139716364
1.095295196493093,1.095295196493093
1.2509396071001484,1.2509396071001484
1.1902197331065054,1.1902197331065054
0.8313728729433518,0.8313728729433518
0.8978329481753228,0.8978329481753228
3.518867853390189,0.7042558443041342
1.649090052603468,0.6599470432489023
0.534288646628709,0.534288646628709
0.4821636995145775,0.4821636995145775
0.3387194655211332,0.3387194655211332
0.42318458891247535,0.42318458891247535
0.1546898495227681,0.1546898495227681
0.2203313707799864,0.2203313707799864
1.0101653530513046,0.009158606903050787
0.30351725504267035,0.30351725504267035
-0.005268784744458001,-0.005268784744458001
0.19829659463460503,0.19829659463460503
0.09709880293005593,0.09709880293005593
0.1243368283030172,0.1243368283030172
-0.091202820436521,-0.091202820436521
0.10400491555385234,0.10400491555385234
0.08331009062290662,0.08331009062290662
0.04647611007259944,0.04647611007259944
2.2143840312505736,0.20254349232389926
0.027609271565720447,0.10308247993639862
2.553290349155055,0.2258312022034427
5.292404332494584,0.26006659727025117
0.41722173622778036,0.41722173622778036
0.590597996087166,0.590597996087166
0.5390670973542699,0.5390670973542699
0.5220816534890848,0.5220816534890848
0.7735399673975467,0.7735399673975467
0.7996401227363851,0.7996401227363851
0.814613580019162,0.814613580019162
1.0770258454342412,1.0770258454342412
1.0485957643049766,1.0485957643049766
1.037252798634423,1.037252798634423
1.461420848543561,1.461420848543561
1.368578287870011,1.368578287870011
1.4046104042096534,1.4046104042096534
1.6573616449251087,1.6573616449251087
1.6467118308717934,1.6467118308717934
1.680157488195167,1.680157488195167
1.634842406324835,1.634842406324835
1.7647847441922255,1.7647847441922255
1.8849682134697268,1.8849682134697268
1.9189872580449614,1.9189872580449614
2.080129085461207,2.080129085461207
2.128493971246479,2.128493971246479
2.155061431071212,2.155061431071212
1.916468615666655,1.916468615666655
2.061061712734551,2.061061712734551
1.950220527567884,1.950220527567884
2.0181946672937516,2.0181946672937516
1.9674578349668164,1.9674578349668164
1.8678604238061058,1.8678604238061058
1.8597147398065152,1.8597147398065152
1.6698239564809716,1.6698239564809716
1.6830342870141315,1.6830342870141315
1.6666494922472581,1.6666494922472581
1.4070855822037398,1.4070855822037398
1.539309483915398,1.539309483915398
-0.10815342972197795,1.4600757921577636
1.1264632362202467,1.1264632362202467
1.1695082172684848,1.1695082172684848
1.1803528933676524,1.1803528933676524
0.9989482256379544,0.9989482256379544
0.8282764453220868,0.8282764453220868
0.7183391896802231,0.7183391896802231
0.7385543496190254,0.7385543496190254
0.4885974052955649,0.4885974052955649
0.6723551691039724,0.6723551691039724
0.38891517008317067,0.38891517008317067
0.2501098903213348,0.2501098903213348
0.306767521071819,0.306767521071819
0.11175033627838504,0.11175033627838504
-0.17587679855427207,-0.17587679855427207
0.02019668052846897,0.02019668052846897
0.07148607279334583,0.07148607279334583
0.1017003565909704,0.1017003565909704
-1.6662414282841143,-0.007572603347097348
-4.298773283988089,-0.08793659701821521
-2.0892143171307787,-0.030217194309130134
-1.7204128729105044,0.1842075529241184
-0.09946768148854823,-0.09946768148854823
0.10049531185722667,0.10049531185722667
0.18187132574321493,0.18187132574321493
0.3293740129220093,0.3293740129220093
0.15762177925531695,0.15762177925531695
0.4448828995653679,0.4448828995653679
0.2518069342663686,0.2518069342663686
0.41167644012304366,0.41167644012304366
0.6365921615309816,0.6365921615309816
0.5699783305856787,0.5699783305856787
0.7876693582123404,0.7876693582123404
1.0144429054534374,1.0144429054534374
1.049610359216992,1.049610359216992
0.9435690987534604,0.9435690987534604
1.2028486948631483,1.2028486948631483
1.2539278652203423,1.2539278652203423
1.2018524822355219,1.2018524822355219
1.3642131289291917,1.3642131289291917
1.6474795940982903,1.6474795940982903
1.3402529314396312,1.6478582244518227
-0.230861584798014,1.7003312242536042
0.14762537542230492,1.5610432874610556
3.130814802826066,1.8086027650102492
1.663899002346112,1.663899002346112
1.8819362748165478,1.8819362748165478
1.99689426557704,1.99689426557704
2.014365214219043,2.014365214219043
1.9291311638107087,1.9291311638107087
3.5910327320158903,1.837749474379668
1.9350250834805953,1.9350250834805953
1.9622184992997442,1.9622184992997442
2.1459440123347253,2.1459440123347253
2.0940650153467373,2.0940650153467373
1.8322368316020805,1.8322368316020805
1.6466718873763346,1.6466718873763346
1.7611267573866423,1.7611267573866423
1.7573693875209042,1.7573693875209042
1.6167989250411539,1.6167989250411539
1.5282059719204482,1.5282059719204482
1.4387527676645737,1.4387527676645737
1.3786015966864402,1.3786015966864402
1.3033717997473357,1.3033717997473357
1.263865564342443,1.263865564342443
1.0228960557166147,1.0228960557166147
0.8785734166346252,0.8785734166346252
0.9154534172544275,0.9154534172544275
0.8546916088421551,0.8546916088421551
0.8564879651321952,0.8564879651321952
0.6891074480147819,0.6891074480147819
0.6305943384848144,0.6305943384848144
0.33684754208311996,0.33684754208311996
0.22077642644416795,0.22077642644416795
0.4118554919257062,0.4118554919257062
0.22989275908844536,0.22989275908844536
0.16398926032904548,0.16398926032904548
0.4157592123014926,0.4157592123014926
0.17275239783678137,0.17275239783678137
0.24737576999963315,0.24737576999963315
3.2920685285959843,0.05070394230960195
0.0390266708060481,0.0390266708060481
-0.16535997241397427,-0.16535997241397427
0.07261065735372728,0.07261065735372728
0.046818869543157705,0.046818869543157705
-0.256714285288006,-0.256714285288006
0.13441570298262712,0.13441570298262712
0.25442993250629575,0.25442993250629575
0.12643335390225124,0.12643335390225124
0.27818044448176127,0.27818044448176127
-0.13752824098713656,0.3567356098601949
1.7705353766879355,0.2949198651532219
0.738223595527383,0.3413805870641597
-0.606058058075156,0.5059586567545244
0.8112123133112826,0.8112123133112826
0.7863404984221952,0.7863404984221952
1.0050096506681705,1.0050096506681705
0.8673407172682511,0.8673407172682511
3.70479106455167,1.086926047434294
5.3112719500838805,0.9841616220203592
2.5965440151019528,1.2127527049326157
3.0283145831063925,1.474187211528618
1.3717783352393527,1.3717783352393527
1.4568001348089579,1.4568001348089579
1.5525796717944664,1.5525796717944664
1.7655303870469354,1.7655303870469354
1.8734902172431225,1.8734902172431225
1.7228923896852897,1.7228923896852897
1.8817148776007178,1.8817148776007178
1.7725616167545015,1.7725616167545015
1.9820027476233653,1.9820027476233653
2.0633475172008824,2.0633475172008824
1.9748639565825852,1.9748639565825852
2.0217315884861176,2.0217315884861176
2.130976462639305,2.130976462639305
1.9727590036436888,1.9727590036436888
1.9635983308429974,1.9635983308429974
1.6515992336624903,1.6515992336624903
1.8674866068670348,1.8674866068670348
1.8566383479748403,1.8566383479748403
1.814020874927741,1.814020874927741
1.6141839753352822,1.6141839753352822
1.5489084640443245,1.5489084640443245
1.5793717550961675,1.5793717550961675
1.5908051809755919,1.5908051809755919
1.4636555987197104,1.4636555987197104
1.2630033505019318,1.2630033505019318
1.2827898504146422,1.2827898504146422
0.9809940692896648,0.9809940692896648
0.9833784288716081,0.9833784288716081
0.818495257059842,0.818495257059842
0.8076214574304971,0.8076214574304971
0.5945272012312642,0.5945272012312642
0.7046405887271117,0.7046405887271117
0.48529874300954384,0.48529874300954384
0.46883728110635975,0.46883728110635975
0.2921207736704161,0.2921207736704161
0.2879853639307247,0.2879853639307247
0.16224618042493869,0.16224618042493869
0.20881548896218832,0.20881548896218832
0.2299269105383187,0.2299269105383187
0.20007015291024516,0.20007015291024516
0.07708994020482093,0.07708994020482093
0.002095408709296538,0.002095408709296538
0.1280048117080592,0.1280048117080592
0.005652967092544436,0.005652967092544436
0.10202758219290992,0.10202758219290992
0.19967490366692292,0.19967490366692292
-0.14483721037696065,-0.14483721037696065
0.10213308156089942,0.10213308156089942
0.34435765903263027,0.34435765903263027
0.10900204843011412,0.10900204843011412
0.395018011676622,0.395018011676622
0.2352501976322382,0.2352501976322382
0.19283857754918088,0.19283857754918088
0.3268524882166529,0.3268524882166529
0.5744600949763342,0.5744600949763342
2.6450325233337573,0.6124171380997607
-1.5449094692009935,0.8661603338102946
1.2317634590729543,0.8785353339874716
4.6514961089525215,0.9524782849722745
1.043417886943324,1.043417886943324
1.2892403912151646,1.2892403912151646
1.2510772748284555,1.2510772748284555
1.2965996208089294,1.2965996208089294
1.4306974799201384,1.4306974799201384
1.516269419688105,1.516269419688105
1.6053671310191706,1.6053671310191706
1.6631649489175815,1.6631649489175815
1.6808676508242701,1.6808676508242701
1.8694103359810526,1.8694103359810526
1.959296043998652,1.959296043998652
1.9180033966071173,1.9180033966071173
1.8715932833722735,1.8715932833722735
1.9710986057221183,1.9710986057221183
1.9951941344809192,1.9951941344809192
1.9934113245085268,1.9934113245085268
-5.27428265285956,1.9662948632884383
-9.365249141630754,1.907973783644211
-7.291482968802214,1.8470063900963785
-2.742460491105996,1.9432767249590814
1.9563876166369578,1.9563876166369578
1.6452276796142804,1.6452276796142804
1.7002083691330134,1.7002083691330134
1.689776525548383,1.689776525548383
1.5526190453678927,1.5526190453678927
1.531370530243771,1.531370530243771
1.3783568583425467,1.3783568583425467
1.3329168292319677,1.3329168292319677
0.6326270058796678,1.1720470548486437
1.8720076295772596,1.1828063834495222
-0.5753405066043265,1.1017509566894874
0.8787475946447127,0.8787475946447127
0.7200414596339184,0.7200414596339184
0.7379792155622926,0.7379792155622926
0.7521483154873942,0.7521483154873942
0.5333485888113868,0.5333485888113868
0.28740287326765035,0.28740287326765035
0.3754214014651034,0.3754214014651034
0.46459065408648725,0.46459065408648725
0.28211495196964853,0.28211495196964853
0.25971547151241314,0.25971547151241314
0.20798784355870095,0.20798784355870095
0.3214737977075641,0.3214737977075641
-0.06881066858294807,-0.06881066858294807
-0.04365095654795878,-0.04365095654795878
-0.03984227906309084,-0.03984227906309084
-0.10810507103043726,-0.10810507103043726
0.10634600420093471,0.10634600420093471
0.20721194050316677,0.20721194050316677
0.04107469536679863,0.04107469536679863
0.07008524131688781,0.07008524131688781
0.11099429404713526,0.11099429404713526
0.128693363122098,0.128693363122098
0.1343280459469282,0.1343280459469282
0.2625221787017344,0.2625221787017344
0.33940311593616623,0.33940311593616623
0.448647823471476,0.448647823471476
0.5110861461270544,0.5110861461270544
0.4860848919994559,0.4860848919994559
0.5914259164563317,0.5914259164563317
0.5851715719536952,0.5851715719536952
0.978822397981403,0.978822397981403
0.9922104078602434,0.9922104078602434
1.3303450951577047,1.3303450951577047
1.2872684890905062,1.2872684890905062
1.4363475701319843,1.4363475701319843
1.4161701025607012,1.4161701025607012
1.3862402452767246,1.3862402452767246
1.6269999582964243,1.6269999582964243
1.552927366535128,1.552927366535128
1.9057083561948254,1.9057083561948254
1.739300787177105,1.739300787177105
1.8272114078741966,1.8272114078741966
1.7882085304198336,1.7882085304198336
-0.6169982711919673,1.9609574509893681
-0.4925166306054338,1.8996331559168143
2.0540867125600073,2.0540867125600073
1.9987099554567798,1.9987099554567798
2.058813673170853,2.058813673170853
1.0959009061375766,2.061441399000377
-0.019542594668948254,1.9476432506259558
1.9759849036798294,1.9759849036798294
1.830313210556591,1.830313210556591
1.9162657839035973,1.9162657839035973
1.824363525322948,1.824363525322948
1.7012842138215818,1.7012842138215818
1.7660105827919046,1.7660105827919046
0.9382889316963066,1.693644374432927
-0.07282046386311225,1.3786902910490548
1.2855077005206388,1.2855077005206388
1.2285670442792478,1.2285670442792478
1.1283789885783257,1.1283789885783257
1.2855608628135138,1.2855608628135138
1.1836271531403735,1.1836271531403735
0.7759595978501749,0.7759595978501749
0.9013431039537187,0.9013431039537187
0.5729654638578262,0.5729654638578262
0.6963373161844031,0.6963373161844031
0.577797761823434,0.577797761823434
0.37534257426191725,0.37534257426191725
0.3551481997205583,0.3551481997205583
0.26335033256451873,0.26335033256451873
0.1639459897675603,0.1639459897675603
0.2859755434258463,0.2859755434258463
0.1523645751733275,0.1523645751733275
-0.07542445003918685,-0.07542445003918685
-0.04353966898956477,-0.04353966898956477
0.1520177579007489,0.1520177579007489
0.18188973204576966,0.18188973204576966
-0.06562367768469297,-0.06562367768469297
0.15526468672499763,0.15526468672499763
-0.08411514231132666,-0.08411514231132666
0.03299898291479715,0.03299898291479715
0.0066702460226280985,0.0066702460226280985
0.02104129880103181,0.02104129880103181
0.3015180067604355,0.3015180067604355
0.021252970589601516,0.021252970589601516
0.23912946024039794,0.23912946024039794
0.36186398099177314,0.36186398099177314
0.35741193806688565,0.35741193806688565
0.2988576978970041,0.2988576978970041
0.40693131017582707,0.40693131017582707
0.7246073266124554,0.7246073266124554
0.7599384621277692,0.7599384621277692
0.9305460868170197,0.9305460868170197
1.0553891933816424,1.0553891933816424
1.0709069067219388,1.0709069067219388
1.3060660165501607,1.3060660165501607
1.0660040903065715,1.0660040903065715
1.4320432957421494,1.4320432957421494
1.5347081558966653,1.5347081558966653
1.7100110382572367,1.7100110382572367
1.610524715507837,1.610524715507837
1.8608906120918323,1.8608906120918323
1.8975938752509083,1.8975938752509083
1.8661366403552897,1.8661366403552897
1.8362454182029695,1.8362454182029695
1.6284144883734952,1.6284144883734952
1.8828605528985944,1.8828605528985944
2.1631344363152127,2.1631344363152127
1.9073794993434927,1.9073794993434927
1.846196297836975,1.846196297836975
1.9272139981086065,1.9272139981086065
1.8803813259610296,1.8803813259610296
2.0637611244888565,2.0637611244888565
2.083641716890902,2.083641716890902
1.9703120757959467,1.9703120757959467
1.9873096050036962,1.9873096050036962
1.6373001696946092,1.6373001696946092
1.7221552448206083,1.7221552448206083
1.5935126003280757,1.5935126003280757
0.2970017297788252,1.4229056520477061
-1.0568937007100894,1.573219094595011
1.3504755659262722,1.3504755659262722
1.1887673147868092,1.1887673147868092
1.2404582197811407,1.2404582197811407
1.0512123926931756,1.0512123926931756
1.0398026097571451,1.0398026097571451
0.2757453106501553,0.7652455906555817
0.7559731180093237,0.7559731180093237
0.5906403594264218,0.5906403594264218
0.3951627301488286,0.3951627301488286
0.3670742594574759,0.3670742594574759
0.35151381090365746,0.35151381090365746
0.36610799821439494,0.36610799821439494
0.31537952924796214,0.31537952924796214
0.30070552340323137,0.30070552340323137
0.32815412628558494,0.32815412628558494
0.09159005387375181,0.09159005387375181
0.02319937079289883,0.02319937079289883
0.02170627129576229,0.02170627129576229
0.06177863070459543,0.06177863070459543
-0.11294421162330943,-0.11294421162330943
0.1706716964962794,0.1706716964962794
-0.012319378961511286,-0.012319378961511286
-0.014154900301525775,-0.014154900301525775
0.13054441775870712,0.13054441775870712
0.8733830313989331,0.029874214605005056
0.292741235385795,0.292741235385795
0.2698964999644503,0.2698964999644503
0.35118831697807246,0.35118831697807246
0.45757441239369107,0.45757441239369107
0.9725792091537566,0.4220293572546719
0.25166775729052404,0.6987717696893331
-2.025957928366196,0.680476626596291
-1.3126738821181028,0.7384824375089679
0.6646426863332283,0.6646426863332283
0.9200974253780327,0.9200974253780327
0.9313751753345109,0.9313751753345109
1.0332463074662783,1.0332463074662783
1.135658544289089,1.135658544289089
1.2375557982211671,1.2375557982211671
1.488038083011543,1.488038083011543
1.418350200171575,1.418350200171575
1.5154071095605357,1.5154071095605357
1.6956710115025155,1.6956710115025155
1.8810673870332222,1.8810673870332222
1.6857747015307716,1.6857747015307716
1.7882458886904822,1.7882458886904822
1.984727461037781,1.984727461037781
2.1039185454478617,2.1039185454478617
1.7829942945696602,1.7829942945696602
2.0590271079165463,2.0590271079165463
1.9824101612675356,1.9824101612675356
1.9315312578134174,1.9315312578134174
2.0623134862717696,2.0623134862717696
1.9132828536270243,1.9132828536270243
2.043878730412248,2.043878730412248
2.0848541019114055,2.0848541019114055
2.0928223773940338,2.0928223773940338
1.844796101087733,1.844796101087733
1.744889785987944,1.744889785987944
1.5977175703786022,1.5977175703786022
1.6731536209509243,1.6731536209509243
1.4768902421694483,1.4768902421694483
1.400724409828919,1.400724409828919
1.372049912033698,1.372049912033698
1.1083812633441041,1.1083812633441041
1.2744594273572931,1.2744594273572931
1.1579363879088735,1.1579363879088735
0.9270490989793513,0.9270490989793513
0.8811288729189479,0.8811288729189479
0.8115161651657335,0.8115161651657335
0.762236069175323,0.762236069175323
-0.8513559271968598,0.6632041502031054
-1.7068456996322827,0.45042611709039587
0.48749082232651636,0.48749082232651636
0.5020282602348455,0.5020282602348455
-4.3065453841733055,0.37536159123040136
-3.9367413076519613,0.32752962377043204
0.017873587422825743,0.017873587422825743
-2.7359403885400315,0.020743204922023695
-0.051478939588603154,-0.051478939588603154
0.13333122555492308,0.13333122555492308
0.020154478898268234,0.020154478898268234
-0.12775263869341144,-0.12775263869341144
-0.09990630504805201,-0.09990630504805201
0.0007042735441002528,0.0007042735441002528
0.8627570616244358,0.15424555794561468
0.1498669192832141,0.1498669192832141
-0.02595530536487234,-0.02595530536487234
0.25350203794887616,0.25350203794887616
0.15916328243784172,0.15916328243784172
0.13498720960729682,0.13498720960729682
0.37664801966364025,0.37664801966364025
0.3272321821469819,0.3272321821469819
0.6381445864183599,0.6381445864183599
0.6191747462038528,0.6191747462038528
0.5840030446238308,0.5840030446238308
0.9443549686831191,0.9443549686831191
0.9659433740679062,0.9659433740679062
1.0904351783463109,1.0904351783463109
1.1057474277424544,1.1057474277424544
1.3560823416885415,1.3560823416885415
1.2607339190793292,1.2607339190793292
-1.4467831928026411,1.4254039189917418
-2.094638436214047,1.5481549546855609
1.6461414871374909,1.5663550793041368
1.6549056132331055,1.6549056132331055
1.7020503256787516,1.7020503256787516
1.8873977962205803,1.8873977962205803
1.9141453657444922,1.9141453657444922
2.078593779618586,2.078593779618586
1.7863653186460702,1.7863653186460702
1.9451197797076019,1.9451197797076019
2.02146627378324,2.02146627378324
2.039702042545049,2.039702042545049
2.0045020298854435,2.0045020298854435
1.9685810369388894,1.9685810369388894
1.9451523412460192,1.9451523412460192
4.649541770050969,1.86392720682142
1.9393011488577923,1.9393011488577923
1.819171170466924,1.819171170466924
1.805006279914313,1.805006279914313
6.882380719126266,1.706187375962283
5.1175567295587205,1.653967611141099
7.20142469508418,1.5276643271515447
8.457647949286534,1.5094144843142183
1.270768295512598,1.270768295512598
1.358067488336409,1.358067488336409
1.152615881196713,1.152615881196713
1.2174613483128653,1.2174613483128653
0.9967829828206907,0.9967829828206907
0.9254649497154479,0.9254649497154479
0.787736017004932,0.787736017004932
0.635394589624281,0.635394589624281
0.622096289381607,0.622096289381607
0.6210754599187551,0.6210754599187551
0.568556805825082,0.568556805825082
0.14359599857505612,0.14359599857505612
0.28810357604811115,0.28810357604811115
0.2780156923995177,0.2780156923995177
0.23047801508405208,0.23047801508405208
0.29590121150042603,0.29590121150042603
0.1722575492288144,0.1722575492288144
0.1021734711390116,0.1021734711390116
0.17178093369763928,0.17178093369763928
-0.0851222669480066,-0.0851222669480066
-0.2664328660344002,-0.2664328660344002
-0.3752036429767365,0.17090971574930625
-0.28144488311783766,-0.07520873285881616
0.13187485408183558,0.13187485408183558
-0.06916704587268763,-0.06916704587268763
0.08428461611237872,0.08428461611237872
0.18682673992765864,0.18682673992765864
0.7598545575854503,0.2650877705107661
4.455316610358313,0.2405518670738327
0.42198167164713174,0.42198167164713174
0.4544990073528906,0.4544990073528906
0.6552700361431811,0.6552700361431811
0.6102880609984049,0.6102880609984049
0.8363435440117836,0.8363435440117836
0.8124149084045582,0.8124149084045582
0.9194035234708484,0.9194035234708484
0.9862977942309553,0.9862977942309553
1.2862894439183599,1.2862894439183599
1.3405556034232526,1.3405556034232526
-0.8965823247977225,1.3117803456860182
1.334655148183681,1.334655148183681
1.4605254136788572,1.4605254136788572
1.7191842574122722,1.7191842574122722
1.6914875917256584,1.6914875917256584
1.743761004979692,1.743761004979692
1.6762713211018692,1.6762713211018692
1.897262381932557,1.897262381932557
1.8908957040556722,1.8908957040556722
2.064261932251815,2.064261932251815
1.89817409476927,1.89817409476927
1.8617326415774218,1.8617326415774218
2.0491997302967953,2.0491997302967953
1.9986801686677618,1.9986801686677618
1.8486955026863308,1.8486955026863308
2.1122964153750945,2.1122964153750945
2.01733566023126,2.01733566023126
1.9325162726242364,1.9325162726242364
1.881591797477427,1.881591797477427
1.8030053169344549,1.8030053169344549
1.6562104301127851,1.6562104301127851
1.6603283903256214,1.6603283903256214
1.5491989596168456,1.5491989596168456
1.5186453400296307,1.5186453400296307
1.3959312139215874,1.3959312139215874
1.017385692810265,1.017385692810265
1.1346566664106696,1.1346566664106696
1.2075581810983378,1.2075581810983378
1.0639505468051116,1.0639505468051116
0.7887761556455986,0.7887761556455986
0.6579021640457481,0.6579021640457481
1.9842006174062465,0.7778444249899702
4.028521603422929,0.5362026832866194
0.344974337069775,0.344974337069775
0.4661141205457834,0.4661141205457834
0.25931465028283796,0.25931465028283796
0.10881454046792038,0.10881454046792038
0.21834824793351038,0.21834824793351038
0.28107550742936727,0.28107550742936727
0.11044972857685978,0.11044972857685978
0.17566724800020467,0.17566724800020467
0.037409273203384975,0.037409273203384975
0.08387364215611608,0.08387364215611608
0.001785141731801694,0.001785141731801694
-0.007099806070960209,-0.007099806070960209
0.125959304641778,0.125959304641778
0.016934650807332908,0.016934650807332908
-0.006664955188214784,-0.006664955188214784
0.06399244693627407,0.06399244693627407
0.1762067915062909,0.1762067915062909
0.08224514735451721,0.08224514735451721
2.5618127678892946,0.2570263412013351
2.189595419717661,0.42538843050984815
4.411774096583549,0.3405802172052123
0.5530017250369883,0.5530017250369883
0.5899086981757564,0.5899086981757564
0.5383758975860532,0.5383758975860532
0.6947480996000845,0.6947480996000845
3.0876560782729987,0.7432597331650005
6.109120917965033,1.0338857294421886
4.644945086099916,1.1374225513426484
1.1021791280837758,1.1021791280837758
1.173390362094425,1.173390362094425
1.4064210296397415,1.4064210296397415
1.6084249286298258,1.6084249286298258
1.5767135237198335,1.5767135237198335
1.6880141390646617,1.6880141390646617
1.813196053267068,1.813196053267068
1.7247787865340851,1.7247787865340851
1.9340197096300928,1.9340197096300928
1.7744400870905828,1.7744400870905828
1.9140093149822253,1.9140093149822253
2.0858208825769164,2.0858208825769164
1.878382940090025,1.878382940090025
2.025073511664544,2.025073511664544
2.0072946340113953,2.0072946340113953
1.928938617242129,1.928938617242129
1.8377544479858972,1.8377544479858972
2.0860779422221363,2.0860779422221363
1.9606620542391766,1.9606620542391766
1.9288996860297842,1.9288996860297842
1.7608533707159277,1.7608533707159277
-1.0191205205983658,1.90035344106969
-0.7901038272810803,1.8311975389724777
0.646130401248475,1.807760611779789
1.5802430657687325,1.5802430657687325
1.447492373651892,1.447492373651892
1.464588624923941,1.464588624923941
1.3720046121894345,1.3720046121894345
1.1696936832780143,1.1696936832780143
1.1289713156547019,1.1289713156547019
1.0049858072734104,1.0049858072734104
0.7156689534478256,0.7156689534478256
0.7198156309445942,0.7198156309445942
0.5731974135954595,0.5731974135954595
0.5751025777629092,0.5751025777629092
0.4510623431743294,0.4510623431743294
0.30131847384466454,0.30131847384466454
0.3012025439260164,0.3012025439260164
0.284834305994263,0.284834305994263
0.17375313810057866,0.17375313810057866
0.22201264003583432,0.22201264003583432
0.01683509830394836,0.01683509830394836
-0.0045631916292540875,-0.0045631916292540875
-0.08133880477682412,-0.08133880477682412
-0.06503237610310109,-0.06503237610310109
0.07283996799692094,0.07283996799692094
-0.017303753425379237,-0.017303753425379237
0.07753026923442816,0.07753026923442816
0.07966508067972711,0.07966508067972711
0.11117204296991581,0.11117204296991581
-0.03674414622017802,-0.03674414622017802
0.09933862630879568,0.09933862630879568
0.19383028890900827,0.19383028890900827
0.17473730808552815,0.17473730808552815
0.35201855011735744,0.35201855011735744
0.4598965717074643,0.4598965717074643
0.35177894491838124,0.35177894491838124
0.5862631446811478,0.5862631446811478
0.6444598375067592,0.6444598375067592
0.8499968193262005,0.8499968193262005
0.9079018719728473,0.9079018719728473
1.0561575643262584,1.0561575643262584
1.0847765319388996,1.0847765319388996
1.1771049310494535,1.1771049310494535
1.166495904908798,1.166495904908798
1.442255424955014,1.442255424955014
1.4698446017477518,1.4698446017477518
1.6681160962374482,1.6681160962374482
1.707724235573757,1.707724235573757
1.808681985733982,1.808681985733982
1.8146102398746575,1.8146102398746575
1.8677442322033293,1.8677442322033293
1.8720363119927945,1.8720363119927945
1.7723376761354888,1.7723376761354888
2.309128053102798,1.8938871139995141
1.1032750801009135,1.9388434965443289
1.7029099811928177,1.7029099811928177
2.0367189612584826,2.0367189612584826
1.8396961866831367,1.8396961866831367
2.05620310687277,2.05620310687277
2.1242369234356246,2.1242369234356246
1.8611767076034278,1.8611767076034278
1.6679179995065565,1.6679179995065565
1.7349872809874745,1.7349872809874745
1.7303553289952616,1.7303553289952616
1.7043089328401402,1.7043089328401402
1.6538207824911537,1.6538207824911537
1.45757690339544,1.45757690339544
1.3297473217167033,1.3297473217167033
1.3505946149902914,1.3505946149902914
1.439928533261576,1.439928533261576
1.1010602170056711,1.1010602170056711
1.0484316965807732,1.0484316965807732
0.8428766599891794,0.8428766599891794
1.1370528792686423,1.1370528792686423
0.7259580739800456,0.7259580739800456
0.5651550015941712,0.5651550015941712
0.5613094752603195,0.5613094752603195
0.46534927214707666,0.46534927214707666
0.4627361912712243,0.4627361912712243
0.2920992385977206,0.2920992385977206
0.257175701858048,0.257175701858048
0.05638178596660118,0.05638178596660118
0.171672928540886,0.171672928540886
0.025787817458004125,0.025787817458004125
-0.04743374243707166,-0.04743374243707166
2.56723287633496,-0.015149874912620771
0.1698300373488576,0.1698300373488576
0.04644561915606687,0.04644561915606687
0.050541825439515804,0.050541825439515804
2.4669026930259896,0.07335576493544532
-0.12308531427918742,-0.12308531427918742
-0.07214096801603054,-0.07214096801603054
0.0007510413898298152,0.0007510413898298152
0.16062946996176103,0.16062946996176103
0.29470237889516726,0.29470237889516726
0.30158270327901393,0.30158270327901393
0.357284769293057,0.357284769293057
0.3200439184813803,0.3200439184813803
0.5326451102077094,0.5326451102077094
0.5170252692313004,0.5170252692313004
0.410236018559443,0.410236018559443
0.7958851187131929,0.7958851187131929
0.9631565547286127,0.9631565547286127
0.9998955385351345,0.9998955385351345
0.9211777745599781,0.9211777745599781
1.1711950041861234,1.1711950041861234
1.2179317543502182,1.2179317543502182
1.454228648228239,1.454228648228239
1.5721612534231673,1.5721612534231673
1.5228858583563514,1.5228858583563514
1.596268618371528,1.596268618371528
1.7905966926792618,1.7905966926792618
1.73771987083294,1.73771987083294
1.949351126442231,1.949351126442231
1.7981113355791465,1.7981113355791465
1.9317540644005518,1.9317540644005518
1.899747960958822,1.899747960958822
1.98450608964356,1.98450608964356
2.0800498018113225,2.0800498018113225
2.0748433648901754,2.0748433648901754
1.8798898242174147,1.8798898242174147
1.8748426708976915,1.8748426708976915
1.8992920138627574,1.8992920138627574
1.9108562994639111,1.9108562994639111
1.7853991475258624,1.7853991475258624
1.920054790039651,1.920054790039651
1.7437489408747702,1.7437489408747702
1.5986312768929558,1.5986312768929558
1.5088534060530463,1.5088534060530463
1.5374298177666537,1.5374298177666537
1.391079310820921,1.391079310820921
1.2891510598170173,1.2891510598170173
1.3262768284360864,1.3262768284360864
1.072700485068364,1.072700485068364
0.9933782475232608,0.9933782475232608
1.0518455933839481,1.0518455933839481
0.9276377285231606,0.9276377285231606
0.6392295321129833,0.6392295321129833
3.1621634318501495,0.8331143528236155
0.6520237225706546,0.6520237225706546
0.6277545065836174,0.6277545065836174
0.3531084048162012,0.3531084048162012
-0.1961910595787839,0.5184904648880211
0.21671626888373857,0.21671626888373857
0.15172086010887897,0.15172086010887897
0.26051145286530974,0.26051145286530974
0.15854419566052075,0.15854419566052075
0.2800986932574147,0.2800986932574147
-0.05564592011046379,-0.05564592011046379
-0.011784956322025808,-0.011784956322025808
-0.022502497735876998,-0.022502497735876998
0.0995783833492669,0.0995783833492669
0.08812894438551082,0.08812894438551082
0.04448182123462105,0.04448182123462105
-1.7030076511895662,0.02191189272681965
1.2656839084722975,0.16745595566396976
-2.4106460607148326,0.274666925681465
0.2565793659821026,0.2565793659821026
0.37523973363661645,0.37523973363661645
0.30068201757418117,0.30068201757418117
0.42997414353513064,0.42997414353513064
0.49715942649131345,0.49715942649131345
0.6581002628647221,0.6581002628647221
0.794554136913354,0.794554136913354
0.8874872133269892,0.8874872133269892
0.9338636309125543,0.9338636309125543
0.9536753511468827,0.9536753511468827
0.9556058402805819,0.9556058402805819
1.1918023710349845,1.1918023710349845
1.2396221171433661,1.2396221171433661
1.4469915623017011,1.4469915623017011
1.4633625075951235,1.4633625075951235
1.7158299915793742,1.7158299915793742
1.6390773438882396,1.6390773438882396
1.616630976129149,1.616630976129149
1.6066612833782328,1.6066612833782328
1.8456421184601781,1.8456421184601781
1.8711419570509218,1.8711419570509218
1.8715994398571758,1.8715994398571758
2.077587375158277,2.077587375158277
1.9310198340190265,1.9310198340190265
2.0906154418691987,2.0906154418691987
2.1075841338894707,2.1075841338894707
1.9214614359010593,1.9214614359010593
2.0517866174916843,2.0517866174916843
1.9887280595777816,1.9887280595777816
1.8809646582810948,1.8809646582810948
1.8032229887723807,1.8032229887723807
1.858377944820064,1.858377944820064
1.750895464996136,1.750895464996136
1.8602421186278277,1.8602421186278277
1.4184617103217512,1.4184617103217512
1.519615910034838,1.519615910034838
1.278043999494105,1.278043999494105
1.1190889692886277,1.1190889692886277
1.2633710335207575,1.2633710335207575
0.8851558635741568,0.8851558635741568
1.0657913851486165,1.0657913851486165
0.9208341913989693,0.9208341913989693
0.902682380105264,0.902682380105264
0.5061468461547928,0.5061468461547928
0.608935582117537,0.608935582117537
0.5279346490333032,0.5279346490333032
0.5995544614177993,0.5995544614177993
0.33106795772033876,0.33106795772033876
0.3965950654067607,0.3965950654067607
0.003541360473972327,0.003541360473972327
0.13464948407264665,0.13464948407264665
0.25808083091060485,0.25808083091060485
0.049987455089363746,0.049987455089363746
0.066548867338315,0.066548867338315
0.05232102974449393,0.05232102974449393
-0.017350219566157368,-0.017350219566157368
0.12877371880887617,0.12877371880887617
0.03848374317674418,0.03848374317674418
-0.07111055768822555,-0.07111055768822555
0.017461856919309144,0.017461856919309144
0.19179045356666202,0.19179045356666202
0.05128798405918461,0.05128798405918461
0.24722944281094444,0.24722944281094444
0.46736920093539563,0.46736920093539563
3.4079255460962607,0.25687226029212534
5.489076708464308,0.4371980314118777
3.121779239210092,0.2680312510499112
7.72670808939965,0.34540370091048195
0.5656328941632067,0.5656328941632067
0.6669843562547679,0.6669843562547679
0.7854897535988525,0.7854897535988525
0.8495536490510873,0.8495536490510873
0.8943252600016944,0.8943252600016944
1.0768854545906277,1.0768854545906277
1.1909754988238266,1.1909754988238266
1.2587269595704116,1.2587269595704116
1.456589157079633,1.456589157079633
1.6380899913952534,1.6380899913952534
1.5163898756239036,1.5163898756239036
1.6293008213951619,1.6293008213951619
1.7653886074099239,1.7653886074099239
1.8480163340366966,1.8480163340366966
1.9100632347816817,1.9100632347816817
1.9443599573735897,1.9443599573735897
1.8999334510629928,1.8999334510629928
1.9976775266906812,1.9976775266906812
2.014514803873267,2.014514803873267
1.8578134139288094,1.8578134139288094
2.0213261737760666,2.0213261737760666
2.089164158989665,2.089164158989665
2.0966238752920403,2.0966238752920403
1.9971260260259718,1.9971260260259718
1.831619878357749,1.831619878357749
1.8485253451405301,1.8485253451405301
1.6280870245576415,1.6280870245576415
1.7724241274597563,1.7724241274597563
1.564992460223661,1.564992460223661
1.602468974140053,1.602468974140053
1.6761801647340306,1.6761801647340306
1.382824933160004,1.382824933160004
1.2241346615679964,1.2241346615679964
1.2155985920698225,1.2155985920698225
1.0161562516317446,1.0161562516317446
1.0893270858530444,1.0893270858530444
0.8346757142439227,0.8346757142439227
0.8430613000507828,0.8430613000507828
0.630973578870542,0.630973578870542
0.8173104328531937,0.8173104328531937
0.45500663076214143,0.45500663076214143
0.31632161834877837,0.31632161834877837
0.3377069006026542,0.3377069006026542
0.25407766282823674,0.25407766282823674
0.24899090610788713,0.24899090610788713
0.1351855721331862,0.1351855721331862
0.239624220060064,0.239624220060064
3.812994421349152,-0.05862900087157655
0.03386609131662861,0.03386609131662861
0.10099938569031962,0.10099938569031962
0.06770004093243505,0.06770004093243505
0.23524875987373242,0.23524875987373242
0.04892353501946189,0.04892353501946189
0.07575537365469517,0.07575537365469517
0.02398510611231444,0.02398510611231444
0.0465446482555619,0.0465446482555619
