\contentsline {section}{\numberline {1}Introduction}{1}{section.1}% 
\contentsline {section}{\numberline {2}Algorithms}{2}{section.2}% 
\contentsline {section}{\numberline {3}Datasets Description}{7}{section.3}% 
\contentsline {section}{\numberline {4}Evaluation Metric}{8}{section.4}% 
\contentsline {section}{\numberline {5}Experimental Results}{8}{section.5}% 
\contentsline {section}{\numberline {6}Conclusion}{9}{section.6}% 
