\relax 
\providecommand\hyper@newdestlabel[2]{}
\providecommand\HyperFirstAtBeginDocument{\AtBeginDocument}
\HyperFirstAtBeginDocument{\ifx\hyper@anchor\@undefined
\global\let\oldcontentsline\contentsline
\gdef\contentsline#1#2#3#4{\oldcontentsline{#1}{#2}{#3}}
\global\let\oldnewlabel\newlabel
\gdef\newlabel#1#2{\newlabelxx{#1}#2}
\gdef\newlabelxx#1#2#3#4#5#6{\oldnewlabel{#1}{{#2}{#3}}}
\AtEndDocument{\ifx\hyper@anchor\@undefined
\let\contentsline\oldcontentsline
\let\newlabel\oldnewlabel
\fi}
\fi}
\global\let\hyper@last\relax 
\gdef\HyperFirstAtBeginDocument#1{#1}
\providecommand\HyField@AuxAddToFields[1]{}
\providecommand\HyField@AuxAddToCoFields[2]{}
\bibstyle{abbrvnat}
\@writefile{toc}{\contentsline {section}{\numberline {1}Introduction}{1}{section.1}\protected@file@percent }
\newlabel{introduction}{{1}{1}{Introduction}{section.1}{}}
\citation{HOLT20045}
\citation{hastie01statisticallearning}
\@writefile{toc}{\contentsline {section}{\numberline {2}Algorithms}{2}{section.2}\protected@file@percent }
\newlabel{algorithms}{{2}{2}{Algorithms}{section.2}{}}
\citation{doi:10.1080/00401706.1970.10488634}
\citation{10.5555/3009657.3009730}
\citation{hyndman2018forecasting}
\citation{hyndman2018forecasting}
\citation{10.1145/3068335}
\citation{cite-key}
\citation{10.1145/335191.335388}
\citation{article}
\citation{4781136}
\citation{10.1162/089976601750264965}
\@writefile{toc}{\contentsline {section}{\numberline {3}Datasets Description}{7}{section.3}\protected@file@percent }
\newlabel{datasets}{{3}{7}{Datasets Description}{section.3}{}}
\@writefile{toc}{\contentsline {section}{\numberline {4}Evaluation Metric}{8}{section.4}\protected@file@percent }
\newlabel{metrics}{{4}{8}{Evaluation Metric}{section.4}{}}
\@writefile{toc}{\contentsline {section}{\numberline {5}Experimental Results}{8}{section.5}\protected@file@percent }
\newlabel{results}{{5}{8}{Experimental Results}{section.5}{}}
\bibdata{main}
\bibcite{10.1145/335191.335388}{{1}{2000}{{Breunig et~al.}}{{Breunig, Kriegel, Ng, and Sander}}}
\bibcite{hastie01statisticallearning}{{2}{2001}{{Hastie et~al.}}{{Hastie, Tibshirani, and Friedman}}}
\@writefile{toc}{\contentsline {section}{\numberline {6}Conclusion}{9}{section.6}\protected@file@percent }
\newlabel{conclusion}{{6}{9}{Conclusion}{section.6}{}}
\bibcite{doi:10.1080/00401706.1970.10488634}{{3}{1970}{{Hoerl and Kennard}}{{}}}
\bibcite{HOLT20045}{{4}{2004}{{Holt}}{{}}}
\bibcite{hyndman2018forecasting}{{5}{2018}{{Hyndman and Athanasopoulos}}{{}}}
\bibcite{4781136}{{6}{2008}{{{Liu} et~al.}}{{{Liu}, {Ting}, and {Zhou}}}}
\bibcite{10.5555/3009657.3009730}{{7}{1999}{{Mason et~al.}}{{Mason, Baxter, Bartlett, and Frean}}}
\bibcite{article}{{8}{1999}{{Rousseeuw and Driessen}}{{}}}
\bibcite{10.1162/089976601750264965}{{9}{2001}{{Sch\"{o}lkopf et~al.}}{{Sch\"{o}lkopf, Platt, Shawe-Taylor, Smola, and Williamson}}}
\bibcite{10.1145/3068335}{{10}{2017}{{Schubert et~al.}}{{Schubert, Sander, Ester, Kriegel, and Xu}}}
\bibcite{cite-key}{{11}{2010}{{Zare et~al.}}{{Zare, Shooshtari, Gupta, and Brinkman}}}
