X,Truth
1.1134685436099472,1.1134685436099472
0.999956562826966,0.999956562826966
4.854350417153664,0.8819308432008783
3.8484491303718302,0.9369388944813075
0.9581754135696428,0.9581754135696428
1.147559342337296,1.147559342337296
1.0097776053254877,1.0097776053254877
0.9835536446563433,0.9835536446563433
0.9954167404247415,0.9954167404247415
1.2875393013044845,1.2875393013044845
1.0818918913871955,1.0818918913871955
1.0264481547645918,1.0264481547645918
0.9634484881672827,0.9634484881672827
1.122523856048607,1.122523856048607
-1.235493806257449,1.0928377720221445
1.0366494987030788,1.0366494987030788
1.1105945289649595,1.1105945289649595
1.1623727361773133,1.1623727361773133
1.1539022927201295,1.1539022927201295
1.1477527084745747,1.1477527084745747
0.6976937229409022,0.6976937229409022
1.0213948182506938,1.0213948182506938
0.8845928095632506,0.8845928095632506
1.0345738985122475,1.0345738985122475
1.142540953222894,1.142540953222894
1.01736761918476,1.01736761918476
1.0998808746695157,1.0998808746695157
0.9605045316814712,0.9605045316814712
1.0048479451697612,1.0048479451697612
0.7952336242732031,0.7952336242732031
1.0685304740787747,1.0685304740787747
1.2011819099250853,1.2011819099250853
0.9470843903843683,0.9470843903843683
1.0052717641170203,1.0052717641170203
1.1827743780189925,1.1827743780189925
1.1129983316436158,1.1129983316436158
1.0089148016088156,1.0089148016088156
0.9981401292469425,0.9981401292469425
0.992791027832011,0.992791027832011
0.9832863677917638,0.9832863677917638
0.9774332375230839,0.9774332375230839
1.0337036232940449,1.0337036232940449
0.9720817917784287,0.9720817917784287
0.9993549968963192,0.9993549968963192
1.0659347370494567,1.0659347370494567
1.0758384274718524,1.0758384274718524
0.9969817991022643,0.9969817991022643
0.9481837122484059,0.9481837122484059
0.9817010622160156,0.9817010622160156
1.077672371854793,1.077672371854793
0.9247209358324006,0.9247209358324006
1.0781904865766063,1.0781904865766063
1.187328750579226,1.187328750579226
0.861221820510838,0.861221820510838
1.0963804820752239,1.0963804820752239
1.0377750369484007,1.0377750369484007
0.9371039712805923,0.9371039712805923
1.0098205000532372,1.0098205000532372
0.9057154483051644,0.9057154483051644
0.7208809870583135,0.7208809870583135
0.9758278609089069,0.9758278609089069
1.1378490084006656,1.1378490084006656
1.051648157485069,1.051648157485069
0.965186787270176,0.965186787270176
1.0659848394305695,1.0659848394305695
1.004085479847673,1.004085479847673
0.9532378819515988,0.9532378819515988
0.9159398962061206,0.9159398962061206
1.106669967558229,1.106669967558229
1.0002420448929,1.0002420448929
1.1152780781849199,1.1152780781849199
0.9478373330507689,0.9478373330507689
0.9414613066998954,0.9414613066998954
1.1044725305704381,1.1044725305704381
1.139433527474981,1.139433527474981
1.0684819169159872,1.0684819169159872
0.7820580582026053,1.0143291164669617
5.256252050715149,0.9238070168939053
1.0342100685404274,1.0342100685404274
1.046571488483724,1.046571488483724
1.1891158251015495,1.1891158251015495
5.58466148536006,0.9058989603413798
3.7929183165660874,1.0465903431451153
7.624068889945871,1.0210570283803044
1.0303844761453276,1.0303844761453276
0.9821094918214297,0.9821094918214297
0.990485064022887,0.990485064022887
1.1675650000271247,1.1675650000271247
0.9320506063477181,0.9320506063477181
1.0788537919570944,1.0788537919570944
1.1393714976720468,1.1393714976720468
0.9760274133269622,0.9760274133269622
1.0001361102546258,1.0001361102546258
0.9071636652607998,0.9071636652607998
0.9711489680133739,0.9711489680133739
0.9371696972701375,0.9371696972701375
1.0130773944178693,1.0130773944178693
1.0312996452097312,1.0312996452097312
0.8779049599647231,0.8779049599647231
1.0358556932176297,1.0358556932176297
1.0687645968625794,1.0687645968625794
1.19499057263593,1.19499057263593
1.0720571203483455,1.0720571203483455
1.0089381188282311,1.0089381188282311
1.0965262197202743,1.0965262197202743
1.0185381311857238,1.0185381311857238
1.1022898097594218,1.1022898097594218
1.0285972912125287,1.0285972912125287
1.1595696198189205,1.1595696198189205
1.1105880904779135,1.1105880904779135
0.8883861576099611,0.8883861576099611
1.003557841231469,1.003557841231469
0.9899903035456706,0.9899903035456706
1.1035518557697228,1.1035518557697228
1.1502132524751298,1.1502132524751298
1.0516133179935623,1.0516133179935623
0.9661593856221365,0.9661593856221365
1.0856599297537826,1.0856599297537826
0.9931008681914142,0.9931008681914142
1.0040218324400014,1.0040218324400014
0.9814750177971632,0.9814750177971632
1.0849252002668006,1.0849252002668006
1.026062269945908,1.026062269945908
1.1205736114889697,1.1205736114889697
0.7855295710273204,0.8444536495422664
-2.034855480284533,0.9904491212183789
-1.647986618988799,0.9250023063486934
-0.856553740665011,0.9796393186911625
1.0285907689148484,1.0285907689148484
1.0077748492184688,1.0077748492184688
1.128466837883325,1.128466837883325
1.048623953793073,1.048623953793073
0.9981034880960341,0.9981034880960341
1.0005000861106204,1.0005000861106204
1.0084992737856924,1.0084992737856924
1.0682576150308933,1.0682576150308933
0.7677630561068202,0.7677630561068202
0.8447499896175225,0.8447499896175225
5.196053421812707,1.1197631780760964
0.8830726562689784,0.8830726562689784
1.043621342172214,1.043621342172214
0.9507269593617325,0.9507269593617325
1.248896057543961,1.248896057543961
1.0304615473547707,1.0304615473547707
1.1175839619877173,1.1175839619877173
0.921226449404466,0.921226449404466
1.13516428956328,1.13516428956328
1.0368004585646724,1.0368004585646724
0.9094331596169849,0.9094331596169849
0.8613220269131847,0.8613220269131847
1.052149844722698,1.052149844722698
1.023820139383482,1.023820139383482
1.0747386112877917,1.0747386112877917
1.0303433105614273,1.0303433105614273
1.0814896711380764,1.0814896711380764
0.9902018509562871,0.9902018509562871
1.0212725143020027,1.0212725143020027
0.7215083129665107,0.9162310973801882
-1.8133812470544097,1.0854423321720665
3.0063554646003876,1.1089786090323512
-1.1534353186134427,0.9699417413555222
1.105795958916312,1.105795958916312
1.0106343669974762,1.0106343669974762
1.0719246570994254,1.0719246570994254
0.9980191057636691,0.9980191057636691
0.9951866567531371,0.9951866567531371
0.9102428688814315,0.9102428688814315
0.9364702745200749,0.9364702745200749
0.8934131052077652,0.8934131052077652
-0.9497793462934176,0.8843685735754039
0.8400066798415617,0.8400066798415617
1.105111257818311,1.105111257818311
0.8544312522847614,0.8544312522847614
1.0757576345752657,1.0757576345752657
1.028222388966329,1.028222388966329
1.021255218516154,1.021255218516154
0.8473215577583464,0.8473215577583464
1.017182379921569,1.017182379921569
1.0088823524409778,1.0088823524409778
1.1554649651158013,1.1554649651158013
1.0515089002603166,1.0515089002603166
1.1035208814547484,1.1035208814547484
0.9205935388745016,0.9205935388745016
1.0640552333578726,1.0640552333578726
0.9844225879336137,0.9844225879336137
0.9730805097123362,0.9730805097123362
1.1468984600522927,1.1468984600522927
1.037376484980398,1.037376484980398
1.08693190793015,1.08693190793015
0.9324749687147182,0.9324749687147182
0.9956407190922536,0.9956407190922536
1.015861328974734,1.015861328974734
0.7150522478073575,0.7150522478073575
0.723105697059727,0.723105697059727
1.0759393212563735,1.0759393212563735
0.997059637657634,0.997059637657634
1.26936335187548,1.26936335187548
0.9468334940021945,0.9468334940021945
0.8213901047736792,0.8213901047736792
0.9162846475920308,0.9162846475920308
0.9185212163965188,0.9185212163965188
1.2273052795863264,1.2273052795863264
0.9547184050021653,0.9547184050021653
1.1925994376990872,1.1925994376990872
1.032394310614796,1.032394310614796
0.8854029932378642,0.8854029932378642
1.0433218824046022,1.0433218824046022
2.817567177404976,1.0118889378275158
0.9315861550596571,0.9315861550596571
0.9405140162336049,0.9405140162336049
0.8860805762071053,0.8860805762071053
1.0555338792828122,1.0555338792828122
0.8155424820047545,0.8155424820047545
1.2204948039678822,1.2204948039678822
1.0100945656515496,1.0100945656515496
-0.5364265153880201,1.170405832745533
1.113322455210176,1.113322455210176
1.0694434071929257,1.0694434071929257
0.8915182648506208,0.8915182648506208
0.8914018339086709,0.8914018339086709
1.1336359538492393,1.1336359538492393
1.0940952223339304,1.0940952223339304
1.144737078572277,1.0090729210858977
0.9754191850280716,0.9754191850280716
0.8992253563464403,0.8992253563464403
0.8268471967629875,0.8268471967629875
3.635053747674213,0.982756645508898
1.0351381735641059,1.0351381735641059
0.993489377512092,0.993489377512092
1.1154993366808268,1.1154993366808268
1.174399583674716,1.174399583674716
0.715213934515806,0.715213934515806
1.1201597650059807,1.1201597650059807
3.096274329116195,0.9946761354146492
0.9225333500514383,0.9225333500514383
0.8903680650560797,0.8903680650560797
1.1195666278709737,1.1195666278709737
0.8946697611645038,0.8946697611645038
1.0242219063819291,1.0242219063819291
1.0773451346166405,1.0773451346166405
0.9947256293593025,0.9947256293593025
1.0185319935803785,1.0185319935803785
0.846652517665019,0.846652517665019
1.0189768966328552,1.0189768966328552
0.8843531251762138,0.8843531251762138
0.8735416894191274,0.8735416894191274
0.9825124414519268,0.9825124414519268
0.8554102343231853,0.8554102343231853
1.0627910745030602,1.0627910745030602
1.0409411954159051,1.0409411954159051
1.0792219674962393,1.0792219674962393
0.9720198734497647,0.9720198734497647
0.9494692129416727,0.9494692129416727
0.9396920370009074,0.9396920370009074
1.1377999417486289,1.1377999417486289
1.1295688391326626,1.1295688391326626
1.004087684780779,1.004087684780779
1.105499786943001,1.105499786943001
1.0354298308626313,1.0354298308626313
0.986378779234704,0.986378779234704
1.0832304331080358,1.0832304331080358
0.7732113661457031,0.7732113661457031
1.2020004349185858,1.2020004349185858
0.917194593496683,0.917194593496683
1.0356481138115905,1.0356481138115905
1.0776331314850052,1.0776331314850052
1.1123729048021747,1.1123729048021747
1.0795937751608717,1.0795937751608717
0.9434201625071528,0.9434201625071528
1.2051382801364943,1.2051382801364943
4.166821819675595,1.0763135838842717
2.1435752616894383,1.0038748430708553
0.7873451053880254,0.7873451053880254
0.9993633862468254,0.9993633862468254
3.5726912170356955,1.1742005148820573
0.9979734759795142,0.9979734759795142
0.8897901502140562,0.8897901502140562
0.9397595945184107,0.9397595945184107
0.9582002704006356,0.9582002704006356
0.9893035136240944,0.9893035136240944
0.892802786155048,0.892802786155048
0.9732829778693873,0.9732829778693873
1.1406443825342683,1.1406443825342683
1.1112814662472468,1.1112814662472468
1.141991266271695,1.141991266271695
1.102627708034102,1.102627708034102
0.9781250208654539,0.9781250208654539
1.0067675906106188,1.0067675906106188
0.9428774408786516,0.9428774408786516
0.7909679738454797,0.7909679738454797
0.9423241803388176,0.9423241803388176
-0.604163538557948,0.9745477500213298
-1.7274528381340515,0.9584581559086972
1.3906888541551288,0.8212748753018351
1.1646885526418824,1.1646885526418824
0.9199000119381168,0.9199000119381168
0.9543228262414257,0.9543228262414257
0.8099380364657087,0.8099380364657087
1.0006671288921818,1.0006671288921818
1.1128270522294204,1.1128270522294204
0.8555358891578004,0.8555358891578004
0.9853443044100345,0.9853443044100345
0.8283918018864809,0.8283918018864809
0.8703980052746851,0.8703980052746851
1.084512354358401,1.084512354358401
0.8243957509044031,0.8243957509044031
0.9444442833712281,0.9444442833712281
1.1045109823452983,1.1045109823452983
0.9112736592500184,0.9112736592500184
0.992315719844815,0.992315719844815
1.0050382282427983,1.0050382282427983
1.0545242971329365,1.0545242971329365
1.491390577037556,0.9522397915625062
0.8912193228859142,0.8912193228859142
0.9386039661178349,0.9386039661178349
0.919286234555276,0.919286234555276
0.8923856691882828,0.8923856691882828
6.083609219791803,0.9999358621084459
0.9355435259531694,0.9355435259531694
1.0881527207329376,1.0881527207329376
0.9474332860565335,0.9474332860565335
0.8597963351288297,0.8597963351288297
-2.5368553105258744,1.097669431661346
1.1254377414092007,1.1254377414092007
1.0296310285711292,1.0296310285711292
3.688015550178922,1.09356232232129
3.8360337352306173,0.9162756428280419
3.7437901725811193,0.9935061909454749
-2.126565200457985,0.9707657277559064
0.9623259477284359,0.9623259477284359
1.0800350165267711,1.0800350165267711
1.0835485740445383,1.0835485740445383
1.0083215572980055,1.0083215572980055
0.9961605115952763,0.9961605115952763
1.1473652444891087,1.1473652444891087
0.9932931995531855,0.9932931995531855
0.9422652536974784,0.9422652536974784
0.9940708520677813,0.9940708520677813
0.894391818585923,0.894391818585923
0.9933389336108454,0.9933389336108454
0.9348640913016911,0.9348640913016911
0.8855222365106135,0.8855222365106135
0.9092831480301022,0.9092831480301022
0.9845514458879484,0.9845514458879484
0.9189705411265096,0.9189705411265096
0.8711301465530112,0.8711301465530112
0.9582678914520212,0.9582678914520212
0.9770030455900727,0.9770030455900727
1.0476007292207583,1.0476007292207583
1.1119043588581816,1.1119043588581816
1.030926089559009,1.030926089559009
0.839637469880719,0.839637469880719
0.9133557809508059,0.9133557809508059
0.8318661745664305,0.8318661745664305
0.94136015407645,0.94136015407645
1.1799828580381628,1.1799828580381628
1.0598952023691015,1.0598952023691015
0.8108250617781289,0.8108250617781289
0.9051350231875216,0.9051350231875216
1.1171755869951896,1.1171755869951896
1.0677042483658319,1.0677042483658319
1.0981247151695466,1.0981247151695466
1.1650394150398569,1.1650394150398569
1.1385091314243503,1.1385091314243503
1.011094315687586,1.011094315687586
-0.12543364417864877,1.1036629177405592
4.072646413814134,0.967865803948603
5.739750858508399,0.9594310764359585
3.2555531277747907,0.8091373929152627
5.029471983583778,1.1103024200245737
1.095771386253055,1.095771386253055
1.0593655144192125,1.0593655144192125
0.9684190228595815,0.9684190228595815
1.1157431932221138,1.1157431932221138
0.9267998571345173,0.9267998571345173
0.7525430507692952,0.952370937601459
0.9011784700461054,0.9011784700461054
1.0479042223662407,1.0479042223662407
0.9212967414411192,0.9212967414411192
0.7805307048725919,0.7805307048725919
0.9635574874003427,0.9635574874003427
0.8787865646258148,0.8787865646258148
1.011861591630986,1.011861591630986
1.0650320382600993,1.0650320382600993
0.9707656311350128,0.9707656311350128
-1.5248070560036502,0.9949883193517285
1.0226932288240969,1.0226932288240969
1.023629624597061,1.023629624597061
1.0315481140414935,1.0315481140414935
1.0365498538176179,1.0365498538176179
1.0011306099246866,1.0011306099246866
0.8650162949955161,0.8650162949955161
0.9994196942271605,0.9994196942271605
-3.3990091247880927,0.9754889121120532
-1.3187104635096465,0.9430958491461028
-3.8196705798970854,1.0257942119814123
-1.7785676134783786,1.0659883567009625
-2.7318199704370385,0.8980331518921738
1.144182613495192,1.144182613495192
0.7919039592535468,0.7919039592535468
1.0639387415617676,1.0639387415617676
1.013947893610719,1.013947893610719
0.8307134491594994,0.8307134491594994
0.729951896183017,0.729951896183017
1.0075127887141353,1.0075127887141353
1.226427681507246,1.226427681507246
0.3845204364647872,0.8412826842036658
-1.662335189215476,1.0369453825581074
0.9927316304363678,0.9927316304363678
1.0771430585651354,1.0771430585651354
0.8831460607083068,0.8831460607083068
1.2698799491027026,1.2698799491027026
1.2062340471274795,1.2062340471274795
0.9563603284225171,0.9563603284225171
0.9193394868238003,0.9193394868238003
1.071414517061295,1.071414517061295
0.9879331235930703,0.9879331235930703
1.0410898915799176,1.0410898915799176
1.0688596864617967,1.0688596864617967
0.9546760931052009,0.9546760931052009
1.0060469128517495,1.0060469128517495
1.1526433694106126,1.1526433694106126
1.007984844827109,1.007984844827109
0.9698646662973277,0.9698646662973277
1.1482254238214888,1.1482254238214888
1.0941968168439133,1.0941968168439133
0.8984893634714903,0.8984893634714903
1.0125935561846882,1.0125935561846882
0.9672131505603818,0.9672131505603818
1.1293552951682324,1.1293552951682324
1.13287786171363,1.13287786171363
1.1549203906394976,1.1549203906394976
1.00913828087676,1.00913828087676
1.08432563221578,1.08432563221578
0.9034258860936111,0.9034258860936111
1.118830485174963,1.118830485174963
0.8487339841020376,0.8487339841020376
1.1175310556767557,1.1175310556767557
0.9616892998529313,0.9616892998529313
0.8826642529451365,0.8826642529451365
1.127180170842992,1.127180170842992
0.8635333691413192,0.8635333691413192
1.2369622839598917,1.2369622839598917
1.041354658063025,1.041354658063025
1.1305005073827612,1.1305005073827612
1.0632208584003913,1.0632208584003913
0.7641926880927395,0.7641926880927395
0.8370136949877428,0.8370136949877428
1.0495103952393945,1.0495103952393945
0.9442712291667785,0.9442712291667785
0.9747479229473218,0.9747479229473218
1.0525341589953627,1.0525341589953627
1.0553727163521207,1.0553727163521207
1.0479292507536584,1.0479292507536584
1.168388852089726,1.168388852089726
1.0561344007423674,1.0561344007423674
1.0343224337932835,1.0343224337932835
1.2350553453400392,1.2350553453400392
1.1961900569890034,1.1961900569890034
1.1203522811474194,1.1203522811474194
0.8069375808225664,0.8069375808225664
1.0378279420866534,1.0378279420866534
0.9243987621206131,0.9243987621206131
0.9320025603646555,0.9320025603646555
0.9177276098992818,0.9177276098992818
0.9957770923129017,0.9957770923129017
0.888084597554247,0.888084597554247
0.9373210116073013,0.9373210116073013
0.8694970740694927,0.8694970740694927
0.8787926254888458,0.8787926254888458
0.914324008833974,0.914324008833974
1.0181195421850617,1.0181195421850617
1.1153740513852948,1.1153740513852948
0.985093213803595,0.985093213803595
3.4476251336721577,0.8958829056260087
3.0768883768785686,1.204980200849868
1.052502831813489,1.052502831813489
1.083650486485719,1.083650486485719
0.884722387995092,0.884722387995092
0.7721675539078221,0.7721675539078221
1.1051325723710046,1.1051325723710046
0.9054648355641836,0.9054648355641836
1.0108764174693048,1.0108764174693048
0.9202931051504504,0.9202931051504504
1.0554297452078747,1.0554297452078747
1.1682818638450059,1.1682818638450059
0.9480169722108942,0.9480169722108942
1.0643796770694418,1.0643796770694418
1.1108174358800926,1.1108174358800926
0.8999671965986812,0.8999671965986812
0.9159743829884681,0.9159743829884681
0.8054522704686262,0.8054522704686262
1.0441374683967777,1.0441374683967777
0.8001575580464746,0.8001575580464746
0.9861405570549406,0.9861405570549406
1.0654245002865768,1.0654245002865768
0.9113916748054813,0.9113916748054813
1.1030853372514207,1.1030853372514207
1.0487514860761171,1.0487514860761171
1.1171992132091764,1.1171992132091764
1.101434022011886,1.101434022011886
1.199588608856619,1.199588608856619
0.9754811496482438,0.9754811496482438
1.021182823793048,1.021182823793048
1.115586235484022,1.115586235484022
1.115730061495104,1.115730061495104
1.0002418046928743,1.0002418046928743
0.9480162189974101,0.9480162189974101
1.0278470073440695,1.0278470073440695
1.020778772964165,1.020778772964165
1.0234484017474061,1.0234484017474061
0.8592754077334305,0.8592754077334305
0.9713685865496716,0.9713685865496716
0.9660472386042162,0.9660472386042162
0.9537972253558689,0.9537972253558689
1.0265125234009114,1.0265125234009114
0.9313464489412916,0.9313464489412916
1.1270028927850708,1.1270028927850708
0.9468511328742935,0.9468511328742935
1.0002637325870118,1.0002637325870118
0.9856629053664596,0.9856629053664596
1.1692607212379822,1.1692607212379822
1.012605756883664,1.012605756883664
0.9063233631415275,0.9063233631415275
0.98215648478187,0.98215648478187
1.0529808119521882,1.0529808119521882
0.8287764680572428,0.8287764680572428
1.0493088353880513,1.0493088353880513
0.954158198655822,0.954158198655822
0.9402682335548376,0.9402682335548376
1.0481318164907172,1.0481318164907172
1.2194630703657947,1.2194630703657947
1.16275484801489,1.16275484801489
1.090508949586722,1.090508949586722
1.0915665081717545,1.0915665081717545
0.7582166782672481,0.7582166782672481
1.065848439958248,1.065848439958248
1.0106146908977052,1.0106146908977052
0.9460581831651053,0.9460581831651053
0.8629761117492505,0.8629761117492505
0.8797371645579368,0.8797371645579368
1.004954406695871,1.004954406695871
0.9488158451088587,0.9488158451088587
0.7538326878532479,0.7538326878532479
1.0648309800927962,1.0648309800927962
0.9960561923213671,0.9960561923213671
0.7980832913712796,0.7980832913712796
4.69465519611776,0.9009988399300438
6.564730410581495,0.9583791451239727
4.0384498897029495,1.1011563391917503
4.12992639679476,0.930199827650312
1.010528447258077,1.010528447258077
0.9855023733928189,0.9855023733928189
0.986546179860442,0.986546179860442
0.8569068564541862,0.8569068564541862
0.9682555683779714,0.9682555683779714
1.070968759614701,1.070968759614701
0.9962929411813365,0.9962929411813365
1.1416934650169783,1.1416934650169783
0.9305201694184286,0.9305201694184286
0.9767496112176486,0.9767496112176486
1.0815820349080245,1.0815820349080245
0.9245694186314902,0.9245694186314902
1.0425179259819806,1.0425179259819806
1.1121005552573484,1.1121005552573484
1.0699116828332755,1.0699116828332755
0.9088865541136896,0.9088865541136896
1.0489072853373296,1.0489072853373296
1.0744601952841089,1.0744601952841089
1.1635481199527804,1.1635481199527804
1.1029238166110946,1.1029238166110946
1.07033730572088,1.07033730572088
1.2160710253590314,1.2160710253590314
0.8910757494447503,0.8910757494447503
1.092163966016388,1.092163966016388
1.0578708227942053,1.0578708227942053
1.0244827624530892,1.0244827624530892
1.0962500693060164,1.0962500693060164
1.0114965419598076,1.0114965419598076
1.0128624967662527,1.0128624967662527
0.9292234438361509,0.9292234438361509
0.9989657762918027,0.9989657762918027
0.9739589260892799,0.9739589260892799
1.0419446028642116,1.0419446028642116
1.0200431928589913,1.0200431928589913
0.9772606839517674,0.9772606839517674
0.9211865049421375,0.9211865049421375
0.9605700978242052,0.9605700978242052
1.1869799379484354,1.1869799379484354
0.9392450504215987,0.9392450504215987
0.9848079875093595,0.9848079875093595
0.9254288614797826,0.9254288614797826
0.9705242125105682,0.9705242125105682
1.141480938281062,1.141480938281062
1.1264440113073455,1.1264440113073455
0.986888333979923,0.986888333979923
0.9684361163877614,0.9684361163877614
0.9547895290187095,0.9547895290187095
1.1193562092163762,1.1193562092163762
1.0758584782893288,1.0758584782893288
0.8368208987553434,0.8368208987553434
3.5145514073811768,0.8751776391717075
5.338446657006064,1.071257284940331
-0.47819502360255006,0.7786964434267674
1.060399364110666,1.060399364110666
1.0602355399433636,1.0602355399433636
1.200749156560783,1.200749156560783
0.9474556465249901,0.9474556465249901
0.9961017131946771,0.9961017131946771
1.0539121473654003,1.0539121473654003
1.0335001779986095,1.0335001779986095
0.8637087832630401,0.8637087832630401
1.0413853211303095,1.0413853211303095
0.9974096071621128,0.9974096071621128
1.0358955476487641,1.0358955476487641
0.8710895106849373,0.8710895106849373
0.9552850036324185,0.9552850036324185
-1.2733167660318068,0.8906419649484635
-3.1190825365489383,1.0711071184629617
-1.3637221368354655,0.8453207289303746
1.063640325801783,1.063640325801783
0.8833189462655398,0.8833189462655398
0.9215452059985801,0.9215452059985801
0.7777862183782797,0.7777862183782797
1.14915488189336,1.14915488189336
0.8991539504521986,0.8991539504521986
1.0622298616968946,1.0622298616968946
0.8404920442066346,0.8404920442066346
1.0545283941976635,1.0545283941976635
1.0070625493037242,1.0070625493037242
1.007152968295425,1.007152968295425
0.958902751308214,0.958902751308214
1.0762616661415172,1.0762616661415172
1.0662065186031533,1.0662065186031533
0.9420542409109566,0.9420542409109566
0.9132685856936481,0.9132685856936481
1.0944723363547135,1.0944723363547135
0.8594667713264676,0.8594667713264676
0.9247997106387936,0.9247997106387936
0.8964842682316886,0.8964842682316886
0.9824347386655531,0.9824347386655531
1.0076064535428502,1.0076064535428502
0.877726496720088,0.877726496720088
1.108491587999631,1.108491587999631
1.1570956548454314,1.1570956548454314
1.0750999842942583,1.0750999842942583
1.1085802287003226,1.1085802287003226
1.0698424215129863,1.0698424215129863
1.1829964324860451,1.1829964324860451
1.0818498101064906,1.0818498101064906
0.9933405335708971,0.9933405335708971
0.9814395746190315,0.9814395746190315
0.9866461372499442,0.9866461372499442
1.0672399312235008,1.0672399312235008
0.7563997598555797,0.7563997598555797
1.0360435050415329,1.0360435050415329
0.8276334814888078,0.8276334814888078
0.931970252577577,0.931970252577577
0.9204736455147513,0.9204736455147513
0.9257986864327286,0.9257986864327286
1.0291301145652034,1.0291301145652034
1.0824134317357452,1.0824134317357452
0.8619837639884079,0.8619837639884079
0.9994644523732259,0.9994644523732259
0.97311310531968,0.97311310531968
0.8769851065765889,0.8769851065765889
0.9770932203190233,0.9770932203190233
0.9022561074882373,0.9022561074882373
1.0435293908720764,1.0435293908720764
1.0443882911317512,1.0443882911317512
0.9169960113518987,0.9169960113518987
0.9094743278737829,0.9094743278737829
0.9693815801791016,0.9693815801791016
1.1165362292918508,1.1165362292918508
0.9341900526850906,0.9341900526850906
1.1027153405514092,1.1027153405514092
0.7659001034327659,0.7659001034327659
0.9550337066949699,0.9550337066949699
0.7598455146348384,0.7598455146348384
1.0256747164003506,1.0256747164003506
0.8887109597438669,0.8887109597438669
1.172552528594694,1.172552528594694
1.1513676238998034,1.1513676238998034
1.0773654181327805,1.0773654181327805
0.9923047977169891,0.9923047977169891
4.729245916467249,1.0356907642398043
5.145428757600663,0.9685199206894807
0.996262562134242,0.996262562134242
0.8833462192073775,0.8833462192073775
1.9789142927557095,1.0473108148874346
1.091029911007095,1.091029911007095
0.7589872594492686,0.7589872594492686
0.8437105850511804,0.8437105850511804
0.8894314794341684,0.8894314794341684
0.8522370187381343,0.8522370187381343
0.8767807050878194,0.8767807050878194
0.8425066547121722,0.8425066547121722
0.9499021889243939,0.9499021889243939
0.9728610282894649,0.9728610282894649
0.8321446457436956,0.8321446457436956
0.9152131358075167,0.9152131358075167
0.9694825208462716,0.9694825208462716
2.373067937161883,0.9490976543114764
5.886053672759288,0.8154228896404383
2.893134810531155,0.9943748768385801
0.9340788006219736,0.9340788006219736
3.0080022686684473,0.8682447412896539
1.3218917797343752,0.9871267342127593
0.7631025196741039,1.0347487384527987
1.1038008202601994,1.1038008202601994
0.8994358757165264,0.8994358757165264
0.9239569666269226,0.9239569666269226
1.2106972387472834,1.2106972387472834
1.0658176032109563,1.0658176032109563
0.9246111540516974,0.9246111540516974
1.1101954103938538,1.1101954103938538
1.1312457440140329,1.1312457440140329
0.9395293657771878,0.9395293657771878
0.9511497103060229,0.9511497103060229
0.9523269984946453,0.9523269984946453
1.077841379856148,1.077841379856148
0.9937315048695339,0.9937315048695339
2.373602902254727,1.038250925852365
1.8068434901174488,1.1392576747903889
4.666837097674669,1.0294758674222029
1.9660250393037622,0.9973637123605639
1.0697029486653666,1.0697029486653666
0.9680856965109252,0.9680856965109252
0.9163935341167092,0.9163935341167092
0.833152731121853,0.833152731121853
0.9845444223462024,0.9845444223462024
1.080455042361362,1.080455042361362
0.9727698527185595,0.9727698527185595
0.926618320398178,0.926618320398178
1.0721290084099269,1.0721290084099269
1.0969605368280213,1.0969605368280213
1.2850994241889984,1.2850994241889984
1.0956648922008134,1.0956648922008134
1.2670898250229017,1.2670898250229017
1.1808065834387762,1.1808065834387762
0.7622574287169968,0.9446525850847871
-0.8954276899447091,0.8502559021427343
-0.5017549769342495,0.8737964315379574
-0.5559518317918445,0.9799426450916041
-0.2324262280417534,0.9886543337231603
1.0411052774054448,1.0411052774054448
0.9912260424706556,0.9912260424706556
1.1199325515185174,1.1199325515185174
0.8790958753268789,0.8790958753268789
0.9414223371686791,0.9414223371686791
1.009196688703877,1.009196688703877
-3.632694976903986,1.029161975411455
0.9115805883187353,0.9115805883187353
1.1028063282868832,1.1028063282868832
-2.2126369741168164,1.0456666505582202
1.0447363043278663,1.0447363043278663
1.037907889404781,1.037907889404781
1.0727266412092908,1.0727266412092908
0.8941660106280238,0.947088739059301
3.5028763993370715,0.9522755539947353
1.8668590118177604,1.1616809979467866
0.9809830181991634,0.9809830181991634
1.100629961376696,1.100629961376696
0.9959784432823195,0.9959784432823195
1.0192044213553415,1.0192044213553415
1.0225158028396297,1.0225158028396297
1.0762686353441704,1.0762686353441704
7.586435818340134,1.0656744953536357
5.89873937843152,0.8594128887453345
9.342484101126972,0.899971204637984
0.8497553311417603,0.8497553311417603
0.9545404775600467,0.9545404775600467
1.0095303182348543,1.0095303182348543
1.0914181261461635,1.0914181261461635
0.773501534763449,0.773501534763449
0.9479179982225955,0.9479179982225955
0.933964264211449,0.933964264211449
1.056040913460475,1.056040913460475
0.9020302486165881,0.9020302486165881
0.9747233587996803,0.9747233587996803
1.0351137425665862,1.0351137425665862
0.9603075432120393,0.9603075432120393
1.0970982472438822,1.0970982472438822
0.8394726199246288,0.8394726199246288
1.0568854273367794,1.0568854273367794
1.0373305709475127,1.0373305709475127
1.0897473204629666,1.0897473204629666
0.8837553814057422,0.8837553814057422
0.9520946615066713,0.9520946615066713
1.0203051319768508,1.0203051319768508
1.1813275173450326,1.1813275173450326
0.8695194847073712,0.8695194847073712
1.0294469600023937,1.0294469600023937
1.0710249550772404,1.0710249550772404
1.1062312672437176,1.1062312672437176
1.142629678739207,1.142629678739207
1.1056083467753755,1.1056083467753755
1.102190608222322,1.102190608222322
1.1830662275241395,1.1830662275241395
0.8885958751399698,0.8885958751399698
0.9515489813550386,0.9515489813550386
1.0539065523939415,1.0539065523939415
1.0994581143403728,1.0994581143403728
0.9704932219820082,0.9704932219820082
0.87335792797106,0.87335792797106
0.803469439221751,0.803469439221751
0.9906793604160454,0.9906793604160454
1.1319993034460087,1.1319993034460087
0.8792259821189046,0.8792259821189046
6.067260999227948,1.1173156733266127
2.1226106973409324,1.0053405352016014
2.428053084865346,1.0438714816951422
-0.2228456226843052,1.0235918540212896
3.7507998827030566,1.0496089173687042
1.1241146184111375,1.1241146184111375
-4.569063971054631,0.9005403069332782
-4.836139748480631,0.9040238247024945
1.044125329338221,1.044125329338221
0.9695685495134825,0.9695685495134825
1.0663733290942532,1.0663733290942532
1.0474895309236678,1.0474895309236678
1.0142179620133291,1.0142179620133291
0.8241952431484797,0.8241952431484797
0.9895413206516089,0.9895413206516089
0.950937981349527,0.950937981349527
1.0200217958485585,1.0200217958485585
1.066885924423357,1.066885924423357
1.126390528349585,1.126390528349585
1.0754946601107993,1.0754946601107993
0.939469804986204,0.939469804986204
1.0904998780128392,1.0904998780128392
1.0444731241013863,1.0444731241013863
0.7984076519068379,0.7984076519068379
1.1276560645791185,1.1276560645791185
0.17708039992040692,0.8705389580073497
3.5723949802309267,0.8791315772966551
1.0203889231413525,1.0203889231413525
0.9846769445845109,0.9846769445845109
0.8443294438169643,0.8443294438169643
1.019789908958853,1.019789908958853
0.9227366144265412,0.9227366144265412
4.13905171512666,1.0908821266745576
1.1801226309583568,1.1801226309583568
1.1298575385869871,1.1298575385869871
1.161360962395103,1.161360962395103
1.1087473352404114,1.1087473352404114
0.9888240991502447,0.9888240991502447
0.8318512601139638,0.8318512601139638
1.0416675093565888,1.0416675093565888
0.9871154096169282,0.9871154096169282
0.8642784889292028,0.8642784889292028
5.0418829841499,0.9830510187446206
0.9319917631805459,0.9319917631805459
0.952165294161358,0.952165294161358
1.0546871410453573,1.0546871410453573
0.862324739545546,0.862324739545546
0.9639923129046387,0.9639923129046387
0.9876250224625468,0.9876250224625468
0.9967983641198909,0.9967983641198909
0.9763209570847002,0.9763209570847002
1.0972369595496045,1.0972369595496045
1.0388501349451318,1.0388501349451318
0.9581733595041142,0.9581733595041142
0.9046832595576912,0.9046832595576912
1.0064626861897694,1.0064626861897694
1.1373419897505153,1.1373419897505153
1.0350572978916608,1.0350572978916608
0.8897953440468611,0.8897953440468611
0.8273300754619959,0.8273300754619959
0.9568490654550236,0.9568490654550236
1.0386586725553613,1.0386586725553613
1.1507815827457855,1.1507815827457855
1.0803804026587418,1.0803804026587418
0.9656020315318181,0.9656020315318181
1.125784490720701,1.125784490720701
0.8747233903976703,0.8747233903976703
1.125431906041945,1.125431906041945
1.1536862591900114,1.1536862591900114
0.9914757797717676,0.9914757797717676
0.9433102479093114,0.9433102479093114
0.9617143456939747,0.9617143456939747
-1.5884640847724458,1.0693779737461633
1.007670562403007,1.007670562403007
0.9287326044878943,0.9287326044878943
1.0662109645397606,1.0662109645397606
1.1356432825767842,1.1356432825767842
0.8906248398287554,0.8906248398287554
1.0142142624300687,1.0142142624300687
0.9195968224721448,0.9195968224721448
1.0143616502997812,1.0143616502997812
2.305758442058495,0.9411599766182837
1.139900930298861,1.139900930298861
1.150128838340299,1.150128838340299
0.8927481426446922,0.8927481426446922
0.8785392617111274,0.8785392617111274
0.9675457374213186,0.9675457374213186
1.0298785027601167,1.0298785027601167
1.116172979562289,1.116172979562289
0.8334585707402753,0.8334585707402753
1.1028545139167425,1.1028545139167425
0.27104143778199763,1.0251159939069185
2.883145105387322,0.9511873580491168
-1.3103248326784633,1.1082125610528462
1.3476195045883683,1.0312911329670578
0.9713730110728661,0.9713730110728661
1.0649324282901869,1.0649324282901869
0.8845061745489088,0.8845061745489088
0.9865480225263304,0.9865480225263304
1.0965469383372595,1.0965469383372595
1.0081944773933562,1.0081944773933562
1.057819904734163,1.057819904734163
0.9366621480686048,0.9366621480686048
1.0029900540780148,1.0029900540780148
1.074327401396297,1.074327401396297
0.9472367237848296,0.9472367237848296
1.003169083809075,1.003169083809075
1.034445598625044,1.034445598625044
1.0514426860619754,1.0514426860619754
0.900965450117934,0.900965450117934
1.0951621990227607,1.0951621990227607
0.9815298245612747,0.9815298245612747
1.0361573257960655,1.0361573257960655
1.1347742465738655,1.1347742465738655
1.085315421002707,1.085315421002707
1.0552964840862453,1.0552964840862453
1.1193854681024362,1.1193854681024362
0.9744419869282406,0.9744419869282406
0.9884642477994185,0.9884642477994185
1.1519325413118955,1.1519325413118955
5.7635012434526995,1.0869513077022683
6.117991002864668,0.8265909877757612
4.857253565171989,0.9490127637318421
6.082046007728374,1.0714916511399413
1.135257868594314,1.135257868594314
0.9196857287700282,0.9196857287700282
0.8746178259830028,0.8746178259830028
0.9412744611153783,0.9412744611153783
1.1123592605497616,1.1123592605497616
0.8438833046020912,0.8438833046020912
1.0134182191931544,1.0134182191931544
1.263398301479627,1.0450005076859687
1.0853556980304826,1.0853556980304826
0.9442109992412462,0.9442109992412462
0.9910592452746488,0.9910592452746488
1.1525493960603237,1.1525493960603237
0.8835952527077932,0.8835952527077932
0.9000238587794853,0.9000238587794853
0.9239884747470255,0.9239884747470255
1.1047712590368415,1.1047712590368415
1.118701666979376,1.118701666979376
1.09016677152579,1.09016677152579
1.1035522348863447,1.1035522348863447
1.0328351713124533,1.0328351713124533
0.9933137514110767,0.9933137514110767
1.1892210199335385,1.1892210199335385
0.924991437352454,0.924991437352454
2.4571463513013723,0.9936159352797026
1.0476552579148184,0.9841370147713591
3.8462176682330584,0.9605129956743087
0.9667418668445793,0.9667418668445793
1.1779441051742876,1.1779441051742876
1.0782256874612501,1.0782256874612501
0.9562747797528883,0.9562747797528883
1.1045134819926787,1.1045134819926787
1.1019002851885624,1.1019002851885624
0.915272302355331,0.915272302355331
1.1352601069103139,1.1352601069103139
1.0397135060818992,1.0397135060818992
0.9243507032002484,0.9243507032002484
0.908312996621879,0.908312996621879
0.8433546136786969,0.8433546136786969
0.9501474503338652,0.9501474503338652
0.9176988976989794,0.9176988976989794
1.1401561160292772,1.1401561160292772
1.138323975415088,1.138323975415088
1.0661758861139583,1.0661758861139583
0.9553349554098847,0.9553349554098847
0.8589186103602057,0.8589186103602057
0.8978224126473775,0.8978224126473775
-1.3102318713729204,1.1620733504045027
-2.4407949251081087,0.9739414517816998
1.232226003886221,0.9448854626367643
-0.9509803066159691,0.9869346413372707
0.9479977862205096,0.9479977862205096
1.1001875912137073,1.1001875912137073
1.130597644441423,1.130597644441423
1.1060989655233835,1.1060989655233835
1.1959173996408596,1.1959173996408596
0.9454345826920304,0.9454345826920304
1.0118116692229537,1.0118116692229537
1.1457309983341544,1.1457309983341544
1.0363739131484497,1.0363739131484497
0.8923261399617325,0.8923261399617325
1.1878701272736545,1.1878701272736545
1.0739687188939904,1.0739687188939904
0.9191872651843723,0.9191872651843723
0.9592394843325762,0.9592394843325762
0.7202653586325097,0.9359141977392375
4.680289323402097,0.9630131877780591
3.354115186373788,0.9314125313467446
2.890543333343172,1.0393014941178829
1.0329516878095517,1.0329516878095517
0.9566903353392199,0.9566903353392199
0.8376106613500836,0.8376106613500836
1.0913644792928363,1.0913644792928363
0.9236125103104043,0.9236125103104043
0.8965601604368237,0.8965601604368237
1.1295062844845187,1.1295062844845187
0.9510026819888041,0.9510026819888041
0.8821237464023656,0.8821237464023656
1.0431638257088773,1.0431638257088773
1.1946519013699763,1.1946519013699763
1.049897737019658,1.049897737019658
1.0865625589980465,1.0865625589980465
1.1225621300864383,1.1225621300864383
0.9782098630064122,0.9782098630064122
0.8796888715471193,0.8796888715471193
1.0419690855967725,1.0419690855967725
0.9013971656727442,0.9013971656727442
0.9684710805542535,0.9684710805542535
1.152392034087798,1.152392034087798
0.9311651433570037,0.9311651433570037
1.075704923484359,1.075704923484359
0.9736190842533085,0.9736190842533085
0.9331373212007531,0.9331373212007531
1.2395387486430927,1.2395387486430927
1.0292382169807601,1.0292382169807601
-0.521107512787091,0.8832649917813422
-1.0475735559105623,1.021051917036083
0.608569025879191,1.0133654376116854
1.0057924389038806,1.0057924389038806
1.1134654124970678,1.1134654124970678
1.0904265770774635,1.0904265770774635
1.109374812000507,1.109374812000507
0.9220952195801438,0.9220952195801438
0.8885489831232403,0.8885489831232403
-0.791174595037537,0.920495769577422
1.091175039976132,1.091175039976132
1.1114643239158992,1.1114643239158992
0.9596358623195527,0.9596358623195527
1.0218075415034813,1.0218075415034813
1.010386812927536,1.010386812927536
0.9356707549090055,0.9356707549090055
1.0482428218487725,1.0482428218487725
1.0429588691435399,1.0429588691435399
1.0019573414106984,1.0019573414106984
1.0193703330461035,1.0193703330461035
1.0440320051555052,1.0440320051555052
0.9794807091173823,0.9794807091173823
0.9563706014036871,0.9563706014036871
0.8955715142361719,0.8955715142361719
0.9824110507044815,0.9824110507044815
0.8574375337917428,0.8574375337917428
0.819129774428608,0.819129774428608
1.0043588640294048,1.0043588640294048
0.811687093956676,0.811687093956676
0.9624586709911426,0.9624586709911426
1.0977890293152337,1.0977890293152337
0.9903329125015286,0.9903329125015286
1.1417568657035089,1.1417568657035089
1.0601595643144637,1.0601595643144637
1.018458939458181,1.018458939458181
2.0199842286286644,1.1194060562935346
3.1784435553298502,0.990082780600142
-1.6894481819936158,1.0464735407910655
3.4381796722410085,0.9371482733434677
2.3669723231730635,0.8452518934438279
1.7323702420326634,1.1861786314046276
0.6906411264999873,0.6906411264999873
0.9607894133185182,0.9607894133185182
1.0433286288952037,1.0433286288952037
1.161646646159026,1.161646646159026
1.1045299763831362,1.1045299763831362
1.109325955697045,1.109325955697045
0.43632531297106625,0.9306980483530013
-1.1277082265864014,1.1179655643944635
-1.3194268766578268,1.206593085065677
1.297071421813718,0.8823410886714573
0.8876659696548311,0.8876659696548311
0.8817607502297026,0.8817607502297026
0.9072779502693069,0.9072779502693069
1.1484479914220667,1.1484479914220667
1.0711974993201734,1.0711974993201734
0.9967776737713362,0.9967776737713362
0.9322290788536973,0.9322290788536973
1.0511420853037625,1.0511420853037625
1.0808437774712754,1.0808437774712754
1.0334001835970983,1.0334001835970983
0.818430019307088,0.818430019307088
1.0134286994042856,1.0134286994042856
1.0237186313238744,1.0237186313238744
0.926850942012324,0.926850942012324
1.2063466639473837,1.2063466639473837
1.0701914138970585,1.0701914138970585
1.0905824756970772,1.0905824756970772
1.0123631025929758,1.0123631025929758
1.1162356861047238,1.1162356861047238
1.0521348166372686,1.0521348166372686
1.0063950234111763,1.0063950234111763
0.9964139638560277,0.9964139638560277
0.9730334595498298,0.9730334595498298
1.0051057702891641,1.0051057702891641
1.0079994108505994,1.0079994108505994
1.0440170233760908,1.0440170233760908
0.9519510310412964,0.9519510310412964
1.1436990588220501,1.1436990588220501
1.0691315891286142,1.0691315891286142
0.9508060798004018,0.9508060798004018
1.0587532005828375,1.0587532005828375
1.0018703420699833,1.0018703420699833
1.1233645093224027,1.1233645093224027
0.9517293749479022,0.9517293749479022
1.0706766169821338,1.0706766169821338
0.8222830531411155,0.8222830531411155
0.9606868764744834,0.9606868764744834
1.011287877439364,1.011287877439364
1.0201812360419167,1.0201812360419167
0.9658442408797369,0.9658442408797369
0.9805554466537738,0.9805554466537738
0.8956938988619335,0.8956938988619335
1.1567243927614093,1.1567243927614093
0.868320041980705,0.868320041980705
0.9636300404047612,0.9636300404047612
1.052714020090954,1.052714020090954
1.2291780919718576,1.2291780919718576
1.0746971043117368,1.0746971043117368
1.000445051796409,1.000445051796409
1.0134082050015232,1.0134082050015232
4.3623649514012355,1.017887554099191
3.329078506625004,1.0093150966107964
1.0118230062609403,1.0118230062609403
1.1230255177149258,1.1230255177149258
1.0634226109906473,1.0634226109906473
4.465964182111634,0.9692570867483854
7.134164150627614,0.9482567992455773
1.0513281466736812,1.0513281466736812
1.0157195836475115,1.0157195836475115
1.0980117205261055,1.0980117205261055
1.0698414309478723,1.0698414309478723
0.9051122229268429,0.9051122229268429
1.0897132274382284,1.0897132274382284
0.8213919580997197,0.8213919580997197
1.0707291448696368,1.0707291448696368
1.053397501877641,1.053397501877641
0.8880494584373138,0.8880494584373138
0.8997834519554786,0.8997834519554786
0.8851724172904148,0.8851724172904148
0.9965970445299206,0.9965970445299206
1.108498335311803,1.108498335311803
0.9383775568458805,0.9383775568458805
1.1562699058203847,1.1562699058203847
0.9719992942121438,0.9719992942121438
1.0391861914041405,1.0391861914041405
1.0398585544994352,1.0398585544994352
0.8668513228360899,0.8668513228360899
1.0567927550011014,1.0567927550011014
1.1508012134595087,1.1508012134595087
1.0403239181483686,1.0403239181483686
0.9210258079865052,0.9210258079865052
0.9071720122389723,0.9071720122389723
1.1360528711824536,1.1360528711824536
1.051084094511164,1.051084094511164
-1.9264566225983655,0.9385921915398987
1.1040399332968531,1.1040399332968531
0.869998574119973,0.869998574119973
1.1229801390142904,1.1229801390142904
0.907086754292025,0.907086754292025
0.9852124832083311,0.9852124832083311
0.7781323235298816,0.7781323235298816
1.112146264246581,1.112146264246581
0.9638056105453584,0.9638056105453584
0.7678171613518057,0.7678171613518057
0.8833986474968547,0.8833986474968547
0.8047826482991909,0.8047826482991909
0.9335407399779936,0.9335407399779936
1.0638157162742132,1.0638157162742132
1.171542758318572,1.171542758318572
1.026695886121194,1.026695886121194
0.879571929913096,0.879571929913096
0.004310287680168612,0.9475236356288005
0.6006175175698804,1.1152747680562727
0.04488979821111516,0.9948409929676516
-1.748845739881014,0.9857631017044928
1.12387770335682,1.12387770335682
0.9405709859562236,0.9405709859562236
1.1603916787089636,1.1603916787089636
1.1480846630802823,1.1480846630802823
1.1739769874926589,1.1739769874926589
0.9383676555780365,0.9383676555780365
0.9641202782651567,0.9641202782651567
0.9774414833235818,0.9774414833235818
0.920109411041768,0.920109411041768
0.818748154200903,0.818748154200903
1.1654619381000029,1.1654619381000029
1.2043884737349382,1.2043884737349382
1.013971281491181,1.013971281491181
0.9398610931017479,0.9398610931017479
1.1512016818929316,1.1512016818929316
0.8312709605418747,0.8312709605418747
1.221824888559936,1.221824888559936
0.8980528079916799,0.8980528079916799
0.8580247647356255,0.8580247647356255
0.9904885175019504,0.9904885175019504
0.8190833121093524,0.8190833121093524
0.9204648877345115,0.9204648877345115
1.0895653227127613,1.0895653227127613
1.110778831550101,1.110778831550101
1.0565639362887882,1.0565639362887882
1.0905839566692217,1.0905839566692217
1.069858933325611,1.069858933325611
0.8532037424944738,0.8532037424944738
0.8972910397284807,0.8972910397284807
0.9995717681022304,0.9995717681022304
0.8384552925423215,0.8384552925423215
0.9388186189635045,0.9388186189635045
0.9650445108303056,0.9650445108303056
1.139550974715494,1.139550974715494
0.8722974348548418,0.8722974348548418
1.0320246416717809,1.0320246416717809
0.8289760011386478,0.8289760011386478
-3.2895803429972776,1.0522501343979744
-3.370026739647634,1.035187498725003
1.0245852453962851,1.0245852453962851
0.8937812333380517,0.8937812333380517
1.1125335073199862,1.1125335073199862
0.9215417721241619,0.9215417721241619
1.118500691833775,1.118500691833775
0.9724234952110518,0.9724234952110518
1.1231810293916644,1.1231810293916644
0.9781026439099805,0.9781026439099805
0.9457045797315666,0.9457045797315666
1.1746672922559345,1.1746672922559345
0.8271655385602377,0.8271655385602377
0.9576291476818358,0.9576291476818358
0.864676251652429,0.864676251652429
1.1194793353091086,1.1194793353091086
0.8288499995038403,0.8288499995038403
0.9668979684764486,0.9668979684764486
0.9914307190659701,0.9914307190659701
0.9226035897378195,0.9226035897378195
0.9331611647790236,0.9331611647790236
0.9970541309571123,0.9970541309571123
1.0269312783726303,1.0269312783726303
0.9596903367498287,0.9596903367498287
1.090654795591288,1.090654795591288
1.2224540305936642,1.2224540305936642
0.829465662754129,0.829465662754129
0.9018943270567917,0.9018943270567917
0.9093800483561837,0.9093800483561837
0.9144801943236508,0.9144801943236508
0.9364377767429992,0.9364377767429992
0.909265369134304,0.909265369134304
0.9129426943840467,0.9129426943840467
1.2133436571624674,1.2133436571624674
6.408989377544601,0.813732220575849
0.9817242849852548,0.9817242849852548
1.1745971646373516,1.143157296671669
-2.688131478598749,1.055501775574791
1.0349940072008712,1.0349940072008712
0.09219441327496769,0.8682742933299805
-0.7471514004530413,1.1307231097271209
1.0883342261258764,1.0883342261258764
1.0704143175923588,1.0704143175923588
1.1118996703732709,1.1118996703732709
1.045695153293294,1.045695153293294
1.0134600238688618,1.0134600238688618
1.163456321094508,1.163456321094508
1.2379740491755067,1.2379740491755067
-1.7355802583203106,1.0525204982028136
0.9789133454056799,0.9789133454056799
1.1321652581519572,1.1321652581519572
-0.6103481159181309,0.9745005182156915
-0.3815836512432761,0.8367072028186336
1.0554394593622936,1.0554394593622936
1.040524474867785,1.040524474867785
0.8597395212412184,0.8597395212412184
1.014250035342205,1.014250035342205
1.0239907967663393,1.0239907967663393
0.8213765994565553,0.8213765994565553
0.963721477567182,0.963721477567182
1.0852817206195804,1.0852817206195804
1.2179692475981647,1.2179692475981647
1.1863994650338983,1.1863994650338983
0.9052132053655528,0.9052132053655528
0.9533108385618775,0.9533108385618775
1.0025836548738147,1.0025836548738147
1.0949382766243774,1.0949382766243774
0.9465636511275736,0.9465636511275736
1.1412536074307875,1.1412536074307875
0.963148339686708,0.963148339686708
0.9840852087915104,0.9840852087915104
1.0343657401753528,1.0343657401753528
1.0644919701196633,1.0644919701196633
0.8134315776521645,0.8134315776521645
1.036952896834907,1.036952896834907
1.0526685944238676,1.0526685944238676
0.9124398887403783,0.9124398887403783
0.928076939870737,0.928076939870737
0.9303500301084056,0.9303500301084056
0.9314590530795032,0.9314590530795032
0.9890334898751921,0.9890334898751921
0.9214304202144413,0.9214304202144413
0.8629252508853996,0.8629252508853996
1.0718658653445525,1.0718658653445525
0.9972474465039417,0.9972474465039417
0.8378159179967932,0.8378159179967932
0.9856984609346093,0.9856984609346093
0.9615617538201412,0.9615617538201412
0.8248517345797103,0.8248517345797103
0.9767818912866375,0.9767818912866375
0.9432388790562507,0.9432388790562507
0.9982240755640429,0.9982240755640429
1.035866696365561,1.035866696365561
1.1140088820639429,1.1140088820639429
1.0386559480205473,1.0386559480205473
0.9482248092887972,0.9482248092887972
1.0074322628648824,1.0074322628648824
1.061385843469013,1.061385843469013
0.8781301572443815,0.8781301572443815
1.0275096364875607,1.0275096364875607
0.8455087190707535,0.8455087190707535
0.9996561536528739,0.9996561536528739
1.1166457983611395,1.1166457983611395
1.0711783504642016,1.0711783504642016
0.9281032962337362,0.9281032962337362
0.9151126604151423,0.9151126604151423
0.9634248145554017,0.9634248145554017
0.982731371932525,0.982731371932525
1.1990147816628276,1.1990147816628276
1.0421925938236882,1.0421925938236882
0.8937630194131435,0.8937630194131435
0.9027697324322554,0.9027697324322554
0.9944410168191055,0.9944410168191055
0.8898822554577863,0.8898822554577863
0.9994713711029495,0.9994713711029495
0.28272236612203694,1.023038598229496
1.0608454561516774,1.0608454561516774
1.033428849088009,1.033428849088009
0.9506013425677389,0.9506013425677389
2.064248578274171,0.8202425275018115
1.2724758372685612,0.9116671890718955
1.4696295590615898,1.1554822136230367
2.6000530473313193,1.0808652227765267
0.9124100828254003,0.9124100828254003
0.878598851813986,0.878598851813986
0.9399409375378905,0.9399409375378905
1.0752936736424816,1.0752936736424816
0.9042422101461053,0.9042422101461053
1.0384638385362261,1.0384638385362261
0.9512313636977024,0.9512313636977024
0.9085202026180721,0.9085202026180721
0.8855694186571625,0.8855694186571625
0.9007690002013918,0.9007690002013918
0.901015927611441,0.901015927611441
1.079370631446265,1.079370631446265
1.008751539351061,1.008751539351061
1.0744426953011306,1.0744426953011306
0.8764764007158559,0.8764764007158559
1.0559819866425362,1.0559819866425362
1.0105558630493496,1.0105558630493496
1.018414014519851,1.018414014519851
0.9401734606604422,0.9401734606604422
0.7735963626172349,0.7735963626172349
1.0405509277438945,1.0405509277438945
1.08405329902094,1.08405329902094
0.9088334882672895,0.9088334882672895
0.9747882642604042,0.9747882642604042
1.1085406684792432,1.1085406684792432
0.9274346892990476,0.9274346892990476
0.9921052302707013,0.9921052302707013
1.074744678216185,1.074744678216185
1.076738481993348,1.076738481993348
0.82727018407786,0.82727018407786
1.0233654849026776,1.0233654849026776
0.8214030566933286,0.8214030566933286
0.9493024833464552,0.9493024833464552
0.977857171883719,0.977857171883719
0.8402602716240761,0.8402602716240761
0.8891027729714959,0.8891027729714959
0.9166172771216351,0.9166172771216351
0.9678185051459627,0.9678185051459627
0.9307352248907843,0.9307352248907843
0.9655429012334313,0.9655429012334313
1.0579449923648372,1.0579449923648372
1.0626532701456566,1.0626532701456566
1.1398862332178836,1.1398862332178836
1.0586428103711827,1.0586428103711827
0.7258832815006978,0.7258832815006978
1.0200941839318274,1.0200941839318274
0.9706423600405499,0.9706423600405499
1.0307826722483089,1.0307826722483089
0.969604536636626,0.969604536636626
1.0531446460258742,1.0531446460258742
0.8814085715632293,0.8814085715632293
0.8778458328020058,0.8778458328020058
1.150056603816357,1.150056603816357
0.9944122664146209,0.9944122664146209
1.0696227156561218,1.0696227156561218
1.0833574236092474,1.0833574236092474
1.0552198866573002,1.0552198866573002
0.9806032509441421,0.9806032509441421
1.0235021456168447,1.0235021456168447
0.8987495017799424,0.8987495017799424
1.0281790304512943,1.0281790304512943
0.9304094600788355,0.9304094600788355
0.8941729089098818,0.8941729089098818
0.9579485593985015,0.9579485593985015
0.8505565932109336,0.8505565932109336
1.0826069261967963,1.0826069261967963
0.9857855550950643,0.9857855550950643
0.6952286631062043,1.0841116254638201
0.9926909585711712,0.9926909585711712
1.0902661988471585,1.0902661988471585
0.9477496629217627,0.9477496629217627
1.1274368684398102,1.1274368684398102
1.0465503987305058,1.0465503987305058
1.095345404300217,1.095345404300217
0.9135644019598642,0.9135644019598642
0.8562316914955851,0.8562316914955851
0.9328175079407135,0.9328175079407135
1.1340578157282053,1.1340578157282053
0.9931985689112209,0.9931985689112209
1.2527400412837308,1.2527400412837308
1.0994495861760534,1.0994495861760534
1.1645150350868152,1.1645150350868152
0.8504532108311189,0.8504532108311189
1.0104994004942072,1.0104994004942072
1.061913924113308,1.061913924113308
0.962606482821573,0.962606482821573
1.0190430360366414,1.0190430360366414
0.8773616100590657,0.8773616100590657
0.8449163206755421,0.8449163206755421
1.0924215800990094,1.0924215800990094
0.99934208721856,0.99934208721856
1.2397539428501774,1.2397539428501774
0.9955476565080014,0.9955476565080014
1.0974126208154886,1.0974126208154886
0.9222062752413301,0.9222062752413301
0.7423455160500427,0.7423455160500427
1.0195727669314143,1.0195727669314143
1.0512341136752374,1.0512341136752374
0.7823122340028315,0.7823122340028315
0.9741575051002537,0.9741575051002537
1.0630049090715767,1.0630049090715767
1.235210067636495,1.235210067636495
1.1683692440221538,1.1683692440221538
1.0686105603367986,1.0686105603367986
1.106407733548482,1.106407733548482
1.0274360716788418,1.0274360716788418
1.0233883974543052,1.0233883974543052
1.0751496938616054,1.0751496938616054
0.9790510728280564,0.9790510728280564
0.9245592950976169,0.9245592950976169
1.0254905465678168,1.0254905465678168
1.1354560145459218,1.1354560145459218
1.1885388587546772,1.1885388587546772
1.0376463798902327,1.0376463798902327
0.9751676456898409,0.9751676456898409
0.8932900719705725,0.8932900719705725
1.0744577689752466,1.0744577689752466
0.9673134503030995,0.9673134503030995
1.087577311299523,1.087577311299523
0.8377280711291131,0.8377280711291131
0.9568765328169342,0.9568765328169342
1.0928398117796423,1.0928398117796423
1.0779090517539305,1.0779090517539305
1.0229204197240587,1.0229204197240587
0.7397599373543042,0.7397599373543042
0.9134209471367208,0.9134209471367208
0.8528443527996019,0.8528443527996019
0.8401176182570262,0.8401176182570262
1.04938168296583,1.04938168296583
0.93052031769613,0.93052031769613
1.023673212537064,1.023673212537064
1.041064198870224,1.041064198870224
1.0079299663380095,1.0079299663380095
0.9919576333756749,0.9919576333756749
0.8394756453805711,0.8394756453805711
1.040894506060254,1.040894506060254
1.0009367220655676,1.0009367220655676
1.063390174077384,1.063390174077384
0.9122917227786982,0.9122917227786982
1.0970786196528979,1.0970786196528979
1.0972315540650164,1.0972315540650164
0.9213467798972432,0.9213467798972432
0.8703606103231685,0.8703606103231685
1.1510942076351198,1.1510942076351198
1.2316073873493218,1.2316073873493218
0.9135543056688809,0.9135543056688809
1.0039652167879696,1.0039652167879696
1.0614460979591422,1.0614460979591422
1.0421550435337494,1.0421550435337494
1.0094276303430698,1.0094276303430698
0.9872214005541606,0.9872214005541606
1.0409688159791362,1.0409688159791362
0.7776820811799927,0.7776820811799927
0.8476921663956521,0.8476921663956521
0.7364916444431555,0.7364916444431555
1.0556869291086366,1.0556869291086366
0.8740592669986473,0.8740592669986473
1.0310039957543673,1.0310039957543673
0.9429603951020381,0.9429603951020381
0.9021478087276433,0.9021478087276433
1.0917566809252064,1.0917566809252064
0.9782273930754433,0.9782273930754433
1.1712476170016997,1.1712476170016997
0.9413692219427623,0.9413692219427623
0.9923960985529556,0.9923960985529556
0.9074304063753553,0.9074304063753553
1.1152063306977293,1.1152063306977293
0.9124794331306143,0.9124794331306143
0.9071998890911502,0.9071998890911502
1.086861329278889,1.086861329278889
1.057256140058255,1.057256140058255
1.1089631768015868,1.1089631768015868
1.0058237554212828,1.0058237554212828
1.2529387932268505,1.2529387932268505
6.2400309218535455,0.9651027838218379
8.25849403643053,1.0906656641887709
1.1437097792175739,1.1437097792175739
0.9761801628703128,0.9761801628703128
0.994296073969994,0.994296073969994
1.0656495689774776,1.0656495689774776
0.9901613717281675,0.9901613717281675
0.9894396298241155,0.9894396298241155
0.9943093803337434,0.9943093803337434
0.9038497320955936,0.9038497320955936
1.1544078731642857,1.1544078731642857
1.0100606283354874,1.0100606283354874
1.046490120359177,1.046490120359177
0.9717152738883073,0.9717152738883073
0.97567740202988,0.97567740202988
1.0241844944751664,1.0241844944751664
1.0670238419876619,1.0670238419876619
1.9125756398881961,1.021992142745758
3.359907135014838,0.9113219721362477
0.7616107088490168,0.9176493273694593
1.022256150299596,1.022256150299596
0.9838908502480029,0.9838908502480029
0.9867136609727652,0.9867136609727652
1.0729071465807292,1.0729071465807292
1.0119111680960629,1.0119111680960629
0.9556606572777436,0.9556606572777436
0.9028480399913807,0.9028480399913807
1.0421724311449383,1.0421724311449383
0.9272061385100286,0.9272061385100286
0.9974931794752593,0.9974931794752593
1.942674178752191,0.8277235003556929
1.1560662552197671,1.1560662552197671
1.0533708817783083,1.0533708817783083
0.968327674611152,0.968327674611152
1.0453653138695178,1.0453653138695178
1.0345294473611257,1.0345294473611257
0.995086943149392,0.995086943149392
0.9545624067554572,0.9545624067554572
1.040285384098971,1.040285384098971
1.0647981374672062,1.0647981374672062
1.0223593067820522,1.0223593067820522
0.9717381620925888,0.9717381620925888
0.8615734594381547,0.8615734594381547
0.9850109757304598,0.9850109757304598
1.0476167144196262,1.0476167144196262
1.0606980482135657,1.0606980482135657
1.1561569286984485,1.1561569286984485
0.9589657399166991,0.9589657399166991
0.983100989807585,0.983100989807585
1.0149016004252367,1.0149016004252367
1.2242968707122206,1.2242968707122206
0.9607640556450047,0.9607640556450047
0.918498272365714,0.918498272365714
0.8830309120750132,0.8830309120750132
1.02135379613221,1.02135379613221
0.8822704309216897,0.8822704309216897
1.0468546143722888,1.0468546143722888
1.0479227717669801,1.0479227717669801
0.8652336304831979,0.8652336304831979
0.9729366459717135,0.9729366459717135
0.9334767476936255,0.9334767476936255
1.1178223182905587,1.1178223182905587
1.0898957996662906,1.0898957996662906
1.0567441826003583,1.0567441826003583
1.0215368235130897,1.0215368235130897
1.0233788124440992,1.0233788124440992
0.9661069604782975,0.9661069604782975
1.0245388182178587,1.0245388182178587
1.0999426891449726,1.0999426891449726
0.8606500457747428,0.8606500457747428
0.995636324397074,0.995636324397074
1.079386674201018,1.079386674201018
1.009501444297455,1.009501444297455
1.0196301623169066,1.0196301623169066
0.4506139263030603,1.1382574263854626
-0.6720231988735907,1.0159712045347353
1.0036765548784337,1.0036765548784337
1.0005039684657768,1.0005039684657768
0.9640586375799619,0.9640586375799619
1.0852595889420125,1.0852595889420125
0.8460343042612017,0.8460343042612017
0.8743527924668327,0.8743527924668327
0.8931697445029336,0.8931697445029336
0.935761641236978,0.935761641236978
1.0881234462328897,1.0881234462328897
0.9406783658042683,0.9406783658042683
0.9292312890477047,0.9292312890477047
0.8519457886573603,0.8519457886573603
0.9972666496602302,0.9972666496602302
0.8784888591476346,0.8784888591476346
0.9280694482356208,0.9280694482356208
0.9617299745699226,0.9617299745699226
0.8270938983814184,0.8270938983814184
1.048247516255525,1.048247516255525
0.8945063479154272,0.8945063479154272
1.024457762717473,1.024457762717473
1.1043910363341811,1.1043910363341811
1.0799790418869204,1.0799790418869204
1.1046714018264105,1.1046714018264105
1.1765999735705774,1.1765999735705774
0.9832637142642359,0.9832637142642359
1.0243770076234575,1.0243770076234575
1.0867059675856212,1.0867059675856212
0.9133028346583542,0.9133028346583542
1.22097438932139,1.22097438932139
0.9239936949208799,0.9239936949208799
0.9903872998705541,0.9903872998705541
1.1247327847274766,1.1247327847274766
0.9269289564128341,0.9269289564128341
1.0379267232783251,1.0379267232783251
1.0588988310000427,1.0588988310000427
1.0788236760651853,1.0788236760651853
0.8707760508178147,0.8707760508178147
1.0605812644402912,1.0605812644402912
1.0596355191452251,1.0596355191452251
1.0661959580016203,1.0661959580016203
0.8929918169089244,0.8929918169089244
1.0509552833699913,1.0509552833699913
1.074210573169896,1.074210573169896
1.0490796400980011,1.0490796400980011
1.1509607841920964,1.1509607841920964
0.9985860998628134,0.9985860998628134
-1.0587596907244934,1.0658377316340513
-1.289021807295161,1.1517224795887202
0.8266578596357644,0.8266578596357644
1.188655319550746,1.188655319550746
0.9891579134342203,0.9891579134342203
1.0434213157176493,1.0434213157176493
1.0126409901011066,1.0126409901011066
3.9494570361209704,0.8608980757993486
1.0280290643535375,1.0280290643535375
0.9896279458910707,0.9896279458910707
1.02799409987614,1.02799409987614
1.0278101599126461,1.0278101599126461
0.13486356163249336,0.8576407294321353
0.9026922260944904,0.9026922260944904
0.8956041696233726,0.8956041696233726
0.9398396711314926,0.9398396711314926
0.9747274781132238,0.9747274781132238
0.9866236110555537,0.9866236110555537
0.9490157716467269,0.9490157716467269
1.0504811076351181,1.0504811076351181
1.076653357834776,1.076653357834776
1.1317467439001674,1.1317467439001674
1.0409173327899512,1.0409173327899512
0.9418829956074753,0.9418829956074753
0.8262124467980638,0.8262124467980638
1.0568031017116297,1.0568031017116297
0.965775276937143,0.965775276937143
1.0533691208381244,1.0533691208381244
1.0575519471468016,1.0575519471468016
0.9993463641294424,0.9993463641294424
1.1231579676354158,1.1231579676354158
1.0835512006080208,1.0835512006080208
1.0779976232164588,1.0779976232164588
1.0264820400776051,1.0264820400776051
0.9489559271099186,0.9489559271099186
1.060231837599225,1.060231837599225
1.1445836529880369,1.1445836529880369
1.136098894438496,1.136098894438496
1.1082955923650586,1.1082955923650586
1.053466928618103,1.053466928618103
1.170341403311744,1.170341403311744
1.0749407286385144,1.0749407286385144
1.009425851682023,1.009425851682023
1.022866925128123,1.022866925128123
1.035130772893842,1.035130772893842
0.9060125866930089,0.9060125866930089
0.9532048415868584,0.9532048415868584
1.0062173363566893,1.0062173363566893
1.0014081845896439,1.0014081845896439
1.0558211147698648,1.0558211147698648
1.1435331764544072,1.1435331764544072
0.8722287808542557,0.8722287808542557
1.0607167040261514,1.0607167040261514
0.9268443225155246,0.9268443225155246
1.011743423731441,1.011743423731441
0.9793673017037187,0.9793673017037187
0.9743873681027606,0.9743873681027606
1.15219032767879,1.15219032767879
0.9627466837705487,0.9627466837705487
0.9423520495646565,0.9423520495646565
0.9554888695525557,0.9554888695525557
0.8013111516471028,0.8013111516471028
1.0715902721299562,1.0715902721299562
1.1566322965529556,1.1566322965529556
0.9950394081181098,0.9950394081181098
1.0271726295496426,1.0271726295496426
0.9699621972685539,0.9699621972685539
0.970796219085698,0.970796219085698
0.9910935669093772,0.9910935669093772
0.9568943040113497,0.9568943040113497
0.9640591182078877,0.9640591182078877
1.071161429053589,1.071161429053589
0.8852336173171005,0.8852336173171005
1.180232207029921,1.180232207029921
1.158886087673956,1.158886087673956
1.0803636720530627,1.0803636720530627
1.164504141857088,1.164504141857088
0.9836710370294645,0.9836710370294645
0.960656426250633,0.960656426250633
0.9731284061433182,0.9731284061433182
0.8504484154753853,0.8504484154753853
1.5211478121908573,0.9604684637021821
-0.43544791560420626,0.9216317744279311
0.7618792681095303,1.0828886513452116
2.439368017801562,1.1128210789357766
0.975291300581961,0.975291300581961
0.9696400879797336,0.9696400879797336
0.9467590485671633,0.9467590485671633
7.425100216093901,0.9486149454300254
9.79417030045269,1.0715277276240354
9.775675790244085,0.9971085260872111
3.004887433227836,1.1212626749670935
0.9413587711938766,0.9413587711938766
1.947476125416197,1.0795441933880576
-3.0000002521228004,0.9855637571069552
1.386464151086792,1.0715676572633184
2.1973299947559832,1.0390366819208767
0.9107603528739379,0.9107603528739379
1.0086563981085082,1.0086563981085082
1.0833035242201146,1.0833035242201146
0.9372149684679312,0.9372149684679312
1.0188214514511786,1.0188214514511786
1.1246848616675262,1.1246848616675262
1.0061282591130019,1.0061282591130019
1.0099038236626678,1.0099038236626678
1.145387995722967,1.145387995722967
1.0691704540446847,1.0691704540446847
0.945881092932647,0.945881092932647
0.9761488612145334,0.9761488612145334
0.9737832292144415,0.9737832292144415
1.0222477785057489,1.0222477785057489
1.0077404991315364,1.0077404991315364
1.0517392210518797,1.0517392210518797
1.0660690568806204,1.0660690568806204
0.7970912991065653,0.7970912991065653
1.189152262995296,1.189152262995296
1.034010396782369,1.034010396782369
1.1961867552406757,1.1961867552406757
0.9094621945257289,0.9094621945257289
1.0965289302872725,1.0965289302872725
0.9975040953419653,0.9975040953419653
0.9980681070750276,0.9980681070750276
1.1030004602296846,1.1030004602296846
1.1394648702587653,1.1394648702587653
-0.7058014755509177,1.1096551773964374
2.387606559241414,1.0575055837312919
2.346401757673006,0.977622378742939
0.7829839928966489,0.7829839928966489
0.9849669908254329,0.9849669908254329
1.2883739444145017,1.2883739444145017
0.9973930016886051,0.9973930016886051
1.00650865461947,1.00650865461947
0.9053425830938934,0.9053425830938934
0.9360412588192994,0.9360412588192994
0.9886810828178784,0.9886810828178784
1.0941129697967455,1.0941129697967455
1.068734311071889,1.068734311071889
0.9542334054339837,0.9542334054339837
1.1375517601553857,1.1375517601553857
0.8907684145215706,0.8907684145215706
1.0805116876397172,1.0805116876397172
0.7969314650185775,0.7969314650185775
1.1679006966656604,1.1679006966656604
1.0315871967575228,1.0315871967575228
1.045515593662886,1.045515593662886
1.293756616490721,1.293756616490721
0.9024552373272272,0.9024552373272272
1.2192955489081208,1.2192955489081208
1.0317015930162088,1.0317015930162088
1.0856510290947903,1.0856510290947903
1.0156730516139687,1.0156730516139687
1.0900864536439998,1.0900864536439998
0.9366250043397889,0.9366250043397889
0.9219480628566853,0.9219480628566853
1.1239293787631413,1.1239293787631413
0.9571725990292971,0.9571725990292971
0.8841103223311992,0.8841103223311992
1.00054959655019,1.00054959655019
1.0528509225735945,1.0528509225735945
1.067771132454658,1.067771132454658
1.135576027694457,1.135576027694457
1.1112336626787673,1.1112336626787673
0.8712058940425084,0.8712058940425084
5.308131000980797,0.9370350871219806
0.8469747123520721,0.8469747123520721
0.8618148062638316,0.8618148062638316
1.0845527873818126,1.0845527873818126
0.9477415201666045,0.9477415201666045
1.017362371837673,1.017362371837673
0.9367469719134768,0.9367469719134768
1.0217597068929043,1.0217597068929043
1.020156977567783,1.020156977567783
1.1832023172096746,1.1832023172096746
1.0373548199067109,1.0373548199067109
0.9927178879111482,0.9927178879111482
0.9806873905554812,0.9806873905554812
1.0145195456263791,1.0145195456263791
1.0391254849298135,1.0391254849298135
0.7562454330657263,0.7562454330657263
1.098100578707573,1.098100578707573
0.9572485958945709,0.9572485958945709
0.9690318754975573,0.9690318754975573
0.8160771653737244,0.8160771653737244
1.0792720939332991,1.0792720939332991
0.8269378848035339,0.8269378848035339
0.9904249035351813,0.9904249035351813
0.9630926675980455,0.9630926675980455
1.0536872902382532,1.0536872902382532
1.2298603296976678,1.2298603296976678
1.0936994241032538,1.0936994241032538
0.8847216501643238,0.8847216501643238
1.0367674116553105,1.0367674116553105
0.9162542753211063,0.9162542753211063
0.8787482807358573,0.8787482807358573
0.8744363967862887,0.8744363967862887
1.0207351092104453,1.0207351092104453
1.0401852164558267,1.0401852164558267
1.0383703010934904,1.0383703010934904
1.1652713007663345,1.1652713007663345
-5.28974998058213,1.0786647026410825
-6.479837557234406,0.9755460754449579
-6.569192412430435,1.0277887740709242
0.9079205480240164,0.9079205480240164
1.177196404145,1.177196404145
0.9390105779676575,0.9390105779676575
0.8975192582296263,0.8975192582296263
0.9666888964200904,0.9666888964200904
1.0602347289969853,1.0602347289969853
0.9552665119601882,0.9552665119601882
1.074321129539811,1.074321129539811
-1.7332473093704959,1.0259753869273411
0.8912421412213335,0.8912421412213335
0.9079580455321705,0.9079580455321705
1.1654868831769212,1.1654868831769212
0.9755694138539648,0.9755694138539648
1.0842906788472608,1.0842906788472608
1.0649057342810395,1.0649057342810395
0.8688005444040975,0.8688005444040975
0.9515625709445451,0.9515625709445451
1.0551645924257098,0.9575193639989285
0.21517843263726089,1.0712872349560763
1.2755804447084562,1.1506559388907025
2.9497712797698687,0.9681636839505975
1.0715410502621723,1.0715410502621723
0.8781820380725458,0.8781820380725458
0.018167665587029536,0.9762719368232657
0.7207035368813249,1.0343194107693483
-1.2126963448800816,1.033712061611562
0.9839084428283257,0.9839084428283257
0.7703608269784809,0.7703608269784809
0.920025126733035,0.920025126733035
1.1943135491126804,1.1943135491126804
1.1655017804814887,1.1655017804814887
1.0845650177792459,1.0845650177792459
1.0335620614427878,1.0335620614427878
0.953743532920086,0.953743532920086
-0.6153162651636479,1.0187915326696224
1.7865095070614638,1.0116530963157395
1.2240815988243672,1.2240815988243672
0.9009954808954368,0.9009954808954368
1.0837321295384998,1.0837321295384998
1.0102540969884393,1.0102540969884393
0.9621906544735143,0.9621906544735143
0.9959537753782052,0.9959537753782052
1.1181259162013137,1.1181259162013137
0.9116250668911134,0.9116250668911134
1.0115755225472733,1.0115755225472733
1.1046780222883368,1.1046780222883368
1.0408822671789513,1.0408822671789513
1.1318894157481216,1.1318894157481216
1.0568333831328458,1.0568333831328458
0.948100670751298,0.948100670751298
0.9663485453856,0.9663485453856
1.0315850082028595,1.0315850082028595
1.0419278389035158,1.0419278389035158
0.9955777427404433,0.9955777427404433
1.0836635107156587,1.0836635107156587
1.0700666686022478,1.0700666686022478
0.9536437765429572,0.9536437765429572
0.9923947703094828,0.9923947703094828
1.0517637454496664,1.0517637454496664
1.1174089623585561,1.1174089623585561
1.098213183423764,1.098213183423764
0.9004654310876296,0.9004654310876296
1.0111551854382919,1.0111551854382919
1.0976138092330898,1.0976138092330898
1.0901738483845724,1.0901738483845724
1.070897918851007,1.070897918851007
0.8837825559587452,0.8837825559587452
1.0493462727804754,1.0493462727804754
0.9663249505562094,0.9663249505562094
0.9673319853009388,0.9673319853009388
0.8806911189509772,0.8806911189509772
0.8969928523468749,0.8969928523468749
1.0449021982155617,1.0449021982155617
1.0638226354668283,1.0638226354668283
0.8980957028799303,0.8980957028799303
1.019627019278773,1.019627019278773
-3.5702944205013267,1.0626644476646527
0.7615006110974207,0.7615006110974207
0.9685686762745794,0.9685686762745794
0.7906519398718057,0.7906519398718057
0.8732435823434391,0.8732435823434391
0.9234137542450851,0.9234137542450851
1.1385830478091972,1.1385830478091972
0.9521782944170403,0.9521782944170403
1.1183853232121233,0.9599213036174272
2.141668605448687,1.0468620177753636
2.546337191721234,0.9216432719073243
1.153133536423306,1.153133536423306
0.965309255279214,0.965309255279214
1.166577351107966,1.166577351107966
1.8165678521725837,0.8273164831133946
-1.4337666438206114,0.8394840975004906
-1.7462575329795136,1.011409485347431
-4.015430103952777,1.044638980828722
-1.6011173566276762,1.1846269705609616
1.1981817529834364,1.1981817529834364
1.1368555395909248,1.1368555395909248
0.9792457512671793,0.9792457512671793
0.9364496602852861,0.9364496602852861
0.7355679512328631,0.7355679512328631
0.8465711299441722,0.8465711299441722
0.8872362040541771,0.8872362040541771
1.068466967609015,1.068466967609015
0.9596375411437392,0.9596375411437392
0.8717481113125002,0.8717481113125002
1.0875510213359851,1.0875510213359851
0.9631302013564028,0.9631302013564028
0.9225975733206774,0.9225975733206774
0.934280343356828,0.934280343356828
1.042949583592843,1.042949583592843
1.098089398602719,1.098089398602719
1.1147493034584381,1.1147493034584381
0.9016302972115822,0.9016302972115822
1.011628887498756,1.011628887498756
1.0840508288306077,1.0840508288306077
1.224930499829131,1.224930499829131
0.9414435067715612,0.9414435067715612
1.066912184847678,1.066912184847678
1.1019204382518735,1.1019204382518735
0.9895868373923521,0.9895868373923521
1.1653804889287815,1.1653804889287815
1.0450648875016404,1.0450648875016404
0.9392228070641275,0.9392228070641275
0.9694204852000373,0.9694204852000373
1.0116711538552106,1.0116711538552106
1.073534268315796,1.073534268315796
0.9848820341977376,0.9848820341977376
0.946257480447194,0.946257480447194
0.8112556410973877,0.8112556410973877
0.8661124908747639,0.8661124908747639
1.2012513597553225,1.2012513597553225
1.0344484795508113,1.0344484795508113
0.7776088717666978,0.7776088717666978
0.9573016509806069,0.9573016509806069
1.0378167014650206,1.0378167014650206
0.971274122884709,0.971274122884709
0.7920612160474938,0.7920612160474938
0.9073968694896358,0.9073968694896358
0.985616222366057,0.985616222366057
1.1162477603373497,1.1162477603373497
0.9844485042364843,0.9844485042364843
0.892654100686137,0.892654100686137
0.9521139380803553,0.9521139380803553
1.084220165204381,1.084220165204381
5.917371799276285,0.9502211054967541
0.9964781059105029,0.9964781059105029
0.9304325573488202,0.9304325573488202
0.9923947347442098,0.9923947347442098
0.9193944263718554,0.9193944263718554
0.9794054905494364,0.9794054905494364
1.191758099236201,1.191758099236201
1.0383236669220848,1.0383236669220848
1.1200892617671208,1.1200892617671208
0.8951986712936119,0.8951986712936119
1.003101091799246,1.003101091799246
1.0581509198803325,1.0581509198803325
0.8890920194044606,0.8890920194044606
1.0068709225411985,1.0068709225411985
0.9347679156572243,0.9347679156572243
