T,S,Score
999,0,0.008427493490185012
1009,0,0.016858976303324447
1019,0,0.023510870092069425
1029,0,0.022627088208319712
1039,0,0.01661920921294624
1049,0,0.01638921012300315
1059,0,0.016512433285190753
1069,0,0.017290228632369953
1079,0,0.01933393967089836
1089,0,0.014373485327287272
1099,0,0.006987402152025035
1109,0,0.00667718267985945
1119,0,0.0013373164534382087
1129,0,5.0424549507432914e-05
1139,0,4.528689241856121e-05
1149,0,4.284616900535054e-05
1159,0,5.235506379253074e-05
1169,0,0.0015715719179606458
1179,0,0.003821418801004728
1189,0,5.5537493371227153e-05
1199,0,0.0012070250448632525
1209,0,0.005206401907424885
1219,0,4.7693683856930846e-05
1229,0,4.430108918052067e-05
1239,0,5.97690735160139e-06
1249,0,9.10653225111302e-06
1259,0,1.9347645860534612e-05
1269,0,3.3126859605658865e-05
1279,0,0.0013254133691955605
1289,0,-9.998001815336721e-09
1299,0,0.0031134077563188534
1309,0,0.004998426661316113
1319,0,0.0013182497704534724
1329,0,0.0026188344920211604
1339,0,0.0036375667271563716
1349,0,0.0037010148266583
1359,0,0.0030932838843305
1369,0,0.0019419654204604342
1379,0,0.00011582124226888757
1389,0,0.00010662758504131897
1399,0,8.715456646490871e-05
1409,0,3.3919572327234526e-05
1419,0,0.0014229780519707802
1429,0,0.0033237527407280476
1439,0,0.0006989187594760304
1449,0,0.0039461496438810695
1459,0,0.009396434435487044
1469,0,0.0077381735808021435
1479,0,0.013035815890055813
1489,0,0.011403385589330683
1499,0,0.02691033322258518
1509,0,0.027935166965639746
1519,0,0.026333377728451457
1529,0,0.032044392177365766
1539,0,0.02861855714492345
1549,0,0.026742807864185925
1559,0,0.025497747642601654
1569,0,0.020288385704455902
1579,0,0.02456297603374008
1589,0,0.019754679149338927
1599,0,0.025167535628567383
1609,0,0.01889622981117839
1619,0,0.019017311296357142
1629,0,0.013084000766352077
1639,0,4.136564469303661e-05
1649,0,0.006027548396729143
1659,0,0.004559633383675765
1669,0,0.018978768714610683
1679,0,0.01685841687543277
1689,0,0.017836557566665356
1699,0,0.016330264883411272
1709,0,0.023574692901491112
1719,0,0.02499585049501518
1729,0,0.014545395332432043
1739,0,0.01673884678988491
1749,0,0.018332241208296685
1759,0,0.02107210687812422
1769,0,0.01404952557508038
1779,0,0.01349052985310284
1789,0,0.011809730883475478
1799,0,6.775823242988199e-05
1809,0,0.011941671228787032
1819,0,0.008578552792564087
1829,0,0.003082984360245289
1839,0,3.179461553415308e-05
1849,0,5.232729985560347e-05
1859,0,4.862564833624239e-05
1869,0,3.632223524913103e-05
1879,0,1.0349639593010274e-05
1889,0,0.0011325577067436976
1899,0,0.0016213618063800617
1909,0,0.005295427217464677
1919,0,0.00716973872817972
1929,0,0.009663970777069208
1939,0,0.005058369923482131
1949,0,0.005492937571372647
1959,0,0.007001102862725039
1969,0,0.003413557572722603
1979,0,0.0018792375261741934
1989,0,0.010185240848089971
1999,0,0.013528422337858614
2009,0,0.020853392092814338
2019,0,0.02445263308106932
2029,0,0.013863496253718799
2039,0,0.022130123761111176
2049,0,0.01991088264906976
2059,0,0.01591806228796694
2069,0,0.017326760501784833
2079,0,0.012621714172045162
2089,0,0.013930229827747831
2099,0,0.017792180732786878
2109,0,0.014179761744401609
2119,0,0.009220855112863524
2129,0,0.010403965044008257
2139,0,0.014878230453579555
2149,0,0.004426182464657091
2159,0,0.0017402090634962564
2169,0,0.007899100802730152
2179,0,0.004644459852655436
2189,0,0.010974764915100688
2199,0,0.016758822021889663
2209,0,0.01814593892667754
2219,0,0.017495607431510074
2229,0,0.011835672284531085
2239,0,0.005621040977326186
2249,0,5.554775063149053e-05
2259,0,2.506379135230885e-05
2269,0,4.655016420884728e-05
2279,0,4.774459429268685e-05
2289,0,2.3620403218405084e-05
2299,0,7.503214089604748e-05
2309,0,0.00010728909816631882
2319,0,0.004976751889575581
2329,0,8.878094377423595e-05
2339,0,1.1307920910863523e-05
2349,0,1.7037398125863135e-05
2359,0,2.392256961292194e-05
2369,0,1.1567451725869038e-05
2379,0,0.0017419600073242392
2389,0,0.010288626776986387
2399,0,0.0032847583559395543
2409,0,0.001303227065939383
2419,0,0.0021860578167668954
2429,0,0.010607100816907855
2439,0,0.011092039024102385
2449,0,0.012557947100999223
2459,0,0.011975598820713751
2469,0,0.0034206625487308573
2479,0,0.002060188443840094
2489,0,0.010421670450970255
2499,0,0.014851343671862083
2509,0,0.013203014724939233
2519,0,0.007831015201565317
2529,0,0.005133383091838306
2539,0,0.0017515423925411056
2549,0,-9.998004757427736e-09
2559,0,3.304668350645468e-05
2569,0,8.39979631633847e-05
2579,0,0.0038173756761203936
2589,0,0.0033799421191081924
2599,0,0.0036897122406803207
2609,0,0.004555727434194745
2619,0,0.007225708522753449
2629,0,0.011256273269156236
2639,0,0.01300248084030986
2649,0,0.006538135742814866
2659,0,0.004446139324895626
2669,0,0.001324156744440863
2679,0,0.009440359379151997
2689,0,0.00011395572449651725
2699,0,0.011535336391947815
2709,0,0.006073064861259525
2719,0,0.0066728095361051065
2729,0,0.008351606945123713
2739,0,0.003645671467187195
2749,0,0.017670318151741637
2759,0,0.020888582100072106
2769,0,0.029308843518208838
2779,0,0.017377202921254442
2789,0,0.016530793986849757
2799,0,0.014365032911416331
2809,0,0.01504548151717816
2819,0,0.027198784764450812
2829,0,0.019049769661314997
2839,0,0.022923236682698744
2849,0,0.019375440719585912
2859,0,0.01900971680984931
2869,0,0.01493099532476655
2879,0,0.007389744468193626
2889,0,0.00010069690525205122
2899,0,0.010492736386218449
2909,0,0.015115668907912383
2919,0,0.01595601046494971
2929,0,0.012839281980122741
2939,0,0.009549497746500324
2949,0,0.009127469274278044
2959,0,0.010466330384655331
2969,0,0.01154909682048072
2979,0,0.009661284793707314
2989,0,0.0031978594823713347
2999,0,0.0022524896284331075
3009,0,0.004847155553700133
3019,0,0.0069618479154343604
3029,0,0.014552247960226417
3039,0,0.018135377688859644
3049,0,0.018916694465766493
3059,0,0.018825981775140443
3069,0,0.016206745172756165
3079,0,0.013876153657697343
3089,0,0.010897340820833601
3099,0,0.013975878856135382
3109,0,0.008528408608434623
3119,0,0.005766865929714093
3129,0,0.007400951779353682
3139,0,0.007594802541176726
3149,0,0.007787079888858017
3159,0,0.006863375232744162
3169,0,0.008042577686371122
3179,0,0.004981509248180971
3189,0,0.00546242445030426
3199,0,0.003291353242338313
3209,0,0.004548753624972757
3219,0,0.0031168367098391436
3229,0,7.702884214100258e-05
3239,0,3.181892780573792e-05
3249,0,0.0011847610912000817
3259,0,0.005200986956942377
3269,0,0.0029431263073183556
3279,0,7.871770324296978e-06
3289,0,1.8948441453059406e-05
3299,0,2.4741486344070918e-05
3309,0,2.3445662726662153e-05
3319,0,4.3540368119043826e-05
3329,0,0.002615356695029214
3339,0,0.004319797292675842
3349,0,0.003952009320919492
3359,0,3.7508702853239484e-05
3369,0,0.0015887365930642439
3379,0,8.918845495475836e-09
3389,0,5.2357846498485294e-05
3399,0,0.00219616552507812
3409,0,0.0040312295740213
3419,0,0.012482322393555068
3429,0,0.017436704273502468
3439,0,0.014918913011513324
3449,0,0.013875904757499835
3459,0,0.013009029528182448
3469,0,0.013159516510161784
3479,0,0.005970773065097079
3489,0,2.1378893433232626e-05
3499,0,1.797644299783574e-05
3509,0,8.650838938584204e-06
3519,0,2.704651640095257e-05
3529,0,0.0021214916059763
3539,0,0.0036506375976972927
3549,0,0.003401299758624299
3559,0,0.0043226638971858855
3569,0,3.427044687775993e-05
3579,0,-9.998001038180604e-09
3589,0,0.0025024187866003467
3599,0,0.0014674822278699096
3609,0,0.004967201709267455
3619,0,0.0016395388832331492
3629,0,0.006888464293423158
3639,0,0.0018009709204072633
3649,0,0.011066129453506268
3659,0,0.0027221436885520034
3669,0,0.018970128256810104
3679,0,0.018973599984869582
3689,0,0.020746259649658705
3699,0,0.034130412951686506
3709,0,0.03399530994203204
3719,0,0.0338046972285595
3729,0,0.041428822777827556
3739,0,0.011650275134276245
3749,0,0.0350164345853492
3759,0,0.041422796898632486
3769,0,0.03962352953221204
3779,0,0.05881135112133329
3789,0,0.02843921564191232
3799,0,0.02635410334370558
3809,0,0.013307015502788178
3819,0,0.04533725652468157
3829,0,0.06521942016403581
3839,0,0.06663729669991059
3849,0,0.09839765897015296
3859,0,0.06141791001985919
3869,0,0.07023359910304228
3879,0,0.07380083627028311
3889,0,0.028775248812845433
3899,0,0.07507604274826318
3909,0,0.041915514750716754
3919,0,0.061086876403044776
3929,0,0.07616857238299235
3939,0,0.10273969424465546
3949,0,0.09325384209736909
3959,0,0.0435014074823461
3969,0,0.06988920269021537
3979,0,0.04453431475075209
3989,0,0.029244212182905294
3999,0,0.08760809989339857
4009,0,0.08817583807122098
4019,0,0.04253737340777042
4029,0,0.1108922873246283
4039,0,0.07062701493370283
4049,0,0.05502494670958458
4059,0,0.0872223093866662
4069,0,0.05855756567661441
4079,0,0.06634926919949724
4089,0,0.07089485728155154
4099,0,0.06910066377408175
4109,0,0.03010768316117246
4119,0,0.04008972445995168
4129,0,0.03191904192219286
4139,0,0.031844042055258925
4149,0,0.037908064322323076
4159,0,0.028952359332800826
4169,0,0.02988409806918163
4179,0,0.024792637727817535
4189,0,0.026228819475103637
4199,0,0.030308827804021388
4209,0,0.026743388107000887
4219,0,0.02562990459103781
4229,0,0.02657110086989939
4239,0,0.0170560860161193
4249,0,0.012451634626243102
4259,0,0.01016232913102455
4269,0,0.009383706820162707
4279,0,0.011385324923839202
4289,0,0.0028711579668520004
4299,0,0.009634169511587576
4309,0,0.02429514102281738
4319,0,0.012154359857343144
4329,0,0.008692044422199896
4339,0,0.025135709329642708
4349,0,0.03211724498754154
4359,0,0.044964619921054605
4369,0,0.02414763278176668
4379,0,0.057344402784583304
4389,0,0.04485619705294319
4399,0,0.08050579943364267
4409,0,0.08300771349106639
4419,0,0.05619794341050688
4429,0,0.07648639699261672
4439,0,0.029820546695201955
4449,0,0.0589968798818265
4459,0,0.044991209059514814
4469,0,0.1356989965447376
4479,0,0.08005460054327385
4489,0,0.0854295769349106
4499,0,0.10695071579275772
4509,0,0.14009846150715888
4519,0,0.14185548365424905
4529,0,0.12319930641566035
4539,0,0.11834903823480669
4549,0,0.10827088478254443
4559,0,0.12349976856618994
4569,0,0.11663806243889407
4579,0,0.14264085300237606
4589,0,0.12536082378254765
4599,0,0.09186107123127496
4609,0,0.1446349410998089
4619,0,0.14227222702058384
4629,0,0.14562750257361712
4639,0,0.10233272358368728
4649,0,0.12322947881994506
4659,0,0.0589776573553481
4669,0,0.07474754331173672
4679,0,0.10075308837023889
4689,0,0.08474212378246126
4699,0,0.11938302976373516
4709,0,0.052668714226418833
4719,0,0.06306284570445397
4729,0,0.06677638403505115
4739,0,0.05124259701095846
4749,0,0.07141358206672566
4759,0,0.061934274034371795
4769,0,0.02195809674445759
4779,0,0.055161297841101686
4789,0,0.02477725537143327
4799,0,0.02922978602958759
4809,0,0.062364006227165425
4819,0,0.062182949062471904
4829,0,0.03906225220200987
4839,0,0.06440307166123638
4849,0,0.029567396551377412
4859,0,0.031196175303773166
4869,0,0.02883249690914491
4879,0,0.014645028970958707
4889,0,0.023697155410409343
4899,0,0.019444957915766836
4909,0,0.01913487402810926
4919,0,0.017598604513029747
4929,0,0.00830052292236727
4939,0,0.0191929505119533
4949,0,0.021966168867671998
4959,0,0.017701784433625245
4969,0,0.015179705433249813
4979,0,0.019375782369836447
4989,0,0.02345271988836234
4999,0,0.018294869615711307
5009,0,0.020237174974881755
5019,0,0.01709002432946749
5029,0,0.015607655788717367
5039,0,0.021653527325230404
5049,0,0.02246707102522949
5059,0,0.02243055297677976
5069,0,0.019469537876529885
5079,0,0.01706854499074767
5089,0,0.015148173090680561
5099,0,0.010715618550388606
5109,0,0.014530267314749379
5119,0,0.01782483273463592
5129,0,0.02135230795713139
5139,0,0.02288583969458735
5149,0,0.018575344004620298
5159,0,0.01830552018269893
5169,0,0.02411876049787165
5179,0,0.04269510837524659
5189,0,0.022975071400673286
5199,0,0.023076161513104265
5209,0,0.022954787439592672
5219,0,0.020021666528058035
5229,0,0.008809797684847187
5239,0,0.03324880225495641
5249,0,0.011461365182940608
5259,0,0.04265938472452058
5269,0,0.041461387659896265
5279,0,0.04833117697439249
5289,0,0.05009285647448436
5299,0,0.01936283643143255
5309,0,0.03048785232173623
5319,0,0.023150176929501054
5329,0,0.05228622515958081
5339,0,0.048945604916952656
5349,0,0.03452188513737953
5359,0,0.04431957940590703
5369,0,0.040579817425614784
5379,0,0.03427000436085159
5389,0,0.02610657936427474
5399,0,0.022161194260962302
5409,0,0.029945995015985827
5419,0,0.05100431224316537
5429,0,0.016918020259510058
5439,0,0.036189346944186296
5449,0,0.026034408774621265
5459,0,0.04122366565942276
5469,0,0.017968876447128745
5479,0,0.03273885454444092
5489,0,0.03215604398205618
5499,0,0.029668088555227068
5509,0,0.02419662601061945
5519,0,0.027471106855539495
5529,0,0.03309408160882299
5539,0,0.023391622587021876
5549,0,0.029110153865043953
5559,0,0.0279278794656887
5569,0,0.03260463883726483
5579,0,0.02932665450081906
5589,0,0.026737393021451006
5599,0,0.018835188769352473
5609,0,0.011697210469452157
5619,0,0.017768341996418524
5629,0,0.0206188969725275
5639,0,0.020616933479592314
5649,0,0.019042931586309153
5659,0,0.01828327225280879
5669,0,0.016411118329967167
5679,0,0.01303365596783479
5689,0,0.013301626095796992
5699,0,0.012838882743128222
5709,0,0.00427478203878906
5719,0,0.0034743956519866503
5729,0,0.004545626919347234
5739,0,0.0051186273487001666
5749,0,0.012180789754321297
5759,0,0.013093444838766288
5769,0,0.016683764393236433
5779,0,0.018054391490022415
5789,0,0.0229177758030073
5799,0,0.0201456645545513
5809,0,0.015452452073145051
5819,0,0.01975055777159651
5829,0,0.013029762858760785
5839,0,0.020189854128060958
5849,0,0.025729298676538448
5859,0,0.027929449709716503
5869,0,0.02568933949743646
5879,0,0.028884156275734096
5889,0,0.03240118656416702
5899,0,0.034929616490271265
5909,0,0.029027707454140628
5919,0,0.02581430743894253
5929,0,0.02342271382012906
5939,0,0.021712696995483005
5949,0,0.01999078242505048
5959,0,0.018439774875022408
5969,0,0.0240492354011394
5979,0,0.02874341429028371
5989,0,0.026704025799407116
5999,0,0.030205448056245532
6009,0,0.026419973321431756
6019,0,0.026135558686117222
6029,0,0.02452462179854764
6039,0,0.02754057217008543
6049,0,0.025608812310742024
6059,0,0.019037501682884372
6069,0,0.016387680923818315
6079,0,0.0186555397346298
6089,0,0.01696742819324154
6099,0,0.016840019703621478
6109,0,0.02619473673052425
6119,0,0.019857064301610772
6129,0,0.024455945089895736
6139,0,0.019304599273400336
6149,0,0.011775183805004863
6159,0,0.012697305889302124
6169,0,0.013068200075758984
6179,0,0.004815505799192932
6189,0,0.01973121677716072
6199,0,0.01823028924084702
6209,0,0.010094039731995186
6219,0,0.020407892267288452
6229,0,0.02272846264949413
6239,0,0.018150671671823104
6249,0,0.013856536376170125
6259,0,0.013049219163544623
6269,0,0.008843420545136593
6279,0,0.011824479648508857
6289,0,0.01122539572271919
6299,0,0.012179079288327066
6309,0,0.014701126622659155
6319,0,0.015143112534809877
6329,0,0.014926332457007419
6339,0,0.01319978535033317
6349,0,0.010026576547677135
6359,0,0.0062639418911986655
6369,0,0.010221063826035826
6379,0,0.014619217375219373
6389,0,0.027508978150849128
6399,0,0.03767772650532797
6409,0,0.03466080687098161
6419,0,0.04976754282827167
6429,0,0.06022231739797557
6439,0,0.04261674770161572
6449,0,0.009796606894492577
6459,0,0.04708334690819005
6469,0,0.05575241409137244
6479,0,0.1109532777069483
6489,0,0.07480536121919235
6499,0,0.06248191986766427
6509,0,0.0753435757887615
6519,0,0.14751236310478033
6529,0,0.08441583847794598
6539,0,0.13391240843906305
6549,0,0.0973106635101243
6559,0,0.0800910573825434
6569,0,0.1281480156161695
6579,0,0.11565429492069956
6589,0,0.09735303271599782
6599,0,0.0858428702069447
6609,0,0.09110209213204229
6619,0,0.08503196453050732
6629,0,0.10533158897260253
6639,0,0.12164407449674774
6649,0,0.07356121513384062
6659,0,0.04291591946188844
6669,0,0.070790911768568
6679,0,0.067576603473958
6689,0,0.0513554188377916
6699,0,0.047202626094463684
6709,0,0.07572682800177188
6719,0,0.06179819516219398
6729,0,0.0530801392729352
6739,0,0.059974935935385165
6749,0,0.057303038643685134
6759,0,0.03865110915850928
6769,0,0.044260205376387196
6779,0,0.040942001584754084
6789,0,0.04448399294737693
6799,0,0.0401241678703787
6809,0,0.04646934034036104
6819,0,0.04303556078988269
6829,0,0.03865801858685758
6839,0,0.03476015483096068
6849,0,0.03091824386540154
6859,0,0.031824252423483745
6869,0,0.024105273081203915
6879,0,0.01660948459973194
6889,0,0.02327841844143269
6899,0,0.021924124978267068
6909,0,0.024668763140040073
6919,0,0.017256480414292785
6929,0,0.05064844266378138
6939,0,0.03453305671343815
6949,0,0.03521069943489308
6959,0,0.03616463807640424
6969,0,0.05251674215172297
6979,0,0.04633593015499882
6989,0,0.04643168496248451
6999,0,0.044282874013424345
7009,0,0.07622843938424184
7019,0,0.038583221494861375
7029,0,0.04593021464375324
7039,0,0.0720734816297689
7049,0,0.07492624946388271
7059,0,0.033884816881306734
7069,0,0.11889951312668523
7079,0,0.1166666949210694
7089,0,0.09766597299836544
7099,0,0.09447405814743759
7109,0,0.020063153948697177
7119,0,0.07873043866354401
7129,0,0.1556843941342303
7139,0,0.09674738453560716
7149,0,0.16763368166816206
7159,0,0.15641470073503538
7169,0,0.14667864937407749
7179,0,0.15069005296499527
7189,0,0.17743278438141663
7199,0,0.14087945111934574
7209,0,0.17626719579563488
7219,0,0.1579654604659697
7229,0,0.15510203477433604
7239,0,0.11216951243441986
7249,0,0.09916705025380967
7259,0,0.11233557905092872
7269,0,0.09613312634065163
7279,0,0.1185877264227706
7289,0,0.1387895237315493
7299,0,0.06676781362374451
7309,0,0.055001124140037994
7319,0,0.09435267450366824
7329,0,0.11485252387292422
7339,0,0.06449843538736366
7349,0,0.0679764908862105
7359,0,0.02823915548132333
7369,0,0.04611688851635232
7379,0,0.055429089739666204
7389,0,0.018141091571099666
7399,0,0.018820614750137965
7409,0,0.020903465419172207
7419,0,0.03484918129025216
7429,0,0.04729355796247747
7439,0,0.02826112233931166
7449,0,0.016284755686003405
7459,0,0.006519867929230039
7469,0,0.0013080594610395124
7479,0,4.674709567564772e-05
7489,0,3.564154759039262e-05
7499,0,7.093877713970631e-06
7509,0,0.0024931144498887003
7519,0,0.012264302131599347
7529,0,0.011177346778427188
7539,0,0.018999109144655302
7549,0,0.018408602995283574
7559,0,0.02402447040155642
7569,0,0.04302864298952991
7579,0,0.017195312646122063
7589,0,0.06130379818012077
7599,0,0.020579374337859835
7609,0,0.007219277295524129
7619,0,0.09153418840404626
7629,0,0.030393383348648717
7639,0,0.025533215259389785
7649,0,0.08640151906360771
7659,0,0.08944698521490801
7669,0,0.04856253231521712
7679,0,0.07227769867190659
7689,0,0.08446018495377061
7699,0,0.12638439044470862
7709,0,0.06687648149707459
7719,0,0.11826821413126987
7729,0,0.11238851412574113
7739,0,0.10742748293299831
7749,0,0.14816979499257332
7759,0,0.123022768130572
7769,0,0.0758783891019239
7779,0,0.10510157509842999
7789,0,0.08880256841894263
7799,0,0.0785399541984817
7809,0,0.0857939591079776
7819,0,0.12180749955024328
7829,0,0.08236095606021299
7839,0,0.11830912685674666
7849,0,0.08105403006230705
7859,0,0.0728850970410968
7869,0,0.04362575317987405
7879,0,0.03135667301219991
7889,0,0.05794272064657702
7899,0,0.0641042524013764
7909,0,0.03273790949234223
7919,0,0.04029825046836699
7929,0,0.02490741677031294
7939,0,0.040604569302400084
7949,0,0.03735610923709598
7959,0,0.039714258125395085
7969,0,0.04578678357853139
7979,0,0.03897771047301313
7989,0,0.028628584795487133
7999,0,0.016367097619753967
8009,0,0.01994112483359578
8019,0,0.01330900838346033
8029,0,0.006156821523969014
8039,0,4.616344907881764e-05
8049,0,0.0017505918062880044
8059,0,2.058292321199806e-05
8069,0,3.333635114199929e-05
8079,0,0.0016459430949307685
8089,0,0.0020768463294744133
8099,0,0.004878799871901651
8109,0,0.009584297966835409
8119,0,0.007237808700890802
8129,0,0.004297434728958827
8139,0,0.013092806435228643
8149,0,0.01456730705419318
8159,0,0.017607584870622084
8169,0,0.016671460859460974
8179,0,0.022124600180770004
8189,0,0.015083403998111866
8199,0,0.0163499246601434
8209,0,0.015537597520673074
8219,0,0.018555370208296007
8229,0,0.017882374883627983
8239,0,0.01784549358141002
8249,0,0.019728996992753378
8259,0,0.025571957586826788
8269,0,0.01715246673626969
8279,0,0.030815418234754477
8289,0,0.027494223895583647
8299,0,0.026619252265405735
8309,0,0.02496926907475394
8319,0,0.024169430966293592
8329,0,0.02468952707570704
8339,0,0.026827960527864958
8349,0,0.021006268852678645
8359,0,0.020337731155476213
8369,0,0.015417093082069844
8379,0,0.018811528456641857
8389,0,0.018929560291215897
8399,0,0.014094816768796481
8409,0,0.017342856443706534
8419,0,0.016550750136651082
8429,0,0.01753108482119431
8439,0,0.011800942236421863
8449,0,0.013704805633255934
8459,0,0.013096891152875434
8469,0,0.008895111037890313
8479,0,0.007117668501727958
8489,0,0.005061145470878048
8499,0,0.007983597173988055
8509,0,0.007433060864326213
8519,0,0.006680779822134997
8529,0,2.675593437273527e-05
8539,0,-2.658797182419903e-09
8549,0,1.1498339377302713e-05
8559,0,0.007149733974443795
8569,0,0.0022377023671427687
8579,0,0.003335096229114709
8589,0,4.315236789537158e-05
8599,0,1.531219572803444e-05
8609,0,4.724850833781602e-05
8619,0,0.00224532959667062
8629,0,0.003944227170451231
8639,0,0.012842872143722317
8649,0,0.02860501232935081
8659,0,0.037758461013694455
8669,0,0.04748385342443018
8679,0,0.06184357542756008
8689,0,0.07226524486837343
8699,0,0.08254042385055027
8709,0,0.08937579478761959
8719,0,0.10237319317537774
8729,0,0.11452889898060287
8739,0,0.11469544213509614
8749,0,0.11868036446600999
8759,0,0.12263784655618387
8769,0,0.13019955518033677
8779,0,0.15015943180753744
8789,0,0.15426971598347688
8799,0,0.14735924124675948
8809,0,0.1481856415149675
8819,0,0.161792323403464
8829,0,0.17648894120662661
8839,1,0.19022689886692284
8849,1,0.20629447144363006
8859,1,0.33925976404085634
8869,1,0.23720374740022682
8879,1,0.24940405063829918
8889,1,0.27995471032950175
8899,1,0.3048091890724279
8909,1,0.3291338924481039
8919,1,0.35135113313151567
8929,1,0.37318279893086004
8939,1,0.3960991158549022
8949,1,0.41907505633453945
8959,1,0.44846681232696833
8969,1,0.4909707384289817
8979,1,0.5245024611566279
8989,1,0.572230325560538
8999,1,0.6061418761788746
9009,1,0.6657445086729438
9019,1,0.7242155281033562
9029,1,0.744023097552919
9039,1,0.8048194943735025
9049,1,0.8721997331398279
9059,1,0.666022627931026
9069,1,1.0756660170614727
9079,1,0.8262051990058681
9089,1,0.26113489421585595
9099,1,1.2207015093125668
9109,1,1.3745515768324528
9119,1,1.58255919728409
9129,1,-0.17192074872329088
9139,1,1.0685468241710554
9149,1,1.4929194723268127
9159,1,1.1062057707060253
9169,1,0.04545756672462786
9179,1,-0.5928587255607114
9189,1,0.07158506813635235
9199,1,0.7588171658897477
9209,1,-2.0633620293377093
9219,1,1.1497014234245633
9229,1,1.548506451525755
9239,1,1.7433459397895061
9249,1,0.3433641301012281
9259,1,1.866593360154294
9269,1,1.7156505199307746
9279,1,2.1000558082472547
9289,1,0.6124091951410877
9299,1,1.8852853349902272
9309,1,4.074075624330067
9319,1,3.719558500792664
9329,1,3.9018897378870347
9339,1,3.673232412733645
9349,1,4.44897660893422
9359,1,4.343167332215316
9369,1,4.267774085041707
9379,1,4.142736387422049
9389,1,4.058333790410412
9399,1,3.9628652028844824
9409,1,3.846232987874153
9419,1,3.74329719856283
9429,1,3.658870187357394
9439,1,3.5521537433238515
9449,1,3.4602189900962204
9459,1,3.375536627942316
9469,1,3.24886256886283
9479,1,3.153579076973362
9489,1,3.0552440003647323
9499,1,2.94986294818988
9509,1,2.871201983951952
9519,1,2.7652903778354028
9529,1,2.695048344075847
9539,1,2.5558545521774603
9549,1,2.476350505439
9559,1,2.3820562438569635
9569,1,2.2468842014357806
9579,1,2.181439549287104
9589,1,2.052782537033953
9599,1,1.9584569601446091
9609,1,1.8691783176678924
9619,1,1.7590622647225316
9629,1,1.6775955358680958
9639,1,1.5638966509499008
9649,1,1.46774339792065
9659,1,1.3644620531837532
9669,1,1.2701899602337503
9679,1,1.1626805881359026
9689,1,1.0821693127454917
9699,1,0.9737995593585018
9709,1,0.8866118557739212
9719,1,0.7814012336029947
9729,1,0.6642570204550732
9739,1,0.5848941396833538
9749,1,0.49166066292057703
9759,1,0.3484813178825289
9769,1,0.04340984350351784
9779,1,0.15630557233796094
9789,1,0.05777851249208665
9799,1,0.0005782995566180893
9809,1,0.07692927374981445
9819,1,0.08334632940825853
9829,1,0.1128999519274208
9839,1,0.11466933202329999
9849,1,0.10931847137398637
9859,1,0.11565550726266088
9869,1,0.14445494411651344
9879,1,0.1225936678111973
9889,1,0.10698054544948715
9899,1,0.0905985223532712
9909,1,0.06551962584385834
9919,1,0.06138544275723795
9929,1,0.0578574327526461
9939,1,0.07057437104804953
9949,1,0.08847769510013298
9959,1,0.07826812640507003
9969,1,0.04882239096347857
9979,1,0.027753013099544477
9989,1,0.03747477830652851
9999,1,0.02365924617866577
10009,1,0.04382865838485911
10019,1,0.043651870762580036
10029,1,0.04287212337331969
10039,1,0.04233422770579276
10049,1,0.009978704817345752
10059,1,0.021703893055128376
10069,1,0.03142139149401013
10079,1,0.04340326173165321
10089,1,0.0101243444435557
10099,1,0.058658750026114315
10109,1,0.06376103555933832
10119,1,0.0512623368745555
10129,1,0.055693145945256206
10139,1,0.06315407115920724
10149,1,0.07472226231447299
10159,1,0.07434789583922663
10169,1,0.09394544240214053
10179,1,0.08399822736218704
10189,1,0.033140155533234794
10199,1,0.07270234154867661
10209,1,0.049001446276362215
10219,1,0.08151958146015914
10229,1,0.07829266198474805
10239,1,0.043289417291703935
10249,1,0.06214294912190377
10259,1,0.06305061645614424
10269,1,0.04890546547069524
10279,1,0.03809667793072696
10289,1,0.02766998800479792
10299,1,0.0012321560426374334
10309,1,0.02161778343946652
10319,1,0.00033149061784998324
10329,1,0.007206983136483713
10339,1,0.03884453142420763
10349,1,0.000648622351065109
10359,1,0.0021797231900345104
10369,1,0.025055658946883164
10379,1,0.027228388060375697
10389,1,0.02839763358229558
10399,1,0.03647347267621798
10409,1,0.012703920963034632
10419,1,0.01211235200904237
10429,1,0.00045490925108276903
10439,1,0.0009485448031602006
10449,1,0.0013098425416113169
10459,1,0.0014412231600861025
10469,1,0.0016546848108252576
10479,1,0.0014345889650547172
10489,1,0.000994673986493333
10499,1,0.0008098259828495658
10509,1,0.0009059780461269096
10519,1,0.0010975839079166994
10529,1,0.001431490155246462
10539,1,0.0012308378863038483
10549,1,0.0013417722013254751
10559,1,0.0018536561088361436
10569,1,0.0016919302599610608
10579,1,0.0020232117688758766
10589,1,0.023846767333605023
10599,1,0.023976808728673082
10609,1,0.0017381323520771486
10619,1,0.0013881957376681298
10629,1,0.001091995759678388
10639,1,0.0013517001879049806
10649,1,0.0048236210035360605
10659,1,0.014750606690833279
10669,1,-0.000191881234789526
10679,1,0.017877098349348475
10689,1,0.03242979110471805
10699,1,0.005424639864157199
10709,1,0.03425442593768174
10719,1,0.07476335545389512
10729,1,0.1471280532493997
10739,1,0.028148289042792374
10749,1,0.019036290276961243
10759,1,0.020728904501683076
10769,1,0.04650237418059766
10779,1,0.01516017565277128
10789,1,0.0139559243017775
10799,1,0.019926975596250174
10809,1,0.027958413353339928
10819,1,0.056507966939460696
10829,1,0.03186476529748827
10839,1,0.033715446539435034
10849,1,0.03154572129317301
10859,1,0.05100470729009815
10869,1,0.0639541597849359
10879,1,0.06552829620819067
10889,1,0.09586032671133254
10899,1,0.10025564890909888
10909,1,0.08071944539047066
10919,1,0.03273013860693341
10929,1,0.002984284252011027
10939,1,0.0004354948266621639
10949,1,0.012512224704294583
10959,1,0.013229011942097246
10969,1,0.029814218620745514
10979,1,0.03701470896886405
10989,1,0.01296537815264942
10999,1,0.062211667280944294
11009,1,0.06645643969369541
11019,1,0.0617261842376991
11029,1,0.05476614044355288
11039,1,0.07869103080750617
11049,1,0.05766187712999582
11059,1,0.03512076773524658
11069,1,0.05207629598267255
11079,1,0.07937921190438346
11089,1,0.09617972083575477
11099,1,0.07051318342066548
11109,1,0.0766448143102419
11119,1,0.07837674905940256
11129,1,0.03029851570256048
11139,1,0.020104202389037873
11149,1,0.03655990518504065
11159,1,0.06594235070029597
11169,1,0.06168166277176468
11179,1,0.045491188923937664
11189,1,0.020206494992801805
11199,1,0.06006329177069303
11209,1,0.027970178723180417
11219,1,0.03918974614786419
11229,1,0.005959253628152972
11239,1,0.005442692602849575
11249,1,0.005187625285788977
11259,1,0.005238139584983648
11269,1,0.014454002054818504
11279,1,0.030095451533518114
11289,1,0.005312885991776484
11299,1,0.005364971722391643
11309,1,0.005522287460941577
11319,1,0.02226388837266552
11329,1,0.0337237900092997
11339,1,0.04691033915323961
11349,1,0.026287829177850053
11359,1,0.09357761263973907
11369,1,0.06498307284237842
11379,1,0.07079879655786592
11389,1,0.13350774978496777
11399,1,0.062109942971902754
11409,1,0.10164809275586062
11419,1,0.12439261115353711
11429,1,0.17434923096987404
11439,1,0.17450476888232108
11449,1,0.25386015619711744
11459,1,0.18352468247929227
11469,1,0.47881553599974513
11479,1,0.40615765387375125
11489,1,0.23294124559593388
11499,1,0.1618580076482974
11509,1,0.16396212691317535
11519,1,0.06344539665986815
11529,1,0.07343555974634275
11539,1,0.011689922688887355
11549,1,0.02400960842257749
11559,1,0.03582415119875415
11569,1,0.013669906044935065
11579,1,0.06055189940959349
11589,1,0.04610093395790871
11599,1,0.020764607557019088
11609,1,0.020778715731701425
11619,1,0.08893023569020397
11629,1,0.12356720665565968
11639,1,0.062189332179412415
11649,1,0.055602603826069186
11659,1,0.020598610095612757
11669,1,0.053041963980035356
11679,1,0.018011049607314922
11689,1,0.003978383908176064
11699,1,0.003923583319401569
11709,1,0.0032688802783700788
11719,1,0.007331984636160804
11729,1,0.0059477360359226905
11739,1,0.031084989920075412
11749,1,0.10052392088356299
11759,1,0.24603110676281448
11769,1,0.11479612926064076
11779,1,0.15967683264002686
11789,1,0.0729806853812408
11799,1,0.16414345661466057
11809,1,0.03848823936826862
11819,1,0.05460558729628878
11829,1,0.0855579036919053
11839,1,0.06416385164112826
11849,1,0.038637288549173976
11859,1,0.0018035274139321378
11869,1,0.03792441527994639
11879,1,0.007616277376196301
11889,1,0.10528460470014123
11899,1,0.03396299903584571
11909,1,0.10721526999225078
11919,1,0.010290324260844863
11929,1,0.09122191973422511
11939,1,0.0608697304265064
11949,1,0.022017827310826188
11959,1,0.12676687528921593
11969,1,0.06236625112867755
11979,1,0.06613988260009696
11989,1,0.0012488952720922097
11999,1,3.5472272257308646e-06
12009,1,0.00030572915221188657
12019,1,-0.0008763084771015173
12029,1,0.0007917220172969364
12039,1,0.001097509400801222
12049,1,0.003355495028250388
12059,1,0.010824694862143658
12069,1,0.007570237425682413
12079,1,0.013995666502452264
12089,1,0.008051072297672102
12099,1,0.046731514831009624
12109,1,0.10977081862320659
12119,1,0.16980670685290128
12129,1,0.04150693913587733
12139,1,0.132687487631041
12149,1,0.015661487803910412
12159,1,0.11561973766126654
12169,1,0.09501378392352605
12179,1,0.01285091719870235
12189,1,0.09395627450690364
12199,1,0.049528014762414085
12209,1,0.07902118222014787
12219,1,0.028242999520438294
12229,1,0.11787514050021686
12239,1,0.1160095370034741
12249,1,0.1122205140160451
12259,1,0.09599747288338645
12269,1,0.13476253086281187
12279,1,0.05770364501041653
12289,1,0.09844444972603755
12299,1,0.0801646818679016
12309,1,0.08777656153390023
12319,1,0.09284065289087906
12329,1,0.011576448484713397
12339,1,0.08075382015876925
12349,1,0.1208797786957021
12359,1,0.14923658777515403
12369,1,0.039050105163082605
12379,1,0.3140831390946175
12389,1,0.3822869243478142
12399,1,0.17025278651428793
12409,1,0.1846399196355451
12419,1,0.15715782160727176
12429,1,0.10173424099722933
12439,1,0.11428756303771315
12449,1,0.16521215161371494
12459,1,0.14532593086735757
12469,1,0.16200110809021218
12479,1,0.2310671751863297
12489,1,0.02314045042891566
12499,1,0.07726428735345636
12509,1,0.06779844904883459
12519,1,0.01809970301222419
12529,1,0.05310944797918249
12539,1,0.10249827510619225
12549,1,0.2267051495361272
12559,1,0.09825517602327716
12569,1,0.052768375308958615
12579,1,0.011391243493568792
12589,1,0.005281057288673896
12599,1,0.20336896385672842
12609,1,0.13839773385135756
12619,1,0.0023746086142151235
12629,1,0.16126554056641146
12639,1,0.1127958723167155
12649,1,0.11163543233677203
12659,1,0.09762894249953802
12669,1,0.15698733808697402
12679,1,0.09880615255533493
12689,1,0.10086903669150504
12699,1,0.06467857549353895
12709,1,0.008770873123832512
12719,1,0.0040736487131085575
12729,1,0.040291516160135155
12739,1,0.12107897042410243
12749,1,0.024056847949064486
12759,1,0.05849672152403912
12769,1,0.07715165756600884
12779,1,0.21157404765995402
12789,1,0.010075265235344188
12799,1,0.003855891454230931
12809,1,0.08627717175569449
12819,1,0.0013753804338304532
12829,1,0.05423283001165019
12839,1,0.013081411013118327
12849,1,0.19273354040142332
12859,1,0.019612667120162963
12869,1,0.0005592486333674263
12879,1,0.02405636902584707
12889,1,0.02257666202340025
12899,1,0.0004923178391714744
12909,1,0.001580735395615096
12919,1,0.0025894991834458647
12929,1,0.002338454970317483
12939,1,0.14213954208696777
12949,1,0.011224407330091557
12959,1,0.05935660019237543
12969,1,0.00513834232258803
12979,1,0.12988682755778613
12989,1,0.034643374408608485
12999,1,0.09551259653130317
13009,1,0.036119584838698426
13019,1,0.03650913543861495
13029,1,0.06763054062942903
13039,1,0.08342103940927525
13049,1,0.0387089292055669
13059,1,0.043157262447138245
13069,1,0.09829606475576025
13079,1,0.051753008941564926
13089,1,0.004151241909272685
13099,1,0.09307086303288603
13109,1,0.42115946595198783
13119,1,0.25275021291395294
13129,1,0.10968156383412458
13139,1,0.023502486807180756
13149,1,0.3185795719772384
13159,1,0.19138394146764348
13169,1,0.20935235357881798
13179,1,0.13337261912379106
13189,1,0.013404843939936184
13199,1,0.03116466884746294
13209,1,0.11753217575498609
13219,1,0.06578455419188678
13229,1,0.1295510351687167
13239,1,0.05505938887507067
13249,1,0.0827960148324225
13259,1,0.04435961113776865
13269,1,0.05467595283604465
13279,1,0.047454798931062414
13289,1,0.05859585280811308
13299,1,0.004983119586240037
13309,1,0.004603422441244676
13319,1,0.0039597293290135616
13329,1,0.002399751120830962
13339,1,0.0027768795327111073
13349,1,0.003762300290404419
13359,1,0.0037127807340077146
13369,1,0.043479847004941674
13379,1,0.005819593876127682
13389,1,0.05853228082279294
13399,1,0.006301143733968617
13409,1,0.008323620318852976
13419,1,0.007804043355081114
13429,1,0.007131095117125896
13439,1,0.005605125191767979
13449,1,0.09051929263078784
13459,1,0.00386618531948818
13469,1,0.0036244622603641696
13479,1,0.0036071090411129436
13489,1,0.005764169800013319
13499,1,0.044898375511293165
13509,1,0.004904240596098508
13519,1,0.03976304267345432
13529,1,0.004634862357835279
13539,1,0.05707066052238563
13549,1,0.06800082325264695
13559,1,0.009045643404693271
13569,1,0.061462183825095495
13579,1,0.013887047358281834
13589,1,0.081736520096581
13599,1,0.1220283053156217
13609,1,0.12689573437817814
13619,1,0.12525199076651145
13629,1,0.1320531616417031
13639,1,0.29674569583011345
13649,1,0.14813408747087975
13659,1,0.09275435050354847
13669,1,0.1983732362894225
13679,1,0.129340307579764
13689,1,0.013419426429171266
13699,1,0.1086135272055544
13709,1,0.13787446125148717
13719,1,0.0056806890338128024
13729,1,0.016448262336998143
13739,1,0.0383916193474545
13749,1,0.04370774896194751
13759,1,0.00358593189384826
13769,1,-1.1162743340786818e-08
13779,1,0.020824767801250088
13789,1,0.07455765573586992
13799,1,0.0011755488543670478
13809,1,0.045968220119474545
13819,1,0.031691090172445646
13829,1,0.01017728897403225
13839,1,0.017086730691998953
13849,1,0.12233242631187513
13859,1,0.1112491447324574
13869,1,0.16376604719590915
13879,1,0.13109586214264568
13889,1,0.13075750489715066
13899,1,0.1915439488254701
13909,1,0.06693102518138366
13919,1,0.12529663980465966
13929,1,0.02229832064259879
13939,1,0.05720857405388646
13949,1,0.006595094612897756
13959,1,0.008886234632303314
13969,1,0.10003864824568887
13979,1,0.011898425552190672
13989,1,0.00141306619470688
13999,1,0.17234488664469838
14009,1,0.052991303794318934
14019,1,0.09297729854622294
14029,1,0.10128068465700779
14039,1,0.0745285142010208
14049,1,0.016385114364513287
14059,1,0.02110696792752581
14069,1,0.06180317566757065
14079,1,0.036136413168688986
14089,1,0.06779693085687172
14099,1,0.11833840724551647
14109,1,0.3594870234459455
14119,1,0.18405065161566792
14129,1,0.07804754826337207
14139,1,0.09595955819191132
14149,1,0.2845496880267
14159,1,0.10387559075538283
14169,1,0.12604724666150796
14179,1,0.13408848580538368
14189,1,0.16754049354820422
14199,1,0.08298558740509332
14209,1,0.11058520103219377
14219,1,0.1864263649829715
14229,1,0.07621765895097382
14239,1,0.09267348863425279
14249,1,0.0942352461719913
14259,1,0.0680082738589588
14269,1,0.09167608603831973
14279,1,0.09150291522054821
14289,1,0.10072895063470988
14299,1,0.10851130887380195
14309,1,0.16141381850455994
14319,1,0.24969146803828057
14329,1,0.1736524909512992
14339,1,0.18124759274228192
14349,1,0.022611556189839233
14359,1,0.06297934632552676
14369,1,0.10175233672184703
14379,1,0.10941442672583068
14389,1,0.024625540976719484
14399,1,0.44063511146259726
14409,1,0.30562893147529746
14419,1,0.29887850580616565
14429,1,0.28847563166890183
14439,1,0.03332426788675591
14449,1,0.26270143762762
14459,1,0.2504726033507849
14469,1,0.13437100538281638
14479,1,0.08487452634330944
14489,1,0.42123982533848325
14499,1,0.16470202356027042
14509,1,0.24486226446354575
14519,1,0.06329656469004624
14529,1,0.24775454230079952
14539,1,0.17291457763831752
14549,1,0.14285990276860394
14559,1,0.06258857176635091
14569,1,0.15497429219472358
14579,1,0.24004733800715494
14589,1,0.017785699437363967
14599,1,0.005698740150443304
14609,1,0.05462736319384642
14619,1,0.06297264867430463
14629,1,0.21349677181736826
14639,1,0.08281178864872962
14649,1,0.3935414376901457
14659,1,0.20927651505243805
14669,1,0.22388591606504926
14679,1,0.02543444063564193
14689,1,0.32196517251042134
14699,1,0.06661785596997849
14709,1,0.117083139321288
14719,1,0.1107397502740386
14729,1,0.008388157639573846
14739,1,0.07362186578858837
14749,1,0.002844695419070953
14759,1,0.06131364515890164
14769,1,0.00674727488722765
14779,1,-2.1168182540165503e-08
14789,1,0.06809796670391433
14799,1,0.1355725208418751
14809,1,0.09380940312548303
14819,1,0.1855333592139552
14829,1,0.16080564761650606
14839,1,0.16942196687144306
14849,1,0.12668931179192122
14859,1,0.2671510508844417
14869,1,0.2479257823599227
14879,1,0.22665332956645445
14889,1,0.17009315111224366
14899,1,0.2933042229071394
14909,1,0.42977142425754
14919,1,0.5038832471357866
14929,1,0.3730944685806197
14939,1,0.18628192769395918
14949,1,0.1911823268305718
14959,1,0.2926864015853695
14969,1,0.4829639352153552
14979,1,0.3641769909221141
14989,1,0.3460478502837114
14999,1,0.5177515859347958
15009,1,0.31766895976645615
15019,1,0.17927529556062283
15029,1,0.029900811829535134
15039,1,0.14676581104625536
15049,1,0.3331509647498472
15059,1,0.11203014756265683
15069,1,0.11765507948551657
15079,1,0.227431913632137
15089,1,0.16694127837943884
15099,1,0.1665660577704764
15109,1,0.10624158558850683
15119,1,0.0032144529616477957
15129,1,0.031468727319831524
15139,1,0.08377304954987941
15149,1,0.11216910629570531
15159,1,0.03390450683102669
15169,1,0.0421937576624174
15179,1,0.03509519368271785
15189,1,0.04805184339083457
15199,1,0.04282080341575811
15209,1,0.012011413648682912
15219,1,0.005265271362471735
15229,1,2.8293845688143193e-05
15239,1,0.0037282655436129963
15249,1,0.0036105030575118158
15259,1,0.012525048997353572
15269,1,0.015400231174279133
15279,1,0.020144883834502525
15289,1,0.014383396904084078
15299,1,0.0337823027884554
15309,1,0.00813307427788229
15319,1,0.12227435715871288
15329,1,0.20296234827658444
15339,1,0.2355033661541045
15349,1,0.27509369264113537
15359,1,0.2441292906141111
15369,1,0.2908759509932022
15379,1,0.2789135967136087
15389,1,0.42284381411316285
15399,1,0.1853621657553226
15409,1,0.22073330118006906
15419,1,0.09381372020403944
15429,1,0.23942145799361614
15439,1,0.18911392859303255
15449,1,0.13065063534215338
15459,1,0.2027693749481937
15469,1,0.26765270199881264
15479,1,0.12866020486349605
15489,1,0.19546015148538043
15499,1,0.24352779648603684
15509,1,0.3372479074612049
15519,1,0.7685049552925756
15529,1,0.1332309446016985
15539,1,0.15886771589248017
15549,1,0.2028470247461377
15559,1,0.3031879212647334
15569,1,0.2741629658800209
15579,1,0.18618339025320174
15589,1,0.556551793498439
15599,1,0.3637908009407781
15609,1,0.8694501619878076
15619,1,0.9156302108908669
15629,1,0.2821950682903327
15639,1,0.15899765025160512
15649,1,0.8242164605269396
15659,1,0.3572945377426658
15669,1,0.5239974372859122
15679,1,0.5113687868636813
15689,1,0.565158406759889
15699,1,0.26866164651241115
15709,1,0.5373189939636895
15719,1,0.5294188357867475
15729,1,0.38140184691644435
15739,1,0.3540726969692992
15749,1,0.536375735420496
15759,1,0.49088746543961936
15769,1,1.2368486265951564
15779,1,1.621776076184117
15789,1,0.7402469084076352
15799,1,0.7671376336938543
15809,1,0.24305233154912753
15819,1,0.7401963342750771
15829,1,0.10047593964906104
15839,1,0.6042157217954361
15849,1,0.9790088033356145
15859,1,0.9059470026253221
15869,1,1.067758209849901
15879,1,0.7538658197631625
15889,1,0.9718179607446018
15899,1,0.8688649643288816
15909,1,0.7523970926510053
15919,1,1.1435365988941681
15929,1,0.03832148413182945
15939,1,1.4292144359869832
15949,1,2.0665510069733193
15959,1,2.0206479638389823
15969,1,0.5936546077006651
15979,1,1.6570882752724585
15989,1,1.8982772956867513
15999,1,0.4183744988506859
16009,1,1.5801127354342208
16019,1,1.560030315403347
16029,1,1.144235390311795
16039,1,1.4414129039974353
16049,1,1.2256494101612732
16059,1,0.8856966770871636
16069,1,0.3916213395054949
16079,1,0.48974327407611884
16089,1,0.5128292191238265
16099,1,0.5597567991619389
16109,1,0.5735058074658682
16119,1,0.678324071099685
16129,1,0.5956539350979004
16139,1,0.6639747423900355
16149,1,0.06976531523833751
16159,1,0.6992794389964122
16169,1,0.07032463489911062
16179,1,0.22015646168414138
16189,1,0.8717770597944187
16199,1,0.5122140551770181
