T,S,Score
999,0,0.9782159241715013
1009,0,0.9486062471780058
1019,0,0.8577597401317193
1029,0,0.9453695436380523
1039,0,0.9760890489520819
1049,0,1.023991467175951
1059,0,1.0635101520869679
1069,0,0.9355032265162087
1079,0,0.9854617599189969
1089,0,1.0323764579263297
1099,0,0.9668324440357005
1109,0,1.1195310001564347
1119,0,1.029640754627902
1129,0,1.1258759054402192
1139,0,1.0182283638057255
1149,0,0.9969484773158312
1159,0,1.0181025344543881
1169,0,1.0934310638759968
1179,0,1.1590912217655476
1189,0,1.1358990386718706
1199,0,1.1031601095884516
1209,0,1.1865991114398515
1219,0,1.203658071155849
1229,0,1.14253703508683
1239,0,1.1863942920444488
1249,0,1.2041692385247513
1259,0,1.1847939665911933
1269,0,1.1746829193949533
1279,0,1.2572310995940708
1289,0,1.1982093224504289
1299,0,1.1792274226215806
1309,0,1.005827990408308
1319,0,1.0145398530768297
1329,0,0.959915787410973
1339,0,1.0399759635213472
1349,0,1.057013897628864
1359,0,0.9847826993896632
1369,0,0.940100398621264
1379,0,1.035624146231073
1389,0,0.9137028762435065
1399,0,1.03228005024065
1409,0,1.069808930704225
1419,0,0.9999882550616024
1429,0,0.9381249086987108
1439,0,0.9373135584550222
1449,0,0.9607560352888093
1459,0,0.9210094952461948
1469,0,0.9269391925807969
1479,0,0.878706898975384
1489,0,0.8628755910764205
1499,0,1.006055018730918
1509,0,0.9446558503126442
1519,0,0.8757382834544752
1529,0,0.9460253613365712
1539,0,0.9397497597041128
1549,0,0.895657494017253
1559,0,1.1599619318823602
1569,0,1.15188456492788
1579,0,1.1522906327771933
1589,0,1.2485363317042248
1599,0,1.181369120364034
1609,0,1.1609531794462398
1619,0,1.2720235460558476
1629,0,1.2211842098233412
1639,0,1.2349866061522543
1649,0,1.1577215333184983
1659,0,1.121136275915292
1669,0,1.196875841129609
1679,0,1.2581693680838648
1689,0,1.2955659026240205
1699,0,1.429813231947829
1709,0,1.4433166518381293
1719,0,1.435495972346483
1729,0,1.5922451226729055
1739,0,1.5285218536976872
1749,0,1.5040461718056097
1759,0,1.438040478952563
1769,0,1.3158068805080347
1779,0,1.4556658421670732
1789,0,1.3967251428861969
1799,0,1.3331730598088056
1809,0,1.1143194542787727
1819,0,1.1855713890927164
1829,0,0.9687458700899273
1839,0,1.038355380270516
1849,0,0.9428226067404095
1859,0,1.1148358216099723
1869,0,1.1115593572268856
1879,0,1.0719289222755572
1889,0,1.0564021315552463
1899,0,0.9648670699874504
1909,0,0.9896789408990067
1919,0,1.0193436497985133
1929,0,0.9327122155119065
1939,0,1.0068590178917418
1949,0,1.0468978854067759
1959,0,1.0637077588645352
1969,0,0.9848963861507722
1979,0,0.8734881787767727
1989,0,0.9452884054579247
1999,0,0.8693628300523297
2009,0,0.8886700913943528
2019,0,0.9443054537738423
2029,0,0.8839373133472666
2039,0,0.9531094191916931
2049,0,0.9654767878017153
2059,0,1.0379881084435514
2069,0,0.9397141061182249
2079,0,1.1934756372468656
2089,0,1.0978502495568019
2099,0,1.0634889460460162
2109,0,1.1702066539630478
2119,0,1.2117514681727743
2129,0,1.194066120283006
2139,0,1.1083101108325153
2149,0,1.1619673518459777
2159,0,1.1494240871043113
2169,0,1.1704115515346347
2179,0,1.0810272133879373
2189,0,1.005656655925959
2199,0,1.226398728845091
2209,0,1.1341233224386875
2219,0,1.1278447879719276
2229,0,1.2049076831824552
2239,0,1.3684827235216044
2249,0,1.2242721781086665
2259,0,1.0644962084406595
2269,0,1.1027169293074846
2279,0,1.2057796391939448
2289,0,1.1566989608174625
2299,0,1.1503899173407715
2309,0,1.018773992199999
2319,0,1.174507886053786
2329,0,1.0302796781115653
2339,0,1.1055346249945843
2349,0,1.0338489361234182
2359,0,1.02027612002273
2369,0,1.170942149433323
2379,0,0.9285035861801546
2389,0,1.0858804590818347
2399,0,1.0650641322506478
2409,0,1.1750353403636031
2419,0,0.9409285339918539
2429,0,1.0495031648951505
2439,0,1.0025425944738284
2449,0,0.9499868012440585
2459,0,1.0324662209878104
2469,0,0.95244008971721
2479,0,1.0088949214772858
2489,0,0.9970100125633877
2499,0,1.010035911866379
2509,0,0.9494417802152761
2519,0,0.9885268180210803
2529,0,1.0166443813144204
2539,0,0.9737680197678662
2549,0,0.9853257044993715
2559,0,1.1508703168149133
2569,0,1.0412808758552308
2579,0,1.273531180018211
2589,0,1.0893402779119414
2599,0,1.086541073912706
2609,0,1.128974705589368
2619,0,0.973709285204531
2629,0,1.092567640274805
2639,0,1.0473248213429738
2649,0,1.0579445796919082
2659,0,1.1147762897862121
2669,0,1.108709871138854
2679,0,1.0954561663581883
2689,0,1.0727139981901406
2699,0,1.0533538961078568
2709,0,0.9831376805716233
2719,0,1.070773635279703
2729,0,1.0803737343898794
2739,0,1.1898001731380043
2749,0,0.9860601017361242
2759,0,1.0361285963897298
2769,0,1.1455750860962362
2779,0,1.12743893218768
2789,0,0.9856826875038341
2799,0,0.8974480265597187
2809,0,0.9603134238243021
2819,0,0.9000640402952618
2829,0,0.8948226418099301
2839,0,0.8553857109296893
2849,0,0.8481454277155479
2859,0,0.86203864520009
2869,0,0.9083336501051001
2879,0,0.835771892362022
2889,0,1.0067532219139266
2899,0,0.9271668716870114
2909,0,1.0314291522224326
2919,0,1.0550986864327636
2929,0,0.8639383828193233
2939,0,0.9577369817191907
2949,0,0.9970455962937361
2959,0,0.9628323486328724
2969,0,0.9625881864080293
2979,0,1.0399593279988117
2989,0,1.1077093571862213
2999,0,0.9781207528850852
3009,0,1.0327705726091878
3019,0,0.8911438212037285
3029,0,0.9537241214709238
3039,0,1.0054385883315846
3049,0,1.1454204847669802
3059,0,1.2483513022666044
3069,0,1.2709277581089993
3079,0,1.2231035582326661
3089,0,1.1441157177070556
3099,0,1.137367381917071
3109,0,1.1314664647701342
3119,0,1.0859814336535871
3129,0,1.210728394036898
3139,0,1.2300867287921973
3149,0,1.4197675942682693
3159,0,1.4342828200327082
3169,0,1.5468362346929732
3179,0,1.4561051408947223
3189,0,1.497967885634675
3199,0,1.4657610960594907
3209,0,1.3936739367701614
3219,0,1.2093595444839156
3229,0,1.3442750537139347
3239,0,1.4142922254035148
3249,0,1.4137387396501175
3259,0,1.4280719324590558
3269,0,1.6216271519115961
3279,0,1.2496940045656844
3289,0,1.2735702653635161
3299,0,1.2907508437464221
3309,0,1.340408835069674
3319,0,1.2277247122375485
3329,0,1.1784657620527423
3339,0,1.0580054672748267
3349,0,1.1105241060417337
3359,0,1.0889833399760518
3369,0,1.0278568862411201
3379,0,1.139182687846511
3389,0,0.9730104627131124
3399,0,1.065402837231232
3409,0,1.0727078019519354
3419,0,1.022244683869669
3429,0,1.153417168101444
3439,0,1.0937737837954091
3449,0,1.1626180079865256
3459,0,0.8955868462958337
3469,0,0.9852407068635075
3479,0,1.2001044283200148
3489,0,1.059465880171016
3499,0,1.104328604442406
3509,0,1.0994833025686999
3519,0,1.1624421390957802
3529,0,1.1803941313836548
3539,0,1.1705730277569113
3549,0,1.2112030681195831
3559,0,1.0390717839027448
3569,0,1.1310557363145484
3579,0,1.1894416702196207
3589,0,1.1172578976099434
3599,0,1.0007114182815577
3609,0,1.0582576674790927
3619,0,1.195219855922986
3629,0,1.212925434929586
3639,0,1.2083105998131245
3649,0,1.1272280804009642
3659,0,1.3814162476337037
3669,0,1.2456416358127043
3679,0,1.177369182265832
3689,0,1.2250096674956645
3699,0,1.012684788967407
3709,0,1.1111641713992602
3719,0,1.0183817241475746
3729,0,1.013154858798352
3739,0,1.094596901095797
3749,0,0.9966429500892567
3759,0,1.0969303700245163
3769,0,1.1246666517063155
3779,0,1.0884668951806473
3789,0,1.0387181207283236
3799,0,1.0834248670644424
3809,0,1.1903330218925003
3819,0,1.1140295614331681
3829,0,1.1659779535771548
3839,0,1.1447139958103982
3849,0,1.2420632166547372
3859,0,1.2068369570965767
3869,0,1.3808570441164576
3879,0,1.197541300354847
3889,0,1.27251837091797
3899,0,0.9735779956545976
3909,0,1.0249271235464013
3919,0,0.9433954665687934
3929,0,0.9795447287204994
3939,0,0.9206763877903754
3949,0,0.8968951747819676
3959,0,0.8532170801493054
3969,0,0.8407009362598106
3979,0,0.9746765572438124
3989,0,0.9222899236867337
3999,0,0.9380719133728564
4009,0,0.9651800953647416
4019,0,1.0001823540216368
4029,0,0.8707869947070359
4039,0,0.9925723345214889
4049,0,0.9956503428848501
4059,0,1.0166334504610872
4069,0,1.0756353212226073
4079,0,1.0508234368256417
4089,0,1.1181765460385114
4099,0,1.1368805932940371
4109,0,1.054352377728103
4119,0,1.1157146856008455
4129,0,1.1034898541808549
4139,0,1.1593781080212375
4149,0,1.0588697723634053
4159,0,1.193751015233808
4169,0,1.2330104521499063
4179,0,1.1629702291605737
4189,0,1.2497186874063522
4199,0,1.199740175454673
4209,0,1.2126656015358008
4219,0,1.2215910924352058
4229,0,1.123573050792536
4239,0,1.1283786076227078
4249,0,1.031948803284822
4259,0,1.0674612903212854
4269,0,1.1513957581845133
4279,0,1.1697656812265538
4289,0,1.0985208883580453
4299,0,1.0357034421573503
4309,0,1.0721717252621445
4319,0,1.093527399914919
4329,0,1.261483649572606
4339,0,1.1461856485285509
4349,0,1.2670809662665634
4359,0,1.251259342553671
4369,0,1.2044958734165006
4379,0,1.0406628763861931
4389,0,1.16041201658031
4399,0,1.119110848850731
4409,0,1.0483620609797737
4419,0,1.183607318042607
4429,0,1.1866413523005683
4439,0,1.069094616591591
4449,0,1.1880503981693187
4459,0,1.1942210775968611
4469,0,1.0958870383791663
4479,0,1.0927812191838813
4489,0,1.2002083961899874
4499,0,1.0655326155428955
4509,0,1.1615435554564324
4519,0,1.173022415235787
4529,0,1.092633171681534
4539,0,1.2026159965286667
4549,0,1.3144049239203177
4559,0,1.2548717355159955
4569,0,1.307021737648689
4579,0,1.3928936402438425
4589,0,1.393777337254351
4599,0,1.2530643848250824
4609,0,1.1369757045662177
4619,0,1.1143842280156389
4629,0,1.234980990584353
4639,0,1.1305311067908324
4649,0,1.2384783534015364
4659,0,1.298441389351453
4669,0,1.2168465037709661
4679,0,1.06801174325016
4689,0,1.1661168444346328
4699,0,1.0270697577024688
4709,0,1.306739915285069
4719,0,1.14292828513606
4729,0,1.157222818203861
4739,0,1.2395327227897541
4749,0,1.2234806625256478
4759,0,1.1658402572492403
4769,0,1.131551670003905
4779,0,0.9647544505204421
4789,0,1.14409060320011
4799,0,1.1670351742638811
4809,0,1.326409318359667
4819,0,1.2804572624516308
4829,0,1.2103289874327468
4839,0,1.143563139860387
4849,0,1.1579182212302437
4859,0,0.9425529349783595
4869,0,1.150428077672058
4879,0,1.1328129025353353
4889,0,1.0459667063705593
4899,0,1.058449668449481
4909,0,1.0256297462984008
4919,0,1.0848217594301608
4929,0,1.1562642179413216
4939,0,1.1051529921033245
4949,0,1.1829138790758829
4959,0,1.1817517444059558
4969,0,1.2586717185311447
4979,0,1.3450402888354556
4989,0,1.3818337300667005
4999,0,1.475923253561187
5009,0,1.5518539460399527
5019,0,1.4196988660845509
5029,0,1.4107560976859492
5039,0,1.3009710121889384
5049,0,1.3628837376718097
5059,0,1.1971808995048179
5069,0,1.1624885591367056
5079,0,1.0533544206666345
5089,0,1.025451089783923
5099,0,1.04425171286704
5109,0,0.9911390249843823
5119,0,1.024127431635788
5129,0,0.9800332480968627
5139,0,0.925813262203827
5149,0,0.8789150924354364
5159,0,0.9415853143837322
5169,0,0.9564770951284189
5179,0,0.838326844104153
5189,0,0.8729772452617846
5199,0,0.9004785476275403
5209,0,0.8796656536460853
5219,0,0.9460175233656193
5229,0,0.9370043340527441
5239,0,0.8922111036401507
5249,0,0.8765496560093512
5259,0,0.8947613110223717
5269,0,0.8923637934474297
5279,0,1.0136695956756903
5289,0,0.9816137709603198
5299,0,0.9368854213757706
5309,0,0.9343770116503983
5319,0,0.9247396926762589
5329,0,0.986168363833668
5339,0,0.9520102157493889
5349,0,0.9263069590896053
5359,0,1.091377589820071
5369,0,0.9580291638510685
5379,0,0.9311243143230017
5389,0,1.003664599215797
5399,0,1.0570808671067198
5409,0,1.053572583143936
5419,0,1.0824458263012788
5429,0,1.0555581403683656
5439,0,1.1085364164639417
5449,0,1.0280539999071419
5459,0,1.0681766424042238
5469,0,1.012068045336934
5479,0,1.0103125822835861
5489,0,1.2429361962174885
5499,0,1.2310029132548679
5509,0,1.182512095421208
5519,0,1.201196353264255
5529,0,1.312381143890627
5539,0,1.3553417207799914
5549,0,1.3945695398192282
5559,0,1.3910814837144372
5569,0,1.2275252768949976
5579,0,1.3754823800213156
5589,0,1.313365877668593
5599,0,1.2876431891584648
5609,0,1.3577193552969655
5619,0,1.1695076889909821
5629,0,1.3097403024302738
5639,0,1.2520433566535656
5649,0,1.1061992811822252
5659,0,1.037034208600617
5669,0,1.0642193903313801
5679,0,1.1015466378888985
5689,0,1.1910580517312856
5699,0,1.0645452004131402
5709,0,1.0289377608860841
5719,0,1.2068812050291533
5729,0,1.1295854392774793
5739,0,1.0696416563625524
5749,0,1.044489617856779
5759,0,1.0081565292402124
5769,0,0.9393837654067945
5779,0,1.0584710922546128
5789,0,1.1056448830283188
5799,0,1.1062550127886293
5809,0,1.0132307750217748
5819,0,1.0475632295525448
5829,0,0.9686524991161066
5839,0,0.9618281227382065
5849,0,1.0079465990361527
5859,0,1.0111474937167442
5869,0,1.1063941620591682
5879,0,1.0590267065126875
5889,0,1.1330341270997293
5899,0,1.0571085726430414
5909,0,1.0030064632109394
5919,0,1.1081603222979208
5929,0,0.9778381065763155
5939,0,0.9043783638651162
5949,0,1.0026378195437557
5959,0,0.9463132879580598
5969,0,1.0477976448246116
5979,0,1.1575357925701666
5989,0,1.153341680736676
5999,0,1.0880757401205423
6009,0,0.9778595968443637
6019,0,0.9042801798856718
6029,0,0.9586785698979285
6039,0,0.9087864958961221
6049,0,0.9645162416307733
6059,0,0.9644629635620224
6069,0,0.9499707697036515
6079,0,1.0248873725463148
6089,0,0.9457060286497311
6099,0,1.1036950069496496
6109,0,1.1329203209267893
6119,0,0.9502202540867828
6129,0,1.1971374484562245
6139,0,1.2145263791755294
6149,0,1.0786838157150078
6159,0,0.97508212812928
6169,0,0.9829841641446802
6179,0,0.9428975722246657
6189,0,1.1283502862646997
6199,0,1.1774614505305954
6209,0,1.1237520284298963
6219,0,1.1958367314282636
6229,0,1.2652327170381188
6239,0,1.2112855537508354
6249,0,1.355312105992777
6259,0,1.1026285768314796
6269,0,1.1732476887634258
6279,0,1.3299855476171802
6289,0,1.2111542254377796
6299,0,1.1496702514920973
6309,0,1.1558058372827211
6319,0,1.1551820679212146
6329,0,1.1436464617676223
6339,0,1.1370661106684548
6349,0,1.0962213417185662
6359,0,1.24828000183936
6369,0,1.3505285871917745
6379,0,1.3050946842541467
6389,0,1.2236843751586604
6399,0,1.2113446103909933
6409,0,1.2500171690994388
6419,0,1.0051487120304863
6429,0,1.1361161126803745
6439,0,1.1283945384497491
6449,0,1.2869896535918177
6459,0,1.2897288830774487
6469,0,1.2558012693024314
6479,0,1.4100249317045208
6489,0,1.4629768710517375
6499,0,1.4223652433121297
6509,0,1.4453813044246508
6519,0,1.4861816103328302
6529,0,1.2303705126409024
6539,0,1.3556935649371813
6549,0,1.2993964005408039
6559,0,1.2641894082914078
6569,0,1.3652939777808408
6579,0,1.3744279807515565
6589,0,1.329783744231349
6599,0,1.2402012964188758
6609,0,1.3391740885228347
6619,0,1.1490223803424606
6629,0,1.2377664167010867
6639,0,1.285100232914737
6649,0,1.3262765371227834
6659,0,1.4227397503459682
6669,0,1.2970163842705453
6679,0,1.3906741204133173
6689,0,1.4158637174798503
6699,0,1.5423756704766534
6709,0,1.4474885524440928
6719,0,1.4679228305586653
6729,0,1.4112953145234808
6739,0,1.4378961591241328
6749,0,1.423901580282322
6759,0,1.4967444381354666
6769,0,1.4131300402085307
6779,0,1.507312489328894
6789,0,1.4541768012930123
6799,0,1.4764216314185623
6809,0,1.5364920635863586
6819,0,1.3697479272623998
6829,0,1.3497656476285296
6839,0,1.2909846188875154
6849,0,1.356366440502234
6859,0,1.3056455735470371
6869,0,1.1790295878045294
6879,0,1.1701701211477364
6889,0,1.1655351319668998
6899,0,1.1654548444367514
6909,0,1.130671936089806
6919,0,1.15656191609716
6929,0,1.2542858724561283
6939,0,1.2253010176822121
6949,0,1.3918245086176861
6959,0,1.3222344752808466
6969,0,1.2716902897010365
6979,0,1.2368865654103267
6989,0,1.397979217695745
6999,0,1.3715582670325026
7009,0,1.5446039886972946
7019,0,1.4732524544556813
7029,0,1.4061759600221873
7039,0,1.5001686748789747
7049,0,1.5199133060253043
7059,0,1.3887112636362995
7069,0,1.4066361550488975
7079,0,1.5184610799844405
7089,0,1.4705566629681293
7099,0,1.259169812333447
7109,0,1.1466323836128038
7119,0,1.25469010030559
7129,0,1.2306428738991235
7139,0,1.3351365713923518
7149,0,1.3100978609035883
7159,0,1.4269775941306198
7169,0,1.2589353799842329
7179,0,1.2228419366653815
7189,0,1.3530136916103885
7199,0,1.4734361996779681
7209,0,1.315260288424121
7219,0,1.3722421903390407
7229,0,1.2460194057082103
7239,0,1.1250695239319755
7249,0,1.0960214114325744
7259,0,1.2638818167738077
7269,0,1.1531231359361707
7279,0,1.238341244716597
7289,0,1.2109665384279693
7299,0,1.0909525962170605
7309,0,1.0576769649558264
7319,0,1.1811193937921147
7329,0,1.2354890030051116
7339,0,1.28344388591949
7349,0,1.432338293163418
7359,0,1.2540356267587753
7369,0,1.2487025867018835
7379,0,1.2480971838887425
7389,0,1.1386669556073987
7399,0,1.0916244541714955
7409,0,1.0452587592296676
7419,0,1.0631150491017154
7429,0,1.2376294967269383
7439,0,1.11958693174422
7449,0,1.1186196067648855
7459,0,1.1684687641913818
7469,0,1.1809754061344349
7479,0,1.2248810029455477
7489,0,1.2955823557458956
7499,0,1.272999703172698
7509,0,1.1139109710513926
7519,0,1.2068593145082742
7529,0,1.1934052143383405
7539,0,1.1735287408739181
7549,0,1.1546622655400576
7559,0,1.1052249999747703
7569,0,1.0550983433074377
7579,0,1.0226144891234856
7589,0,1.0009043954874706
7599,0,1.0444383984879635
7609,0,1.0127378329620584
7619,0,1.0418124673604436
7629,0,1.0178871685901514
7639,0,1.2082332768040376
7649,0,1.0884194062608434
7659,0,1.210481455757245
7669,0,1.0663190117133683
7679,0,1.123491712339783
7689,0,1.1758510639847553
7699,0,1.2440364218293471
7709,0,1.1979456157061352
7719,0,1.114393883383708
7729,0,1.2589737821498979
7739,0,1.3259686662741026
7749,0,1.1352847538448767
7759,0,1.028088491173265
7769,0,1.004530526675244
7779,0,1.077786207946732
7789,0,1.1759915505856189
7799,0,1.1008257202860845
7809,0,0.977273087680356
7819,0,0.9729276900421514
7829,0,0.944313280141776
7839,0,1.0488595347107674
7849,0,1.094310669087857
7859,0,0.9701855808218103
7869,0,0.9783621173719319
7879,0,1.0206715630162144
7889,0,0.963683879486826
7899,0,0.9856285959240859
7909,0,0.9535127052472671
7919,0,1.134928212934131
7929,0,1.09580007450956
7939,0,1.0546571963901354
7949,0,1.0373751378435432
7959,0,1.091931862158671
7969,0,1.1392201180637673
7979,0,1.2137585189898263
7989,0,1.2361025337465907
7999,0,1.140005275121209
8009,0,1.143859349853849
8019,0,1.098949206208515
8029,0,1.077633231287343
8039,0,1.1237762913436222
8049,0,1.1256806017164274
8059,0,1.0659211623845277
8069,0,1.1351645289277574
8079,0,1.1219022354435075
8089,0,1.142011392802879
8099,0,1.057669121228851
8109,0,1.2753696385887305
8119,0,1.117165497033358
8129,0,1.0520454990142047
8139,0,1.0486761349778022
8149,0,1.1544175218432307
8159,0,1.083391959351072
8169,0,1.1396297078760094
8179,0,1.0578784964607564
8189,0,1.0209580930921238
8199,0,1.156380573533947
8209,0,1.2634595261118005
8219,0,1.2688650568333166
8229,0,1.3245632701750691
8239,0,1.2648820243868177
8249,0,1.1536335528986303
8259,0,1.0977820664730054
8269,0,1.1603871034247257
8279,0,1.1254170656387474
8289,0,1.1085413214039763
8299,0,0.9647744858108982
8309,0,0.9716725506718447
8319,1,1.0585189260490298
8329,1,1.101357984297067
8339,1,1.2166001511335187
8349,1,1.3223848155211961
8359,1,1.5511763934513625
8369,1,1.5212544947779159
8379,1,1.5438516833141451
8389,1,1.532554030599546
8399,1,1.631163956422977
8409,1,1.719176303380554
8419,1,1.9125441998831652
8429,1,2.0867293303220817
8439,1,2.1373610779700343
8449,1,2.2422608957008734
8459,1,2.316434762681596
8469,1,2.3146576169447677
8479,1,2.6664949793686707
8489,1,2.6217195543831466
8499,1,2.673260983350085
8509,1,2.887077497411826
8519,1,2.898558025978854
8529,1,3.0139756852326585
8539,1,3.073445053743334
8549,1,3.1692038918960828
8559,1,3.1946721653283916
8569,1,3.31819276275419
8579,1,3.373018870511212
8589,1,3.4768872146854
8599,1,3.6131614632004325
8609,1,3.900556180393489
8619,1,3.877137562407819
8629,1,4.056388867735587
8639,1,4.244708147488798
8649,1,4.273389912322111
8659,1,4.487276202812572
8669,1,4.503323193168615
8679,1,4.653067651909032
8689,1,4.680576883676489
8699,1,4.742051646015235
8709,1,4.947373220909084
8719,1,5.215701050303394
8729,1,5.228420230105135
8739,1,5.348601560981684
8749,1,5.551013142585731
8759,1,5.67841690091009
8769,1,5.787515451161182
8779,1,5.9456976350774315
8789,1,6.323930341329167
8799,1,6.452766793306095
8809,1,6.489309252684989
8819,1,6.055254650672759
8829,1,5.904709143651691
8839,1,5.646502118039143
8849,1,5.507550251663343
8859,1,5.437178337142321
8869,1,5.304905394938883
8879,1,5.2121272474477855
8889,1,5.1015965418007525
8899,1,5.020585587235908
8909,1,4.919582804088218
8919,1,4.554978897933208
8929,1,4.36062889752951
8939,1,4.4426074790528505
8949,1,4.5501730449290125
8959,1,4.260113390209121
8969,1,4.092612824169748
8979,1,4.141388222047915
8989,1,3.875205767346777
8999,1,3.9291263378263834
9009,1,3.734899937814637
9019,1,4.087666969980694
9029,1,4.02844973203083
9039,1,4.106037221036395
9049,1,3.9835993729280514
9059,1,3.9742854171423114
9069,1,4.215510169127855
9079,1,4.36504261507908
9089,1,4.159423127528168
9099,1,4.289675097949944
9109,1,4.284668410605278
9119,1,4.2950098872801235
9129,1,4.497109018658955
9139,1,4.7265028645789045
9149,1,4.75356050681905
9159,1,4.964330145105497
9169,1,4.99843191668365
9179,1,5.11271702477357
9189,1,5.359542016481527
9199,1,5.605852641816033
9209,1,6.0636088168676
9219,1,6.462402392072628
9229,1,6.643535406627211
9239,1,6.6081332155875385
9249,1,6.261692026201785
9259,1,6.399139004593307
9269,1,6.25017723455006
9279,1,6.2355409368923045
9289,1,6.38381298381093
9299,1,6.2522155212470985
9309,1,6.275113507558175
9319,1,6.565223341452391
9329,1,6.582112428648983
9339,1,6.994638752312106
9349,1,7.089796477963055
9359,1,7.074213264345377
9369,1,7.052085402195693
9379,1,6.960670519942487
9389,1,7.120406958582016
9399,1,6.844015607831719
9409,1,6.646820825284527
9419,1,6.511715831422849
9429,1,6.481063358524133
9439,1,6.088750824471399
9449,1,5.880283625128502
9459,1,5.62176120633225
9469,1,5.4509478021769775
9479,1,5.222960181997918
9489,1,4.988738016689712
9499,1,4.825983478842772
9509,1,4.6841251217242
9519,1,4.699890579765828
9529,1,4.430138190981747
9539,1,4.176854973859534
9549,1,4.2133947078641025
9559,1,4.069261120930971
9569,1,4.15020465258255
9579,1,3.865234439929083
9589,1,3.5941603856269912
9599,1,3.527967149591901
9609,1,3.5359606471606138
9619,1,3.0670721590198613
9629,1,3.276802743678189
9639,1,3.087117385589781
9649,1,2.814538010122581
9659,1,2.7870536207743113
9669,1,2.3819481355473355
9679,1,2.5100178870750134
9689,1,2.169911223276398
9699,1,2.0308026774994996
9709,1,1.9677028968135175
9719,1,2.096768931563049
9729,1,1.9193629305014301
9739,1,2.1192941151808253
9749,1,2.1219749219583326
9759,1,2.241414092619177
9769,1,2.584777821651555
9779,1,2.4702498677983016
9789,1,2.510061747211563
9799,1,2.4110570009037704
9809,1,2.3893378773978844
9819,1,2.3274075416201896
9829,1,2.490729509199353
9839,1,2.6356311945626913
9849,1,2.55936525028677
9859,1,2.575302190146478
9869,1,2.735150110893755
9879,1,2.652105746770829
9889,1,2.8882152107967416
9899,1,2.765381396626715
9909,1,2.9714017950925244
9919,1,3.187779437063525
9929,1,3.4625906845156735
9939,1,3.205326220566926
9949,1,3.4547773635248307
9959,1,3.4529932086421593
9969,1,3.206058934908896
9979,1,3.2656660737401997
9989,1,2.8992942933982997
9999,1,3.0507906100912714
10009,1,2.8074023017095886
10019,1,2.8477748573417623
10029,1,2.7259577163969135
10039,1,2.5015518037670295
10049,1,2.343742989724536
10059,1,2.5333436204604842
10069,1,2.4849419971139133
10079,1,2.55178642618725
10089,1,2.2495000708095487
10099,1,2.2843501025404023
10109,1,1.9975396784403943
10119,1,2.0627459651757594
10129,1,1.8296102058252468
10139,1,1.713028327683847
10149,1,1.657682517903387
10159,1,1.7729417030550527
10169,1,1.6437966849519356
10179,1,1.5334265342658526
10189,1,1.6118825096678095
10199,1,1.6907183442443148
10209,1,1.701921685046977
10219,1,1.6560175527664187
10229,1,1.5800275742268342
10239,1,1.7302131093724176
10249,1,1.657760130513163
10259,1,1.6133303241546237
10269,1,1.6545522112872544
10279,1,1.7078254421593766
10289,1,1.58386080971974
10299,1,1.74937210789459
10309,1,1.920828249132387
10319,1,1.718647441069298
10329,1,2.2034267374791376
10339,1,2.1850348788722886
10349,1,2.511848218125002
10359,1,2.4681769851559467
10369,1,2.506889951122938
10379,1,2.607903023374
10389,1,2.723567247920594
10399,1,2.6667813291289573
10409,1,3.0104625733541392
10419,1,2.8880848228923153
10429,1,3.203059819999825
10439,1,3.1140247369097693
10449,1,3.365051859811321
10459,1,3.4342242386830657
10469,1,3.40169389237618
10479,1,3.4057585524342957
10489,1,3.9590123603991922
10499,1,3.896155982185206
10509,1,3.3987748205210897
10519,1,3.6623070894600662
10529,1,3.423138305718129
10539,1,3.5234871090512048
10549,1,3.387970156939449
10559,1,3.50845978730116
10569,1,3.516042079233461
10579,1,3.4609203395376484
10589,1,3.4486636500129517
10599,1,3.4279165331678394
10609,1,3.4759844091461005
10619,1,3.181523237727881
10629,1,3.1966252656991383
10639,1,3.076447035818603
10649,1,2.9371742717137037
10659,1,2.8084040656307563
10669,1,2.802284083081338
10679,1,2.7557250098890975
10689,1,2.687729640796815
10699,1,2.5741144196213703
10709,1,2.4219071594724824
10719,1,2.5724712514393584
10729,1,2.661952393688842
10739,1,2.9576729063496168
10749,1,2.7554549196258717
10759,1,2.646577384627
10769,1,2.4421004453039576
10779,1,2.4011544506014264
10789,1,2.1722517117131916
10799,1,1.8753124389882252
10809,1,1.7609550306094164
10819,1,1.7673298898576928
10829,1,1.9701650707503335
10839,1,1.6013157165117013
10849,1,1.7698127235346501
10859,1,1.6774975014097935
10869,1,1.6741784886257092
10879,1,1.3797248851591328
10889,1,1.4445036614113325
10899,1,1.3559234986666038
10909,1,1.2706237989228708
10919,1,1.3002829260719653
10929,1,1.1797350667879352
10939,1,1.1998755835949593
10949,1,1.38773152017415
10959,1,1.4787205157787378
10969,1,1.5471633226065162
10979,1,1.5492029100333597
10989,1,1.4471592739365005
10999,1,1.55707636478151
11009,1,1.7649308827263652
11019,1,1.6830651459493755
11029,1,1.744810721265102
11039,1,1.754829879382722
11049,1,1.9524104863079015
11059,1,1.839955428864409
11069,1,1.9596792000955372
11079,1,1.7531255453025654
11089,1,1.6057430492094251
11099,1,1.7667362643277145
11109,1,1.8752631430437885
11119,1,2.0146620501119594
11129,1,1.9835258588582987
11139,1,2.042081629162524
11149,1,2.05342722494038
11159,1,1.9525543560268377
11169,1,1.8418986749344148
11179,1,1.7384726618972781
11189,1,1.5693220048483223
11199,1,1.756684791275227
11209,1,1.7663145158911695
11219,1,1.884754658689817
11229,1,1.6634411367309097
11239,1,1.6456733940306612
11249,1,1.4487425077590552
11259,1,1.6935838823420581
11269,1,1.7128621557256067
11279,1,1.8086296305093854
11289,1,1.87994925022388
11299,1,2.3384855285659585
11309,1,2.3642168323075605
11319,1,2.389463268991002
11329,1,2.4270882379226997
11339,1,2.399223817990088
11349,1,2.1816532457881066
11359,1,2.174272288270936
11369,1,2.414276557052416
11379,1,2.5156739667556627
11389,1,2.4264551732382187
11399,1,2.595357382282852
11409,1,2.34197519450257
11419,1,2.110110947029761
11429,1,2.077619593498799
11439,1,2.3176039045570582
11449,1,2.347236374953925
11459,1,2.3063847418912546
11469,1,2.4012722201361782
11479,1,2.4713672503038207
11489,1,2.3520089701484688
11499,1,2.171547732589513
11509,1,2.2541877823962295
11519,1,2.096415609005663
11529,1,2.0581747871159193
11539,1,1.956241453085901
11549,1,2.185499009643536
11559,1,2.302821615689182
11569,1,2.4298748329380713
11579,1,2.0993896836411285
11589,1,2.3062374872609164
11599,1,2.4580020660230515
11609,1,2.4947485964265645
11619,1,2.7407389419981607
11629,1,2.6677628058638736
11639,1,2.8975319367618066
11649,1,3.022463941460611
11659,1,2.6484874000274896
11669,1,2.824941328279786
11679,1,2.7224304948754185
11689,1,2.8642146363990384
11699,1,3.095927650314451
11709,1,3.166060489237465
11719,1,3.072841968497922
11729,1,3.041125257408031
11739,1,2.8491288144256575
11749,1,2.6855212000215913
11759,1,2.4964781747445492
11769,1,2.63100531580724
11779,1,2.6119562086036248
11789,1,2.5136430958333125
11799,1,2.727535644895315
11809,1,2.6498278993334257
11819,1,2.6937979014906945
11829,1,2.7284673707838136
11839,1,2.540162811295703
11849,1,2.5367348430746044
11859,1,2.5326185928414278
11869,1,2.7962486936210857
11879,1,2.600195567001386
11889,1,2.2695671417335586
11899,1,2.2330511620640827
11909,1,1.9824331349543511
11919,1,2.1603605641879433
11929,1,2.04799469453278
11939,1,2.3616365720183126
11949,1,2.1636892589443395
11959,1,2.100025119144766
11969,1,1.8889115005405923
11979,1,1.7769549981506254
11989,1,1.5240120015251053
11999,1,1.6835788183985012
12009,1,1.588832027179952
12019,1,1.4164602300791445
12029,1,1.680932184991803
12039,1,1.9123501448945661
12049,1,2.1157703067912896
12059,1,2.008289476654999
12069,1,2.0531499922135508
12079,1,1.9085989240772276
12089,1,2.1968584057747984
12099,1,2.319580165399885
12109,1,2.274358067497145
12119,1,2.4303536749994343
12129,1,2.59289411814124
12139,1,2.759924108968935
12149,1,2.6089281423233714
12159,1,2.4784375624075325
12169,1,2.885760770544776
12179,1,3.076849708931841
12189,1,3.514052082043623
12199,1,3.1502899775132063
12209,1,3.3741495852347856
12219,1,3.2056412979631745
12229,1,2.9841499069904236
12239,1,3.2220175442269783
12249,1,3.165003262827981
12259,1,2.9951372634812503
12269,1,3.086380884403735
12279,1,3.2066606088611365
12289,1,3.2563262773474206
12299,1,3.5454400143009335
12309,1,3.268341587247051
12319,1,3.74067120833883
12329,1,3.5997740545183445
12339,1,3.430591911097132
12349,1,3.340149872529731
12359,1,3.530915162670356
12369,1,3.543104484112781
12379,1,3.4102508475704836
12389,1,3.207622149112275
12399,1,3.2712056187624445
12409,1,3.0322261921566067
12419,1,3.08600301766248
12429,1,3.5378255655898947
12439,1,3.0498571783743076
12449,1,2.88912370696855
12459,1,2.5919029404792324
12469,1,2.3238245885361906
12479,1,1.9539891230511854
12489,1,1.7646393097254918
12499,1,1.4532512121371173
12509,1,1.3879488646047167
12519,1,1.1630070971063444
12529,1,1.226689228238302
12539,1,1.3558866759687018
12549,1,1.3554693475594148
12559,1,1.2231646441658948
12569,1,1.2843133689622288
12579,1,1.471784733458952
12589,1,1.374809150268372
12599,1,1.3976740898734277
12609,1,1.4284493413331945
12619,1,1.3875422329108733
12629,1,1.5344014927153569
12639,1,1.6302005526370165
12649,1,1.5199226762102316
12659,1,1.5748753999658809
12669,1,1.7849077578085093
12679,1,1.7359112534361405
12689,1,1.7598537921105013
12699,1,1.6043310236317885
12709,1,1.7495835733081022
12719,1,1.6446804198948866
12729,1,1.6277717764869435
12739,1,1.5983607064029366
12749,1,1.6410437259209696
12759,1,1.769222322829752
12769,1,1.6129855880360051
12779,1,1.897090615420146
12789,1,1.9100817897611
12799,1,2.183226958384709
12809,1,2.0145298002156573
12819,1,2.340398684314305
12829,1,2.281189313429684
12839,1,2.552251743661535
12849,1,2.472347057901393
12859,1,2.470343162777625
12869,1,2.383917907485945
12879,1,2.624898544209451
12889,1,2.2380059343745975
12899,1,2.5091794925884923
12909,1,2.677412847375134
12919,1,2.6108046937511746
12929,1,2.8667031421814926
12939,1,2.8871965329592597
12949,1,2.5035791057590586
12959,1,2.267337483394014
12969,1,2.1600974532561046
12979,1,2.006555344072649
12989,1,1.8991118171035117
12999,1,2.243996845315653
13009,1,1.919542212431667
13019,1,1.9050240596375418
13029,1,1.7993883712441594
13039,1,1.7215130171318969
13049,1,1.7344975017778135
13059,1,1.691901139543546
13069,1,1.7889160274653837
13079,1,1.80062030285868
13089,1,1.7690756059193498
13099,1,1.8669512433035067
13109,1,1.7672331764064795
13119,1,1.9022136010652937
13129,1,1.9605415281471816
13139,1,1.9765574915469395
13149,1,2.0318066795851912
13159,1,2.099356531212468
13169,1,2.142741460487645
13179,1,2.040785994382966
13189,1,2.092405977123617
13199,1,2.4291031156270426
13209,1,2.3613541507771583
13219,1,2.307283472907805
13229,1,2.226834534816441
13239,1,2.0291419937839508
13249,1,2.176618454643681
13259,1,1.998814796935755
13269,1,2.3018242874512715
13279,1,2.12066893122554
13289,1,2.204346820093466
13299,1,2.323663622833195
13309,1,2.3553858926349998
13319,1,2.252251477175744
13329,1,2.378936309997747
13339,1,2.7222764240187307
13349,1,2.6142077643409274
13359,1,2.572197833626576
13369,1,2.623521071296662
13379,1,2.386651558710528
13389,1,2.2675448481871965
13399,1,2.4856583090782083
13409,1,2.7642719688786586
13419,1,2.6764370426155786
13429,1,2.857689226234235
13439,1,2.8159222072888337
13449,1,2.7151613098035647
13459,1,2.716347403703593
13469,1,2.5416721192556695
13479,1,2.4938296469716628
13489,1,2.420668430836803
13499,1,2.534785936575042
13509,1,2.5247375027234993
13519,1,2.4813933878445127
13529,1,2.300408417837202
13539,1,2.3131257483669168
13549,1,2.421626944133777
13559,1,2.5256796080871435
13569,1,2.6956461989695324
13579,1,2.6049702130588956
13589,1,2.8724425965339653
13599,1,3.147586909852939
13609,1,3.368316032442803
13619,1,3.372709334480985
13629,1,3.5172786255848423
13639,1,3.3594230290592635
13649,1,3.257849939473158
13659,1,3.5258665019063984
13669,1,3.697653198192455
13679,1,3.800279432002566
13689,1,3.4902550745525422
13699,1,3.3532194345976776
13709,1,3.2083446129447335
13719,1,3.1323794983266104
13729,1,3.269294523041934
13739,1,3.4429419229909803
13749,1,3.3722066776506052
13759,1,3.1723790257303808
13769,1,3.037013884231399
13779,1,2.8879702750371354
13789,1,2.883635615450318
13799,1,3.0542160668935043
13809,1,3.301470934811318
13819,1,3.329232570154973
13829,1,3.2828470892715313
13839,1,3.3473173995652026
13849,1,3.2696659129449213
13859,1,3.07998258364711
13869,1,2.994436991150395
13879,1,2.9804512265076846
13889,1,3.2974523185456412
13899,1,3.2678612178765842
13909,1,3.0180167991413613
13919,1,3.158071364173614
13929,1,2.983572588461039
13939,1,2.9193663273418693
13949,1,3.4009352242440087
13959,1,3.4770814928392015
13969,1,3.2457582190001366
13979,1,3.2994670083409448
13989,1,3.069447098828547
13999,1,3.2070761981022655
14009,1,3.3416497013518685
14019,1,3.2074325229289706
14029,1,3.265257191249172
14039,1,3.3606554354737757
14049,1,3.313787012590969
14059,1,3.118689388285943
14069,1,2.889372949521195
14079,1,2.9964840004358844
14089,1,3.0026907154497717
14099,1,2.7155865693537518
14109,1,2.5975709776001117
14119,1,2.4432211471955005
14129,1,2.412974722584907
14139,1,2.2789679091939545
14149,1,2.1670497881049675
14159,1,1.9593800046229746
14169,1,1.7939940742429057
14179,1,1.8733677031563845
14189,1,1.9248048686075452
14199,1,1.5958588278321058
14209,1,1.6530717529909096
14219,1,1.6218617005525118
14229,1,1.5345005967390322
14239,1,1.6064081222375428
14249,1,1.750289555214627
14259,1,1.5862580887321291
14269,1,1.7314432508857742
14279,1,1.6132336168727317
14289,1,1.6362581302951897
14299,1,1.8001011102586615
14309,1,1.9117626180619536
14319,1,2.060694018451664
14329,1,2.046724697166958
14339,1,2.1039756070490387
14349,1,1.8839593256881861
14359,1,1.9607248038759058
14369,1,1.866104693362547
14379,1,2.0396582085730994
14389,1,2.067071670544449
14399,1,2.1650797849022823
14409,1,2.2900292962565434
14419,1,2.1235401012831114
14429,1,2.438405399502506
14439,1,2.4220508963028253
14449,1,2.4806707450889953
14459,1,2.7217296316502884
14469,1,2.3476268730160483
14479,1,2.638391630430157
14489,1,2.4501460017532164
14499,1,2.556591733739995
14509,1,2.602219997535278
14519,1,2.056554069646426
14529,1,2.1927729440739583
14539,1,1.9332954488248326
14549,1,2.0524937524944686
14559,1,2.1089108059590087
14569,1,1.6903958125400425
14579,1,1.9768595747586337
14589,1,1.7378952917993067
14599,1,1.8041257019776846
14609,1,1.9336286358956263
14619,1,1.6800432125074456
14629,1,1.6432436225742157
14639,1,1.5312063585283053
14649,1,1.50217798675703
14659,1,1.805888924177445
14669,1,1.7690912416866473
14679,1,1.9027245460301416
14689,1,1.7335121354442529
14699,1,1.5731917077242272
14709,1,1.4390858019910753
14719,1,1.554554733045482
14729,1,1.5252307357716606
14739,1,1.5377299071211215
14749,1,1.3726021694717536
14759,1,1.476351144135969
14769,1,1.3777813090317053
14779,1,1.5606092969067618
14789,1,1.566002433831153
14799,1,1.6709319631777462
14809,1,1.719394355101551
14819,1,1.8752901435851963
14829,1,2.0007247807498887
14839,1,2.1098218367629493
14849,1,2.375145218224577
14859,1,2.646924665159105
14869,1,2.758842654706781
14879,1,2.7043344082326697
14889,1,3.0379474855987025
14899,1,3.237757609462946
14909,1,3.5131996285658476
14919,1,3.68296205038517
14929,1,3.903755883284998
14939,1,4.221239182934193
14949,1,4.290483348723883
14959,1,4.379787195094961
14969,1,4.450483243248875
14979,1,4.434715170790451
14989,1,4.2144475417211265
14999,1,4.236285933118228
15009,1,3.9103149594385447
15019,1,3.7297017570429154
15029,1,3.420055652251286
15039,1,3.34999525375093
15049,1,2.780398697184742
15059,1,2.670844292859197
15069,1,2.6608542458369673
15079,1,2.375184060410737
15089,1,2.4103305921522225
15099,1,2.576432105697929
15109,1,2.4467318344079523
15119,1,2.4854876816693743
15129,1,2.4878275227477618
15139,1,2.345719164631277
15149,1,2.5222634204625836
15159,1,2.2833792275795903
15169,1,2.561071747765511
15179,1,2.3735962791427525
15189,1,2.3724029239963365
15199,1,2.4639643087162533
15209,1,2.372517768116081
15219,1,2.3727651561576266
15229,1,2.566629669603705
15239,1,2.482779295614602
15249,1,2.6559582815149225
15259,1,2.9327032098242607
15269,1,2.7276388383801056
15279,1,2.829468202512088
15289,1,2.323077341186513
15299,1,2.529588919165694
15309,1,2.5171719392701775
15319,1,2.257419778768278
15329,1,2.0874301672529336
15339,1,1.9652794853380342
15349,1,1.8933021651576603
15359,1,2.0393059539277156
15369,1,1.815031557923721
15379,1,1.5790503981405144
15389,1,1.4803274836098324
15399,1,1.423533574192717
15409,1,1.2771885382945518
15419,1,1.3511814378306855
15429,1,1.344705726126657
15439,1,1.3609659108362682
15449,1,1.5249012379662854
15459,1,1.599148854002289
15469,1,1.6077745096206697
15479,1,1.5500312251081467
15489,1,1.766541104124141
15499,1,1.6172164111755607
15509,1,1.5730685519905385
15519,1,1.4271003245415717
15529,1,1.3578582218781203
15539,1,1.424158139748532
15549,1,1.401059602916453
15559,1,1.3406813296679854
15569,1,1.314037276662871
15579,1,1.4260445414736562
15589,1,1.3466212521588543
15599,1,1.5084007418112297
15609,1,1.6747857368047803
15619,1,1.5213805629834853
15629,1,1.4210997749070673
15639,1,1.3270591273027135
15649,1,1.2386927845955416
15659,1,1.4120237444784742
15669,1,1.2674004142111022
15679,1,1.2656742697444032
15689,1,1.2775762359168183
15699,1,1.2881122628701263
15709,1,1.4086178878326556
15719,1,1.394654053612606
15729,1,1.299264965798107
15739,1,1.1443185772834268
15749,1,1.4013232077512754
15759,1,1.1605579679291926
15769,1,1.131294936953563
15779,1,1.2321450146761246
15789,1,1.0921791486597083
15799,1,1.123720797512993
15809,1,1.067777944902528
15819,1,1.1986503014791705
15829,1,1.3885570721808298
15839,1,1.5718796825351378
15849,1,1.7404622149642983
15859,1,1.9219597088370561
15869,1,2.315190948293713
15879,1,2.534139885024733
15889,1,2.734940884821484
15899,1,2.9739311176606353
15909,1,2.979012090864124
15919,1,2.8227434385231827
15929,1,2.739845867739364
15939,1,2.8156725263359057
15949,1,2.905367193879811
15959,1,2.7434812256088863
15969,1,2.9056068023240407
15979,1,2.7310793111975276
15989,1,2.7039875860286253
15999,1,2.7821078535437014
16009,1,2.408146900226286
16019,1,2.5633370112312845
16029,1,2.4714973027762683
16039,1,2.2988917018592145
16049,1,2.0534430237500993
16059,1,2.0223208770123584
16069,1,1.7890158899543211
16079,1,2.0469209234552377
16089,1,2.128858439915393
16099,1,2.146257606163517
16109,1,1.9873726982642832
16119,1,1.7857581133178415
16129,1,1.5611065898651282
16139,1,1.5989660648951978
16149,1,1.5567324789659882
16159,1,1.5125940191167488
16169,1,1.4810880578813788
16179,1,1.4192053816067072
16189,1,1.1934874840148442
16199,1,1.1580474676081078
