T,S,Score
999,0,0.0009173239222217133
1009,0,0.0006913988966326112
1019,0,0.000501428249845226
1029,0,6.993653930481569e-05
1039,0,0.0007947987693336933
1049,0,0.001010735732411061
1059,0,0.0014606796018516444
1069,0,0.0008380376076217444
1079,0,0.0009077695025316856
1089,0,9.824326229757041e-07
1099,0,0.0003533538984066831
1109,0,0.0006724037089338442
1119,0,0.0008344248240776397
1129,0,9.974548690805385e-05
1139,0,0.0010277312006982675
1149,0,0.0012654636151135934
1159,0,0.0010422732655074873
1169,0,0.0013256023620127344
1179,0,0.0009297444775059893
1189,0,0.0005222304464329586
1199,0,0.0005197774853122339
1209,0,0.0005967229144308028
1219,0,0.0012577845752366756
1229,0,0.0009338007538836068
1239,0,0.0012795290659076697
1249,0,0.00163691159773649
1259,0,0.0017776936000080124
1269,0,0.0015703564214083476
1279,0,0.001862975735379635
1289,0,0.08787606416589883
1299,0,0.09463592278850075
1309,0,0.02252749437808005
1319,0,0.02485564893162734
1329,0,0.0016560948358660954
1339,0,0.0017614787893113215
1349,0,0.0024662784549960293
1359,0,0.002490940320433399
1369,0,0.004692654065334423
1379,0,0.021742268996756187
1389,0,0.044059606264859774
1399,0,0.006419035392564443
1409,0,0.005802863941315017
1419,0,0.005824779919758438
1429,0,0.006391251788549601
1439,0,0.03947690135282794
1449,0,0.006545845387159466
1459,0,0.005832291870748574
1469,0,0.006728741004304373
1479,0,0.005350688217714228
1489,0,0.005457534070735459
1499,0,0.005456472965931158
1509,0,0.020134396877912852
1519,0,0.025411482647141048
1529,0,0.006595192395067506
1539,0,0.006738430381860727
1549,0,0.0064020669557862675
1559,0,0.006167510427927292
1569,0,0.005554938758119743
1579,0,0.00600118782509329
1589,0,0.006666071077929769
1599,0,0.0065173497256716395
1609,0,0.006397951931530255
1619,0,0.005724475898468806
1629,0,0.020539337313924766
1639,0,0.007558997077234508
1649,0,0.007276432910172603
1659,0,0.006730025320499378
1669,0,0.0071510472184608265
1679,0,0.00609545177252091
1689,0,0.006092125013530292
1699,0,0.005328148806837629
1709,0,0.00538037710419087
1719,0,0.0053937464036105665
1729,0,0.005842442530520853
1739,0,0.005956060722271395
1749,0,0.00503232379209545
1759,0,0.005609711031827336
1769,0,0.004354141305881742
1779,0,0.004075358258603279
1789,0,0.005981595654440897
1799,0,0.006306514072660585
1809,0,0.005065688923211353
1819,0,0.005039295894111007
1829,0,0.0038965095216503265
1839,0,0.004885276055297538
1849,0,0.004927416693982889
1859,0,0.004030859735110526
1869,0,0.001098019160466368
1879,0,0.0062649035246151175
1889,0,0.006054022540355863
1899,0,0.004935906225455811
1909,0,0.006687662450630183
1919,0,0.006067637335433251
1929,0,0.00622130731289583
1939,0,0.005235747685420844
1949,0,0.028435112707596577
1959,0,0.05257163307040075
1969,0,0.017357925843971722
1979,0,0.0063534153702962115
1989,0,0.006329866820722507
1999,0,0.01888771999477995
2009,0,0.006644634471736022
2019,0,0.03159479010328836
2029,0,0.0060699077477120444
2039,0,0.0057394546435987626
2049,0,0.005720300360673725
2059,0,0.038329672154278405
2069,0,0.006400317529556887
2079,0,0.021906507085166338
2089,0,0.005832216993376382
2099,0,0.004807880511220108
2109,0,0.004596470694602117
2119,0,0.004317082253700921
2129,0,0.0049213876533099055
2139,0,0.0052198134717649225
2149,0,0.005079135322171524
2159,0,0.005289239438902749
2169,0,0.004965931113998123
2179,0,0.0043083704713952065
2189,0,0.004387566105144736
2199,0,0.004290943978255801
2209,0,0.003954860183972342
2219,0,0.00395491241247975
2229,0,0.004094843301133355
2239,0,0.004305862738668065
2249,0,0.005021232486735916
2259,0,0.0047603198271352065
2269,0,0.0048634389621551866
2279,0,0.0051857993552650306
2289,0,0.006121447377715805
2299,0,0.005936311157225149
2309,0,0.006014641195890069
2319,0,0.006338269637837068
2329,0,0.005555943750464254
2339,0,0.005117942579952739
2349,0,0.0045951278635551485
2359,0,0.004530041955239927
2369,0,0.0023369710996902215
2379,0,0.00028597602585511694
2389,0,0.002079020851628366
2399,0,0.0014126109896939187
2409,0,0.0006975274474459447
2419,0,0.0019050142800038916
2429,0,0.0012070841969109014
2439,0,0.0016381260695340627
2449,0,0.002116696002799734
2459,0,0.0015594640267436732
2469,0,0.0020501617774908443
2479,0,0.001586739989440089
2489,0,0.0025840946119863872
2499,0,0.00156523447156931
2509,0,0.0010832635186769912
2519,0,0.002328340048626698
2529,0,0.0012809808357335806
2539,0,0.002125986330371643
2549,0,0.0013922460362444378
2559,0,0.0004013435824220535
2569,0,0.0026476272950070046
2579,0,0.0011188948649741848
2589,0,0.0002472073438577471
2599,0,0.0005815908700840811
2609,0,0.0021210864253235484
2619,0,0.0017154488915692712
2629,0,0.0014351281371769442
2639,0,0.0014241551355175242
2649,0,0.0010675078520024361
2659,0,0.00021630783697734746
2669,0,4.9669151273246115e-05
2679,0,0.0006913640358885975
2689,0,0.0008546036017066938
2699,0,0.0005206568258059874
2709,0,0.0008726655582979581
2719,0,0.0010035119253553604
2729,0,0.0005208676532039158
2739,0,0.0001749497335428729
2749,0,1.0106936687570567e-06
2759,0,0.00012810511042510297
2769,0,0.0003947316342738372
2779,0,0.0004091833477594675
2789,0,0.0005899980893403489
2799,0,0.00018915198870972372
2809,0,0.0007052348621949811
2819,0,0.0006966244381894082
2829,0,0.001179667863827727
2839,0,0.001604641276973906
2849,0,0.0016849811033113338
2859,0,0.0015082106812778773
2869,0,0.0015449794162424313
2879,0,0.001583342433016166
2889,0,0.0016641735198111296
2899,0,0.002219236802571134
2909,0,0.002060201071573564
2919,0,0.0015485979026534924
2929,0,0.001165036666268049
2939,0,0.002313890165593968
2949,0,0.0022725679270590993
2959,0,0.0022433522078116885
2969,0,0.0018999941170320112
2979,0,0.0014352009274216648
2989,0,0.0017554066029470405
2999,0,0.002173407992951182
3009,0,0.0018422712566781851
3019,0,0.0012961681837554417
3029,0,0.0013003402203468073
3039,0,0.0013715623603635096
3049,0,0.0017832420032912188
3059,0,0.0016727701600983136
3069,0,0.0018176638451691818
3079,0,0.001224037902383901
3089,0,0.001437034086355482
3099,0,0.0023169594489521605
3109,0,0.003284951806094172
3119,0,0.003246047269257868
3129,0,0.0031119484194160885
3139,0,0.032913451577298136
3149,0,0.0032112701174239477
3159,0,0.002269580088390233
3169,0,0.0021165017464137015
3179,0,0.00194099981456608
3189,0,0.001794968555100196
3199,0,0.0016858376906433992
3209,0,0.0019171290801395235
3219,0,0.0016913944314668194
3229,0,0.0010697566590598395
3239,0,0.001050635522600818
3249,0,0.0009301828118277733
3259,0,0.0007418568800478531
3269,0,0.00018804988934673084
3279,0,8.952664533740107e-05
3289,0,8.889180149740383e-07
3299,0,0.00013689879156542073
3309,0,4.468379190458727e-05
3319,0,4.856460603663848e-07
3329,0,0.0005784699692591988
3339,0,0.0013815407683931968
3349,0,0.0020765383333219423
3359,0,0.0025499296149173456
3369,0,0.0022644312420503354
3379,0,0.0025882294173723563
3389,0,0.0023417314346309004
3399,0,0.0029603781679670704
3409,0,0.0030391345774270495
3419,0,0.0032318600863191493
3429,0,0.0033580164161540194
3439,0,0.003487700200685395
3449,0,0.003193023472759904
3459,0,0.0029108902757706834
3469,0,0.0032874239273928407
3479,0,0.002822652574847817
3489,0,0.0033973006248374515
3499,0,0.0033865131029081064
3509,0,0.0036519129991385846
3519,0,0.003263004077044551
3529,0,0.0033991143418494185
3539,0,0.03918878618636423
3549,0,0.044242521504563814
3559,0,0.06537801889459116
3569,0,0.04162822529280891
3579,0,0.023174406931405933
3589,0,0.0030424579377403838
3599,0,0.003450710030598547
3609,0,0.056389218375606454
3619,0,0.04044630671843763
3629,0,0.09592350498657154
3639,0,0.08693502613207371
3649,0,0.11773044414748646
3659,0,0.05991170192171319
3669,0,0.03550417440612297
3679,0,0.020887877014879597
3689,0,0.019416713735583957
3699,0,0.01735369977455231
3709,0,0.03139915922922004
3719,0,0.004211759388406677
3729,0,0.003921254290932097
3739,0,0.0036064042797921414
3749,0,0.0036545619201233115
3759,0,0.003222012038936628
3769,0,0.002986146734451467
3779,0,0.002727681145170191
3789,0,0.001852641198505367
3799,0,0.002517903502268659
3809,0,0.0028749479072169293
3819,0,0.002328003354122421
3829,0,0.0019583292977799482
3839,0,0.0015138336304623135
3849,0,0.001530431295263257
3859,0,0.0012295138486398405
3869,0,0.001871312868860997
3879,0,0.0017010420276865057
3889,0,0.0008490759320123331
3899,0,0.0004741931635080521
3909,0,0.0014853304222850472
3919,0,0.0007536195621959951
3929,0,0.05569533214159622
3939,0,0.13472921764585943
3949,0,0.0012593858942977487
3959,0,0.015908372162787343
3969,0,0.02618653469018889
3979,0,0.03359489436975094
3989,0,0.007342340496332145
3999,0,0.001265455260525461
4009,0,0.00946481086203399
4019,0,0.024249427891018527
4029,0,0.0018840352403066696
4039,0,0.0017202901920266855
4049,0,0.03134356884837347
4059,0,0.07919293869461969
4069,0,0.0022095115663368636
4079,0,0.04248411464207291
4089,0,0.0011845833423356211
4099,0,0.04528074135519666
4109,0,-9.441152110933881e-05
4119,0,0.0006216682174360888
4129,0,0.04719984001377642
4139,0,0.020810263002063734
4149,0,0.11511546997971045
4159,0,0.02744838825484075
4169,0,0.04025611834926951
4179,0,0.026381746118998184
4189,0,0.07265888297302675
4199,0,0.04209059025589729
4209,0,0.12968958055369584
4219,0,0.07482497326964477
4229,0,0.06867327199952922
4239,0,0.00983913284691712
4249,0,0.038115391664277076
4259,0,0.01892929108925756
4269,0,0.0017523350224161183
4279,0,0.0020883351923733917
4289,0,0.0017558179744521785
4299,0,0.001525492714807175
4309,0,0.0018220860573008313
4319,0,0.001405601048706906
4329,0,0.0015642035568186885
4339,0,0.0018712640397072766
4349,0,0.0022411937811050997
4359,0,0.0024255147617640027
4369,0,0.055796071839846584
4379,0,0.013989561425606867
4389,0,0.04061188405569516
4399,0,0.0025028782087228585
4409,0,0.0028575137685762364
4419,0,0.0031124029304912537
4429,0,0.0019510009990091337
4439,0,0.00193827471291802
4449,0,0.0018772489750801258
4459,0,0.002789949851985052
4469,0,0.00143792271788995
4479,0,0.001784993097880494
4489,0,0.0010084047939284968
4499,0,0.001425553677336655
4509,0,0.0022335110843076933
4519,0,0.0022156371745825076
4529,0,0.0022610178278789084
4539,0,0.0025393096177144248
4549,0,0.0021927855035612787
4559,0,0.001769219736700689
4569,0,0.0018043870890181446
4579,0,0.0020376736708107024
4589,0,0.0016116312023803925
4599,0,0.002270648535577957
4609,0,0.001871653018930497
4619,0,0.001854518424023066
4629,0,0.002363777146652757
4639,0,0.0038230616507397563
4649,0,0.002795117354268739
4659,0,0.003301622073055621
4669,0,0.0028615138899485415
4679,0,0.0033901476835454525
4689,0,0.0027119327073507615
4699,0,0.0016603724911860573
4709,0,0.0012361746022915288
4719,0,0.0009128563938946566
4729,0,0.0007235443305475542
4739,0,5.664263407861858e-05
4749,0,0.0002354181761941576
4759,0,1.097760545742954e-06
4769,0,9.727607866438781e-07
4779,0,0.00011335363870151882
4789,0,1.4299792027716585e-06
4799,0,0.00010087054741109158
4809,0,1.1720715588636743e-06
4819,0,0.00026843975157508915
4829,0,-9.99800670031803e-09
4839,0,0.00012987490432592175
4849,0,-9.998024963486785e-09
4859,0,0.0003991284872583156
4869,0,0.0009342185614670817
4879,0,0.0013980360836344241
4889,0,0.001668007679573369
4899,0,0.0006595013545217521
4909,0,0.0020118214632854348
4919,0,0.001612668215972779
4929,0,0.0013354341461946362
4939,0,0.0002913538327683485
4949,0,0.0014492490029382465
4959,0,0.0005999854062362364
4969,0,0.0017093913330641364
4979,0,0.0002941741021894595
4989,0,0.0006342097859863283
4999,0,0.000719088016316316
5009,0,0.0017425058951585637
5019,0,0.0017943591618600485
5029,0,0.0024122748849900733
5039,0,0.0016571514530259734
5049,0,0.002191561957128718
5059,0,0.0012418645423507013
5069,0,0.001345616795130622
5079,0,0.0011864026554556095
5089,0,0.00040773199236898705
5099,0,0.0004509625898619918
5109,0,0.0006145430608380797
5119,0,0.0007360893837876636
5129,0,1.0608851226390215e-06
5139,0,0.0008990095678408361
5149,0,0.0010381926116068696
5159,0,0.0007189503344799952
5169,0,0.0008562336870361342
5179,0,0.0012323762947605843
5189,0,0.0008585272999133697
5199,0,0.0009404940441104515
5209,0,8.524222898909084e-05
5219,0,1.549327659000621e-06
5229,0,0.00031608904539048854
5239,0,0.0003406753418347952
5249,0,0.000816069822214438
5259,0,0.0009716045848327526
5269,0,0.0011092628627372147
5279,0,0.0007769419343974238
5289,0,0.0008509193882229038
5299,0,0.0013366072923549077
5309,0,0.0019056613769657393
5319,0,0.0012276341032477212
5329,0,0.001348704631809805
5339,0,0.0015586055432902923
5349,0,0.00043444641668355377
5359,0,0.0003024895177968223
5369,0,0.0005857547397100649
5379,0,0.0009685437567060196
5389,0,0.0011290957045915762
5399,0,0.001011277092230145
5409,0,0.0011418989357461773
5419,0,0.0013865790745338225
5429,0,0.0011555775833012594
5439,0,0.0009262562369567462
5449,0,0.000853205334239826
5459,0,0.0012494675729795568
5469,0,0.0010236612039141169
5479,0,0.0011696492773506928
5489,0,0.0015335350493868027
5499,0,0.0014556072444656953
5509,0,0.0016433380457887559
5519,0,0.023195907856651987
5529,0,0.02342126319100435
5539,0,0.00967597118258029
5549,0,0.003348824659137606
5559,0,0.002829184455389211
5569,0,0.002752629972599119
5579,0,0.0027757603431182165
5589,0,0.002442730547798866
5599,0,0.0023558895983077366
5609,0,0.0017445939805609267
5619,0,0.0009084235159056431
5629,0,0.0006714719028090288
5639,0,0.0007417822513846595
5649,0,1.0156895018931245e-06
5659,0,0.00044752357944360943
5669,0,0.0004902344660580038
5679,0,0.0005224436188204784
5689,0,0.0006292575163883707
5699,0,0.0008859340354794853
5709,0,0.0008848301160861438
5719,0,0.001257735109207514
5729,0,0.00011443597004517914
5739,0,1.4006994416004837e-06
5749,0,0.00020830065827592836
5759,0,-9.174638160303061e-09
5769,0,-8.696148967590744e-09
5779,0,8.148275693692364e-05
5789,0,1.3364541338045655e-06
5799,0,0.0004297517857217992
5809,0,0.0011866731062238345
5819,0,0.0011886975678445655
5829,0,0.002046776406999906
5839,0,0.001772568387642337
5849,0,0.0015676863340028935
5859,0,0.002529622268482079
5869,0,0.0012371933999540397
5879,0,0.002134035850623772
5889,0,0.0012545342720822195
5899,0,0.001543867394966203
5909,0,0.0013416191961627688
5919,0,0.001074923189340049
5929,0,0.0012493983438709444
5939,0,0.0012653741503676486
5949,0,0.001489980081603448
5959,0,0.0023147850174552453
5969,0,0.0021695899739611058
5979,0,0.0020451058266450217
5989,0,0.020000416354996164
5999,0,0.0023829147321841604
6009,0,0.046916767208462606
6019,0,0.0027563681963307385
6029,0,0.02582866402538081
6039,0,0.004554605214250551
6049,0,0.013976387955172087
6059,0,0.0880444240718864
6069,0,0.04990128446306996
6079,0,0.004932843370767159
6089,0,0.00406852316356715
6099,0,0.003921214164380349
6109,0,0.0033786178996725313
6119,0,0.0030861465402723387
6129,0,0.002759388647989136
6139,0,0.0021196987664888756
6149,0,0.0019163894676976212
6159,0,0.0014835271899935054
6169,0,0.0013599793196427123
6179,0,0.0012157324423052729
6189,0,0.0015827398479615895
6199,0,0.0016871174446045356
6209,0,0.0012196827999466642
6219,0,0.0004004238378180758
6229,0,8.46451465585929e-07
6239,0,-7.435663751387267e-09
6249,0,-9.998016026191436e-09
6259,0,5.8000820218728766e-05
6269,0,6.025384621244356e-07
6279,0,6.164517150097915e-05
6289,0,1.1064070084554345e-06
6299,0,0.00019628554848072355
6309,0,0.0008602296930053654
6319,0,0.0009875542079931243
6329,0,0.0014315404031500223
6339,0,0.0018585300401981475
6349,0,0.0019135421525744989
6359,0,0.0018840714327084673
6369,0,0.001653557953992968
6379,0,0.0020908062361072455
6389,0,0.0016764249874998138
6399,0,0.003015675858884015
6409,0,0.0025766739783679715
6419,0,0.0022760313471074656
6429,0,0.0031529832613237385
6439,0,0.0026946863202886306
6449,0,0.002806275845882056
6459,0,0.00420854151592448
6469,0,0.0030602519157403307
6479,0,0.0032810207145735903
6489,0,0.003598840829267591
6499,0,0.0032250111436041284
6509,0,0.0039596046866920975
6519,0,0.003202809765896042
6529,0,0.003397108623564793
6539,0,0.004152231785242322
6549,0,0.04060925479237687
6559,0,0.053154812898260184
6569,0,0.08259814649420966
6579,0,0.043699980939370386
6589,0,0.004026506984305955
6599,0,0.024103341258116973
6609,0,0.003814462434714394
6619,0,0.00398658992205525
6629,0,0.003716547023325356
6639,0,0.0036937062429192036
6649,0,0.003899168032659439
6659,0,0.003282593294722136
6669,0,0.0026642271708206544
6679,0,0.0020225446724266294
6689,0,0.0022320275404004164
6699,0,0.0021228557270336346
6709,0,0.001135766258140325
6719,0,0.0011596018805334896
6729,0,0.0011314582617885094
6739,0,0.0007516568273943092
6749,0,0.0007830932176220995
6759,0,0.0005048437124847704
6769,0,0.0008080164124918965
6779,0,0.0012056833594250027
6789,0,0.001334368431394728
6799,0,0.0014862232312538026
6809,0,0.0011177092092986562
6819,0,0.0011174759222857267
6829,0,0.0017502157350932634
6839,0,0.002190997451824883
6849,0,0.0017819748416911252
6859,0,0.0017367454192099285
6869,0,0.0017740332708944817
6879,0,0.0015926561442241582
6889,0,0.0016517830967650027
6899,0,0.001546263807203796
6909,0,0.0017042862744914844
6919,0,0.0013630982744005093
6929,0,0.0021331081463539237
6939,0,0.002308630826292568
6949,0,0.002639152394820543
6959,0,0.00282720180737861
6969,0,0.0024004945783338005
6979,0,0.0026801670683200274
6989,0,0.003156841438819391
6999,0,0.0028855142989546168
7009,0,0.0032143649720844936
7019,0,0.0028819199485864977
7029,0,0.0031988321431893896
7039,0,0.003364392468959587
7049,0,0.0034489918320980695
7059,0,0.003495608586885246
7069,0,0.004079462594659966
7079,0,0.0036985315950802122
7089,0,0.0030103608469013166
7099,0,0.0029239230217454337
7109,0,0.0031477298950209343
7119,0,0.0033194656416886126
7129,0,0.0031697715256316372
7139,0,0.003063982902776541
7149,0,0.0031042881408943623
7159,0,0.003012819814283585
7169,0,0.002666886442837191
7179,0,0.002117273067139991
7189,0,0.0024427520996065377
7199,0,0.002085868043729122
7209,0,0.0014259487999906395
7219,0,0.0005044100821744446
7229,0,0.0007208906777562696
7239,0,0.0005880929401870238
7249,0,0.0008780960062949594
7259,0,0.0007046161450334765
7269,0,0.0004682668662995271
7279,0,2.1711487210307467e-06
7289,0,0.00048187994582937765
7299,0,0.0006764231732367398
7309,0,0.0006869795329508266
7319,0,0.0008944269225737433
7329,0,0.0013160702938443958
7339,0,0.0003507148045280295
7349,0,0.0007077607480722725
7359,0,0.0013844292809763736
7369,0,0.0009043155990428597
7379,0,0.03108636796089187
7389,0,0.0014891310614982278
7399,0,0.001177577665183227
7409,0,0.008256502876469118
7419,0,0.002002465380455787
7429,0,0.014084877472691826
7439,0,0.0012823390514896116
7449,0,0.05069630110582796
7459,0,8.860100066460097e-05
7469,0,0.0013406783491619056
7479,0,0.0492139343750963
7489,0,0.006838407417549541
7499,0,0.04510530954260972
7509,0,0.000307827893636925
7519,0,0.00010298084668314278
7529,0,0.0007354194912272405
7539,0,0.0016066341271310236
7549,0,0.0006827311788947243
7559,0,0.0010819415360626694
7569,0,0.0017355595920867106
7579,0,0.0008697639594971163
7589,0,0.0014704115125678818
7599,0,0.002679800990841974
7609,0,0.0009130773352650223
7619,0,0.0006161361848427971
7629,0,0.0005746296493354119
7639,0,0.0010916242314142899
7649,0,0.000988948877574447
7659,0,0.0013086446821914954
7669,0,0.0009579716135215133
7679,0,0.0013951874811466425
7689,0,0.001465170363402768
7699,0,0.0010375213986697496
7709,0,0.0011365460103121006
7719,0,0.00044359159000462167
7729,0,0.00028876202048944144
7739,0,0.0007327079046924867
7749,0,0.0013523885795613255
7759,0,0.0004845268919186352
7769,0,0.0003054585727789161
7779,0,0.00021400682328243104
7789,0,0.0005853969712623641
7799,0,0.00010814622601390544
7809,1,0.0037025911120665556
7819,1,0.010799727068494691
7829,1,0.020930836795773233
7839,1,0.029853103899754097
7849,1,0.07318077766414632
7859,1,0.051899337607330565
7869,1,0.06345180778296533
7879,1,0.07452862443977892
7889,1,0.0855902633658992
7899,1,0.0988362740657775
7909,1,0.11239141134751152
7919,1,0.12646348912366728
7929,1,0.1783465495177009
7939,1,0.15544751777765847
7949,1,0.17163254402787104
7959,1,0.1874774636758661
7969,1,0.23176005946466482
7979,1,0.2753477827516248
7989,1,0.24362535927063433
7999,1,0.26349144621413545
8009,1,0.2839776936981017
8019,1,0.3080862320735217
8029,1,0.3322473754796644
8039,1,0.35787469499300484
8049,1,0.3843264168713067
8059,1,0.41379851806502327
8069,1,0.44442842930542353
8079,1,0.47813242054127164
8089,1,0.5140108380146944
8099,1,0.5534417711853459
8109,1,0.5183604510916474
8119,1,0.6030656760308584
8129,1,0.6641492450107265
8139,1,0.5874180060923163
8149,1,0.7028099158543766
8159,1,0.8450377180259849
8169,1,0.8896839094908091
8179,1,0.8437201285264481
8189,1,0.9691672618408994
8199,1,0.9850679140638681
8209,1,1.1197557154640136
8219,1,1.1874459764013703
8229,1,1.1802367360950512
8239,1,1.4371594124701026
8249,1,1.8710524764654575
8259,1,2.0954280443246573
8269,1,0.5477473431816944
8279,1,2.0078367196531284
8289,1,2.3961037173761994
8299,1,3.0428671368240297
8309,1,4.157979294002465
8319,1,4.428796648161915
8329,1,4.355207035622009
8339,1,4.243814124894791
8349,1,4.1427475993628855
8359,1,4.067474965227634
8369,1,3.9424697151429955
8379,1,3.8501972640254487
8389,1,3.7455326866189775
8399,1,3.651659376214064
8409,1,3.5688075226113085
8419,1,3.4474778205094294
8429,1,3.351299135026104
8439,1,3.2563229616532317
8449,1,3.156403643595933
8459,1,3.0416361142239823
8469,1,2.9263231194039623
8479,1,2.7957691659711723
8489,1,2.685759421055307
8499,1,2.586563992684618
8509,1,2.5083766009946373
8519,1,2.3888794089253107
8529,1,2.2901277447773687
8539,1,2.1709265304127796
8549,1,2.107588018755911
8559,1,1.9906988875651548
8569,1,1.8969032744868153
8579,1,1.7601772028802878
8589,1,1.696361893563183
8599,1,1.5971785670881724
8609,1,1.5002952548593051
8619,1,1.4092740990350585
8629,1,1.2995479805975776
8639,1,1.217769561147945
8649,1,1.1220056840814088
8659,1,1.0184321591545553
8669,1,0.029632996107499865
8679,1,0.8313443257216241
8689,1,0.7326955667461716
8699,1,0.6362130848779204
8709,1,0.4737810791091558
8719,1,0.37767747590093825
8729,1,0.02098930177429753
8739,1,0.19912695329055718
8749,1,0.023047767395474927
8759,1,0.0010952881708638507
8769,1,0.04906679631233868
8779,1,0.09352931807717568
8789,1,0.1074065168850799
8799,1,0.0907058611547838
8809,1,0.09342726482047109
8819,1,0.10494478935633778
8829,1,0.14937720096511797
8839,1,0.13024826361908448
8849,1,0.1398681228221486
8859,1,0.11190080389034762
8869,1,0.11103399345220649
8879,1,0.07551307233921123
8889,1,0.08199160085092144
8899,1,0.0981059990144782
8909,1,0.12534924457897478
8919,1,0.12871660590563538
8929,1,0.15102899854310592
8939,1,0.12391983938653212
8949,1,0.10649016016281737
8959,1,0.06541225891479746
8969,1,0.05113055764917107
8979,1,0.03576927804951968
8989,1,0.11023906696996977
8999,1,0.03871589672992937
9009,1,0.006635475001057878
9019,1,0.17557428922914775
9029,1,0.017715891200283274
9039,1,0.003785777162699955
9049,1,0.08706034030771947
9059,1,0.003376328226878389
9069,1,0.003941174123076485
9079,1,0.004311478245845046
9089,1,0.006558505631748368
9099,1,0.008197888049921609
9109,1,0.0085333529861224
9119,1,-0.04290840584722605
9129,1,0.0086404005940664
9139,1,0.009196953819355258
9149,1,0.01898863263880529
9159,1,0.00826677300194556
9169,1,0.02154928474583301
9179,1,0.055859806175442506
9189,1,0.07450822167901194
9199,1,0.07833772845662268
9209,1,0.1152528671059313
9219,1,0.16755871473978023
9229,1,0.13414335751407264
9239,1,0.21432407030694556
9249,1,0.1288448020052847
9259,1,0.2569635693479293
9269,1,0.14702911605938562
9279,1,0.19442801810046217
9289,1,0.15890643565478785
9299,1,0.21214029569275294
9309,1,0.2518923873594618
9319,1,0.2656498905501467
9329,1,0.295729016964195
9339,1,0.2838448911845633
9349,1,0.3090247889372455
9359,1,0.5021136094077665
9369,1,0.3533744800305517
9379,1,0.2819477719410451
9389,1,0.2748691605721162
9399,1,0.4352093298209845
9409,1,0.4248365300107839
9419,1,0.9007943658281434
9429,1,0.3725615736121332
9439,1,0.6068420905904245
9449,1,0.30285369462446077
9459,1,0.242997281317392
9469,1,0.1787062338997092
9479,1,0.1581957976157679
9489,1,0.16036514421613568
9499,1,0.1533947727893506
9509,1,0.15325214460839776
9519,1,0.21118269227393544
9529,1,0.12632053361189277
9539,1,0.11403005955419582
9549,1,0.11396556328870372
9559,1,0.0952865576997241
9569,1,0.15082502216573257
9579,1,0.1469096017515023
9589,1,0.08485103187047871
9599,1,0.08419584601457564
9609,1,0.008691023148225063
9619,1,0.07031770728780129
9629,1,0.08656098458233202
9639,1,0.05151338752962076
9649,1,0.08706741219356656
9659,1,0.030751250551185272
9669,1,0.0577468745885088
9679,1,0.006967491726862118
9689,1,0.0056589683014847125
9699,1,0.0055448032118805
9709,1,0.0028984670335328033
9719,1,0.026629349692616266
9729,1,0.038444801151175934
9739,1,0.004747358581904948
9749,1,0.0048294854157042155
9759,1,0.005105171366746597
9769,1,0.022548784216471773
9779,1,0.005598489924346528
9789,1,0.005797402788937034
9799,1,0.00427463743367934
9809,1,0.003218545776164927
9819,1,0.0011630039473047304
9829,1,0.000838012964579693
9839,1,0.02385704595002147
9849,1,0.0021491146590487675
9859,1,0.014271344167395617
9869,1,0.0020550531913215986
9879,1,0.003094628988823789
9889,1,0.06814385161067571
9899,1,0.00569089343681678
9909,1,0.10291914658019363
9919,1,0.005428401691049578
9929,1,0.007781627943758085
9939,1,0.07705984974901925
9949,1,0.004926954947535478
9959,1,0.005901262538463903
9969,1,0.007389995409260608
9979,1,0.1487315320193876
9989,1,0.027106863706044593
9999,1,0.1303006637065428
10009,1,0.17334607236423472
10019,1,0.04788524205416256
10029,1,0.10161914399363098
10039,1,0.11277757574281194
10049,1,0.1183095239170946
10059,1,0.32865793832855006
10069,1,0.09283694908563928
10079,1,0.09727666826172748
10089,1,0.3231562619739493
10099,1,0.31436377359393985
10109,1,0.37535753138813077
10119,1,0.42074318596207694
10129,1,0.09663643014322493
10139,1,0.19418219222889266
10149,1,0.15667977911048758
10159,1,0.050232570365230544
10169,1,0.12391899329363887
10179,1,0.0750874572561534
10189,1,0.09630425206496973
10199,1,0.2583217686610786
10209,1,0.2888705683900358
10219,1,0.03691033761191753
10229,1,0.11368222654988724
10239,1,0.06470249405976447
10249,1,0.0324212398770764
10259,1,0.05189669400109831
10269,1,0.05702599694418409
10279,1,0.054931359494212795
10289,1,0.12965564804224372
10299,1,0.15755381760335285
10309,1,0.17127868881173292
10319,1,0.18332009931064885
10329,1,0.2807243935405276
10339,1,0.1827193210589902
10349,1,0.1617263702350336
10359,1,0.18441682986675795
10369,1,0.3110949483003971
10379,1,0.3669403069813352
10389,1,0.2715342662662414
10399,1,0.15464919103476887
10409,1,0.25680347610163334
10419,1,0.18558135069370923
10429,1,0.22323993391357544
10439,1,0.12355400445559434
10449,1,0.007991198231024899
10459,1,0.08065296935916177
10469,1,0.09599159268576274
10479,1,0.11305700628363613
10489,1,0.02253491277330505
10499,1,0.010633501229018127
10509,1,0.023430603650349546
10519,1,0.03139336486226252
10529,1,0.005652210428213511
10539,1,0.009979444643941238
10549,1,0.01984463595424718
10559,1,0.013446522158472751
10569,1,0.033632081864869656
10579,1,0.02344795680380346
10589,1,0.12061732098804501
10599,1,0.20961222284152625
10609,1,0.17357635348552836
10619,1,0.10296740501820362
10629,1,0.16519397241429323
10639,1,0.3648578283663364
10649,1,0.40908009536017687
10659,1,0.2955613829119055
10669,1,0.48397767429940963
10679,1,0.2670847303799498
10689,1,0.637661777253694
10699,1,0.7438139806193482
10709,1,0.7561371178443455
10719,1,0.7343478983295524
10729,1,0.60584138667156
10739,1,0.5142279410696982
10749,1,0.4189375991452461
10759,1,0.6147608295700279
10769,1,0.7824318806930219
10779,1,0.972162016264967
10789,1,0.8047080684055479
10799,1,1.6022591089774911
10809,1,0.3457061284478694
10819,1,0.7835469323182752
10829,1,1.9354919589778294
10839,1,1.5618506115835435
10849,1,1.2109792997480546
10859,1,1.9154566308786913
10869,1,1.5552981217609096
10879,1,1.464848683471077
10889,1,1.2016979363044737
10899,1,1.0988917059917775
10909,1,1.212045169917243
10919,1,0.6716163144821736
10929,1,0.784937587205428
10939,1,0.4787272511396793
10949,1,1.1309049626819658
10959,1,1.1272171909569395
10969,1,0.9885689271308309
10979,1,1.5182813994960194
10989,1,0.5549311428627549
10999,1,1.5869239802644974
11009,1,1.439621912179042
11019,1,1.2295032150053238
11029,1,1.1583347471044725
11039,1,0.9856669665951966
11049,1,1.1947505855804517
11059,1,1.6074486625400088
11069,1,1.0026958380162938
11079,1,1.120805716927403
11089,1,0.4933325385676407
11099,1,0.6866099835913362
11109,1,0.7413131278743648
11119,1,0.6282761488562287
11129,1,0.4329678764959557
11139,1,0.12146661016970778
11149,1,0.38454110558632326
11159,1,0.44263264183352974
11169,1,0.22038374416894696
11179,1,0.3418111010086361
11189,1,0.0833318301900825
11199,1,0.036331365679442396
11209,1,0.08952360116011404
11219,1,0.11061663202388372
11229,1,0.04702872605485431
11239,1,0.029068404868299702
11249,1,0.03934408046158672
11259,1,0.05314544189403758
11269,1,0.04643611226754202
11279,1,0.1617232665903694
11289,1,0.06781454706004708
11299,1,0.06711272390301654
11309,1,0.0745867917597332
11319,1,0.08731147569384345
11329,1,0.09924355163125947
11339,1,0.09278156071397642
11349,1,0.23736937815418913
11359,1,0.05564640275284821
11369,1,0.28051612656247715
11379,1,0.13330228813598055
11389,1,0.3144259901254581
11399,1,0.3933542240425908
11409,1,0.3693848483952421
11419,1,0.13459028368850934
11429,1,0.11638628151283131
11439,1,0.10017147118373004
11449,1,0.09405321673337674
11459,1,0.06466568757010988
11469,1,0.0692363795452311
11479,1,0.05890532376229468
11489,1,0.02313891946591984
11499,1,0.10616342201742379
11509,1,0.009283737183312712
11519,1,0.003032779897792992
11529,1,0.0436532368123802
11539,1,0.10699926435284218
11549,1,0.11246729957189117
11559,1,-0.026711711048389764
11569,1,0.01311379245664035
11579,1,0.023844795428779486
11589,1,0.0008419890949344366
11599,1,0.05389985813070064
11609,1,0.011384082070583168
11619,1,0.07634832176447792
11629,1,0.2819736702240434
11639,1,0.07891943425852288
11649,1,0.07313566880904382
11659,1,0.09172800205964465
11669,1,0.28460155371752316
11679,1,0.13209168632043672
11689,1,0.3783212701067139
11699,1,0.2817880998208072
11709,1,0.3732274774703207
11719,1,0.5604066259402789
11729,1,0.2567759628537599
11739,1,0.3239918849793658
11749,1,0.6322323542831456
11759,1,0.2619396217689485
11769,1,0.7575897143569421
11779,1,0.5411646720091992
11789,1,0.3425634304657441
11799,1,0.23632525824136896
11809,1,0.3489490240768076
11819,1,0.536957770398032
11829,1,0.8276305922443699
11839,1,0.8799748922780289
11849,1,1.133389231481691
11859,1,1.5255175417743125
11869,1,0.776982712581713
11879,1,0.9030609522513322
11889,1,1.5886939089711307
11899,1,1.556406450196231
11909,1,1.4578612793839472
11919,1,1.2137014067236715
11929,1,1.6180926618681246
11939,1,1.3330791479050874
11949,1,1.2163673900100813
11959,1,0.9460385999113647
11969,1,0.8820362496826533
11979,1,1.1800328357305934
11989,1,0.9165314160881839
11999,1,0.631736100858975
12009,1,0.6115365989837928
12019,1,0.33721121961232936
12029,1,0.4805660944611056
12039,1,0.572549085329042
12049,1,0.32905247632688794
12059,1,0.5930638651236799
12069,1,0.053637438887724376
12079,1,0.7813390523683577
12089,1,0.13242991851153713
12099,1,0.2508356795889994
12109,1,0.510649031449718
12119,1,0.0006867904726021168
12129,1,0.003413781734575738
12139,1,0.0726636420969049
12149,1,0.11829145540421315
12159,1,0.1663523639895199
12169,1,0.04645934615300895
12179,1,0.022724530122229802
12189,1,0.024401008080245812
12199,1,0.0017309249322419729
12209,1,0.01299255103609287
12219,1,0.031660119547061216
12229,1,0.03486220078717872
12239,1,0.018967434862680266
12249,1,0.03226060614637988
12259,1,0.05042164839673979
12269,1,0.038391142933290545
12279,1,0.04625418256435554
12289,1,0.04594786798089279
12299,1,0.04801509706321716
12309,1,0.035612799926361904
12319,1,0.02695449287125906
12329,1,0.012824140175779097
12339,1,0.022884839081151964
12349,1,0.01841629464559358
12359,1,0.020467933961369367
12369,1,0.021477488881974927
12379,1,0.032828793672247836
12389,1,0.04706872419457803
12399,1,0.06946221327311791
12409,1,0.09960022298650334
12419,1,0.11166478112397982
12429,1,0.15595806378548666
12439,1,0.1714531758511446
12449,1,0.18575132208922274
12459,1,0.21481829389706197
12469,1,0.22397510431483275
12479,1,0.23810986942385148
12489,1,0.3305047778628858
12499,1,0.24437999929936682
12509,1,0.20223421236186734
12519,1,0.22078430162053386
12529,1,0.3342213702256822
12539,1,0.17977674939481036
12549,1,0.1971287274154544
12559,1,0.15887314558042492
12569,1,0.18925901017415414
12579,1,0.12086663505622836
12589,1,0.09230998591756528
12599,1,0.06605579526903993
12609,1,0.13270246762224475
12619,1,0.1006083066270867
12629,1,0.08560916136919544
12639,1,0.09088252789478679
12649,1,0.06009084761504668
12659,1,0.004596957803787438
12669,1,0.05075601200104912
12679,1,0.05267244301162988
12689,1,0.0543798901252015
12699,1,0.05871116761635198
12709,1,0.054667859132126406
12719,1,0.04433808458190769
12729,1,0.028057864791976195
12739,1,0.02855858055172894
12749,1,0.02542167124292538
12759,1,0.028312622325510184
12769,1,0.012013942392863408
12779,1,0.018760744349514524
12789,1,0.01824186901351299
12799,1,0.018902364611195488
12809,1,0.019858645859764934
12819,1,0.028417701573626664
12829,1,0.06248855437856782
12839,1,0.06320847298434673
12849,1,0.09404472365573568
12859,1,0.10446148219629398
12869,1,0.12638671075472557
12879,1,0.14010279698574657
12889,1,0.12723298233310815
12899,1,0.1537895490684894
12909,1,0.10838324898612384
12919,1,0.09130846497469852
12929,1,0.08026958214252772
12939,1,0.06995367109550682
12949,1,0.06149556327314942
12959,1,0.05451957144091957
12969,1,0.047034249888925406
12979,1,0.03961348080323357
12989,1,0.041088313221159356
12999,1,0.032216467678504335
13009,1,0.042344067300342236
13019,1,0.03947978533613827
13029,1,0.05109422102158234
13039,1,0.05718894105924438
13049,1,0.06738824688827727
13059,1,0.10996508378767006
13069,1,0.06969230494638573
13079,1,0.31326307613610976
13089,1,0.222396946577967
13099,1,0.07281473930003246
13109,1,0.1559296380170878
13119,1,0.30523014387032027
13129,1,0.179561183329277
13139,1,0.17967056601246545
13149,1,0.1344388633853313
13159,1,0.3211567730590128
13169,1,0.4083140732383626
13179,1,0.6485588397458872
13189,1,0.4738730472383821
13199,1,0.35288787414277
13209,1,0.30152445717154797
13219,1,0.9215428008164945
13229,1,0.7579221488294341
13239,1,1.0618361279468855
13249,1,0.8926205784047763
13259,1,1.07858510521269
13269,1,0.8432086059990046
13279,1,0.6133114020974847
13289,1,0.5291172750413846
13299,1,0.8034959270953941
13309,1,1.2105070035351952
13319,1,0.6721721048642132
13329,1,1.1929010659754216
13339,1,0.6135851739196443
13349,1,0.877010865514843
13359,1,0.4660195407007808
13369,1,0.49583931482947025
13379,1,0.6791878292279754
13389,1,0.6824493659069366
13399,1,0.9266943463971797
13409,1,0.996894650912294
13419,1,1.4939252873801279
13429,1,0.5615499045054035
13439,1,0.8045952655550785
13449,1,0.5905927074967514
13459,1,0.5102045309425111
13469,1,0.40383443031809535
13479,1,0.5159976543421525
13489,1,0.6008089373913836
13499,1,-0.02693566368051392
13509,1,0.07424146766606449
13519,1,0.12023058398436243
13529,1,0.20663467410222397
13539,1,0.3636876184509974
13549,1,0.1017723324221469
13559,1,0.2972625639523657
13569,1,0.09040465413696352
13579,1,0.37385297986525545
13589,1,0.087390844057457
13599,1,0.21966165517148561
13609,1,0.2356494806397399
13619,1,0.17337527004380082
13629,1,0.13679357377866347
13639,1,0.4867762001478033
13649,1,0.3089895524971361
13659,1,0.18752827938085875
13669,1,0.17596336702035653
13679,1,0.04294173850771826
13689,1,0.07558986626091896
13699,1,0.0803475847108267
13709,1,0.032742640152861546
13719,1,0.029037587493183192
13729,1,0.06811163039653645
13739,1,0.05446403455386245
13749,1,0.020894066030017533
13759,1,0.02165034728169679
13769,1,0.021147697725656722
13779,1,0.019512718530103612
13789,1,0.019041859806600503
13799,1,0.016309376249573182
13809,1,0.012516902905945981
13819,1,0.011305122334298812
13829,1,0.00931588452021831
13839,1,0.013835536095701761
13849,1,0.012699434980213364
13859,1,0.012719306028094624
13869,1,0.012374964735388738
13879,1,-0.02429222718118046
13889,1,0.010550146699442708
13899,1,0.00896692437028418
13909,1,0.00719183326930245
13919,1,-0.05603621798971803
13929,1,0.07185935507395136
13939,1,0.007485286116524492
13949,1,0.007499791403913991
13959,1,0.009749094060100383
13969,1,0.030640369380646792
13979,1,0.014897675241144603
13989,1,0.01507358190927316
13999,1,0.015807204336202862
14009,1,0.11583717932093474
14019,1,0.01726004867476505
14029,1,0.10902645121317761
14039,1,0.018470887973397687
14049,1,0.11930543151986545
14059,1,0.04184072117699461
14069,1,0.08243645336238647
14079,1,0.17905459906221188
14089,1,0.13541552548753416
14099,1,0.16044316004889497
14109,1,0.08707895393167864
14119,1,0.11019913660371505
14129,1,0.08663002483617122
14139,1,0.06782883536640671
14149,1,0.030802438280200573
14159,1,0.04343810249821528
14169,1,0.012992266437627686
14179,1,0.016428161943828345
14189,1,0.013183404925288189
14199,1,0.056168117857784305
14209,1,0.08174600895770268
14219,1,0.04742562691766866
14229,1,0.05186673946976217
14239,1,0.08060181408983058
14249,1,0.10623086647177993
14259,1,0.024625534391294446
14269,1,0.1339825517777425
14279,1,0.10636168102652999
14289,1,0.13602027906552489
14299,1,0.07463868557594083
14309,1,0.11642878410099877
14319,1,0.14576645289639778
14329,1,0.09283376580699931
14339,1,0.20246547196037246
14349,1,0.10679578385936173
14359,1,0.14134006268198562
14369,1,0.162320560297179
14379,1,0.09940860495217901
14389,1,0.1765030442819956
14399,1,0.18982005179982125
14409,1,0.2339474713238605
14419,1,0.30785615791752763
14429,1,0.3619101641302799
14439,1,0.24617938234038844
14449,1,0.2853424052415841
14459,1,0.24689182061766912
14469,1,0.23989567784491544
14479,1,0.26834336020601174
14489,1,0.24467142289713917
14499,1,0.33604685449495786
14509,1,0.26177128113600184
14519,1,0.2751974468051379
14529,1,0.16823964859089613
14539,1,0.10746069305929695
14549,1,0.07179115518090134
14559,1,0.06874072379670049
14569,1,0.04746134774393157
14579,1,0.004289939953548094
14589,1,0.004333954494811609
14599,1,0.08236856426455808
14609,1,0.0866928942102837
14619,1,0.1073120627768277
14629,1,0.10910766697647933
14639,1,0.11450624464137055
14649,1,0.2004120412408667
14659,1,0.22409880034334773
14669,1,0.2169420887449246
14679,1,0.17461538067690413
14689,1,0.1958640491869757
14699,1,0.30443847942081137
14709,1,0.18608974618604412
14719,1,0.17815661322001347
14729,1,0.13334523603690313
14739,1,0.15847897925300247
14749,1,0.15707902212227853
14759,1,0.08932475488901648
14769,1,0.1303213708736246
14779,1,0.12023458020873917
14789,1,0.12418226929175435
14799,1,0.12006483997520079
14809,1,0.18705458420805454
14819,1,0.1677280098685312
14829,1,0.130050555735092
14839,1,0.1579589898901677
14849,1,0.10218643455074339
14859,1,0.133945085874908
14869,1,0.16449259099395364
14879,1,0.1195200213308632
14889,1,0.059789950987604756
14899,1,0.17188684184598668
14909,1,0.005795789921812788
14919,1,0.03371999221134342
14929,1,0.07111498591066634
14939,1,0.006407869899666241
14949,1,0.10389313300860153
14959,1,0.10323525108205661
14969,1,0.10852853307291055
14979,1,0.004876698189922035
14989,1,0.06525712506822684
14999,1,0.004795744001637181
15009,1,0.0037944520638962254
15019,1,0.04682163383882176
15029,1,0.005295924592966461
15039,1,0.005433128261571218
15049,1,0.0355751399238195
15059,1,0.012327709195014358
15069,1,0.08587597514433049
15079,1,0.004652996844978163
15089,1,0.05131713873447796
15099,1,0.02542615897123568
15109,1,0.002031352219225513
15119,1,0.0003054828547385813
15129,1,5.060421192859543e-06
15139,1,1.605993092679281e-06
15149,1,0.0028372924911047037
15159,1,0.0027342973545054217
15169,1,0.002562465360885391
15179,1,0.002250977102167262
15189,1,0.0020183276923957383
15199,1,0.018271029765381697
15209,1,0.002352128785473584
15219,1,0.002879929537678849
15229,1,0.026590318342528008
15239,1,0.002614722402909442
15249,1,0.0023716933284395614
15259,1,0.0020804465380096504
15269,1,0.015023436250685196
15279,1,0.0023071040030316903
15289,1,0.0019400648267025034
15299,1,0.03029143211844354
15309,1,0.020522412605674722
15319,1,0.015091433818168687
15329,1,0.014459710592664099
15339,1,0.013895990929240765
15349,1,0.0007394152166643742
15359,1,0.0187656053454916
15369,1,0.0008826288241469138
15379,1,0.019556866665040973
15389,1,0.0011607753341565386
15399,1,0.055219654738181745
15409,1,0.03016157786458773
15419,1,0.01716163803315579
15429,1,0.00012069488051064114
15439,1,-5.993793961156513e-09
15449,1,0.027831986479928572
15459,1,0.019889248675212245
15469,1,-1.1224999263426128e-08
15479,1,0.0014936992973434982
15489,1,0.0021510432195936957
15499,1,0.004837728875967728
15509,1,-0.006300159125308069
15519,1,0.06859830861268917
15529,1,0.03323365195993122
15539,1,0.07951350804550711
15549,1,0.09112439972591457
15559,1,0.07406481190797864
15569,1,0.11833234684240246
15579,1,0.07145673273690462
15589,1,0.02420030315287136
15599,1,0.013205465274565287
15609,1,0.0008167237573175612
15619,1,0.00046756585904605963
15629,1,0.0015283891374304193
15639,1,0.0011929995247335068
15649,1,0.00046917672904756014
15659,1,0.00014599679708759972
15669,1,0.0007531834788727099
15679,1,7.194218561046295e-06
15689,1,0.000520724824247587
15699,1,0.002175735320336214
15709,1,0.0021783202946504265
15719,1,0.0018326378854472969
15729,1,0.0016978673919022524
15739,1,0.0019198762300780547
15749,1,0.0016582660334648058
15759,1,0.0009439871016533874
15769,1,0.0010016566137695526
15779,1,0.0004201526149320567
15789,1,0.0013474557681626975
15799,1,0.001445574855021281
15809,1,0.0019086075091752086
15819,1,0.00207935669606768
15829,1,0.0022807295735422506
15839,1,0.0028152254518694075
15849,1,0.003132460331556286
15859,1,0.003052828445208655
15869,1,0.0029020397172513923
15879,1,0.002218881634512837
15889,1,0.0022915715036970763
15899,1,0.0025778757196801005
15909,1,0.00341599528554698
15919,1,0.003065728049415406
15929,1,0.003287093615759351
15939,1,0.00308154353168294
15949,1,0.004552376354399368
15959,1,0.0032888046277707583
15969,1,0.002928036082753993
15979,1,0.003708488752199479
15989,1,0.004998918279084663
15999,1,0.005784082978243066
16009,1,0.019217223628632596
16019,1,0.06633324045498235
16029,1,0.05844542775481476
16039,1,0.08524613510969897
16049,1,0.08345445031284915
16059,1,0.09782122062657012
16069,1,0.08966918305270682
16079,1,0.07542851116012328
16089,1,0.045566709619862034
16099,1,0.0037063591271282448
16109,1,0.000868899280703439
16119,1,0.003132155072684162
16129,1,0.004259769536290314
16139,1,0.004171553101049219
16149,1,0.0037865524391040295
16159,1,0.0037613307744887026
16169,1,0.0035331678166359848
16179,1,0.0036669124727828906
16189,1,0.005562178339180546
16199,1,0.03360098481789153
