T,S,Score
999,0,0.18356261345818248
1009,0,-0.040456367418780115
1019,0,0.01201835650036287
1029,0,0.023048656195046924
1039,0,0.07253573640305777
1049,0,0.17236892467544462
1059,0,0.09555554770451424
1069,0,0.0733999521781401
1079,0,0.08555879503555797
1089,0,0.1404997752467858
1099,0,0.1538142514286397
1109,0,0.05651493870526625
1119,0,0.09760119059606154
1129,0,0.13121514863670558
1139,0,0.04402048134056602
1149,0,0.09228115787979096
1159,0,0.08286762226163291
1169,0,-0.0696138960176711
1179,0,0.023405596699625608
1189,0,-0.0016873280602606178
1199,0,0.0063011006361675115
1209,0,-0.11188257351532938
1219,0,-0.1247516134741059
1229,0,-0.14749964308653218
1239,0,-0.19747054833718358
1249,0,-0.11504317832661026
1259,0,-0.18593899554774174
1269,0,-0.10777734421638407
1279,0,-0.10351170090124051
1289,0,-0.0710207876418334
1299,0,-0.17307647903353762
1309,0,-0.07316427811581927
1319,0,-0.18828787929717494
1329,0,-0.10471385378446285
1339,0,-0.07064014836651822
1349,0,-0.010067993789829477
1359,0,-0.0005758219184918145
1369,0,-0.005468737003606283
1379,0,-0.06410876309502755
1389,0,0.008849024376004877
1399,0,0.016433890450686772
1409,0,0.014946228228164604
1419,0,-0.03315655961766251
1429,0,-0.10447392971646696
1439,0,-0.05354317624474636
1449,0,-0.09532340288573848
1459,0,0.014940706413706484
1469,0,0.01108887954614346
1479,0,0.011318662626450093
1489,0,-0.062083095892244144
1499,0,-0.09314045000552906
1509,0,-0.09805341761997455
1519,0,-0.01091110578206167
1529,0,0.0019755510797128117
1539,0,-0.08268749189092295
1549,0,0.009764367661706186
1559,0,0.013631778737574929
1569,0,-0.07931031941060784
1579,0,0.012878086787148524
1589,0,-0.11074564914232998
1599,0,-0.040256768290675815
1609,0,-0.08857743253702832
1619,0,-0.042660658576637145
1629,0,-0.08790891823556524
1639,0,-0.0008358898030539352
1649,0,0.010230583470088095
1659,0,-0.014325664194481003
1669,0,-0.01744767925516122
1679,0,0.060870683207401854
1689,0,0.04089062549155453
1699,0,-0.1715340344406251
1709,0,-0.11053677587717259
1719,0,0.033460628713683827
1729,0,0.01617522904311608
1739,0,-0.08549687680051121
1749,0,-0.006117145744781838
1759,0,-0.1798826449817328
1769,0,-0.04176566140524407
1779,0,-0.003633803985383044
1789,0,-0.027516913742357874
1799,0,-0.048173391787033726
1809,0,-0.07971143951537119
1819,0,-0.13444931784314051
1829,0,-0.17010856426542786
1839,0,-0.1204358483372765
1849,0,-0.1554304852564764
1859,0,-0.18345138133043215
1869,0,-0.1384401690656235
1879,0,-0.11715610623794825
1889,0,-0.22890604443910212
1899,0,-0.08765120503234103
1909,0,-0.10245486599871145
1919,0,-0.13766893236400923
1929,0,-0.10334614695683264
1939,0,-0.17178100362124493
1949,0,-0.15829754145166552
1959,0,-0.08308517571405594
1969,0,-0.07112960859498407
1979,0,-0.10529662589813438
1989,0,-0.031374655941264984
1999,0,-0.007114029763748642
2009,0,-0.17853736395304487
2019,0,-0.06603340968952442
2029,0,-0.059766994811168206
2039,0,-0.09560017951975563
2049,0,-0.20566867608070405
2059,0,-0.06496001771229287
2069,0,-0.08814222097681756
2079,0,-0.1304013979397709
2089,0,-0.11809176965330936
2099,0,0.09080641099464593
2109,0,0.05590730563836921
2119,0,0.004728693230455772
2129,0,0.016353880412426913
2139,0,-0.1549701487724482
2149,0,-0.22412810166079955
2159,0,-0.060428206129058526
2169,0,0.008873637968127901
2179,0,-0.04543798703696467
2189,0,-0.05102928953495278
2199,0,-0.04078003086853765
2209,0,-0.16820340075143414
2219,0,-0.13389486820277607
2229,0,-0.07922939277877472
2239,0,-0.09650798123494597
2249,0,-0.07441352499114728
2259,0,-0.04670048650540948
2269,0,-0.07691345573587305
2279,0,-0.005677163760553938
2289,0,0.07120324564503722
2299,0,0.005554418925916127
2309,0,0.006818271691513611
2319,0,-0.03413859136424802
2329,0,-0.006900224895288853
2339,0,-0.06721118470137433
2349,0,0.008922502493450724
2359,0,0.01422603594049543
2369,0,-0.1502661322889628
2379,0,-0.15355275245464595
2389,0,-0.10138473033486506
2399,0,-0.17750269260322493
2409,0,-0.0980251492641373
2419,0,-0.14506308653243916
2429,0,-0.0861124000653477
2439,0,-0.12095093158367465
2449,0,-0.11606813132115534
2459,0,-0.08519395324700696
2469,0,-0.06114708362746735
2479,0,-0.06781839445807458
2489,0,-0.10203803169396308
2499,0,-0.1238880881341855
2509,0,-0.1992069931369177
2519,0,-0.10528861106080989
2529,0,-0.1435776878620384
2539,0,-0.046711906324741204
2549,0,-0.03945243556782663
2559,0,-0.10900256245292272
2569,0,0.03475781537536082
2579,0,0.04916560153142657
2589,0,0.1100723111440085
2599,0,0.09575312440986095
2609,0,0.13816412147284107
2619,0,0.06641973119114819
2629,0,0.09050070458225246
2639,0,0.054725186970771
2649,0,0.021898102135891495
2659,0,0.13124809759278167
2669,0,0.22024265186380232
2679,0,0.19331430640796232
2689,0,0.23537344745163802
2699,0,0.10650020011825667
2709,0,0.05856306440886394
2719,0,0.02457425833523097
2729,0,0.21642465134611721
2739,0,0.18230841284042854
2749,0,0.28551200274287547
2759,0,0.3264613190853509
2769,0,0.281074609662458
2779,0,0.31378343608787185
2789,0,0.25262884389018736
2799,0,0.10466291943796202
2809,0,0.2518488504824967
2819,0,0.2642068742036131
2829,0,0.25105735466960555
2839,0,0.08321379709228838
2849,0,0.081477841333217
2859,0,0.10357432356996354
2869,0,0.06714285275605902
2879,0,0.13960339691340184
2889,0,0.1660745319186161
2899,0,0.1681919436606253
2909,0,0.044712108167555775
2919,0,-0.05832077003492642
2929,0,-0.016312102460259492
2939,0,-0.11712538213552648
2949,0,-0.16052698563630108
2959,0,-0.1591013730600418
2969,0,-0.09559072504401944
2979,0,-0.09399094855508128
2989,0,-0.05167316873215033
2999,0,-0.10122691442860932
3009,0,-0.1306850111125909
3019,0,-0.1227062870979444
3029,0,-0.21264418141517916
3039,0,-0.18277878178900608
3049,0,-0.14139238929434528
3059,0,-0.08385586162319059
3069,0,-0.2182393849926515
3079,0,-0.055744845360446105
3089,0,-0.15306059160443675
3099,0,-0.1300003238883033
3109,0,-0.056029759043879745
3119,0,-0.16996937868299133
3129,0,-0.11386082669308539
3139,0,-0.06379696312215899
3149,0,-0.12687744541391943
3159,0,0.02162444650531592
3169,0,-0.04326477945800922
3179,0,0.03125635475527466
3189,0,0.04276283297432015
3199,0,0.07702320363541648
3209,0,-0.027607191158943056
3219,0,0.034121130352926854
3229,0,0.1409022903509679
3239,0,0.17056015958761783
3249,0,0.35552345661188267
3259,0,0.3428659018137824
3269,0,0.2056039328334086
3279,0,0.20031240177026388
3289,0,0.21707684921765436
3299,0,0.14008979230228946
3309,0,0.19449955100088612
3319,0,0.004331797443011931
3329,0,0.047889005797959405
3339,0,0.06566493094615966
3349,0,0.06983948527817796
3359,0,-0.023325665865204237
3369,0,0.07157211277054243
3379,0,0.02744062902806088
3389,0,0.22038529351943814
3399,0,0.2175255640997542
3409,0,0.24661851528707468
3419,0,0.34895278752414693
3429,0,0.08787808305778533
3439,0,0.09442704856630224
3449,0,0.17568704963880144
3459,0,0.06288015898356125
3469,0,0.10045789141429784
3479,0,0.08316945367661188
3489,0,0.04233017225089464
3499,0,-0.09339482061750437
3509,0,0.014617065762687953
3519,0,-0.01881057551642873
3529,0,0.08240823511150086
3539,0,0.04022029437062147
3549,0,0.10063386719833556
3559,0,0.19957309545695134
3569,0,0.14098766022919107
3579,0,0.08130347491443579
3589,0,0.051767819544500604
3599,0,0.14881464723095406
3609,0,-0.09346075652938213
3619,0,0.08284180044249778
3629,0,0.021802558466568756
3639,0,0.10771238523448934
3649,0,0.008712168585014002
3659,0,0.06297385534737909
3669,0,0.09626538371850624
3679,0,0.007520073810899586
3689,0,-0.10342113931046448
3699,0,-0.1340984614958638
3709,0,-0.051202697698701005
3719,0,-0.005082896998963027
3729,0,0.03491106734744032
3739,0,0.01942866560038603
3749,0,0.019755925655800533
3759,0,0.04870209681588289
3769,0,0.07859119433586803
3779,0,0.13727022494737073
3789,0,0.05675049255523035
3799,0,-0.06895354639864693
3809,0,0.060248913473480714
3819,0,-0.08344139160264408
3829,0,0.05321874419201278
3839,0,-0.0365636712992381
3849,0,0.07227715461597384
3859,0,0.13192460951089413
3869,0,0.07344470788909163
3879,0,0.031096363007277583
3889,0,0.08552411076346433
3899,0,0.09619823356376433
3909,0,-0.03021399983141837
3919,0,0.016548377486858667
3929,0,-0.13378404264769928
3939,0,-0.0975852438540642
3949,0,-0.12924048993028103
3959,0,-0.1464058797744867
3969,0,-0.1457493642997315
3979,0,-0.11601106560633545
3989,0,-0.025086337813930326
3999,0,-0.12408445217033148
4009,0,-0.01765387329996293
4019,0,-0.15607508458141695
4029,0,0.03717976631537545
4039,0,0.10835179054933253
4049,0,0.1418920821682571
4059,0,0.13420405931060775
4069,0,-0.03382364807290794
4079,0,-0.019874823028493083
4089,0,-0.13340150083849178
4099,0,-0.13360011119042114
4109,0,-0.07991994511219214
4119,0,-0.10007036260838764
4129,0,-0.10502355193271762
4139,0,-0.07470870745434954
4149,0,-0.15472683297252154
4159,0,-0.17203352139297923
4169,0,-0.0796762052964618
4179,0,-0.11913126477498481
4189,0,-0.08232202681144285
4199,0,-0.09792649546654486
4209,0,-0.010286897251493898
4219,0,-0.029523620040481924
4229,0,-0.015523644806103132
4239,0,0.06502828700869534
4249,0,0.13774059662824778
4259,0,0.12306349707508357
4269,0,0.12808492625953471
4279,0,0.2285648164821925
4289,0,0.15077376149788546
4299,0,0.2434971078050414
4309,0,0.169684330056732
4319,0,0.30103201448378814
4329,0,0.29500806909259913
4339,0,0.2415284056476117
4349,0,0.2285088891569378
4359,0,0.4157295884904493
4369,0,0.3103887008132381
4379,0,0.2904823022835097
4389,0,0.22978713927904815
4399,0,0.2842175788603414
4409,0,0.1841432283434048
4419,0,0.22998441022604155
4429,0,0.1586186070591118
4439,0,0.012076704179212583
4449,0,0.11259639853229964
4459,0,0.14529297491828586
4469,0,0.10917765110618693
4479,0,0.05047366890984628
4489,0,0.1524147785592822
4499,0,0.1133001086628781
4509,0,-0.02909448984926144
4519,0,0.05853917175429646
4529,0,0.14558898904272466
4539,0,0.13882587673478108
4549,0,0.05967374015118965
4559,0,0.053001801643340896
4569,0,0.0020697568610879014
4579,0,0.016969740862411098
4589,0,0.011516248654324324
4599,0,-0.1508650104657865
4609,0,-0.06826622576007635
4619,0,-0.1053361549711822
4629,0,-0.2035081632230985
4639,0,-0.059425363160791944
4649,0,-0.09659006721138963
4659,0,-0.12173182263384441
4669,0,-0.12755325305777354
4679,0,-0.19149117013218486
4689,0,-0.02985719516841101
4699,0,-0.20412201618364256
4709,0,-0.0373231151132456
4719,0,0.007149413262180104
4729,0,-0.057624998316482046
4739,0,-0.10808395607094978
4749,0,-0.09661345947923405
4759,0,-0.2238961476653848
4769,0,-0.150474473443291
4779,0,-0.1765553718308125
4789,0,-0.17415234559182968
4799,0,-0.11964259012048539
4809,0,-0.17764527052183676
4819,0,-0.16199334470354632
4829,0,-0.1269576640724046
4839,0,-0.15183609584203217
4849,0,-0.055378106991626375
4859,0,-0.04651045726536196
4869,0,-0.169604881974724
4879,0,-0.0916321850514652
4889,0,-0.0008371445345503048
4899,0,0.028261103142314004
4909,0,-0.07632262591181505
4919,0,-0.07074188642000634
4929,0,0.021736302283349107
4939,0,-0.10595792277935545
4949,0,0.044272967741678215
4959,0,0.09815735161676331
4969,0,0.1288676505264792
4979,0,0.07807857685302977
4989,0,0.20053613513829693
4999,0,0.11030020188085199
5009,0,0.005325312375657809
5019,0,0.04553704161814898
5029,0,0.07182575692403703
5039,0,0.03599056257085309
5049,0,0.02966368564696753
5059,0,-0.08365707821697077
5069,0,-0.11191809958709342
5079,0,0.013420090413108987
5089,0,-0.13432351021524225
5099,0,-0.12471555465011863
5109,0,-0.08673341760178976
5119,0,-0.0639105984824423
5129,0,-0.14952744314464783
5139,0,-0.04908295776183613
5149,0,-0.1008668754322779
5159,0,-0.07654345063942936
5169,0,-0.10797419111863904
5179,0,-0.043657380182307026
5189,0,0.04476795142688339
5199,0,0.012184124125949714
5209,0,-0.024684371082879464
5219,0,0.061432082661427634
5229,0,0.1672532564096907
5239,0,0.016013997382403056
5249,0,0.0352069289514666
5259,0,0.03519881444490158
5269,0,0.1946847894027175
5279,0,0.13560504848059196
5289,0,0.08642986035603473
5299,0,0.21966146155016597
5309,0,0.15788929709107435
5319,0,0.3042350683748337
5329,0,0.27252292300499326
5339,0,0.28637232118507716
5349,0,0.3384427042556658
5359,0,0.2542635617336767
5369,0,0.3235928363432127
5379,0,0.2762789999167503
5389,0,0.21673601163871736
5399,0,0.08402812505870594
5409,0,0.1067358623151694
5419,0,0.13711403139818357
5429,0,0.023716008717875714
5439,0,0.1926035820767087
5449,0,0.24799692038014343
5459,0,0.2136368272974577
5469,0,0.13505648665851044
5479,0,0.1596132697427094
5489,0,0.09457746824377711
5499,0,0.14597983056445596
5509,0,0.23217556252824834
5519,0,0.17736944933438104
5529,0,0.08655353548335543
5539,0,0.08120333294039506
5549,0,0.10709736834994099
5559,0,0.08510613355432839
5569,0,0.015984857159315524
5579,0,0.06098369174995777
5589,0,0.07641376525398702
5599,0,-0.05568248377935203
5609,0,0.014171717642485704
5619,0,0.05169913630392797
5629,0,0.05648227733068123
5639,0,0.010875810240855155
5649,0,-0.08086214179788953
5659,0,0.05426027770245201
5669,0,0.09630926918858196
5679,0,0.052891196018008846
5689,0,0.1967889089344863
5699,0,0.08349894859594476
5709,0,0.20517229599508924
5719,0,0.06811241875457918
5729,0,0.19480260003247118
5739,0,0.11619473153928983
5749,0,0.06106307382975684
5759,0,0.059503818510434736
5769,0,0.08151415571252685
5779,0,-0.008431993278390726
5789,0,0.1294096644138535
5799,0,0.15991884214110696
5809,0,0.0848926000686725
5819,0,0.12780320242351417
5829,0,0.16927350073447223
5839,0,0.243782976769643
5849,0,0.11200412495364398
5859,0,0.1260118228034557
5869,0,0.046775810580992117
5879,0,-0.06713922847296727
5889,0,0.017694632780818842
5899,0,-0.04762109933287306
5909,0,0.08584928547794446
5919,0,-0.051116864418311425
5929,0,-0.03389135831008161
5939,0,-0.07561957079574433
5949,0,-0.15711029465307047
5959,0,-0.0961424697579506
5969,0,-0.11265644600991598
5979,0,-0.16495805782339235
5989,0,-0.19612820728742575
5999,0,-0.1035825841803415
6009,0,-0.14506242071618214
6019,0,-0.1813174421170447
6029,0,-0.13797602617461358
6039,0,-0.13150187344714792
6049,0,-0.045487393708494084
6059,0,-0.13054022210767824
6069,0,-0.006869385101076375
6079,0,0.09281423022667856
6089,0,0.09450010885883564
6099,0,0.04936662279960191
6109,0,-0.0955465343974905
6119,0,-0.15790289459932672
6129,0,-0.05263562571349989
6139,0,-0.09958862638486188
6149,0,-0.16895091468386092
6159,0,-0.0833650523788223
6169,0,-0.11027821447646957
6179,0,-0.04477225359749426
6189,0,-0.13535222516357537
6199,0,-0.06679851603219811
6209,0,-0.2105414229033239
6219,0,-0.07406577804899117
6229,0,0.014624283126565052
6239,0,-0.10327278726682432
6249,0,-0.10273387020300528
6259,0,-0.1283198794783419
6269,0,-0.1648914280951973
6279,0,-0.1266470667126155
6289,0,-0.13028374691234057
6299,0,-0.07914984472694886
6309,0,-0.011339071726268135
6319,0,0.02182974759083267
6329,0,-0.007483666033946901
6339,0,-0.060136136193403744
6349,0,0.012778230923725209
6359,0,-0.05737135478417732
6369,0,-0.048576338366658756
6379,0,-0.005501878634698754
6389,0,0.09081595390187536
6399,0,0.11481420717597812
6409,0,0.16766999142227101
6419,0,0.11995762698247447
6429,0,0.07846859872295742
6439,0,0.0862494286542741
6449,0,0.06368685817314812
6459,0,0.028776596478687577
6469,0,0.01881425451608243
6479,0,0.06059715242204289
6489,0,-0.12834567838187416
6499,0,0.019069666462711465
6509,0,0.04726108636391935
6519,0,0.10455358971698292
6529,0,0.12373700789948372
6539,0,0.24866089271531577
6549,0,0.3321465573359028
6559,0,0.2574349108139199
6569,0,0.3624208819626348
6579,0,0.38520110936536933
6589,0,0.32246060472468097
6599,0,0.28164765928888913
6609,0,0.23670198939956222
6619,0,0.16494459789877391
6629,0,0.18571824029771078
6639,0,0.17817962602014625
6649,0,0.17801264384616888
6659,0,0.21248135487272768
6669,0,0.24657661735847325
6679,0,0.2307734354169486
6689,0,0.06107246275438982
6699,0,-0.03996246957449179
6709,0,0.09327759912360456
6719,0,0.09029948039186264
6729,0,-0.008574336251562786
6739,0,0.18974712392969273
6749,0,-0.0007546001423374138
6759,0,0.061787657024674814
6769,0,0.0505000953375343
6779,0,0.03859012196526046
6789,0,-0.1166318261500996
6799,0,-0.09082218933283726
6809,0,-0.06024414339300421
6819,0,-0.03430553037224848
6829,0,-0.08502871695952496
6839,0,-0.2143086878193431
6849,0,-0.09235401015925104
6859,0,-0.019333302014948428
6869,0,-0.23052230700034193
6879,0,-0.2220432983004399
6889,0,-0.26244005928384917
6899,0,-0.20487137296666458
6909,0,-0.2062844211653042
6919,0,-0.24474493659975127
6929,0,-0.21129154780411097
6939,0,-0.12889451602045343
6949,0,-0.2414090127747952
6959,0,-0.3593022905615433
6969,0,-0.13840361834881776
6979,0,-0.12931675105534723
6989,0,0.007851021556257165
6999,0,-0.02544026710395242
7009,0,-0.02272687838763654
7019,0,0.045964130014536364
7029,0,0.015574692449032757
7039,0,0.1285851513662002
7049,0,0.2294563860580996
7059,0,0.22546046913621542
7069,0,0.28930185453060187
7079,0,0.3515229136587379
7089,0,0.28570944868947246
7099,0,0.15003174833836574
7109,0,0.2680881512597665
7119,0,0.22828652074801714
7129,0,0.23479166579746502
7139,0,0.2626896038607994
7149,0,0.32068017585440756
7159,0,0.44414066146943865
7169,0,0.5008277011391988
7179,0,0.6492105009042892
7189,0,0.6078176641524474
7199,0,0.427846750827505
7209,0,0.39528120392389143
7219,0,0.3477701894513805
7229,0,0.3799635416067443
7239,0,0.5470255356344175
7249,0,0.35888944330270844
7259,0,0.3301304622627028
7269,0,0.31969053961051286
7279,0,0.37199427083268966
7289,0,0.26556157094443456
7299,0,0.33019299756752407
7309,0,0.22801249913873922
7319,0,0.35496467109001506
7329,0,0.28540457679551345
7339,0,0.07705633836556025
7349,0,0.09492911627893863
7359,0,0.27269193218716214
7369,0,0.13093608442866222
7379,0,0.20147986571600296
7389,0,0.0928672872683971
7399,0,0.0799054107369137
7409,0,0.17231113612505056
7419,0,0.10134660277272989
7429,0,0.025320115330272785
7439,0,-0.04583166365380664
7449,0,-0.09106728338501968
7459,0,-0.012697942444600874
7469,0,0.0652230273837473
7479,0,-0.05885130371578873
7489,0,-0.16960872236626634
7499,0,-0.08421884561055959
7509,0,-0.03263054946717581
7519,0,-0.1637903788138757
7529,0,-0.12633219023803732
7539,0,0.05094472009038831
7549,0,0.037321947223992846
7559,0,-0.003548105325834494
7569,0,0.23993766508668712
7579,0,0.21440137560974515
7589,0,0.25424763740260536
7599,0,0.09608871014729503
7609,0,0.2784438237893254
7619,0,0.17878544875458802
7629,0,0.1266892674213288
7639,0,0.3232763810160527
7649,0,0.1589846174290548
7659,0,0.4397903806442697
7669,0,0.5472024289198213
7679,0,0.6971579498304155
7689,0,0.6034983798566671
7699,0,0.3874969961531115
7709,0,0.46318076390938656
7719,0,0.42656263439270725
7729,0,0.42903833859340934
7739,0,0.3942404069329247
7749,0,0.36496390588000094
7759,0,0.4569977563099462
7769,0,0.5216666622810434
7779,0,0.7705155109308
7789,0,0.6285285018851523
7799,0,0.543716729248086
7809,0,0.555261740247713
7819,0,0.6165164782079299
7829,0,0.37643394959233656
7839,0,0.5147658472205976
7849,0,0.4051568784862556
7859,0,0.5936051996396682
7869,0,0.6096217154266218
7879,0,0.6248952491527718
7889,0,0.5086528703461879
7899,0,0.5928936434645736
7909,0,0.4910694509858293
7919,0,0.4639502358600316
7929,0,0.40777450101708246
7939,0,0.4659350747719234
7949,0,0.43088493903405145
7959,0,0.4273514922536872
7969,0,0.30556012646404573
7979,0,0.3121452060484686
7989,0,0.10939883596914957
7999,0,0.0874618538815558
8009,0,0.11888660482641722
8019,0,0.13635995917059873
8029,0,0.018094825279412752
8039,0,0.1485569202292366
8049,0,0.04421680434821751
8059,0,0.157268809548614
8069,0,0.13732444925329013
8079,0,0.27574143215462
8089,0,0.22252125660630484
8099,0,0.14725900317566343
8109,0,0.24054129078866948
8119,0,0.1858949860861463
8129,0,0.22363358501384434
8139,0,0.2178641813795711
8149,0,0.17812634735748167
8159,0,0.17702388626081078
8169,0,0.3028380834233676
8179,0,0.28220984495392576
8189,0,0.17809186079698103
8199,0,0.17073348895361462
8209,0,0.2359544379902735
8219,0,0.16463351267984505
8229,0,0.20034355831561756
8239,0,-0.03051109713039557
8249,0,-0.004956098337568604
8259,0,-0.002920451890528919
8269,0,0.21691897313105868
8279,0,0.20933799272454545
8289,0,0.11733102667336559
8299,0,0.20956020770193728
8309,0,0.2357950813688804
8319,0,0.2887063523905786
8329,0,0.2916874194463578
8339,0,0.40152219323773564
8349,0,0.426729040962738
8359,0,0.6118837239137042
8369,0,0.5043873796665
8379,0,0.48328177480994416
8389,0,0.542347327497764
8399,0,0.47758168856492833
8409,0,0.3249540727464134
8419,0,0.22673311943075525
8429,0,0.23622631903665292
8439,0,0.16486894004444763
8449,0,0.18851941714769826
8459,0,0.18155757448071297
8469,0,0.37112368820844954
8479,0,0.3829364306767108
8489,0,0.2376312431942733
8499,0,0.16107604508894846
8509,0,0.0690604162711912
8519,0,0.1404065304544574
8529,0,0.0017902636635370728
8539,0,0.1736077103283824
8549,0,0.1564695380775939
8559,0,0.19533860663008518
8569,0,0.17848784267235573
8579,0,0.16812024822073235
8589,0,0.19637660676242097
8599,0,0.15615646706342745
8609,0,0.17377585065543333
8619,0,0.115971327810648
8629,0,0.12050398873644452
8639,0,0.060635474391306565
8649,0,0.06278078475817828
8659,0,0.09327541045077081
8669,0,0.34069982144435407
8679,0,0.17921493879251227
8689,0,0.41254449441187757
8699,0,0.5287615388614784
8709,0,0.4928265613651812
8719,0,0.47133240809968946
8729,0,0.49533629047974237
8739,0,0.53573487785372
8749,0,0.5550489618783042
8759,0,0.4914852490195838
8769,0,0.5033217824078381
8779,0,0.677901116124478
8789,0,0.39817238604446115
8799,0,0.6432480015558906
8809,0,0.5839770215320953
8819,0,0.4855708294057014
8829,0,0.6071277399481322
8839,1,0.731993227746993
8849,1,1.1335018094557914
8859,1,1.9428620740688083
8869,1,2.1373618822011786
8879,1,2.432053095729092
8889,1,2.173039917056947
8899,1,2.1971828467714376
8909,1,2.207835322490525
8919,1,3.002741938527082
8929,1,3.024859331723011
8939,1,3.0509279312418065
8949,1,3.606196190058272
8959,1,3.8742868138506883
8969,1,4.255812945786396
8979,1,3.8470943844269425
8989,1,4.5788691169268425
8999,1,4.581224277305957
9009,1,4.877028950407507
9019,1,5.650562504352933
9029,1,5.376435984827847
9039,1,5.945374619509182
9049,1,5.670589774152436
9059,1,6.505964664941806
9069,1,6.7564087751587945
9079,1,6.856318262338331
9089,1,7.047636288738302
9099,1,7.565031076650115
9109,1,6.951040960311453
9119,1,7.734228340883813
9129,1,8.320106501607983
9139,1,8.935719021355524
9149,1,8.759707077758652
9159,1,8.699634899162124
9169,1,9.406840336465265
9179,1,9.24734660922724
9189,1,9.606242512008542
9199,1,10.087298599583074
9209,1,9.91056323084435
9219,1,10.567267109970077
9229,1,10.468668545064226
9239,1,10.894662678896385
9249,1,11.568478185454612
9259,1,11.835342928710046
9269,1,12.05830828603111
9279,1,12.023635827525393
9289,1,12.188992278366047
9299,1,12.575420320637178
9309,1,12.933876705537898
9319,1,13.164711229210809
9329,1,13.305683656336353
9339,1,13.698641469547898
9349,1,13.76070161312552
9359,1,13.20441582132154
9369,1,12.713043815156212
9379,1,12.715791338302232
9389,1,12.453651083750927
9399,1,11.770088898875231
9409,1,11.855528994861821
9419,1,11.053216781273942
9429,1,10.51444867606547
9439,1,10.214558264087337
9449,1,7.561176012866716
9459,1,8.471723600449682
9469,1,7.486975746934441
9479,1,6.095358805537559
9489,1,5.548372913992555
9499,1,4.403968680810757
9509,1,4.596841044850998
9519,1,4.392482230880052
9529,1,3.292837303754607
9539,1,3.0176659894588598
9549,1,2.3244812349558455
9559,1,2.521607728064087
9569,1,2.955196304845237
9579,1,2.9224060941305345
9589,1,3.069029958099888
9599,1,2.9535167562674935
9609,1,2.5950868333788875
9619,1,2.887920030542902
9629,1,3.021978994846112
9639,1,3.3754914874235316
9649,1,2.824073586744184
9659,1,2.835131070245471
9669,1,4.026258864350638
9679,1,3.9064660260538573
9689,1,4.05911129793377
9699,1,3.970979174281771
9709,1,4.5844066229097855
9719,1,5.1912411863458034
9729,1,5.334149760375864
9739,1,5.266380585042446
9749,1,5.945443015854667
9759,1,6.630464665275793
9769,1,6.384461474011877
9779,1,6.654509623979694
9789,1,6.484776025971047
9799,1,6.81925795906014
9809,1,7.566802967804547
9819,1,7.620984925492696
9829,1,7.650182751905344
9839,1,7.585043789194568
9849,1,7.828518452922076
9859,1,7.834273421577546
9869,1,8.297230276599588
9879,1,8.519177249111953
9889,1,8.258960369026763
9899,1,8.185624697191301
9909,1,7.916327528395444
9919,1,7.796761394295804
9929,1,7.767826838855929
9939,1,7.453093634374967
9949,1,7.73956655699231
9959,1,7.774971007004951
9969,1,7.043829073179374
9979,1,6.848247621060968
9989,1,6.75133745574435
9999,1,6.852189541172152
10009,1,7.22484908549292
10019,1,7.411909289571262
10029,1,7.287698346114123
10039,1,6.830498550555133
10049,1,6.7435003230053505
10059,1,6.65068345649689
10069,1,6.863494079236031
10079,1,6.522248523871859
10089,1,6.4105189164182335
10099,1,6.552921771311443
10109,1,6.301239268664966
10119,1,6.3110935966004424
10129,1,6.110642135895686
10139,1,6.009092700645592
10149,1,6.098088890173666
10159,1,6.074153150422201
10169,1,6.02615703038617
10179,1,5.5911983087500685
10189,1,5.69916815249036
10199,1,5.380554106458234
10209,1,5.176021651593738
10219,1,4.873354914292101
10229,1,5.211367652745846
10239,1,4.605630131147849
10249,1,4.543527953226232
10259,1,4.385636594642797
10269,1,4.427185266241578
10279,1,4.552459935510759
10289,1,4.4532084355738455
10299,1,4.402157749875123
10309,1,4.3887794669746
10319,1,3.7791297939247097
10329,1,3.7408895497226076
10339,1,4.038470684173632
10349,1,3.9325108409564136
10359,1,4.070568973243748
10369,1,4.076568852886471
10379,1,3.853026868167869
10389,1,3.941326143506996
10399,1,4.119100804377554
10409,1,4.225806600208971
10419,1,4.306769644991587
10429,1,4.200130475440286
10439,1,4.169305630408915
10449,1,4.3617075908979865
10459,1,4.073441116128005
10469,1,4.0474956744647805
10479,1,4.093385277389878
10489,1,3.8185936996410472
10499,1,3.6913006625039624
10509,1,3.5235201491096606
10519,1,3.438411257713708
10529,1,3.3326647614528992
10539,1,3.1018949342081865
10549,1,3.368008580301979
10559,1,3.1426861171124263
10569,1,3.042737509498198
10579,1,3.0056730211637226
10589,1,2.8364013855337786
10599,1,2.7514106984238413
10609,1,2.827804510616628
10619,1,2.935033627748168
10629,1,3.3305877578045777
10639,1,3.1779678880461004
10649,1,3.0733213937311943
10659,1,3.2513761483320067
10669,1,3.35088913480585
10679,1,3.6731021874871943
10689,1,3.7040578005654696
10699,1,3.766093133739753
10709,1,4.097430007123029
10719,1,4.048755014486767
10729,1,4.027827838559289
10739,1,4.094623169469275
10749,1,4.1598666098912265
10759,1,4.388466736076319
10769,1,4.2325519822667275
10779,1,4.5077687814753755
10789,1,4.506325102537693
10799,1,4.242209969414963
10809,1,4.642798143489065
10819,1,4.645362282808601
10829,1,4.7197580499254554
10839,1,4.61231797523638
10849,1,4.464607988899314
10859,1,4.426311256125744
10869,1,4.550321145794179
10879,1,4.718252338243179
10889,1,4.277441559553082
10899,1,4.305219958506286
10909,1,4.056715918770875
10919,1,3.77883685356369
10929,1,3.85799544200942
10939,1,3.5408459620779746
10949,1,3.2401659213209495
10959,1,3.72637445576383
10969,1,3.9614866101891666
10979,1,3.9144143525817103
10989,1,4.004418182109974
10999,1,3.9853977213197744
11009,1,3.9198150730038943
11019,1,3.9441211994555125
11029,1,4.139203749844584
11039,1,4.148325219628257
11049,1,4.299859959893239
11059,1,4.297320888526442
11069,1,4.218829550832357
11079,1,4.052720018359568
11089,1,4.19112108258042
11099,1,4.022929738746859
11109,1,4.107145343177212
11119,1,3.8340089040296816
11129,1,3.6203666075589807
11139,1,3.411842319284307
11149,1,3.2765134036526513
11159,1,3.339679716433612
11169,1,3.1942736650133132
11179,1,3.424432844481854
11189,1,2.87569117563945
11199,1,2.972334759512628
11209,1,2.6798587854155307
11219,1,2.7638490282838197
11229,1,2.79146299908456
11239,1,2.756644742131083
11249,1,2.640118444691186
11259,1,2.3705881819583507
11269,1,2.5024735024138893
11279,1,2.3475559068345087
11289,1,2.357200336813756
11299,1,2.357961815087683
11309,1,2.330113658977564
11319,1,2.4414914655913194
11329,1,2.3054777156655684
11339,1,2.0031776952058897
11349,1,2.083627326762824
11359,1,2.3247904015142344
11369,1,2.1323099001792807
11379,1,2.4042064790445883
11389,1,2.52465096782909
11399,1,2.4045886561869403
11409,1,2.839777961056498
11419,1,2.5771812905894107
11429,1,2.883711403049642
11439,1,2.699607877336812
11449,1,2.788220307025288
11459,1,2.1543062611546526
11469,1,2.3772668253937486
11479,1,2.2153409252311693
11489,1,1.663648286660984
11499,1,1.4772881278118608
11509,1,1.4128485706176788
11519,1,1.2479052166079083
11529,1,1.0967327356114005
11539,1,1.3294816396163855
11549,1,1.1173284690924967
11559,1,0.9295357531247876
11569,1,1.1493926442679687
11579,1,1.0793887759788432
11589,1,1.0434363770431174
11599,1,1.0880899000059778
11609,1,1.0718016322077153
11619,1,1.2547146770386313
11629,1,1.153942720417132
11639,1,1.1699894436305782
11649,1,1.0649300791200227
11659,1,1.17135972288885
11669,1,1.1629063078188278
11679,1,1.085506457685288
11689,1,1.1320136997024786
11699,1,0.9913399536679502
11709,1,1.0576930659368302
11719,1,1.1046189423823876
11729,1,0.9893039365258135
11739,1,0.7678182974250013
11749,1,0.8295855149170054
11759,1,0.7433903400899933
11769,1,0.8621738023056165
11779,1,0.8808938660053632
11789,1,0.9340003172747475
11799,1,0.8199068408906667
11809,1,0.9089624490797579
11819,1,0.8270596780963416
11829,1,1.0414436782728909
11839,1,1.158720533661615
11849,1,1.251996055215121
11859,1,1.3961710650819734
11869,1,1.6745457546077258
11879,1,1.9271023915592789
11889,1,1.7126179064969107
11899,1,1.796461188822256
11909,1,1.7046605202941172
11919,1,1.4674748680397838
11929,1,1.4171139178451408
11939,1,1.3060927637771478
11949,1,1.3539711225093631
11959,1,1.253837309830267
11969,1,0.7946874730446648
11979,1,0.9820051857479677
11989,1,0.8765049009821132
11999,1,0.740123822746363
12009,1,0.7614293408341714
12019,1,0.8873233914091762
12029,1,0.7944875010532577
12039,1,0.731519149310066
12049,1,0.7352609943526699
12059,1,0.804321637817805
12069,1,0.7462874075711808
12079,1,0.8106091310301597
12089,1,0.699903989010386
12099,1,0.9763536560887784
12109,1,1.008991271863104
12119,1,0.9600373724104172
12129,1,0.7682674311824735
12139,1,0.8556730486388506
12149,1,0.8155214623558893
12159,1,0.770613512635184
12169,1,0.676457309139278
12179,1,0.6401953337969016
12189,1,0.7312129722769406
12199,1,0.5573658857755616
12209,1,0.6744785418840522
12219,1,0.5657259857122006
12229,1,0.5950985425966434
12239,1,0.7184349119430175
12249,1,0.7153113726226367
12259,1,0.6073295369335768
12269,1,0.4563047310571774
12279,1,0.4022412821211825
12289,1,0.4891912880374526
12299,1,0.4640358414138175
12309,1,0.3694048409232539
12319,1,0.3063967676479763
12329,1,0.518900683072725
12339,1,0.3479622482168905
12349,1,0.6019201421867116
12359,1,0.5703464744010519
12369,1,0.5027689711897768
12379,1,0.8414620625900947
12389,1,0.8804940677620802
12399,1,0.9999190305917697
12409,1,1.1404295856865088
12419,1,0.8036732246225462
12429,1,0.848786647245948
12439,1,1.0275427129655916
12449,1,1.0801757374538683
12459,1,0.6374468228265195
12469,1,0.22993490952346407
12479,1,0.1457477778116455
12489,1,0.19489619611128295
12499,1,0.20354706243610665
12509,1,0.21153102601555562
12519,1,0.1952166570618329
12529,1,0.17535549823299224
12539,1,0.20247253321038405
12549,1,0.14394513359449745
12559,1,0.2824861915032446
12569,1,0.0805593943846028
12579,1,0.22594449372858982
12589,1,0.2238668556742065
12599,1,0.37062956323050944
12609,1,0.45028798769859224
12619,1,0.8399406927077167
12629,1,0.9711072720357502
12639,1,1.1220932291415302
12649,1,1.031676253722783
12659,1,0.9174404302277276
12669,1,0.9871349989450093
12679,1,0.9045624329937528
12689,1,0.9068018523709174
12699,1,0.8279564532042575
12709,1,0.8714760598069502
12719,1,0.9144943618629171
12729,1,1.077261162407077
12739,1,0.9210708358609189
12749,1,0.8842575996969018
12759,1,0.9502958772490355
12769,1,0.9146226920424957
12779,1,0.912864886582163
12789,1,0.9005554804106671
12799,1,0.9225402287588498
12809,1,0.8828345010778598
12819,1,0.9332039241736205
12829,1,0.7804532153098143
12839,1,0.8103980436278387
12849,1,0.8515021034103202
12859,1,0.9506248564945057
12869,1,1.0307658759399692
12879,1,0.9561848411203786
12889,1,0.7912337666066743
12899,1,0.8521266604386122
12909,1,0.6527002358918523
12919,1,0.5146683008043783
12929,1,0.42144916830591483
12939,1,0.41540662190137045
12949,1,0.35473247837374544
12959,1,0.3855093629249008
12969,1,0.42298690356785573
12979,1,0.3129969301950901
12989,1,0.21050718436967986
12999,1,0.2403798132329129
13009,1,0.2563625425274505
13019,1,0.18756874131342105
13029,1,0.2325204464955548
13039,1,0.16191561561108436
13049,1,0.15201475248856822
13059,1,0.1238737961420926
13069,1,0.15399082839001954
13079,1,0.1277722161346515
13089,1,0.06480219473086724
13099,1,0.1388989365757215
13109,1,0.13810466516257425
13119,1,0.29147341079269207
13129,1,0.3571459041291428
13139,1,0.3101224793359362
13149,1,0.42880185273901394
13159,1,0.35201166197954514
13169,1,0.39641520477932213
13179,1,0.29756871203354196
13189,1,0.16857209929077743
13199,1,0.017474375331643976
13209,1,-0.02614167104736209
13219,1,0.017567384858553137
13229,1,0.053756612022860084
13239,1,0.0836824182713628
13249,1,0.03607709652859892
13259,1,0.07006825081786783
13269,1,0.11761459028620624
13279,1,0.09114345119018175
13289,1,0.1319532334379292
13299,1,0.06890883561860928
13309,1,0.04155151557685044
13319,1,0.039712174905996656
13329,1,0.09704551489399993
13339,1,0.059036297668911164
13349,1,0.14880856165109435
13359,1,0.18032347863883047
13369,1,0.10165620006206078
13379,1,0.11041864277898916
13389,1,0.017736379701988936
13399,1,-0.019586371175759454
13409,1,0.13012259275200355
13419,1,0.18000198275811075
13429,1,0.09357515748526457
13439,1,0.057275309112196915
13449,1,-0.01930075896099248
13459,1,-0.023976063574118966
13469,1,0.024736015655306476
13479,1,-0.03814864523608352
13489,1,-0.13002254033281901
13499,1,-0.06481348840150991
13509,1,-0.25260672874064705
13519,1,-0.1142559855742934
13529,1,-0.2241934721854315
13539,1,-0.06313736416361881
13549,1,-0.08773799030177076
13559,1,-0.028072815443380694
13569,1,-0.05192777584762642
13579,1,0.007150968028157512
13589,1,-0.045308866928298386
13599,1,0.18298137665229008
13609,1,0.23544815517248485
13619,1,0.33452459698883097
13629,1,0.2606141078772639
13639,1,0.26034653171498734
13649,1,0.2181507214187507
13659,1,0.26961846670962475
13669,1,0.1526197908128979
13679,1,0.2518671542812284
13689,1,0.3245770801709902
13699,1,0.28794792768938904
13709,1,0.3278256708385764
13719,1,0.2255050697990968
13729,1,0.37257813858733113
13739,1,0.5284090832355369
13749,1,0.8293896544038483
13759,1,1.3241225268650139
13769,1,1.7456132582050037
13779,1,1.6269696598742867
13789,1,1.6289325401406367
13799,1,1.57392578444595
13809,1,1.4434707575777526
13819,1,1.5539539642254336
13829,1,1.6799748797640355
13839,1,1.5407643293897457
13849,1,1.8453961238292313
13859,1,1.8653951808935012
13869,1,1.8700877239985632
13879,1,1.4959527989116042
13889,1,1.7037530342791216
13899,1,1.7547900524624924
13909,1,1.8142192527822192
13919,1,1.59061796340806
13929,1,1.2465439962943445
13939,1,0.9076557370069795
13949,1,0.7260721512726233
13959,1,0.6550960658219788
13969,1,0.702791360431801
13979,1,0.7287870106756785
13989,1,0.5054475673718568
13999,1,0.29182822137209774
14009,1,0.21215548594556777
14019,1,0.2742422011389837
14029,1,0.17658971192579165
14039,1,0.21305582155655123
14049,1,0.19292627331927625
14059,1,0.20171427107754603
14069,1,0.23791607058204955
14079,1,0.20123108256742528
14089,1,0.3273734016879787
14099,1,0.5604636196480438
14109,1,0.7263760760590127
14119,1,0.5967402800540075
14129,1,0.6658070558170431
14139,1,0.6703272401950562
14149,1,0.6689024450717589
14159,1,0.6520156537285908
14169,1,0.5724939441433368
14179,1,0.6136991777370642
14189,1,0.5264540413283202
14199,1,0.47892986446454455
14209,1,0.635821928252529
14219,1,0.5290398390415613
14229,1,0.4728798897908012
14239,1,0.3694599749394819
14249,1,0.3270590761617559
14259,1,0.35229435718775537
14269,1,0.4370580930291591
14279,1,0.37711514562889903
14289,1,0.31081744855688087
14299,1,0.2678454889218569
14309,1,0.21058469797504997
14319,1,0.28288898831821563
14329,1,0.38497708872309366
14339,1,0.42969373717736314
14349,1,0.45697079159960263
14359,1,0.5116433983748138
14369,1,0.4422123921403772
14379,1,0.5975519541208012
14389,1,0.4435689832325639
14399,1,0.33222620799974467
14409,1,0.2929918800557785
14419,1,0.39087213412848676
14429,1,0.32800789913602246
14439,1,0.2463806831391827
14449,1,0.2531817081363261
14459,1,0.23380561867754235
14469,1,0.3698909347245244
14479,1,0.3392825459298888
14489,1,0.31057362257915033
14499,1,0.2555800873802514
14509,1,0.18470819473614597
14519,1,0.22271491575504143
14529,1,0.1202630263584138
14539,1,0.10737401128096913
14549,1,0.2704817883434556
14559,1,0.1734001753664649
14569,1,0.12916644989660075
14579,1,-0.006457172359351504
14589,1,-0.06037026803852641
14599,1,0.22679046180797746
14609,1,0.3702926877605197
14619,1,0.5905122290766663
14629,1,0.6550961656302386
14639,1,0.6833408621914396
14649,1,0.7613969577409297
14659,1,0.9371108550057569
14669,1,0.9906726594703475
14679,1,1.1306261501380703
14689,1,1.100607961232862
14699,1,0.9277864830830711
14709,1,1.078251885049071
14719,1,0.8600845380567741
14729,1,0.8233296714574625
14739,1,0.7970504193201757
14749,1,0.428502012467217
14759,1,0.5146740094316078
14769,1,0.5431647266195508
14779,1,0.47196027146049824
14789,1,0.46931726956201947
14799,1,0.47387603707091863
14809,1,0.3600541252098055
14819,1,0.3759370770484718
14829,1,0.40317746362160356
14839,1,0.37332773877962777
14849,1,0.3360033528809533
14859,1,0.3609970638798776
14869,1,0.4383605007311716
14879,1,0.3421868300863272
14889,1,0.43376653907358886
14899,1,0.4301858322723169
14909,1,0.3774049730202951
14919,1,0.35871612352982496
14929,1,0.18926193694986704
14939,1,0.09248374181083596
14949,1,0.2725546535824426
14959,1,0.1319808436740305
14969,1,0.32288319391618825
14979,1,0.34529173273573077
14989,1,0.5109665709134265
14999,1,0.4640709983242731
15009,1,0.39942789437231907
15019,1,0.41135404642035744
15029,1,0.199777637219255
15039,1,0.275891974047328
15049,1,0.14004894530881296
15059,1,0.19431523352826752
15069,1,0.2154598616460488
15079,1,0.16742064071800533
15089,1,0.04057732375259393
15099,1,0.01727617433396822
15109,1,0.003464839215998494
15119,1,0.005434628535911257
15129,1,0.037026860444590026
15139,1,0.020654245746620448
15149,1,0.09514202857873688
15159,1,0.23025398007762599
15169,1,0.28578705021969997
15179,1,0.1984228422359786
15189,1,0.24015957837866986
15199,1,0.30978611155888747
15209,1,0.36485808912919593
15219,1,0.23793202210009734
15229,1,0.2463112339586655
15239,1,0.1778128073854548
15249,1,0.09950525478033212
15259,1,0.16402376610116653
15269,1,0.2315873997356095
15279,1,0.3095628596101625
15289,1,0.22013734232621873
15299,1,0.19370175117447352
15309,1,0.1522213903022991
15319,1,0.06412785542117294
15329,1,0.11748890824069314
15339,1,0.25976105804993954
15349,1,0.18927573091220073
15359,1,0.09860682776565577
15369,1,0.03261657561252673
15379,1,0.01794492660440783
15389,1,0.09514335049143086
15399,1,0.006250298473683857
15409,1,-0.014045366412265392
15419,1,-0.02236166928873684
15429,1,-0.08433715856781909
15439,1,-0.10324163122173058
15449,1,-0.06181701472449397
15459,1,-0.1106592092907257
15469,1,0.01962510254464578
15479,1,0.2578007955801396
15489,1,0.432583484083663
15499,1,0.6442169909138502
15509,1,0.7338652239732483
15519,1,0.8489482602686997
15529,1,0.9704887445359188
15539,1,0.8653385180980292
15549,1,1.240001891489833
15559,1,1.3920723712666518
15569,1,1.3311994862241785
15579,1,1.3746649350011562
15589,1,1.469493607951244
15599,1,1.6843225498114966
15609,1,1.9653273421895143
15619,1,1.6631059380207338
15629,1,2.1963896404960774
15639,1,2.1979443917358013
15649,1,2.5767775262091055
15659,1,2.5546989199663974
15669,1,2.689501005691935
15679,1,2.982218263863074
15689,1,3.305106505302134
15699,1,3.5278016673364254
15709,1,3.5889112730205337
15719,1,3.9233351425470513
15729,1,4.517905633094953
15739,1,4.667258202212735
15749,1,4.99662015083294
15759,1,4.893438055289879
15769,1,4.899631927934564
15779,1,5.050737585950431
15789,1,4.853222615860135
15799,1,5.23907303364592
15809,1,5.305005954354851
15819,1,5.105119893947979
15829,1,5.191793568966259
15839,1,5.357151396198436
15849,1,5.255931735268591
15859,1,5.185055493286134
15869,1,5.525046206044635
15879,1,5.455169907639089
15889,1,5.5855954131595364
15899,1,5.786071779775112
15909,1,5.848744757045144
15919,1,5.705611050880257
15929,1,5.5908542345477885
15939,1,5.708548711657794
15949,1,5.910857310395035
15959,1,5.582058683062486
15969,1,5.546066520405436
15979,1,4.68750534768634
15989,1,4.190824586493883
15999,1,3.854595951530758
16009,1,3.4977734117467807
16019,1,3.1408450009716447
16029,1,3.0840485454927573
16039,1,2.6004848561813803
16049,1,1.9766685304116176
16059,1,1.6129049356169518
16069,1,1.2466139906021898
16079,1,0.8154941015996638
16089,1,0.532093706231176
16099,1,0.37919045470434165
16109,1,0.3484954340087735
16119,1,0.2131399786776489
16129,1,0.1641258137827366
16139,1,0.38785696746879395
16149,1,0.5646692066186374
16159,1,0.7523041599313188
16169,1,0.9675052793357221
16179,1,1.1112012489299745
16189,1,1.2350633257708563
16199,1,1.5495285145233395
