T,S,Score
999,0,0.6191667914390564
1009,0,0.4149755835533142
1019,0,0.5247180461883545
1029,0,0.5476489067077637
1039,0,1.025836706161499
1049,0,0.46587586402893066
1059,0,0.5725024342536926
1069,0,0.7327067255973816
1079,0,0.6429868340492249
1089,0,0.40693575143814087
1099,0,0.22893166542053223
1109,0,0.3743201494216919
1119,0,0.3647993803024292
1129,0,0.4659150242805481
1139,0,0.5292573571205139
1149,0,0.5985994935035706
1159,0,0.535008430480957
1169,0,0.3461640477180481
1179,0,0.45319753885269165
1189,0,0.4170597791671753
1199,0,0.702144205570221
1209,0,0.556086003780365
1219,0,0.8289334774017334
1229,0,0.43383681774139404
1239,0,0.5820915699005127
1249,0,0.6581467986106873
1259,0,0.6034220457077026
1269,0,0.4591912627220154
1279,0,0.19763797521591187
1289,0,0.9527857899665833
1299,0,0.6394316554069519
1309,0,0.6299570798873901
1319,0,0.548492431640625
1329,0,0.4406295418739319
1339,0,0.5501238703727722
1349,0,0.05851101875305176
1359,0,0.3985735774040222
1369,0,0.45901817083358765
1379,0,0.6565417051315308
1389,0,0.4151807427406311
1399,0,0.857426643371582
1409,0,0.528339684009552
1419,0,0.5952109098434448
1429,0,0.7061411142349243
1439,0,0.5846174955368042
1449,0,0.700877845287323
1459,0,0.7343608736991882
1469,0,0.41280388832092285
1479,0,0.4721340537071228
1489,0,0.7382850050926208
1499,0,0.6423368453979492
1509,0,0.6635633707046509
1519,0,0.861841082572937
1529,0,0.4273234009742737
1539,0,0.7434143424034119
1549,0,0.47404056787490845
1559,0,0.7842558026313782
1569,0,0.653730034828186
1579,0,0.26661860942840576
1589,0,0.5857715010643005
1599,0,0.5637146830558777
1609,0,0.5779394507408142
1619,0,0.7797476649284363
1629,0,0.6089460253715515
1639,0,0.9863930344581604
1649,0,0.6318907141685486
1659,0,0.6618427038192749
1669,0,0.383949875831604
1679,0,0.5178768038749695
1689,0,0.532368540763855
1699,0,0.44799792766571045
1709,0,0.38545429706573486
1719,0,0.43569546937942505
1729,0,0.40656447410583496
1739,0,0.6487458348274231
1749,0,0.6039576530456543
1759,0,0.5471997261047363
1769,0,0.5179870128631592
1779,0,0.6679595708847046
1789,0,0.48451757431030273
1799,0,0.5487611889839172
1809,0,0.8661765456199646
1819,0,0.6999241709709167
1829,0,0.24251586198806763
1839,0,0.6080477237701416
1849,0,0.3697108030319214
1859,0,0.4406229853630066
1869,0,0.7273287773132324
1879,0,0.7075749039649963
1889,0,0.5729764103889465
1899,0,0.5045862197875977
1909,0,0.7038917541503906
1919,0,0.3275691270828247
1929,0,0.39548975229263306
1939,0,0.6100993752479553
1949,0,0.5298775434494019
1959,0,0.7861905097961426
1969,0,0.603538990020752
1979,0,0.8270070552825928
1989,0,0.922386646270752
1999,0,0.5063380002975464
2009,0,0.6581512689590454
2019,0,0.8855069875717163
2029,0,0.929078221321106
2039,0,0.7919813990592957
2049,0,0.9136680960655212
2059,0,0.5468281507492065
2069,0,0.6307748556137085
2079,0,0.48552513122558594
2089,0,0.41475367546081543
2099,0,0.41023653745651245
2109,0,0.21213185787200928
2119,0,0.4835192561149597
2129,0,0.34051334857940674
2139,0,0.7965076565742493
2149,0,0.5742319226264954
2159,0,0.36813801527023315
2169,0,0.5088915228843689
2179,0,0.5508583784103394
2189,0,0.3686904311180115
2199,0,0.7548768520355225
2209,0,0.36809152364730835
2219,0,0.203924298286438
2229,0,0.4225764274597168
2239,0,0.4054754972457886
2249,0,0.46917539834976196
2259,0,0.700752317905426
2269,0,0.35528039932250977
2279,0,0.5263575315475464
2289,0,0.6095909476280212
2299,0,0.4803483486175537
2309,0,0.7180280685424805
2319,0,0.535879909992218
2329,0,0.5150445699691772
2339,0,0.5715677738189697
2349,0,0.6614433526992798
2359,0,0.3345010280609131
2369,0,0.4806363582611084
2379,0,0.470784068107605
2389,0,0.3390336036682129
2399,0,0.78179532289505
2409,0,0.5670710206031799
2419,0,0.4909670352935791
2429,0,0.5430395007133484
2439,0,0.5063676834106445
2449,0,0.7971442937850952
2459,0,0.7334524393081665
2469,0,1.0863149762153625
2479,0,0.8967977166175842
2489,0,0.6963255405426025
2499,0,0.7080160975456238
2509,0,0.7187568545341492
2519,0,0.5358849763870239
2529,0,0.6140820980072021
2539,0,0.763957142829895
2549,0,0.8584344387054443
2559,0,0.7295464277267456
2569,0,0.541185200214386
2579,0,0.43943703174591064
2589,0,0.49616479873657227
2599,0,0.3853546380996704
2609,0,0.34828275442123413
2619,0,0.4134529232978821
2629,0,0.1524122953414917
2639,0,0.32488757371902466
2649,0,0.28142106533050537
2659,0,0.3568938374519348
2669,0,0.1722584366798401
2679,0,0.3920065760612488
2689,0,0.106842041015625
2699,0,0.3197229504585266
2709,0,0.5959105491638184
2719,0,0.2647194266319275
2729,0,0.1776098608970642
2739,0,0.5359513163566589
2749,0,0.22774332761764526
2759,0,0.0879359245300293
2769,0,0.2277064323425293
2779,0,0.25957804918289185
2789,0,0.33345943689346313
2799,0,0.22451496124267578
2809,0,0.44208407402038574
2819,0,0.36028099060058594
2829,0,0.4286147356033325
2839,0,0.3772518038749695
2849,0,0.5335637927055359
2859,0,0.2631438970565796
2869,0,0.3618103861808777
2879,0,0.20154684782028198
2889,0,0.6381803154945374
2899,0,0.6255555152893066
2909,0,0.5494047403335571
2919,0,0.5004766583442688
2929,0,0.713407039642334
2939,0,0.44511711597442627
2949,0,0.41078048944473267
2959,0,0.5238755941390991
2969,0,0.2892218828201294
2979,0,0.6082885265350342
2989,0,0.4597046375274658
2999,0,0.4925149083137512
3009,0,0.5081380009651184
3019,0,0.19242659211158752
3029,0,0.6731244325637817
3039,0,0.24809783697128296
3049,0,0.4468820095062256
3059,0,0.18797874450683594
3069,0,0.3248364329338074
3079,0,0.2766141891479492
3089,0,0.40488773584365845
3099,0,0.19482043385505676
3109,0,0.8021976947784424
3119,0,0.31389331817626953
3129,0,0.4153856039047241
3139,0,0.43438720703125
3149,0,0.4243354797363281
3159,0,0.6029040217399597
3169,0,0.5771738290786743
3179,0,0.4227098226547241
3189,0,0.7089290618896484
3199,0,0.5238658785820007
3209,0,0.4304817318916321
3219,0,0.241682767868042
3229,0,0.21955087780952454
3239,0,0.03252735733985901
3249,0,0.21972954273223877
3259,0,0.4902770519256592
3269,0,0.432622492313385
3279,0,0.4774653911590576
3289,0,0.3984900712966919
3299,0,0.21308016777038574
3309,0,0.5843140482902527
3319,0,0.24622154235839844
3329,0,0.2290482521057129
3339,0,0.3352782130241394
3349,0,0.36217379570007324
3359,0,0.1378229856491089
3369,0,0.5093218088150024
3379,0,0.3655022382736206
3389,0,0.4290613532066345
3399,0,0.30607616901397705
3409,0,0.2998565435409546
3419,0,0.5496312379837036
3429,0,0.9981377720832825
3439,0,0.4041872024536133
3449,0,0.4615013003349304
3459,0,0.36786949634552
3469,0,0.6703106164932251
3479,0,0.5323237180709839
3489,0,0.6121909022331238
3499,0,0.7710319757461548
3509,0,0.3408913016319275
3519,0,0.4277281165122986
3529,0,0.2730253338813782
3539,0,0.4577169418334961
3549,0,0.335426390171051
3559,0,0.32933562994003296
3569,0,0.49460965394973755
3579,0,0.38551968336105347
3589,0,0.6678783893585205
3599,0,0.4061884880065918
3609,0,0.44837653636932373
3619,0,0.47091251611709595
3629,0,0.673730194568634
3639,0,0.36616718769073486
3649,0,0.6558182835578918
3659,0,0.4620022773742676
3669,0,0.104461669921875
3679,0,0.46154582500457764
3689,0,0.40201300382614136
3699,0,0.7825168967247009
3709,0,0.5277804732322693
3719,0,0.16810697317123413
3729,0,0.48208487033843994
3739,0,0.3498522639274597
3749,0,0.35002338886260986
3759,0,0.11455172300338745
3769,0,0.47751152515411377
3779,0,0.48599153757095337
3789,0,0.3581092953681946
3799,0,0.5064801573753357
3809,0,0.37106871604919434
3819,0,0.12542903423309326
3829,0,0.3941309452056885
3839,0,0.3435205817222595
3849,0,0.4586614966392517
3859,0,0.44603753089904785
3869,0,0.45823562145233154
3879,0,0.6316479444503784
3889,0,0.7274830341339111
3899,0,0.8133726716041565
3909,0,0.3446515202522278
3919,0,0.9632282257080078
3929,0,0.7753260731697083
3939,0,0.7544664144515991
3949,0,0.783571720123291
3959,0,0.5475664734840393
3969,0,0.5735181570053101
3979,0,0.5538161993026733
3989,0,0.633532702922821
3999,0,0.4984567165374756
4009,0,0.3261638283729553
4019,0,0.6955314874649048
4029,0,0.7818431258201599
4039,0,0.6155837178230286
4049,0,0.7093694806098938
4059,0,0.46083539724349976
4069,0,1.1312200427055359
4079,0,0.7432774901390076
4089,0,0.44244885444641113
4099,0,0.43297427892684937
4109,0,0.7191128730773926
4119,0,0.5716431736946106
4129,0,0.6255660057067871
4139,0,0.5999562740325928
4149,0,0.5824908018112183
4159,0,0.47770094871520996
4169,0,0.6630649566650391
4179,0,0.7361632585525513
4189,0,0.6847227215766907
4199,0,0.5633831024169922
4209,0,0.8737752437591553
4219,0,0.6130288243293762
4229,0,0.07502099871635437
4239,0,0.41904300451278687
4249,0,0.4314200282096863
4259,0,0.5644486546516418
4269,0,0.5658255219459534
4279,0,0.10923659801483154
4289,0,0.4816058278083801
4299,0,0.33137452602386475
4309,0,0.5356547236442566
4319,0,0.4253026843070984
4329,0,0.384177029132843
4339,0,0.3818795680999756
4349,0,0.4146885871887207
4359,0,0.6309441328048706
4369,0,0.4565868377685547
4379,0,0.50846266746521
4389,0,0.5330955982208252
4399,0,0.41215455532073975
4409,0,0.421281099319458
4419,0,0.8190851211547852
4429,0,0.6659222841262817
4439,0,0.40675610303878784
4449,0,0.6597608923912048
4459,0,0.4027479290962219
4469,0,0.3394906520843506
4479,0,0.5601025819778442
4489,0,0.3826914429664612
4499,0,0.3874492645263672
4509,0,0.33341139554977417
4519,0,0.49708741903305054
4529,0,0.48029494285583496
4539,0,0.3949691653251648
4549,0,0.29139018058776855
4559,0,0.19537603855133057
4569,0,0.3624638319015503
4579,0,0.40700584650039673
4589,0,0.4377123713493347
4599,0,0.4247679114341736
4609,0,0.5825420022010803
4619,0,0.6262350678443909
4629,0,0.6329233646392822
4639,0,0.4346497058868408
4649,0,0.6068040728569031
4659,0,0.281780481338501
4669,0,0.49417006969451904
4679,0,0.49126768112182617
4689,0,0.3539086580276489
4699,0,0.43713265657424927
4709,0,0.30564308166503906
4719,0,0.3380090594291687
4729,0,0.32366371154785156
4739,0,0.43648242950439453
4749,0,0.6676115393638611
4759,0,0.39371711015701294
4769,0,0.7514593005180359
4779,0,0.3251156210899353
4789,0,0.36185216903686523
4799,0,0.49142026901245117
4809,0,0.5979909300804138
4819,0,0.6959499716758728
4829,0,0.5389039516448975
4839,0,0.3047531843185425
4849,0,0.5409814119338989
4859,0,0.4505271315574646
4869,0,0.5111826062202454
4879,0,0.3073325753211975
4889,0,0.5108372569084167
4899,0,0.5577070116996765
4909,0,0.4879324436187744
4919,0,1.123514175415039
4929,0,0.8495879173278809
4939,0,0.49764662981033325
4949,0,0.28832191228866577
4959,0,0.5007093548774719
4969,0,0.4725276231765747
4979,0,0.6069965958595276
4989,0,0.461958646774292
4999,0,0.2740873098373413
5009,0,0.460767924785614
5019,0,0.59066241979599
5029,0,0.4200023412704468
5039,0,0.36903393268585205
5049,0,0.4916958808898926
5059,0,0.5442913770675659
5069,0,0.6793547868728638
5079,0,0.308973491191864
5089,0,0.18645739555358887
5099,0,0.3863828182220459
5109,0,0.4108307957649231
5119,0,0.3853899836540222
5129,0,0.44226545095443726
5139,0,0.45166850090026855
5149,0,0.45090121030807495
5159,0,0.2864916920661926
5169,0,0.4050631523132324
5179,0,0.41970914602279663
5189,0,0.10841935873031616
5199,0,0.3934444785118103
5209,0,0.525212824344635
5219,0,0.40920376777648926
5229,0,0.35816818475723267
5239,0,0.4644109606742859
5249,0,0.48845046758651733
5259,0,0.3193078637123108
5269,0,0.3757067918777466
5279,0,0.4391445517539978
5289,0,0.21197187900543213
5299,0,0.40902990102767944
5309,0,0.7444956302642822
5319,0,0.6643753051757812
5329,0,0.342681348323822
5339,0,0.3370887041091919
5349,0,0.20359984040260315
5359,0,0.5302872061729431
5369,0,0.4842013716697693
5379,0,0.6474593877792358
5389,0,0.31023097038269043
5399,0,0.4723780155181885
5409,0,0.45816874504089355
5419,0,0.4091973900794983
5429,0,0.5516766905784607
5439,0,0.4331458806991577
5449,0,0.4831011891365051
5459,0,0.4769209027290344
5469,0,0.22968947887420654
5479,0,0.601975679397583
5489,0,0.5209872126579285
5499,0,0.5036081671714783
5509,0,0.5527597665786743
5519,0,0.4522837996482849
5529,0,0.29144012928009033
5539,0,0.5014324188232422
5549,0,0.49926871061325073
5559,0,0.6937427520751953
5569,0,0.4735795855522156
5579,0,0.32612085342407227
5589,0,0.6714988946914673
5599,0,0.4601101279258728
5609,0,0.2757366895675659
5619,0,0.1676011085510254
5629,0,0.45482444763183594
5639,0,0.27765798568725586
5649,0,0.32403433322906494
5659,0,0.36017197370529175
5669,0,0.20096051692962646
5679,0,0.3057127594947815
5689,0,0.2685467004776001
5699,0,0.3531593084335327
5709,0,0.2561323046684265
5719,0,0.21668529510498047
5729,0,0.5320528149604797
5739,0,0.49897247552871704
5749,0,0.5038761496543884
5759,0,0.4298276901245117
5769,0,0.5591807961463928
5779,0,0.5573397278785706
5789,0,0.4920928478240967
5799,0,0.5862274765968323
5809,0,0.36668360233306885
5819,0,0.4947989583015442
5829,0,0.5565940141677856
5839,0,0.6720728874206543
5849,0,0.6126716732978821
5859,0,0.5243112444877625
5869,0,0.7443586587905884
5879,0,0.6017933487892151
5889,0,0.44848257303237915
5899,0,0.3213789463043213
5909,0,0.4443320631980896
5919,0,0.7628363370895386
5929,0,0.6618523597717285
5939,0,0.49371254444122314
5949,0,0.6502163410186768
5959,0,0.34409981966018677
5969,0,0.7411051988601685
5979,0,0.39768028259277344
5989,0,0.768962025642395
5999,0,0.43095749616622925
6009,0,0.73701411485672
6019,0,0.568714439868927
6029,0,0.9963606595993042
6039,0,0.7274490594863892
6049,0,0.7628257870674133
6059,0,0.9899255037307739
6069,0,1.0366998314857483
6079,0,0.9556072950363159
6089,0,0.878488302230835
6099,0,0.670897364616394
6109,0,0.7576109766960144
6119,0,0.6230243444442749
6129,0,0.5413791537284851
6139,0,0.6550936698913574
6149,0,0.5042844414710999
6159,0,0.5041637420654297
6169,0,0.5722150206565857
6179,0,0.3025076985359192
6189,0,0.34411776065826416
6199,0,0.5212180614471436
6209,0,0.4766073226928711
6219,0,0.6323946118354797
6229,0,0.24283581972122192
6239,0,0.28754115104675293
6249,0,0.26579946279525757
6259,0,0.5745798349380493
6269,0,0.2248542308807373
6279,0,0.15403243899345398
6289,0,0.6046476364135742
6299,0,0.35866326093673706
6309,0,0.4558864235877991
6319,0,0.37775230407714844
6329,0,0.59954833984375
6339,0,0.2306545376777649
6349,0,0.4515892267227173
6359,0,0.128419429063797
6369,0,0.3672217130661011
6379,0,0.3812108039855957
6389,0,0.6159703135490417
6399,0,0.7241401672363281
6409,0,0.43903130292892456
6419,0,0.46632981300354004
6429,0,0.2655702233314514
6439,0,0.7216866612434387
6449,0,0.3696027994155884
6459,0,0.6323190331459045
6469,0,0.18078011274337769
6479,0,0.46277135610580444
6489,0,0.6212953925132751
6499,0,0.38271182775497437
6509,0,0.5045034885406494
6519,0,0.48770034313201904
6529,0,0.44914424419403076
6539,0,0.33499622344970703
6549,0,0.7387372851371765
6559,0,0.6284006237983704
6569,0,0.6660429239273071
6579,0,0.5614949464797974
6589,0,0.5348108410835266
6599,0,0.46013307571411133
6609,0,0.6822454333305359
6619,0,0.4160715341567993
6629,0,0.8343138694763184
6639,0,0.5868021845817566
6649,0,0.37301820516586304
6659,0,0.5313235521316528
6669,0,0.5230203866958618
6679,0,0.4134529232978821
6689,0,0.6876158714294434
6699,0,0.6419509053230286
6709,0,0.7753586769104004
6719,0,0.5528825521469116
6729,0,0.5205368399620056
6739,0,0.5129498243331909
6749,0,0.45465904474258423
6759,0,0.5092869997024536
6769,0,0.6326522827148438
6779,0,0.402959942817688
6789,0,0.5720438361167908
6799,0,0.20375269651412964
6809,0,0.3333868980407715
6819,0,0.451781690120697
6829,0,0.32817190885543823
6839,0,0.3119276165962219
6849,0,0.5935641527175903
6859,0,0.5600376725196838
6869,0,0.7421230673789978
6879,0,0.6509795784950256
6889,0,0.6447370648384094
6899,0,0.5652115345001221
6909,0,0.3274100422859192
6919,0,0.5854188203811646
6929,0,0.6511698961257935
6939,0,0.6829521059989929
6949,0,0.32521742582321167
6959,0,0.5702731013298035
6969,0,0.4239760637283325
6979,0,0.4517945647239685
6989,0,0.7022097110748291
6999,0,0.5313048958778381
7009,0,0.40188276767730713
7019,0,0.3862018585205078
7029,0,0.4706626534461975
7039,0,0.30415838956832886
7049,0,0.40760940313339233
7059,0,0.3701772093772888
7069,0,0.3209434151649475
7079,0,0.24223589897155762
7089,0,0.49415791034698486
7099,0,0.35231268405914307
7109,0,0.5255074501037598
7119,0,0.3367406725883484
7129,0,0.4192390441894531
7139,0,0.24378246068954468
7149,0,0.4524797797203064
7159,0,0.1390000581741333
7169,0,0.26854777336120605
7179,0,0.4536682963371277
7189,0,0.47588562965393066
7199,0,0.7890488505363464
7209,0,0.4766131043434143
7219,0,0.6783406734466553
7229,0,0.7018404603004456
7239,0,0.41034114360809326
7249,0,0.510419487953186
7259,0,0.42162346839904785
7269,0,0.5061237812042236
7279,0,0.4133140444755554
7289,0,0.36440062522888184
7299,0,0.7518714070320129
7309,0,0.6833687424659729
7319,0,0.6304316520690918
7329,0,0.5541326999664307
7339,0,0.5484564900398254
7349,0,0.5428022742271423
7359,0,0.5642064213752747
7369,0,0.7048870921134949
7379,0,0.4680468440055847
7389,0,0.6980385780334473
7399,0,0.4882394075393677
7409,0,0.7596990466117859
7419,0,0.45599186420440674
7429,0,0.5874395370483398
7439,0,0.444372296333313
7449,0,0.6868624091148376
7459,0,0.46796977519989014
7469,0,0.6233381032943726
7479,0,0.5804802179336548
7489,0,0.5464364290237427
7499,0,0.38635170459747314
7509,0,0.5052903890609741
7519,0,0.7367320656776428
7529,0,0.722895622253418
7539,0,0.877586305141449
7549,0,0.7871866226196289
7559,0,0.5143309235572815
7569,0,0.7116435170173645
7579,0,0.7309396266937256
7589,0,0.7181110978126526
7599,0,0.5440859794616699
7609,0,0.6702933311462402
7619,0,0.632095992565155
7629,0,0.7564657330513
7639,0,0.7543593645095825
7649,0,0.35265660285949707
7659,0,0.5087004899978638
7669,0,0.5934925079345703
7679,0,0.47002267837524414
7689,0,0.44384461641311646
7699,0,0.5588615536689758
7709,0,0.5984653830528259
7719,0,0.4161883592605591
7729,0,0.41667115688323975
7739,0,0.2733706831932068
7749,0,0.5664704442024231
7759,0,0.18896740674972534
7769,0,0.4358959197998047
7779,0,0.3607420325279236
7789,0,0.460482656955719
7799,0,0.4407697916030884
7809,1,0.418083131313324
7819,1,0.06689366698265076
7829,1,0.48717594146728516
7839,1,0.40488725900650024
7849,1,0.15678775310516357
7859,1,0.36128854751586914
7869,1,0.34280925989151
7879,1,0.3012402653694153
7889,1,0.42412418127059937
7899,1,0.48124414682388306
7909,1,0.7659496068954468
7919,1,0.8749236464500427
7929,1,0.854934811592102
7939,1,1.0501629710197449
7949,1,1.266531229019165
7959,1,1.4245145916938782
7969,1,1.3365482091903687
7979,1,1.4870615005493164
7989,1,1.849377155303955
7999,1,2.0944464206695557
8009,1,2.104431986808777
8019,1,1.9993355870246887
8029,1,1.8869202733039856
8039,1,2.094449818134308
8049,1,2.0265140533447266
8059,1,2.691973924636841
8069,1,2.6505165696144104
8079,1,2.919215440750122
8089,1,2.629361927509308
8099,1,2.5205259323120117
8109,1,2.6122159361839294
8119,1,3.2394505739212036
8129,1,3.1901596784591675
8139,1,3.554668426513672
8149,1,3.482945680618286
8159,1,3.603226900100708
8169,1,3.9594266414642334
8179,1,3.8547648191452026
8189,1,4.432618856430054
8199,1,4.526262998580933
8209,1,4.443570375442505
8219,1,4.550590634346008
8229,1,5.295925140380859
8239,1,5.177353501319885
8249,1,5.772942066192627
8259,1,6.670996427536011
8269,1,6.273504257202148
8279,1,7.068604469299316
8289,1,7.948877811431885
8299,1,8.928971290588379
8309,1,8.479668617248535
8319,1,8.272979259490967
8329,1,8.427417755126953
8339,1,8.25369119644165
8349,1,8.020330905914307
8359,1,7.288483381271362
8369,1,7.426554203033447
8379,1,6.722227334976196
8389,1,6.018106937408447
8399,1,6.237642765045166
8409,1,5.440618515014648
8419,1,5.066749811172485
8429,1,5.610277414321899
8439,1,4.898048400878906
8449,1,4.7886271476745605
8459,1,4.478511333465576
8469,1,4.292899131774902
8479,1,4.2901575565338135
8489,1,4.000997185707092
8499,1,3.7437087297439575
8509,1,3.6584726572036743
8519,1,3.323904275894165
8529,1,3.183603286743164
8539,1,2.6682310104370117
8549,1,2.9589030742645264
8559,1,2.5216634273529053
8569,1,2.664301633834839
8579,1,2.271508574485779
8589,1,2.0722806453704834
8599,1,2.0792632699012756
8609,1,2.2594298720359802
8619,1,2.1684186458587646
8629,1,2.4716131687164307
8639,1,1.851923942565918
8649,1,1.9176899194717407
8659,1,1.7474009990692139
8669,1,1.500436544418335
8679,1,1.304730772972107
8689,1,1.3393940329551697
8699,1,1.2750017642974854
8709,1,1.1162184476852417
8719,1,0.8085052967071533
8729,1,0.8234643936157227
8739,1,0.8336579203605652
8749,1,0.3976905345916748
8759,1,1.0222534537315369
8769,1,0.6567593812942505
8779,1,0.6071552634239197
8789,1,0.466320276260376
8799,1,0.5278613567352295
8809,1,0.41994762420654297
8819,1,0.6156611442565918
8829,1,0.8533457517623901
8839,1,0.7764987349510193
8849,1,1.0523859858512878
8859,1,1.0886763334274292
8869,1,0.8002448081970215
8879,1,0.9417508840560913
8889,1,1.0765989422798157
8899,1,0.9312309622764587
8909,1,1.617238163948059
8919,1,1.306759536266327
8929,1,1.6741228103637695
8939,1,0.8854080438613892
8949,1,0.9686551094055176
8959,1,0.8852217197418213
8969,1,1.0805341601371765
8979,1,0.9991507530212402
8989,1,0.8223788738250732
8999,1,1.154192566871643
9009,1,1.376531720161438
9019,1,1.7859044075012207
9029,1,0.6285521388053894
9039,1,0.7142517566680908
9049,1,0.5622057318687439
9059,1,0.7772356271743774
9069,1,0.5624726414680481
9079,1,0.5535405278205872
9089,1,0.4042307138442993
9099,1,0.2793383002281189
9109,1,0.5335761308670044
9119,1,0.8203748464584351
9129,1,0.6069125533103943
9139,1,0.45399540662765503
9149,1,0.3971298933029175
9159,1,0.7082707285881042
9169,1,0.40697258710861206
9179,1,0.6744011044502258
9189,1,0.6180897355079651
9199,1,0.519199013710022
9209,1,0.8343934416770935
9219,1,0.5773389339447021
9229,1,0.8961405158042908
9239,1,0.5814366340637207
9249,1,0.5687661170959473
9259,1,0.7697771787643433
9269,1,0.609463632106781
9279,1,0.3822382688522339
9289,1,0.9745767712593079
9299,1,1.0236310958862305
9309,1,1.095962405204773
9319,1,1.0874236822128296
9329,1,1.464286208152771
9339,1,1.225712776184082
9349,1,0.9185128808021545
9359,1,1.0824490189552307
9369,1,1.3956470489501953
9379,1,1.1984810829162598
9389,1,1.7521674633026123
9399,1,1.3329251408576965
9409,1,1.6472909450531006
9419,1,1.7417396903038025
9429,1,1.90165376663208
9439,1,1.7609329223632812
9449,1,1.3572934865951538
9459,1,1.2530158758163452
9469,1,1.0924083590507507
9479,1,1.0300607681274414
9489,1,1.3272502422332764
9499,1,0.6026425957679749
9509,1,0.8458899855613708
9519,1,1.0513609051704407
9529,1,1.0471479892730713
9539,1,0.43154656887054443
9549,1,0.2917935848236084
9559,1,0.4587095379829407
9569,1,0.25486552715301514
9579,1,0.29547637701034546
9589,1,0.42876511812210083
9599,1,0.428647518157959
9609,1,0.38879841566085815
9619,1,0.3014901876449585
9629,1,0.4303709864616394
9639,1,0.33565860986709595
9649,1,0.18674498796463013
9659,1,0.09035325050354004
9669,1,0.22502726316452026
9679,1,0.09947121143341064
9689,1,0.13612431287765503
9699,1,0.21643537282943726
9709,1,0.12538665533065796
9719,1,0.1817415952682495
9729,1,0.10708922147750854
9739,1,-0.0947248637676239
9749,1,-0.03252863883972168
9759,1,0.1291845440864563
9769,1,-0.02735203504562378
9779,1,0.23951095342636108
9789,1,0.1326172947883606
9799,1,0.22752809524536133
9809,1,0.17234444618225098
9819,1,-0.06809753179550171
9829,1,0.05117204785346985
9839,1,0.2976195216178894
9849,1,0.23868751525878906
9859,1,0.3102450370788574
9869,1,0.2673410177230835
9879,1,0.3703433871269226
9889,1,0.34221529960632324
9899,1,0.16328930854797363
9909,1,0.22006380558013916
9919,1,0.17832481861114502
9929,1,0.029818087816238403
9939,1,0.41597145795822144
9949,1,0.10038453340530396
9959,1,0.325836181640625
9969,1,0.4316886067390442
9979,1,0.005839556455612183
9989,1,0.3203461170196533
9999,1,0.5715596675872803
10009,1,0.5750147104263306
10019,1,0.37385132908821106
10029,1,0.6833446025848389
10039,1,0.5415617227554321
10049,1,0.7309294939041138
10059,1,1.0291348099708557
10069,1,0.38618385791778564
10079,1,0.6516785621643066
10089,1,0.48760539293289185
10099,1,0.6034560799598694
10109,1,0.5939919352531433
10119,1,0.5217357277870178
10129,1,0.30383336544036865
10139,1,0.4737907648086548
10149,1,0.30207115411758423
10159,1,0.38494253158569336
10169,1,0.35495346784591675
10179,1,0.4220699071884155
10189,1,0.7191709876060486
10199,1,0.4488230347633362
10209,1,0.2927209138870239
10219,1,0.28168702125549316
10229,1,0.3643842935562134
10239,1,0.2881240248680115
10249,1,0.013101845979690552
10259,1,0.3076097369194031
10269,1,0.14924776554107666
10279,1,0.3183162808418274
10289,1,0.16871154308319092
10299,1,0.5842915177345276
10309,1,0.3330509662628174
10319,1,0.5484805107116699
10329,1,0.5891446471214294
10339,1,0.7413191199302673
10349,1,0.6745198369026184
10359,1,0.7510991096496582
10369,1,0.6669535040855408
10379,1,0.743203341960907
10389,1,0.6976935863494873
10399,1,0.7111316323280334
10409,1,0.4549593925476074
10419,1,0.5550244450569153
10429,1,0.4121873378753662
10439,1,0.38536709547042847
10449,1,0.23115259408950806
10459,1,0.047340720891952515
10469,1,-0.08784908056259155
10479,1,-0.0014795660972595215
10489,1,0.1698933243751526
10499,1,0.0711306631565094
10509,1,0.06330996751785278
10519,1,0.15280112624168396
10529,1,0.07588708400726318
10539,1,-0.05637839436531067
10549,1,0.23555809259414673
10559,1,0.01217663288116455
10569,1,0.28769075870513916
10579,1,0.15713417530059814
10589,1,0.3742128014564514
10599,1,0.6671507358551025
10609,1,0.5422889590263367
10619,1,0.6850271821022034
10629,1,0.7970150113105774
10639,1,0.8867552280426025
10649,1,1.1198238134384155
10659,1,1.8635040521621704
10669,1,1.6660178899765015
10679,1,0.6782775521278381
10689,1,2.0503638982772827
10699,1,1.8695766925811768
10709,1,2.3179057836532593
10719,1,1.8844844102859497
10729,1,2.800249934196472
10739,1,2.667240858078003
10749,1,2.27462899684906
10759,1,2.8703482151031494
10769,1,2.9235860109329224
10779,1,3.053143620491028
10789,1,3.067068934440613
10799,1,3.7151389122009277
10809,1,3.497453212738037
10819,1,3.867295026779175
10829,1,4.141285300254822
10839,1,3.9705746173858643
10849,1,3.886936902999878
10859,1,3.954737901687622
10869,1,4.176860809326172
10879,1,3.6908892393112183
10889,1,3.3809584379196167
10899,1,3.5387176275253296
10909,1,3.1431972980499268
10919,1,3.2782464027404785
10929,1,2.718616008758545
10939,1,3.0245323181152344
10949,1,3.1041133403778076
10959,1,3.4880608320236206
10969,1,3.4150147438049316
10979,1,3.595317006111145
10989,1,3.575430393218994
10999,1,3.636953830718994
11009,1,3.881141781806946
11019,1,3.4267656803131104
11029,1,2.7203762531280518
11039,1,3.3991756439208984
11049,1,3.597693920135498
11059,1,3.619901418685913
11069,1,2.7518593072891235
11079,1,2.867254376411438
11089,1,2.348970651626587
11099,1,2.1429895162582397
11109,1,1.1225988864898682
11119,1,0.835848331451416
11129,1,1.2626346349716187
11139,1,1.089535117149353
11149,1,0.9999256134033203
11159,1,0.45211225748062134
11169,1,0.8484781980514526
11179,1,0.34966564178466797
11189,1,0.43697723746299744
11199,1,0.10721462965011597
11209,1,0.28799235820770264
11219,1,0.09267330169677734
11229,1,0.2895442247390747
11239,1,0.15872234106063843
11249,1,0.3726767301559448
11259,1,0.5235090255737305
11269,1,0.060124099254608154
11279,1,0.46880650520324707
11289,1,0.19143372774124146
11299,1,0.3391495943069458
11309,1,0.4024243950843811
11319,1,0.27072012424468994
11329,1,0.6855325102806091
11339,1,0.6178519129753113
11349,1,0.2601872682571411
11359,1,0.8154788613319397
11369,1,0.8352311849594116
11379,1,0.8817821741104126
11389,1,0.5203021168708801
11399,1,0.530662477016449
11409,1,0.8557657599449158
11419,1,0.805826723575592
11429,1,0.314885675907135
11439,1,0.46609777212142944
11449,1,0.12570655345916748
11459,1,0.36117205023765564
11469,1,0.10434508323669434
11479,1,0.03355291485786438
11489,1,0.3484311103820801
11499,1,0.1978675127029419
11509,1,0.183274507522583
11519,1,0.21090412139892578
11529,1,0.05917936563491821
11539,1,0.06043693423271179
11549,1,0.5311179161071777
11559,1,0.16103008389472961
11569,1,0.33771026134490967
11579,1,0.6170573830604553
11589,1,0.4913012385368347
11599,1,0.6017432808876038
11609,1,0.7974764108657837
11619,1,0.7446091175079346
11629,1,0.9805725812911987
11639,1,1.3208474516868591
11649,1,0.7768644094467163
11659,1,0.9642181992530823
11669,1,1.3616653084754944
11679,1,1.5688949823379517
11689,1,1.158261239528656
11699,1,1.312235414981842
11709,1,1.9580074548721313
11719,1,2.1176559925079346
11729,1,1.705696940422058
11739,1,1.9862570762634277
11749,1,2.0176882147789
11759,1,2.00885009765625
11769,1,2.2339593172073364
11779,1,2.265950918197632
11789,1,2.4644088745117188
11799,1,2.3463512659072876
11809,1,1.7251291871070862
11819,1,1.9767318964004517
11829,1,1.901815414428711
11839,1,2.216751456260681
11849,1,2.904565691947937
11859,1,2.9793035984039307
11869,1,2.892521858215332
11879,1,3.335254192352295
11889,1,3.4612390995025635
11899,1,4.179064989089966
11909,1,3.5237162113189697
11919,1,3.8914260864257812
11929,1,3.655142068862915
11939,1,4.051658868789673
11949,1,3.290846586227417
11959,1,2.824212431907654
11969,1,2.5838383436203003
11979,1,2.5760109424591064
11989,1,2.2009189128875732
11999,1,1.5476713180541992
12009,1,1.7900581359863281
12019,1,1.2784473299980164
12029,1,1.126244843006134
12039,1,1.4652570486068726
12049,1,1.0731178522109985
12059,1,0.8957472443580627
12069,1,1.0977097749710083
12079,1,0.8212876915931702
12089,1,0.7330657839775085
12099,1,0.609765887260437
12109,1,0.269762247800827
12119,1,0.27752864360809326
12129,1,0.444469690322876
12139,1,0.2805047631263733
12149,1,0.6626749634742737
12159,1,0.3847179412841797
12169,1,0.39333832263946533
12179,1,0.31977713108062744
12189,1,0.2664054036140442
12199,1,0.1508350968360901
12209,1,0.23456227779388428
12219,1,0.19162100553512573
12229,1,0.14529424905776978
12239,1,-0.06879124045372009
12249,1,0.14397436380386353
12259,1,0.12056785821914673
12269,1,0.1965179443359375
12279,1,0.1973590850830078
12289,1,0.1924750804901123
12299,1,0.14207413792610168
12309,1,0.0912286639213562
12319,1,-0.059256523847579956
12329,1,0.10587859153747559
12339,1,0.14847224950790405
12349,1,-0.006560981273651123
12359,1,0.16207849979400635
12369,1,0.09798860549926758
12379,1,0.07505825161933899
12389,1,0.04883980751037598
12399,1,0.13737112283706665
12409,1,0.13598769903182983
12419,1,0.20929676294326782
12429,1,0.23391157388687134
12439,1,0.38037848472595215
12449,1,0.1723078489303589
12459,1,0.8846302628517151
12469,1,0.9708054065704346
12479,1,0.4632888436317444
12489,1,0.7911190986633301
12499,1,0.8229355812072754
12509,1,0.9361057281494141
12519,1,0.5865454077720642
12529,1,0.5542212128639221
12539,1,0.5508501529693604
12549,1,0.379441499710083
12559,1,0.4986943006515503
12569,1,0.7600418925285339
12579,1,0.5573102831840515
12589,1,1.1171244978904724
12599,1,0.5555004477500916
12609,1,0.6593586206436157
12619,1,0.6218668222427368
12629,1,0.22923076152801514
12639,1,0.19165849685668945
12649,1,0.1588016152381897
12659,1,0.11494764685630798
12669,1,0.2542482614517212
12679,1,0.3451038599014282
12689,1,0.3198315501213074
12699,1,0.22508418560028076
12709,1,0.27777695655822754
12719,1,0.23970985412597656
12729,1,0.19016432762145996
12739,1,-0.04914841055870056
12749,1,0.017533421516418457
12759,1,0.17775624990463257
12769,1,0.08789348602294922
12779,1,-0.08514773845672607
12789,1,-0.0827164351940155
12799,1,0.09189081192016602
12809,1,0.1688862442970276
12819,1,0.10434567928314209
12829,1,0.0998871922492981
12839,1,0.14961379766464233
12849,1,0.26128172874450684
12859,1,0.22783982753753662
12869,1,0.023607224225997925
12879,1,0.5571979880332947
12889,1,0.4463200569152832
12899,1,0.42182302474975586
12909,1,0.5197912454605103
12919,1,0.16746032238006592
12929,1,0.2763764262199402
12939,1,0.13349217176437378
12949,1,0.11678740382194519
12959,1,0.18824604153633118
12969,1,0.25579720735549927
12979,1,0.30126166343688965
12989,1,0.17362982034683228
12999,1,0.34127354621887207
13009,1,0.6172840595245361
13019,1,0.29812610149383545
13029,1,0.5003485083580017
13039,1,0.15869510173797607
13049,1,0.3139185309410095
13059,1,0.5039821267127991
13069,1,0.6503335237503052
13079,1,0.38306283950805664
13089,1,0.35146933794021606
13099,1,0.6343466639518738
13109,1,0.6415721774101257
13119,1,0.4584282636642456
13129,1,0.44297635555267334
13139,1,0.7764616012573242
13149,1,1.1180347800254822
13159,1,1.2327721118927002
13169,1,1.2669815421104431
13179,1,1.1704381704330444
13189,1,1.541587471961975
13199,1,1.402697205543518
13209,1,1.5088838338851929
13219,1,1.2390954494476318
13229,1,1.8325955867767334
13239,1,2.4570053815841675
13249,1,2.096823811531067
13259,1,1.618757963180542
13269,1,1.6599901914596558
13279,1,1.7086915969848633
13289,1,1.9195175170898438
13299,1,2.325840473175049
13309,1,2.5752131938934326
13319,1,2.45063054561615
13329,1,2.223854899406433
13339,1,2.230650782585144
13349,1,3.014348268508911
13359,1,2.4872326850891113
13369,1,1.5354329347610474
13379,1,1.3923940658569336
13389,1,1.9412026405334473
13399,1,2.233352780342102
13409,1,2.035051703453064
13419,1,2.4732043743133545
13429,1,2.113163113594055
13439,1,1.8373019695281982
13449,1,1.1355043649673462
13459,1,1.6940288543701172
13469,1,1.2911279201507568
13479,1,1.5078169107437134
13489,1,0.9796997904777527
13499,1,1.1182445883750916
13509,1,1.1900725364685059
13519,1,1.1658912897109985
13529,1,0.8529968857765198
13539,1,1.2541359663009644
13549,1,0.783473014831543
13559,1,0.7690249085426331
13569,1,0.8295108675956726
13579,1,0.6460000276565552
13589,1,0.6012217402458191
13599,1,0.9251801371574402
13609,1,0.7625682950019836
13619,1,0.5253733992576599
13629,1,0.7682364583015442
13639,1,0.755918025970459
13649,1,1.2480159997940063
13659,1,0.5793973803520203
13669,1,0.6642444133758545
13679,1,0.5760657787322998
13689,1,0.6104490756988525
13699,1,0.33660465478897095
13709,1,0.03565341234207153
13719,1,0.2086161971092224
13729,1,-0.004846155643463135
13739,1,0.07014986872673035
13749,1,0.08606848120689392
13759,1,0.22577989101409912
13769,1,0.14328253269195557
13779,1,0.26353132724761963
13789,1,0.13736975193023682
13799,1,0.07718846201896667
13809,1,-0.16327616572380066
13819,1,0.09720301628112793
13829,1,0.09739547967910767
13839,1,0.05301612615585327
13849,1,0.2173638939857483
13859,1,0.021161258220672607
13869,1,0.4281232953071594
13879,1,0.13511589169502258
13889,1,0.20131295919418335
13899,1,0.4851832985877991
13909,1,0.30217885971069336
13919,1,0.4271339178085327
13929,1,0.3983454704284668
13939,1,0.34329456090927124
13949,1,0.27752113342285156
13959,1,0.21671026945114136
13969,1,-0.011393934488296509
13979,1,0.23931699991226196
13989,1,0.2395477294921875
13999,1,0.01193949580192566
14009,1,0.20753318071365356
14019,1,0.21123617887496948
14029,1,0.19547408819198608
14039,1,0.3518637418746948
14049,1,0.1306440234184265
14059,1,0.4360218048095703
14069,1,0.39154452085494995
14079,1,0.9044326543807983
14089,1,0.725923478603363
14099,1,0.4018627405166626
14109,1,0.3560422658920288
14119,1,0.3610132932662964
14129,1,0.27266591787338257
14139,1,0.5040053725242615
14149,1,0.2034742832183838
14159,1,0.21651381254196167
14169,1,0.14067602157592773
14179,1,-0.006302297115325928
14189,1,0.16866731643676758
14199,1,0.237210214138031
14209,1,0.3848596215248108
14219,1,0.19046133756637573
14229,1,0.22649186849594116
14239,1,0.2340049147605896
14249,1,0.401319682598114
14259,1,0.30262523889541626
14269,1,0.23673415184020996
14279,1,0.44965946674346924
14289,1,0.3860276937484741
14299,1,0.5553496479988098
14309,1,0.3173796534538269
14319,1,0.28880345821380615
14329,1,0.374859094619751
14339,1,0.44749635457992554
14349,1,0.15785127878189087
14359,1,0.3652595281600952
14369,1,0.36642175912857056
14379,1,0.5174773931503296
14389,1,0.3303822875022888
14399,1,0.38806235790252686
14409,1,0.7423840761184692
14419,1,0.8380776643753052
14429,1,0.6609644889831543
14439,1,0.7591943740844727
14449,1,0.6119592189788818
14459,1,0.7454960942268372
14469,1,0.8081539273262024
14479,1,0.6501820087432861
14489,1,0.6476876139640808
14499,1,0.408657431602478
14509,1,0.5864496231079102
14519,1,0.6302829384803772
14529,1,0.5297974348068237
14539,1,0.2949150800704956
14549,1,0.45733433961868286
14559,1,0.183280348777771
14569,1,0.20837384462356567
14579,1,0.09735369682312012
14589,1,0.49063241481781006
14599,1,0.22801631689071655
14609,1,0.45052850246429443
14619,1,0.6354473829269409
14629,1,0.28932690620422363
14639,1,0.37397652864456177
14649,1,0.6063055396080017
14659,1,0.7485103011131287
14669,1,0.6897461414337158
14679,1,0.5076959133148193
14689,1,0.4773697853088379
14699,1,0.4765089750289917
14709,1,0.2769193649291992
14719,1,0.46484464406967163
14729,1,0.5863251090049744
14739,1,0.4133071303367615
14749,1,0.33568716049194336
14759,1,0.6168635487556458
14769,1,0.3793194890022278
14779,1,0.44694483280181885
14789,1,0.09702792763710022
14799,1,0.533866286277771
14809,1,0.42502230405807495
14819,1,0.30445414781570435
14829,1,0.3755595088005066
14839,1,0.09378117322921753
14849,1,0.046233147382736206
14859,1,0.18799802660942078
14869,1,0.407396137714386
14879,1,0.33641016483306885
14889,1,0.3025226593017578
14899,1,0.30993956327438354
14909,1,0.15389010310173035
14919,1,0.1643390655517578
14929,1,0.19222140312194824
14939,1,0.22775143384933472
14949,1,0.20430970191955566
14959,1,0.11987829208374023
14969,1,0.10187196731567383
14979,1,0.19685053825378418
14989,1,0.1202927827835083
14999,1,0.06823974847793579
15009,1,0.0330657958984375
15019,1,0.1407909393310547
15029,1,-0.034832507371902466
15039,1,-0.05881181359291077
15049,1,0.040941089391708374
15059,1,0.04359564185142517
15069,1,0.1056361198425293
15079,1,-0.06589829921722412
15089,1,-0.018142014741897583
15099,1,-0.14664232730865479
15109,1,-0.08025673031806946
15119,1,0.20275187492370605
15129,1,0.11896991729736328
15139,1,0.06949016451835632
15149,1,0.08055031299591064
15159,1,-0.08517688512802124
15169,1,0.04558256268501282
15179,1,-0.016922950744628906
15189,1,-0.0824539065361023
15199,1,0.09556341171264648
15209,1,0.19428890943527222
15219,1,0.1675713062286377
15229,1,0.04872250556945801
15239,1,0.11298906803131104
15249,1,0.18584388494491577
15259,1,0.15451258420944214
15269,1,0.132179856300354
15279,1,-0.12884971499443054
15289,1,-0.12506231665611267
15299,1,-0.04647919535636902
15309,1,0.09470707178115845
15319,1,0.06419068574905396
15329,1,-0.023258090019226074
15339,1,-0.12372669577598572
15349,1,-0.044435322284698486
15359,1,0.08462297916412354
15369,1,0.10063517093658447
15379,1,0.1147034764289856
15389,1,0.17347824573516846
15399,1,0.12393665313720703
15409,1,0.12576699256896973
15419,1,0.05862545967102051
15429,1,0.16300451755523682
15439,1,0.058184683322906494
15449,1,-0.007225066423416138
15459,1,0.15131229162216187
15469,1,0.10728812217712402
15479,1,0.06848305463790894
15489,1,0.07145482301712036
15499,1,0.2679482102394104
15509,1,0.16322553157806396
15519,1,-0.05013367533683777
15529,1,0.11058282852172852
15539,1,0.17802786827087402
15549,1,0.18093115091323853
15559,1,0.3024737238883972
15569,1,0.10500010848045349
15579,1,-0.011647403240203857
15589,1,0.13441938161849976
15599,1,0.05054450035095215
15609,1,0.057149291038513184
15619,1,0.13380515575408936
15629,1,0.110664963722229
15639,1,-0.1415407657623291
15649,1,0.1673668920993805
15659,1,-0.08087426424026489
15669,1,0.11626410484313965
15679,1,0.20965850353240967
15689,1,0.1349671483039856
15699,1,0.04348742961883545
15709,1,-0.04090619087219238
15719,1,0.14436399936676025
15729,1,0.06975701451301575
15739,1,-0.010574162006378174
15749,1,0.07654699683189392
15759,1,0.14655035734176636
15769,1,0.044919729232788086
15779,1,-0.18103280663490295
15789,1,-0.12781089544296265
15799,1,0.11513316631317139
15809,1,-0.1860244870185852
15819,1,-0.023061096668243408
15829,1,-0.0647784173488617
15839,1,-0.11437150835990906
15849,1,0.14982950687408447
15859,1,0.16597694158554077
15869,1,0.05659404397010803
15879,1,0.006501942873001099
15889,1,0.043190956115722656
15899,1,-0.012160122394561768
15909,1,0.0002206563949584961
15919,1,-0.05676543712615967
15929,1,-0.08465567231178284
15939,1,0.02711355686187744
15949,1,0.20345580577850342
15959,1,0.1706620454788208
15969,1,-0.016987234354019165
15979,1,-0.028941750526428223
15989,1,0.15310490131378174
15999,1,0.2278447151184082
16009,1,0.1345192790031433
16019,1,0.12533044815063477
16029,1,0.24056273698806763
16039,1,0.09768593311309814
16049,1,0.21059387922286987
16059,1,0.19471335411071777
16069,1,0.17500156164169312
16079,1,0.10270357131958008
16089,1,0.12240958213806152
16099,1,-0.03229069709777832
16109,1,-0.0147438645362854
16119,1,-0.0319666862487793
16129,1,0.0035405755043029785
16139,1,0.17213773727416992
16149,1,0.1324443221092224
16159,1,-0.0709182620048523
16169,1,0.17122942209243774
16179,1,-0.03189685940742493
16189,1,0.0380687415599823
16199,1,0.067718505859375
