T,S,Score
999,0.0,0.021013618
1009,0.0,-0.338467
1019,0.0,0.11153841
1029,0.0,-0.29872012
1039,0.0,0.00096154213
1049,0.0,-0.2616843
1059,0.0,0.04607618
1069,0.0,-0.04458934
1079,0.0,-0.23340851
1089,0.0,-0.15408063
1099,0.0,-0.22862267
1109,0.0,-0.120039284
1119,0.0,-0.24587405
1129,0.0,-0.3216046
1139,0.0,-0.22471988
1149,0.0,-0.30370605
1159,0.0,-0.13478053
1169,0.0,-0.26650584
1179,0.0,-0.25621194
1189,0.0,-0.37075818
1199,0.0,0.07160151
1209,0.0,-0.14885545
1219,0.0,-0.05752307
1229,0.0,-0.08725619
1239,0.0,0.05094731
1249,0.0,-0.12663901
1259,0.0,-0.4762355
1269,0.0,-0.14625132
1279,0.0,-0.18855542
1289,0.0,0.09902674
1299,0.0,-0.43521106
1309,0.0,-0.058529973
1319,0.0,-0.19874185
1329,0.0,0.25103825
1339,0.0,-0.21566212
1349,0.0,-0.27058947
1359,0.0,0.07920563
1369,0.0,-0.36218935
1379,0.0,-0.34816706
1389,0.0,-0.010097027
1399,0.0,-0.030785084
1409,0.0,-0.11297619
1419,0.0,0.16108775
1429,0.0,0.33166075
1439,0.0,0.18608308
1449,0.0,0.42495131
1459,0.0,0.36013383
1469,0.0,0.57742345
1479,0.0,0.41615844
1489,0.0,0.43147463
1499,0.0,0.21482766
1509,0.0,0.7162876
1519,0.0,0.37218463
1529,0.0,0.62618774
1539,0.0,0.29129112
1549,0.0,0.1905551
1559,0.0,-0.049401104
1569,0.0,0.12966228
1579,0.0,0.14178133
1589,0.0,-0.026929975
1599,0.0,0.05587077
1609,0.0,0.08992815
1619,0.0,-0.24971968
1629,0.0,0.041657805
1639,0.0,0.4149018
1649,0.0,-0.27039218
1659,0.0,0.1407702
1669,0.0,0.18826681
1679,0.0,0.085036635
1689,0.0,0.037546337
1699,0.0,0.11914325
1709,0.0,0.101435065
1719,0.0,0.14730203
1729,0.0,0.13756454
1739,0.0,0.017486095
1749,0.0,0.15908456
1759,0.0,-0.3293599
1769,0.0,-0.029518247
1779,0.0,-0.075460136
1789,0.0,-0.16207093
1799,0.0,0.07849324
1809,0.0,-0.02046287
1819,0.0,0.036440015
1829,0.0,-0.231817
1839,0.0,-0.10549605
1849,0.0,-0.059611797
1859,0.0,-0.20771682
1869,0.0,-0.25734282
1879,0.0,0.112092495
1889,0.0,-0.4169147
1899,0.0,0.061332583
1909,0.0,-0.016464531
1919,0.0,0.13615704
1929,0.0,0.32138222
1939,0.0,0.49822694
1949,0.0,0.37603068
1959,0.0,-4.017353e-05
1969,0.0,0.45412666
1979,0.0,0.23831332
1989,0.0,0.16609484
1999,0.0,0.068454444
2009,1.0,0.70498097
2019,1.0,0.021319509
2029,1.0,0.27760744
2039,1.0,0.45076305
2049,1.0,0.12865484
2059,1.0,0.15550923
2069,1.0,0.11769378
2079,1.0,0.012951016
2089,1.0,-0.06870997
2099,1.0,-0.289176
2109,1.0,-0.1519314
2119,1.0,0.47708803
2129,1.0,0.29528052
2139,1.0,0.5349029
2149,1.0,0.15054393
2159,1.0,0.3310007
2169,1.0,0.4812479
2179,1.0,0.49872673
2189,1.0,0.23541582
2199,1.0,0.6356021
2209,1.0,0.592239
2219,1.0,1.3933957
2229,1.0,1.6437005
2239,1.0,2.020092
2249,1.0,1.136271
2259,1.0,1.3238028
2269,1.0,2.3888552
2279,1.0,1.4403977
2289,1.0,1.3517797
2299,1.0,2.5311697
2309,1.0,2.133564
2319,1.0,1.4863927
2329,1.0,2.0342565
2339,1.0,2.9039202
2349,1.0,2.3248897
2359,1.0,2.7449899
2369,1.0,3.2422533
2379,1.0,3.7968516
2389,1.0,3.04147
2399,1.0,3.239332
2409,1.0,3.7398908
2419,1.0,3.7573876
2429,1.0,3.1367755
2439,1.0,5.241917
2449,1.0,5.0328045
2459,1.0,5.33941
2469,1.0,5.8293066
2479,1.0,6.281455
2489,1.0,6.2602973
2499,1.0,6.7127423
2509,1.0,7.0051622
2519,1.0,7.095483
2529,1.0,5.6595497
2539,1.0,5.567001
2549,1.0,6.0294046
2559,1.0,4.5579386
2569,1.0,4.1778936
2579,1.0,3.689718
2589,1.0,4.4909124
2599,1.0,3.942009
2609,1.0,4.1491537
2619,1.0,4.3830643
2629,1.0,2.629308
2639,1.0,2.9792573
2649,1.0,2.646381
2659,1.0,1.8205303
2669,1.0,2.495203
2679,1.0,2.2383695
2689,1.0,2.266734
2699,1.0,2.9231586
2709,1.0,1.9959066
2719,1.0,1.9852772
2729,1.0,1.1606293
2739,1.0,1.1124096
2749,1.0,1.3890879
2759,1.0,0.7873802
2769,1.0,1.1787217
2779,1.0,1.1883314
2789,1.0,1.0913104
2799,1.0,0.62229997
2809,1.0,1.2660079
2819,1.0,0.72424996
2829,1.0,0.5095689
2839,1.0,0.6315708
2849,1.0,0.23953474
2859,1.0,0.17211956
2869,1.0,0.4263851
2879,1.0,0.34519058
2889,1.0,-0.051411033
2899,1.0,0.39450526
2909,1.0,0.049641967
2919,1.0,0.29690146
2929,1.0,-0.008234501
2939,1.0,0.08920324
2949,1.0,0.39010632
2959,1.0,-0.11626279
2969,1.0,-0.0075489283
2979,1.0,0.21232826
2989,1.0,0.23130119
2999,1.0,0.24444467
3009,0.0,0.020310879
3019,0.0,0.0033783913
3029,0.0,0.3272698
3039,0.0,0.09291494
3049,0.0,0.20552528
3059,0.0,0.02438724
3069,0.0,-0.07030648
3079,0.0,-0.06728482
3089,0.0,0.08329034
3099,0.0,0.29568696
3109,0.0,0.14580524
3119,0.0,0.21110559
3129,0.0,0.12579358
3139,0.0,-0.06674141
3149,0.0,-0.1562978
3159,0.0,-0.2663877
3169,0.0,0.07043207
3179,0.0,-0.28575277
3189,0.0,0.016369224
3199,0.0,-0.09964812
3209,0.0,-0.0046532154
3219,0.0,-0.19157493
3229,0.0,0.08984423
3239,0.0,0.2942711
3249,0.0,0.45990634
3259,0.0,0.16596472
3269,0.0,0.42263722
3279,0.0,0.0477376
3289,0.0,0.3612451
3299,0.0,0.3087393
3309,0.0,0.19088769
3319,0.0,0.17778397
3329,0.0,0.24031514
3339,0.0,-0.07677889
3349,0.0,0.32504493
3359,0.0,0.08804226
3369,0.0,0.03008163
3379,0.0,0.17343605
3389,0.0,-0.30647504
3399,0.0,-0.10018027
3409,0.0,0.044605255
3419,0.0,0.21377432
3429,0.0,-0.02349478
3439,0.0,0.17722607
3449,0.0,-0.14045429
3459,0.0,0.04437387
3469,0.0,-0.077156186
3479,0.0,-0.07146394
3489,0.0,-0.39945257
3499,0.0,-0.17367655
3509,0.0,-0.14840019
3519,0.0,0.09307814
3529,0.0,0.08777535
3539,0.0,-0.15704441
3549,0.0,0.07419932
3559,0.0,0.16892326
3569,0.0,-0.29243422
3579,0.0,0.08796871
3589,0.0,0.10899842
3599,0.0,0.30725944
3609,0.0,0.38035023
3619,0.0,0.50768524
3629,0.0,0.16610992
3639,0.0,0.17929935
3649,0.0,-0.026975274
3659,0.0,-0.23611045
3669,0.0,0.15041327
3679,0.0,0.8286841
3689,0.0,0.21433353
3699,0.0,0.3865224
3709,0.0,0.6067445
3719,0.0,0.20055121
3729,0.0,0.6376014
3739,0.0,0.6640016
3749,0.0,0.44917578
3759,0.0,0.37916875
3769,0.0,0.21146703
3779,0.0,0.5088641
3789,0.0,0.0891934
3799,0.0,-0.033127308
3809,0.0,0.18231899
3819,0.0,0.411582
3829,0.0,0.42924857
3839,0.0,0.066006064
3849,0.0,0.2588811
3859,0.0,0.29318106
3869,0.0,0.0391376
3879,0.0,0.06156671
3889,0.0,-0.2252897
3899,0.0,-0.22616327
3909,0.0,0.02776593
3919,0.0,0.17537856
3929,0.0,0.119627
3939,0.0,0.025881648
3949,0.0,0.032999873
3959,0.0,0.32343
3969,0.0,-0.35741627
3979,0.0,-0.14745545
3989,0.0,0.28402835
3999,0.0,0.02109301
4009,1.0,-0.013856709
4019,1.0,-0.02447486
4029,1.0,-0.08532393
4039,1.0,0.2458899
4049,1.0,0.112882376
4059,1.0,-0.48028362
4069,1.0,0.4100182
4079,1.0,-0.23141289
4089,1.0,0.27052903
4099,1.0,0.006947756
4109,1.0,-0.11777592
4119,1.0,0.25690603
4129,1.0,0.2601912
4139,1.0,0.5887319
4149,1.0,0.8856115
4159,1.0,0.7794659
4169,1.0,0.8166807
4179,1.0,0.5344115
4189,1.0,1.0057292
4199,1.0,1.2997549
4209,1.0,1.0601165
4219,1.0,1.4205557
4229,1.0,1.5285208
4239,1.0,1.5644447
4249,1.0,1.0913793
4259,1.0,1.3814185
4269,1.0,2.6001868
4279,1.0,1.7973143
4289,1.0,2.359075
4299,1.0,2.5213037
4309,1.0,3.0045922
4319,1.0,2.8675344
4329,1.0,3.4698076
4339,1.0,3.9705257
4349,1.0,3.0872054
4359,1.0,3.8067527
4369,1.0,3.7247672
4379,1.0,3.6533382
4389,1.0,3.9791985
4399,1.0,4.442768
4409,1.0,4.285262
4419,1.0,4.0885396
4429,1.0,5.929181
4439,1.0,5.4809823
4449,1.0,5.9496965
4459,1.0,5.955655
4469,1.0,7.04274
4479,1.0,7.300104
4489,1.0,8.055756
4499,1.0,6.3341813
4509,1.0,7.479081
4519,1.0,5.6096544
4529,1.0,7.2150464
4539,1.0,6.502208
4549,1.0,5.498867
4559,1.0,5.5752935
4569,1.0,5.3889437
4579,1.0,4.575869
4589,1.0,5.903373
4599,1.0,3.89471
4609,1.0,4.2964015
4619,1.0,2.7807865
4629,1.0,4.2528567
4639,1.0,2.7679367
4649,1.0,4.0774746
4659,1.0,2.9124932
4669,1.0,3.0023
4679,1.0,2.40555
4689,1.0,3.0237541
4699,1.0,2.4660382
4709,1.0,1.1354607
4719,1.0,2.0517378
4729,1.0,1.6451869
4739,1.0,1.9527957
4749,1.0,1.6136703
4759,1.0,1.346123
4769,1.0,1.3801827
4779,1.0,1.5893749
4789,1.0,1.4339697
4799,1.0,1.0626715
4809,1.0,0.76458234
4819,1.0,1.1029947
4829,1.0,0.8102612
4839,1.0,0.76919705
4849,1.0,0.5883175
4859,1.0,0.2280004
4869,1.0,0.6559953
4879,1.0,0.61214685
4889,1.0,0.20707184
4899,1.0,0.42668784
4909,1.0,0.6284845
4919,1.0,0.7451618
4929,1.0,0.04461372
4939,1.0,0.045343637
4949,1.0,-0.35667706
4959,1.0,0.14012468
4969,1.0,-0.13818836
4979,1.0,0.07028425
4989,1.0,0.102900326
4999,1.0,-0.055987835
5009,0.0,-0.16714418
5019,0.0,-0.062297225
5029,0.0,0.12632
5039,0.0,0.32256627
5049,0.0,-0.05534494
5059,0.0,0.21660858
5069,0.0,0.14069831
5079,0.0,-0.28730124
5089,0.0,-0.23344678
5099,0.0,-0.061602354
5109,0.0,-0.16781253
5119,0.0,-0.51712286
5129,0.0,-0.0019335747
5139,0.0,-0.2602049
5149,0.0,0.10032517
5159,0.0,0.14118093
5169,0.0,0.053582907
5179,0.0,0.01118654
5189,0.0,-0.017484426
5199,0.0,-0.38671994
5209,0.0,0.098070085
5219,0.0,0.014118791
5229,0.0,-0.2578315
5239,0.0,-0.12912011
5249,0.0,0.16932958
5259,0.0,0.033180892
5269,0.0,-0.07152724
5279,0.0,-0.07118535
5289,0.0,0.14201313
5299,0.0,-0.46474952
5309,0.0,-0.3898741
5319,0.0,-0.07303476
5329,0.0,-0.29945773
5339,0.0,-0.006804228
5349,0.0,0.0772621
5359,0.0,0.016649008
5369,0.0,-0.058627248
5379,0.0,0.14154375
5389,0.0,0.075307846
5399,0.0,-0.044691563
5409,0.0,0.092031956
5419,0.0,-0.06695211
5429,0.0,-0.15243119
5439,0.0,0.052526534
5449,0.0,-0.025669277
5459,0.0,-0.041258335
5469,0.0,-0.120191336
5479,0.0,-0.26910305
5489,0.0,-0.19261932
5499,0.0,-0.17533302
5509,0.0,0.0032444
5519,0.0,0.03448844
5529,0.0,-0.29074275
5539,0.0,-0.1483829
5549,0.0,-0.083819866
5559,0.0,0.16802609
5569,0.0,-0.030799508
5579,0.0,0.11695933
5589,0.0,0.15012276
5599,0.0,-0.29494995
5609,0.0,-0.27976167
5619,0.0,-0.25574356
5629,0.0,-0.0091459155
5639,0.0,0.06812829
5649,0.0,0.20578325
5659,0.0,-0.09193808
5669,0.0,-0.21092796
5679,0.0,-0.047546625
5689,0.0,-0.010455191
5699,0.0,-0.32665467
5709,0.0,-0.2820648
5719,0.0,0.28485954
5729,0.0,-0.037186623
5739,0.0,-0.22693801
5749,0.0,0.11269021
5759,0.0,0.020628452
5769,0.0,-0.44993132
5779,0.0,-0.33808792
5789,0.0,-0.18068826
5799,0.0,0.16112399
5809,0.0,-0.151313
5819,0.0,-0.17147386
5829,0.0,-0.10205197
5839,0.0,-0.07464945
5849,0.0,-0.13444543
5859,0.0,-0.52572453
5869,0.0,0.18170941
5879,0.0,-0.11099875
5889,0.0,-0.09623742
5899,0.0,0.07868004
5909,0.0,0.11733264
5919,0.0,-0.0028941631
5929,0.0,-0.17067695
5939,0.0,0.22221684
5949,0.0,-0.06807113
5959,0.0,-0.39306402
5969,0.0,0.1817168
5979,0.0,-0.03405261
5989,0.0,0.094629526
5999,0.0,0.039767027
6009,1.0,-0.10871935
6019,1.0,0.14865816
6029,1.0,0.102935195
6039,1.0,0.04664135
6049,1.0,0.057013273
6059,1.0,-0.13616633
6069,1.0,-0.105071306
6079,1.0,-0.5365813
6089,1.0,-0.32710183
6099,1.0,0.19783205
6109,1.0,0.10229921
6119,1.0,0.039572597
6129,1.0,0.05936742
6139,1.0,0.058737397
6149,1.0,0.050796747
6159,1.0,0.66613656
6169,1.0,0.14519644
6179,1.0,0.5922712
6189,1.0,1.1827703
6199,1.0,1.1848754
6209,1.0,1.1037169
6219,1.0,1.2883211
6229,1.0,1.0844188
6239,1.0,1.0516579
6249,1.0,1.4378424
6259,1.0,0.87227106
6269,1.0,1.0371535
6279,1.0,1.5646031
6289,1.0,2.0331929
6299,1.0,1.6469429
6309,1.0,2.3974233
6319,1.0,2.125955
6329,1.0,2.2269313
6339,1.0,2.4252732
6349,1.0,2.2637987
6359,1.0,2.7769122
6369,1.0,2.9070616
6379,1.0,3.5691402
6389,1.0,3.5186055
6399,1.0,3.2290945
6409,1.0,4.976631
6419,1.0,4.4352646
6429,1.0,4.791419
6439,1.0,4.95055
6449,1.0,5.791607
6459,1.0,5.5099926
6469,1.0,6.2462044
6479,1.0,5.981943
6489,1.0,7.9059587
6499,1.0,6.987362
6509,1.0,6.9817142
6519,1.0,6.5126314
6529,1.0,5.952447
6539,1.0,5.7616587
6549,1.0,6.090313
6559,1.0,4.7187862
6569,1.0,4.9733152
6579,1.0,3.713106
6589,1.0,4.355361
6599,1.0,3.5613642
6609,1.0,3.0376978
6619,1.0,2.8032215
6629,1.0,3.1525037
6639,1.0,2.5312033
6649,1.0,1.9107339
6659,1.0,2.2452252
6669,1.0,2.362029
6679,1.0,1.4794117
6689,1.0,2.087409
6699,1.0,2.1705227
6709,1.0,1.7945039
6719,1.0,1.5106897
6729,1.0,1.3744032
6739,1.0,1.3787763
6749,1.0,0.8080461
6759,1.0,1.0244613
6769,1.0,0.54014087
6779,1.0,0.6174394
6789,1.0,0.3955199
6799,1.0,0.47756612
6809,1.0,0.88625336
6819,1.0,0.6700039
6829,1.0,0.38646233
6839,1.0,0.24326062
6849,1.0,0.113128364
6859,1.0,0.43229842
6869,1.0,0.2689066
6879,1.0,0.6172206
6889,1.0,0.003451705
6899,1.0,-0.015138388
6909,1.0,-0.28755057
6919,1.0,-0.2150954
6929,1.0,-0.09717935
6939,1.0,0.13342059
6949,1.0,-0.05801165
6959,1.0,-0.09669131
6969,1.0,-0.053738594
6979,1.0,-0.094673514
6989,1.0,0.0020803213
6999,1.0,-0.5844484
7009,0.0,-0.04618764
7019,0.0,0.055761695
7029,0.0,-0.29922563
7039,0.0,-0.4976471
7049,0.0,-0.05786383
7059,0.0,0.09265536
7069,0.0,-0.36321038
7079,0.0,-0.083235145
7089,0.0,-0.17139375
7099,0.0,-0.19323039
7109,0.0,-0.3613292
7119,0.0,-0.2926861
7129,0.0,-0.12774134
7139,0.0,-0.1567244
7149,0.0,-0.10295707
7159,0.0,-0.054593563
7169,0.0,-0.09196782
7179,0.0,-0.19424611
7189,0.0,0.13737583
7199,0.0,-0.07367158
7209,0.0,0.19957876
7219,0.0,-0.055850387
7229,0.0,0.277422
7239,0.0,0.123882055
7249,0.0,0.24848074
7259,0.0,0.039351225
7269,0.0,-0.13648689
7279,0.0,0.076752186
7289,0.0,0.1601947
7299,0.0,0.20170766
7309,0.0,0.23938382
7319,0.0,-0.13748312
7329,0.0,0.09710896
7339,0.0,0.39509428
7349,0.0,-0.053162575
7359,0.0,0.21249402
7369,0.0,0.29882014
7379,0.0,0.19412881
7389,0.0,0.27700394
7399,0.0,0.20540929
7409,0.0,0.46373028
7419,0.0,0.25809848
7429,0.0,0.13360703
7439,0.0,-0.12268448
7449,0.0,0.13992763
7459,0.0,0.029838204
7469,0.0,-0.05743003
7479,0.0,0.12730348
7489,0.0,0.028025627
7499,0.0,-0.03917992
7509,0.0,-0.08509588
7519,0.0,-0.0044677258
7529,0.0,-0.12831008
7539,0.0,0.026888251
7549,0.0,-0.2588055
7559,0.0,-0.22788608
7569,0.0,0.05174768
7579,0.0,-0.35710526
7589,0.0,-0.24123222
7599,0.0,-0.0018619299
7609,0.0,-0.08412635
7619,0.0,-0.0903703
7629,0.0,-0.44075406
7639,0.0,0.024680853
7649,0.0,-0.038416266
7659,0.0,-0.13799387
7669,0.0,0.17627472
7679,0.0,-0.07053816
7689,0.0,-0.22929013
7699,0.0,-0.20619649
7709,0.0,-0.048949003
7719,0.0,0.09316051
7729,0.0,-0.18558109
7739,0.0,-0.32665944
7749,0.0,-0.16211611
7759,0.0,-0.045310795
7769,0.0,-0.25197494
7779,0.0,0.16760957
7789,0.0,-0.1327458
7799,0.0,-0.16867179
7809,0.0,-0.2604164
7819,0.0,-0.28807294
7829,0.0,0.013628185
7839,0.0,0.013122141
7849,0.0,0.21556592
7859,0.0,0.06447983
7869,0.0,-0.22280812
7879,0.0,0.08416659
7889,0.0,-0.18220627
7899,0.0,0.26628625
7909,0.0,0.010048151
7919,0.0,-0.124578476
7929,0.0,0.32348526
7939,0.0,0.07149255
7949,0.0,0.12634718
7959,0.0,0.02734679
7969,0.0,-0.00012814999
7979,0.0,-0.14450431
7989,0.0,-0.06681609
7999,0.0,0.011490941
8009,1.0,0.022599816
8019,1.0,0.15383136
8029,1.0,0.031579375
8039,1.0,0.022275448
8049,1.0,0.08177745
8059,1.0,0.12220192
8069,1.0,0.1468417
8079,1.0,0.21508443
8089,1.0,0.57255226
8099,1.0,0.5706086
8109,1.0,-0.1219939
8119,1.0,0.3778392
8129,1.0,0.5108819
8139,1.0,0.44299805
8149,1.0,0.32261038
8159,1.0,0.52382654
8169,1.0,0.7211214
8179,1.0,0.38465106
8189,1.0,0.6529284
8199,1.0,0.65946555
8209,1.0,1.4696112
8219,1.0,1.31158
8229,1.0,0.8627569
8239,1.0,1.2314849
8249,1.0,1.1628177
8259,1.0,2.1760015
8269,1.0,1.9752941
8279,1.0,1.4989538
8289,1.0,2.351853
8299,1.0,2.2400784
8309,1.0,2.183391
8319,1.0,1.8342562
8329,1.0,2.3002737
8339,1.0,2.9831576
8349,1.0,2.9028013
8359,1.0,3.112225
8369,1.0,3.341075
8379,1.0,3.3225114
8389,1.0,4.075617
8399,1.0,4.918975
8409,1.0,3.995523
8419,1.0,4.692625
8429,1.0,4.685571
8439,1.0,5.142235
8449,1.0,4.657264
8459,1.0,6.246443
8469,1.0,5.829542
8479,1.0,6.8051596
8489,1.0,6.6785164
8499,1.0,7.2159753
8509,1.0,6.7966137
8519,1.0,7.700157
8529,1.0,6.391143
8539,1.0,7.3658423
8549,1.0,5.416857
8559,1.0,5.207928
8569,1.0,5.1277523
8579,1.0,5.0258007
8589,1.0,4.985961
8599,1.0,5.036256
8609,1.0,4.1612706
8619,1.0,4.4307733
8629,1.0,3.8818824
8639,1.0,3.303003
8649,1.0,3.513106
8659,1.0,2.6698446
8669,1.0,3.0514507
8679,1.0,2.3720427
8689,1.0,2.4196434
8699,1.0,2.1876853
8709,1.0,1.4547744
8719,1.0,2.0703192
8729,1.0,1.6477536
8739,1.0,1.483029
8749,1.0,1.1281354
8759,1.0,1.4843049
8769,1.0,1.5142676
8779,1.0,0.6390359
8789,1.0,1.0551026
8799,1.0,1.0058373
8809,1.0,0.06369996
8819,1.0,0.3020097
8829,1.0,0.7043508
8839,1.0,0.34501207
8849,1.0,0.42038405
8859,1.0,0.28753436
8869,1.0,0.15613186
8879,1.0,0.53921866
8889,1.0,0.019559741
8899,1.0,0.5177674
8909,1.0,-0.30431908
8919,1.0,0.45422423
8929,1.0,0.052678347
8939,1.0,-0.07904875
8949,1.0,0.11848068
8959,1.0,-0.03167224
8969,1.0,-0.16437423
8979,1.0,-0.17972815
8989,1.0,0.20436221
8999,1.0,0.20151556
9009,0.0,-0.2323947
9019,0.0,0.23466897
9029,0.0,0.22530454
9039,0.0,0.035932064
9049,0.0,0.09226072
9059,0.0,-0.32052004
9069,0.0,0.3566929
9079,0.0,0.0065488815
9089,0.0,-0.064352095
9099,0.0,-0.31261832
9109,0.0,0.09443045
9119,0.0,0.18497819
9129,0.0,-0.5687071
9139,0.0,-0.08663827
9149,0.0,-0.028029323
9159,0.0,0.23071736
9169,0.0,-0.344051
9179,0.0,-0.27098525
9189,0.0,-0.05797738
9199,0.0,-0.15201783
9209,0.0,-0.08494902
9219,0.0,-0.035206437
9229,0.0,-0.25057948
9239,0.0,0.24155974
9249,0.0,0.122716784
9259,0.0,0.28615505
9269,0.0,0.011431336
9279,0.0,0.040632963
9289,0.0,0.403625
9299,0.0,0.053079367
9309,0.0,0.06604493
9319,0.0,-0.040830255
9329,0.0,0.55397743
9339,0.0,0.1547513
9349,0.0,-0.18013895
9359,0.0,0.014721036
9369,0.0,0.20099348
9379,0.0,0.43137842
9389,0.0,-0.35220647
9399,0.0,-0.14330328
9409,0.0,-0.33452928
9419,0.0,0.27064466
9429,0.0,-0.06739223
9439,0.0,-0.012803495
9449,0.0,0.22869724
9459,0.0,0.037902176
9469,0.0,0.061823606
9479,0.0,0.18121672
9489,0.0,0.10739714
9499,0.0,0.43062842
9509,0.0,0.022055209
9519,0.0,0.2731744
9529,0.0,0.03820473
9539,0.0,0.35947835
9549,0.0,0.19054902
9559,0.0,0.047525525
9569,0.0,0.0957464
9579,0.0,0.16361654
9589,0.0,0.15900427
9599,0.0,0.055841208
9609,0.0,0.012907386
9619,0.0,0.30674648
9629,0.0,-0.03654647
9639,0.0,0.010424256
9649,0.0,0.30144507
9659,0.0,0.026309252
9669,0.0,-0.04294157
9679,0.0,0.10710251
9689,0.0,-0.17813694
9699,0.0,0.05948603
9709,0.0,-0.025776267
9719,0.0,-0.079735875
9729,0.0,-0.048535585
9739,0.0,-0.13168573
9749,0.0,-0.1683532
9759,0.0,-0.03194189
9769,0.0,-0.033527374
9779,0.0,-0.20489973
9789,0.0,-0.105834246
9799,0.0,-0.14981127
9809,0.0,0.22803503
9819,0.0,0.35457063
9829,0.0,0.3509447
9839,0.0,0.52116776
9849,0.0,0.444556
9859,0.0,0.13394076
9869,0.0,0.31372952
9879,0.0,0.3990392
9889,0.0,0.17323852
9899,0.0,0.07335591
9909,0.0,0.088158846
9919,0.0,0.1136539
9929,0.0,0.051626563
9939,0.0,0.29015207
9949,0.0,0.00542295
9959,0.0,0.5162854
9969,0.0,0.40584207
9979,0.0,0.47973895
9989,0.0,0.2642213
9999,0.0,0.046830416
10009,1.0,0.42111403
10019,1.0,-0.03282821
10029,1.0,0.2672873
10039,1.0,0.26276827
10049,1.0,0.15337801
10059,1.0,0.22422993
10069,1.0,0.14317167
10079,1.0,0.5631374
10089,1.0,0.04619491
10099,1.0,0.47090948
10109,1.0,0.50459516
10119,1.0,0.7519115
10129,1.0,1.0175822
10139,1.0,0.6328744
10149,1.0,0.89872617
10159,1.0,0.6226619
10169,1.0,0.99928707
10179,1.0,0.5822096
10189,1.0,1.0395617
10199,1.0,0.5258457
10209,1.0,0.81732285
10219,1.0,1.2069153
10229,1.0,1.1796346
10239,1.0,1.2405605
10249,1.0,1.1095011
10259,1.0,0.91886413
10269,1.0,0.78962934
10279,1.0,1.5790557
10289,1.0,1.203982
10299,1.0,1.844032
10309,1.0,1.8375707
10319,1.0,1.7989345
10329,1.0,2.5165675
10339,1.0,2.0543454
10349,1.0,3.4623423
10359,1.0,2.5631862
10369,1.0,2.8787625
10379,1.0,3.8464901
10389,1.0,3.1324682
10399,1.0,4.15496
10409,1.0,4.4196634
10419,1.0,4.8232803
10429,1.0,4.976449
10439,1.0,4.7095313
10449,1.0,4.9434834
10459,1.0,5.8328857
10469,1.0,6.413768
10479,1.0,6.1484585
10489,1.0,7.536979
10499,1.0,7.369055
10509,1.0,7.3340316
10519,1.0,7.127634
10529,1.0,6.619087
10539,1.0,6.7277412
10549,1.0,6.338007
10559,1.0,4.9346094
10569,1.0,4.241495
10579,1.0,5.266932
10589,1.0,3.988971
10599,1.0,3.4745321
10609,1.0,4.260601
10619,1.0,3.611655
10629,1.0,2.2420006
10639,1.0,3.4176753
10649,1.0,3.2450995
10659,1.0,2.8766232
10669,1.0,2.8238206
10679,1.0,2.978115
10689,1.0,1.7344458
10699,1.0,2.520636
10709,1.0,1.484534
10719,1.0,1.3770206
10729,1.0,1.0494562
10739,1.0,1.1469407
10749,1.0,1.4656296
10759,1.0,1.3811066
10769,1.0,1.1102177
10779,1.0,1.0819117
10789,1.0,0.978148
10799,1.0,0.8620372
10809,1.0,0.47046882
10819,1.0,0.64408886
10829,1.0,0.7604186
10839,1.0,0.7985843
10849,1.0,0.49330658
10859,1.0,0.3394282
10869,1.0,0.33578873
10879,1.0,0.5988503
10889,1.0,0.24874783
10899,1.0,0.28970718
10909,1.0,-0.16038883
10919,1.0,-0.09568441
10929,1.0,-0.15422928
10939,1.0,0.14480317
10949,1.0,0.0464617
10959,1.0,-0.34962553
10969,1.0,-0.038178444
10979,1.0,0.38423014
10989,1.0,-0.022193909
10999,1.0,-0.07904112
11009,0.0,-0.07252216
11019,0.0,-0.36385357
11029,0.0,0.07710594
11039,0.0,0.033105314
11049,0.0,0.20779145
11059,0.0,0.020447135
11069,0.0,0.031938612
11079,0.0,0.24688876
11089,0.0,0.11911565
11099,0.0,7.605553e-05
11109,0.0,-0.15120101
11119,0.0,0.039815307
11129,0.0,0.1915415
11139,0.0,-0.042203784
11149,0.0,-0.17636085
11159,0.0,0.0773952
11169,0.0,0.12246728
11179,0.0,0.27424037
11189,0.0,0.13428748
11199,0.0,0.2459594
11209,0.0,-0.07631099
11219,0.0,0.4112475
11229,0.0,-0.18716156
11239,0.0,-0.10660875
11249,0.0,0.2707749
11259,0.0,0.2670344
11269,0.0,0.14976317
11279,0.0,-0.15570986
11289,0.0,-0.23176432
11299,0.0,0.075037
11309,0.0,-0.010654449
11319,0.0,0.21524459
11329,0.0,0.16776872
11339,0.0,0.16676402
11349,0.0,0.444777
11359,0.0,-0.016326189
11369,0.0,0.073608875
11379,0.0,-0.30888617
11389,0.0,0.2537614
11399,0.0,0.26146144
11409,0.0,-0.10855681
11419,0.0,-0.003887713
11429,0.0,0.023662984
11439,0.0,-0.15336466
11449,0.0,0.1401447
11459,0.0,-0.057951212
11469,0.0,0.1080786
11479,0.0,-0.12528765
11489,0.0,-0.007872641
11499,0.0,-0.2514785
11509,0.0,-0.085761905
11519,0.0,0.21343094
11529,0.0,-0.21995181
11539,0.0,0.06591618
11549,0.0,0.14770246
11559,0.0,-0.086037636
11569,0.0,-0.06976706
11579,0.0,-0.039215922
11589,0.0,0.21068645
11599,0.0,0.087791264
11609,0.0,0.030082703
11619,0.0,0.23034143
11629,0.0,0.13346732
11639,0.0,0.067516446
11649,0.0,-0.16004157
11659,0.0,0.03010726
11669,0.0,-0.11698139
11679,0.0,0.11229789
11689,0.0,-0.15978706
11699,0.0,-0.0014346838
11709,0.0,0.099140644
11719,0.0,-0.034115314
11729,0.0,-0.1573019
11739,0.0,0.0001783371
11749,0.0,-0.09399581
11759,0.0,0.11639589
11769,0.0,-0.1372214
11779,0.0,-0.05989051
11789,0.0,-0.2426222
11799,0.0,-0.0059173107
11809,0.0,0.125296
11819,0.0,0.40116584
11829,0.0,0.31916386
11839,0.0,0.26703727
11849,0.0,0.09246516
11859,0.0,-0.020567417
11869,0.0,-0.5912398
11879,0.0,0.04522705
11889,0.0,0.09575367
11899,0.0,0.40856445
11909,0.0,0.2502368
11919,0.0,-0.15954441
11929,0.0,0.18659925
11939,0.0,0.086907744
11949,0.0,-0.21607423
11959,0.0,0.027842462
11969,0.0,-0.10874081
11979,0.0,-0.23316205
11989,0.0,-0.29122323
11999,0.0,-0.37390858
12009,1.0,-0.5371382
12019,1.0,0.0069179535
12029,1.0,-0.45445412
12039,1.0,-0.22678119
12049,1.0,-0.32740605
12059,1.0,-0.05956161
12069,1.0,-0.022179186
12079,1.0,-0.45515347
12089,1.0,-0.1813761
12099,1.0,0.022443414
12109,1.0,-0.48748827
12119,1.0,-0.08845937
12129,1.0,-0.2400564
12139,1.0,0.31582743
12149,1.0,0.3501594
12159,1.0,0.26548684
12169,1.0,0.07909626
12179,1.0,0.7193407
12189,1.0,0.8902418
12199,1.0,0.6609173
12209,1.0,1.3068395
12219,1.0,0.7734022
12229,1.0,1.1589756
12239,1.0,0.6525414
12249,1.0,0.80539465
12259,1.0,1.4257729
12269,1.0,2.0912943
12279,1.0,1.9201448
12289,1.0,1.3259677
12299,1.0,2.1287029
12309,1.0,2.2216973
12319,1.0,2.5962403
12329,1.0,2.1152344
12339,1.0,2.6207988
12349,1.0,3.056006
12359,1.0,3.3529494
12369,1.0,3.788723
12379,1.0,3.710835
12389,1.0,3.1263404
12399,1.0,4.4383516
12409,1.0,4.3373537
12419,1.0,5.0419507
12429,1.0,3.7863998
12439,1.0,5.375869
12449,1.0,6.055758
12459,1.0,6.567013
12469,1.0,6.3548384
12479,1.0,6.227839
12489,1.0,7.2613964
12499,1.0,7.870776
12509,1.0,8.228586
12519,1.0,7.525816
12529,1.0,6.3217573
12539,1.0,5.8221226
12549,1.0,5.8504925
12559,1.0,5.230916
12569,1.0,4.7831693
12579,1.0,4.293737
12589,1.0,3.2916555
12599,1.0,3.2602656
12609,1.0,3.9282734
12619,1.0,3.3282325
12629,1.0,3.1441808
12639,1.0,3.4910362
12649,1.0,2.9933252
12659,1.0,2.559487
12669,1.0,2.6014268
12679,1.0,1.9094851
12689,1.0,1.525426
12699,1.0,1.4539502
12709,1.0,2.0305207
12719,1.0,2.5982528
12729,1.0,1.8242298
12739,1.0,1.9987717
12749,1.0,1.8370627
12759,1.0,0.71808314
12769,1.0,0.529848
12779,1.0,1.2601776
12789,1.0,0.57756174
12799,1.0,0.47437543
12809,1.0,0.64501894
12819,1.0,0.693218
12829,1.0,0.3279333
12839,1.0,1.382522
12849,1.0,0.119606435
12859,1.0,0.67781115
12869,1.0,0.5955923
12879,1.0,0.15413952
12889,1.0,0.24579358
12899,1.0,0.13657558
12909,1.0,0.19975877
12919,1.0,-0.16087914
12929,1.0,0.24171674
12939,1.0,0.19381607
12949,1.0,0.26817536
12959,1.0,-0.10478306
12969,1.0,0.29709476
12979,1.0,-0.36186016
12989,1.0,-0.25258207
12999,1.0,0.13551497
13009,0.0,-0.01604408
13019,0.0,0.11933392
13029,0.0,0.09547275
13039,0.0,0.15024543
13049,0.0,0.24799764
13059,0.0,0.020907521
13069,0.0,0.4173442
13079,0.0,-0.19730437
13089,0.0,-0.13904494
13099,0.0,-0.03872037
13109,0.0,-0.11961007
13119,0.0,-0.2208212
13129,0.0,-0.036664724
13139,0.0,-0.047198176
13149,0.0,-0.12431991
13159,0.0,0.18109661
13169,0.0,-0.42532802
13179,0.0,-0.056803346
13189,0.0,0.29028398
13199,0.0,0.031606555
13209,0.0,-0.059804797
13219,0.0,-0.19847357
13229,0.0,-0.14102638
13239,0.0,0.12261683
13249,0.0,0.029455304
13259,0.0,0.1922543
13269,0.0,-0.29514563
13279,0.0,-0.3158484
13289,0.0,-0.1741767
13299,0.0,0.18217403
13309,0.0,-0.10994768
13319,0.0,-0.09147167
13329,0.0,-0.04331076
13339,0.0,-0.27486378
13349,0.0,-0.0013985634
13359,0.0,0.0029672384
13369,0.0,-0.0031116009
13379,0.0,-0.18227327
13389,0.0,0.20191675
13399,0.0,-0.1623525
13409,0.0,-0.13219172
13419,0.0,-0.13288498
13429,0.0,-0.027268052
13439,0.0,0.11311132
13449,0.0,-0.115361035
13459,0.0,0.032296896
13469,0.0,-0.12767506
13479,0.0,-0.5152286
13489,0.0,-0.2633674
13499,0.0,-0.08937442
13509,0.0,-0.25071317
13519,0.0,-0.22021925
13529,0.0,-0.3852136
13539,0.0,-0.30213332
13549,0.0,-0.24152422
13559,0.0,0.035752952
13569,0.0,-0.46685225
13579,0.0,-0.08085847
13589,0.0,-0.383366
13599,0.0,0.26900947
13609,0.0,-0.52566093
13619,0.0,-0.068609476
13629,0.0,-0.1984896
13639,0.0,-0.043083966
13649,0.0,-0.19846189
13659,0.0,0.12639666
13669,0.0,-0.0848341
13679,0.0,0.16355449
13689,0.0,0.2713638
13699,0.0,0.27729815
13709,0.0,0.092144966
13719,0.0,0.36950213
13729,0.0,-0.17169797
13739,0.0,0.16251498
13749,0.0,-0.10398173
13759,0.0,-0.08657253
13769,0.0,-0.12923163
13779,0.0,0.053893983
13789,0.0,-0.40139103
13799,0.0,-0.1964395
13809,0.0,-0.09256041
13819,0.0,0.010107219
13829,0.0,-0.04196489
13839,0.0,-0.13691181
13849,0.0,0.09512246
13859,0.0,-0.20045877
13869,0.0,-0.254538
13879,0.0,-0.08834875
13889,0.0,0.00011253357
13899,0.0,-0.12473118
13909,0.0,-0.30365747
13919,0.0,-0.10644251
13929,0.0,0.11767006
13939,0.0,-0.22418404
13949,0.0,-0.026083052
13959,0.0,-0.61811775
13969,0.0,0.34619337
13979,0.0,0.19094121
13989,0.0,0.065344095
13999,0.0,0.0236696
14009,1.0,0.34096134
14019,1.0,-0.19158423
14029,1.0,-0.06689119
14039,1.0,-0.0457533
14049,1.0,-0.21535927
14059,1.0,-0.20277196
14069,1.0,-0.026123345
14079,1.0,-0.17447007
14089,1.0,0.093811095
14099,1.0,-0.12709403
14109,1.0,0.1968987
14119,1.0,0.67722625
14129,1.0,0.29508626
14139,1.0,0.33664918
14149,1.0,0.47246468
14159,1.0,0.14620507
14169,1.0,0.23799956
14179,1.0,0.813639
14189,1.0,0.4910671
14199,1.0,0.5046282
14209,1.0,1.3819178
14219,1.0,0.83879286
14229,1.0,1.3319275
14239,1.0,1.1012926
14249,1.0,0.86157334
14259,1.0,1.8282144
14269,1.0,1.1180739
14279,1.0,1.3703327
14289,1.0,1.9424126
14299,1.0,2.053901
14309,1.0,1.8511645
14319,1.0,2.6796494
14329,1.0,2.523733
14339,1.0,2.112251
14349,1.0,3.6662054
14359,1.0,3.1078806
14369,1.0,3.8365412
14379,1.0,3.8796687
14389,1.0,4.4825406
14399,1.0,3.3338273
14409,1.0,3.3323252
14419,1.0,4.538208
14429,1.0,4.783059
14439,1.0,6.2177224
14449,1.0,5.1958146
14459,1.0,7.0812364
14469,1.0,7.330184
14479,1.0,7.013982
14489,1.0,7.2255225
14499,1.0,8.87751
14509,1.0,8.695663
14519,1.0,6.5675955
14529,1.0,6.8927164
14539,1.0,6.668276
14549,1.0,6.254818
14559,1.0,6.012494
14569,1.0,4.395256
14579,1.0,4.5862575
14589,1.0,4.790903
14599,1.0,4.36961
14609,1.0,4.2100677
14619,1.0,3.0399885
14629,1.0,3.1840887
14639,1.0,3.11757
14649,1.0,2.7550244
14659,1.0,2.8169866
14669,1.0,2.6881738
14679,1.0,2.211215
14689,1.0,2.2851362
14699,1.0,2.1149511
14709,1.0,2.6696243
14719,1.0,1.2646704
14729,1.0,1.9008461
14739,1.0,1.1220173
14749,1.0,1.3077911
14759,1.0,0.98012364
14769,1.0,1.4063401
14779,1.0,1.3519357
14789,1.0,1.0167836
14799,1.0,0.64038885
14809,1.0,0.7549549
14819,1.0,0.9604198
14829,1.0,0.6683159
14839,1.0,0.60715944
14849,1.0,0.7025417
14859,1.0,0.36245185
14869,1.0,0.17155242
14879,1.0,0.21183419
14889,1.0,0.1134243
14899,1.0,0.46802586
14909,1.0,-0.12537152
14919,1.0,-0.14224255
14929,1.0,0.17156488
14939,1.0,0.053730607
14949,1.0,0.15033019
14959,1.0,0.20384121
14969,1.0,-0.051611066
14979,1.0,0.31014496
14989,1.0,0.043911338
14999,1.0,0.15488124
15009,0.0,0.18439221
15019,0.0,0.29074162
15029,0.0,-0.10698056
15039,0.0,0.19026959
15049,0.0,-0.0183537
15059,0.0,-0.06220126
15069,0.0,-0.1951549
15079,0.0,-0.037756026
15089,0.0,0.01841575
15099,0.0,-0.02081877
15109,0.0,0.13913697
15119,0.0,0.12558371
15129,0.0,-0.15364933
15139,0.0,0.061356485
15149,0.0,0.118468344
15159,0.0,0.018544853
15169,0.0,-0.024762034
15179,0.0,0.30584544
15189,0.0,0.054707766
15199,0.0,0.13984156
15209,0.0,-0.2109862
15219,0.0,0.056564808
15229,0.0,0.10675824
15239,0.0,0.35902113
15249,0.0,-0.024285793
15259,0.0,0.16158748
15269,0.0,-0.013099074
15279,0.0,0.76238716
15289,0.0,0.03910339
15299,0.0,0.45470864
15309,0.0,0.52633286
15319,0.0,0.30601424
15329,0.0,0.516098
15339,0.0,0.32660288
15349,0.0,0.501121
15359,0.0,0.6258495
15369,0.0,0.60737324
15379,0.0,0.48104733
15389,0.0,0.67054176
15399,0.0,0.29517728
15409,0.0,0.66211104
15419,0.0,0.60591155
15429,0.0,0.4331581
15439,0.0,0.34172976
15449,0.0,0.06382275
15459,0.0,0.2987275
15469,0.0,0.4122758
15479,0.0,0.44021994
15489,0.0,0.49508536
15499,0.0,0.15740192
15509,0.0,0.42007512
15519,0.0,0.2945559
15529,0.0,0.18000984
15539,0.0,0.30277884
15549,0.0,0.5652351
15559,0.0,0.020199776
15569,0.0,0.3428043
15579,0.0,0.1580587
15589,0.0,0.024239898
15599,0.0,0.06347138
15609,0.0,0.13116723
15619,0.0,0.024006844
15629,0.0,0.12442464
15639,0.0,0.16957086
15649,0.0,0.04719895
15659,0.0,0.046369553
15669,0.0,-0.037356615
15679,0.0,0.21020019
15689,0.0,0.094065666
15699,0.0,-0.31849647
15709,0.0,0.22468847
15719,0.0,-0.29837364
15729,0.0,0.097687066
15739,0.0,0.028561115
15749,0.0,0.5396801
15759,0.0,0.24835122
15769,0.0,0.12761128
15779,0.0,-0.10810816
15789,0.0,0.109215975
15799,0.0,-0.16348678
15809,0.0,0.3457216
15819,0.0,0.17207181
15829,0.0,0.22529197
15839,0.0,-0.6509277
15849,0.0,-0.0517146
15859,0.0,-0.24953175
15869,0.0,-0.022720397
15879,0.0,0.052541435
15889,0.0,0.114886284
15899,0.0,-0.020481706
15909,0.0,-0.0172562
15919,0.0,-0.38174486
15929,0.0,0.0966354
15939,0.0,-0.1038506
15949,0.0,0.06288612
15959,0.0,0.13326561
15969,0.0,0.18758827
15979,0.0,0.41492492
15989,0.0,0.34083986
15999,0.0,-0.1302141
16009,1.0,0.08390212
16019,1.0,0.28566378
16029,1.0,0.3561551
16039,1.0,0.36375725
16049,1.0,0.4725402
16059,1.0,0.52671206
16069,1.0,0.40715224
16079,1.0,0.08985567
16089,1.0,0.1857549
16099,1.0,0.0053316355
16109,1.0,0.18658078
16119,1.0,0.13467884
16129,1.0,0.25440466
16139,1.0,0.32908314
16149,1.0,0.34486496
16159,1.0,0.2358216
16169,1.0,0.45669222
16179,1.0,0.78650576
16189,1.0,0.7421556
16199,1.0,0.5869245
16209,1.0,0.9410226
16219,1.0,1.3785295
16229,1.0,1.1232507
16239,1.0,1.1491714
16249,1.0,1.3498089
16259,1.0,0.89302075
16269,1.0,1.866916
16279,1.0,1.6908474
16289,1.0,1.7167778
16299,1.0,2.1959052
16309,1.0,2.6246662
16319,1.0,2.1279106
16329,1.0,1.8537543
16339,1.0,2.4777675
16349,1.0,3.481252
16359,1.0,4.7002335
16369,1.0,3.5876155
16379,1.0,4.355381
16389,1.0,3.71227
16399,1.0,4.192027
16409,1.0,4.6764016
16419,1.0,5.1183033
16429,1.0,6.1274366
16439,1.0,5.7653704
16449,1.0,5.9036055
16459,1.0,6.219695
16469,1.0,5.3743777
16479,1.0,7.0350933
16489,1.0,8.033211
16499,1.0,7.155505
16509,1.0,8.336237
16519,1.0,7.522283
16529,1.0,6.5948467
16539,1.0,7.120558
16549,1.0,5.5153427
16559,1.0,5.315113
16569,1.0,4.589037
16579,1.0,5.1339035
16589,1.0,4.644743
16599,1.0,4.320028
16609,1.0,3.91831
16619,1.0,3.858492
16629,1.0,3.4155781
16639,1.0,3.621866
16649,1.0,2.203261
16659,1.0,2.9321399
16669,1.0,2.0353024
16679,1.0,2.8179126
16689,1.0,1.6571878
16699,1.0,1.6986274
16709,1.0,1.990343
16719,1.0,1.4301634
16729,1.0,1.1009666
16739,1.0,1.2461244
16749,1.0,0.58994806
16759,1.0,0.42547476
16769,1.0,0.6242732
16779,1.0,0.9709885
16789,1.0,0.6006175
16799,1.0,0.48522532
16809,1.0,0.27113736
16819,1.0,0.15485632
16829,1.0,0.49291694
16839,1.0,0.36801368
16849,1.0,0.64003456
16859,1.0,0.22243392
16869,1.0,0.25726497
16879,1.0,0.3859555
16889,1.0,0.3385461
16899,1.0,0.18668115
16909,1.0,-0.08038759
16919,1.0,-0.05585432
16929,1.0,-0.13137162
16939,1.0,0.14018011
16949,1.0,-0.06801975
16959,1.0,-0.12200177
16969,1.0,-0.2444998
16979,1.0,-0.1642173
16989,1.0,-0.032249093
16999,1.0,0.27790618
17009,0.0,0.31156564
17019,0.0,0.2461636
17029,0.0,0.12170088
17039,0.0,-0.14144802
17049,0.0,0.26625156
17059,0.0,-0.04750359
17069,0.0,-0.16328835
17079,0.0,-0.028735518
17089,0.0,-0.07546353
17099,0.0,0.27664602
17109,0.0,0.0037368536
17119,0.0,-0.24296236
17129,0.0,-0.04034388
17139,0.0,-0.2277081
17149,0.0,-0.0067396164
17159,0.0,-0.2301482
17169,0.0,-0.104243815
17179,0.0,-0.28711677
17189,0.0,-0.14038211
17199,0.0,0.026529789
17209,0.0,-0.043711662
17219,0.0,-0.10568106
17229,0.0,-0.054579258
17239,0.0,-0.07495344
17249,0.0,0.14531988
17259,0.0,0.38830292
17269,0.0,0.20946383
17279,0.0,0.15972787
17289,0.0,0.020144224
17299,0.0,-0.11602974
17309,0.0,-0.12300241
17319,0.0,0.063266516
17329,0.0,-0.17284703
17339,0.0,-0.11885226
17349,0.0,0.3103199
17359,0.0,-0.10103464
17369,0.0,0.27781045
17379,0.0,0.49207383
17389,0.0,0.22223055
17399,0.0,0.6945478
17409,0.0,0.2851144
17419,0.0,0.5804109
17429,0.0,0.18910384
17439,0.0,0.22378969
17449,0.0,0.1925776
17459,0.0,0.07255113
17469,0.0,-0.015581608
17479,0.0,0.39532542
17489,0.0,-0.006957531
17499,0.0,0.31066895
17509,0.0,0.17733109
17519,0.0,0.25668126
17529,0.0,-0.20893347
17539,0.0,0.0024144053
17549,0.0,0.32625246
17559,0.0,-0.0020840168
17569,0.0,-0.27611786
17579,0.0,0.08146441
17589,0.0,0.14557755
17599,0.0,-0.068837404
17609,0.0,0.029954314
17619,0.0,-0.17257112
17629,0.0,-0.09425783
17639,0.0,-0.23333538
17649,0.0,-0.2042352
17659,0.0,-0.28715324
17669,0.0,-0.24834663
17679,0.0,-0.2438435
17689,0.0,0.006024301
17699,0.0,0.020884037
17709,0.0,0.1030643
17719,0.0,0.22343194
17729,0.0,0.077747345
17739,0.0,0.34569252
17749,0.0,0.0065193176
17759,0.0,0.5734295
17769,0.0,0.3132918
17779,0.0,0.34592605
17789,0.0,0.36934078
17799,0.0,0.24713862
17809,0.0,0.018471122
17819,0.0,0.5367571
17829,0.0,0.044674873
17839,0.0,0.25439095
17849,0.0,0.48116976
17859,0.0,0.5504043
17869,0.0,0.7091143
17879,0.0,0.47727102
17889,0.0,0.78547263
17899,0.0,0.56072605
17909,0.0,0.9248596
17919,0.0,0.4749133
17929,0.0,0.33057785
17939,0.0,0.6904672
17949,0.0,0.43579406
17959,0.0,0.35047692
17969,0.0,0.46778977
17979,0.0,0.15682328
17989,0.0,0.48164874
17999,0.0,0.21434128
18009,1.0,0.68013966
18019,1.0,0.24756265
18029,1.0,-0.012567461
18039,1.0,-0.044451237
18049,1.0,0.42927647
18059,1.0,1.0506017
18069,1.0,0.96590185
18079,1.0,0.2493769
18089,1.0,0.17243218
18099,1.0,0.70760643
18109,1.0,0.4461739
18119,1.0,0.43282187
18129,1.0,0.29378545
18139,1.0,0.19811082
18149,1.0,0.27277088
18159,1.0,0.8250002
18169,1.0,0.53090286
18179,1.0,0.36799657
18189,1.0,0.6156268
18199,1.0,0.32461286
18209,1.0,1.1352038
18219,1.0,0.6420058
18229,1.0,1.0563716
18239,1.0,1.2127923
18249,1.0,1.769289
18259,1.0,1.3844595
18269,1.0,1.6946967
18279,1.0,1.9389789
18289,1.0,1.9127591
18299,1.0,1.7335563
18309,1.0,1.635702
18319,1.0,2.2105696
18329,1.0,2.6935084
18339,1.0,2.2947242
18349,1.0,2.5321276
18359,1.0,3.9549646
18369,1.0,3.4588974
18379,1.0,3.973766
18389,1.0,4.3395433
18399,1.0,4.575734
18409,1.0,5.257781
18419,1.0,5.019146
18429,1.0,4.6293087
18439,1.0,4.663409
18449,1.0,5.3345933
18459,1.0,5.913044
18469,1.0,4.8627214
18479,1.0,6.346346
18489,1.0,7.642153
18499,1.0,8.135704
18509,1.0,7.7358565
18519,1.0,7.710634
18529,1.0,6.5542417
18539,1.0,5.696459
18549,1.0,6.571489
18559,1.0,5.8881006
18569,1.0,5.302726
18579,1.0,5.616883
18589,1.0,4.2361927
18599,1.0,4.8707213
18609,1.0,4.9435067
18619,1.0,4.5249233
18629,1.0,3.4409597
18639,1.0,3.129887
18649,1.0,2.557655
18659,1.0,3.011078
18669,1.0,3.0713286
18679,1.0,1.905674
18689,1.0,1.8107345
18699,1.0,1.6605961
18709,1.0,2.119532
18719,1.0,2.315923
18729,1.0,1.8625714
18739,1.0,1.7042314
18749,1.0,1.5686126
18759,1.0,0.87904894
18769,1.0,1.3270049
18779,1.0,1.7287765
18789,1.0,1.427518
18799,1.0,1.0641892
18809,1.0,1.5139116
18819,1.0,1.067787
18829,1.0,0.74362034
18839,1.0,0.6271399
18849,1.0,0.8054191
18859,1.0,0.7698803
18869,1.0,0.46787983
18879,1.0,0.6092095
18889,1.0,0.4919263
18899,1.0,0.056793094
18909,1.0,0.37556708
18919,1.0,0.11223662
18929,1.0,-0.044982553
18939,1.0,0.00473392
18949,1.0,-0.0017668009
18959,1.0,0.23299229
18969,1.0,0.059027195
18979,1.0,-0.19771147
18989,1.0,0.07587683
18999,1.0,0.094281495
19009,0.0,0.0027014017
19019,0.0,-0.21820307
19029,0.0,-0.18857217
19039,0.0,0.012239635
19049,0.0,0.009180784
19059,0.0,-0.33043176
19069,0.0,-0.12742543
19079,0.0,-0.21595728
19089,0.0,-0.3115213
19099,0.0,-0.09176493
19109,0.0,-0.09051871
19119,0.0,-0.18160701
19129,0.0,0.06825733
19139,0.0,0.029026985
19149,0.0,-0.13604867
19159,0.0,0.23777103
19169,0.0,0.12978023
19179,0.0,0.13186133
19189,0.0,-0.11908686
19199,0.0,0.057944953
19209,0.0,-0.27711135
19219,0.0,0.073140025
19229,0.0,0.25862235
19239,0.0,-0.32220912
19249,0.0,0.22142106
19259,0.0,-0.078145325
19269,0.0,-0.3783927
19279,0.0,-0.12664735
19289,0.0,-0.11243248
19299,0.0,-0.103456795
19309,0.0,0.090298116
19319,0.0,-0.31682122
19329,0.0,-0.42918563
19339,0.0,-0.017912745
19349,0.0,0.092526436
19359,0.0,-0.1686939
19369,0.0,-0.18121934
19379,0.0,0.12554914
19389,0.0,-0.13510275
19399,0.0,-0.23725396
19409,0.0,-0.3000462
19419,0.0,-0.24884075
19429,0.0,0.07398152
19439,0.0,-0.24563491
19449,0.0,-0.015436292
19459,0.0,0.36627424
19469,0.0,-0.085986435
19479,0.0,-0.04028833
19489,0.0,0.16807729
19499,0.0,-0.10055542
19509,0.0,0.027710795
19519,0.0,-0.08859122
19529,0.0,-0.12555349
19539,0.0,-0.17507392
19549,0.0,0.1827529
19559,0.0,-0.042283416
19569,0.0,0.009737849
19579,0.0,-0.028757453
19589,0.0,0.00406456
19599,0.0,0.079803586
19609,0.0,0.45319337
19619,0.0,0.24867761
19629,0.0,0.4475149
19639,0.0,0.46640742
19649,0.0,0.57300246
19659,0.0,0.4476241
19669,0.0,0.35620928
19679,0.0,1.2017567
19689,0.0,0.96593046
19699,0.0,0.5302316
19709,0.0,0.6592074
19719,0.0,0.5824576
19729,0.0,0.7280055
19739,0.0,0.7097616
19749,0.0,0.98658174
19759,0.0,1.3179181
19769,0.0,0.9140527
19779,0.0,0.92004335
19789,0.0,0.68022275
19799,0.0,1.0909104
19809,0.0,0.9754776
19819,0.0,1.0673826
19829,0.0,0.2746352
19839,0.0,0.2092799
19849,0.0,0.7310991
19859,0.0,0.6055552
19869,0.0,1.0370252
19879,0.0,0.52651125
19889,0.0,0.4174791
19899,0.0,0.54526806
19909,0.0,0.5603702
19919,0.0,0.33747005
19929,0.0,0.25214577
19939,0.0,-0.000715971
19949,0.0,0.09971237
19959,0.0,-0.37351
19969,0.0,0.11171806
19979,0.0,-0.15919429
19989,0.0,0.06947124
19999,0.0,-0.2661209
