T,S,Score
999,0,0.0028258524466378
1009,0,0.012283506849201209
1019,0,0.008918820677497552
1029,0,0.009827328086486009
1039,0,0.005442536070121073
1049,0,0.004144161928652412
1059,0,0.008227577878115566
1069,0,0.008330294962052676
1079,0,0.012159151285619951
1089,0,0.01538028811747133
1099,0,0.017761313013674396
1109,0,0.021694265066997565
1119,0,0.030873036142726573
1129,0,0.03036679150287347
1139,0,0.029766228403704742
1149,0,0.029529535235466586
1159,0,0.028903267224748397
1169,0,0.027201123472426925
1179,0,0.025347239769114516
1189,0,0.017771084087898847
1199,0,0.01951592512843836
1209,0,0.02539386423072748
1219,0,0.02849078645851061
1229,0,0.03043768025956628
1239,0,0.035353488524689836
1249,0,0.03059406752790661
1259,0,0.030613952018351376
1269,0,0.031601436176269204
1279,0,0.032208009662939685
1289,0,0.0331411454026076
1299,0,0.030694827880619502
1309,0,0.031271885804573574
1319,0,0.03049240965747113
1329,0,0.027261986612842737
1339,0,0.02137083259677186
1349,0,0.01851284062955122
1359,0,0.01454485608015571
1369,0,0.019886747697672014
1379,0,0.027471502047742347
1389,0,0.022147106475659317
1399,0,0.016962416424668558
1409,0,0.01735667561314269
1419,0,0.019037849616815317
1429,0,0.021255843181671286
1439,0,0.022060851456673414
1449,0,0.015027933478563682
1459,0,0.005291757097040772
1469,0,0.005314968714591195
1479,0,0.00525908046907575
1489,0,0.005145374714807194
1499,0,0.006626229123721683
1509,0,0.005180148372965265
1519,0,0.005133211790336933
1529,0,0.005148447821423374
1539,0,0.01203270421136815
1549,0,0.005184564985566409
1559,0,0.005159617587296439
1569,0,0.005171937387956127
1579,0,0.005158901807097438
1589,0,0.005150520061129982
1599,0,0.005187769210606097
1609,0,0.005188355368350828
1619,0,0.0051312092074346505
1629,0,0.005142261857907393
1639,0,0.005151491192354918
1649,0,0.005173773997396824
1659,0,0.005181116236266103
1669,0,0.0052004886023782615
1679,0,0.005261810376458342
1689,0,0.007501712812684802
1699,0,0.015511005339698125
1709,0,0.015435125828955565
1719,0,0.013357308177557203
1729,0,0.014969956603450296
1739,0,0.01882869767182782
1749,0,0.020817970148674092
1759,0,0.024113906821458697
1769,0,0.020069426994589135
1779,0,0.024435351487132217
1789,0,0.021725821057620276
1799,0,0.021328212212733788
1809,0,0.023708806023116924
1819,0,0.031937984911331374
1829,0,0.033348564593933594
1839,0,0.0362092546577133
1849,0,0.03168981445151531
1859,0,0.030974261903397915
1869,0,0.010944387883093099
1879,0,0.0051809924209400005
1889,0,0.005356135874364121
1899,0,0.005030956502544981
1909,0,0.015131051468462775
1919,0,0.018224459870359255
1929,0,0.029719566967818245
1939,0,0.0320874020389561
1949,0,0.04499692788816945
1959,0,0.09333576539806399
1969,0,0.0702197943057048
1979,0,0.1202708230435684
1989,0,0.050462329067837985
1999,0,0.03449779677658599
2009,0,0.03668942021132393
2019,0,0.0328532809866815
2029,0,0.01384841195895642
2039,0,0.035732015221244695
2049,0,0.025623156505884648
2059,0,0.08653077888458327
2069,0,0.004379657928927472
2079,0,0.02792884189450051
2089,0,0.0555234494825394
2099,0,0.02208163751155856
2109,0,0.027171236591056913
2119,0,0.02905987046788583
2129,0,0.012751012915553583
2139,0,0.022757273440764392
2149,0,0.027153093804087147
2159,0,0.011151931696111506
2169,0,0.011355841334419803
2179,0,0.005065189026528083
2189,0,0.005167896330735
2199,0,0.005218793974264113
2209,0,0.00782476782926661
2219,0,0.006948978102769565
2229,0,0.01362220923512475
2239,0,0.023783097866949432
2249,0,0.025481640104997427
2259,0,0.02823496414236598
2269,0,0.0276991748976535
2279,0,0.02468605384574496
2289,0,0.016049630188814612
2299,0,0.012663576453619652
2309,0,0.009698980049517802
2319,0,0.011321682645962894
2329,0,0.005288068750114228
2339,0,0.005242069566295804
2349,0,0.005203527369431804
2359,0,0.005177255099609868
2369,0,0.002393413335342154
2379,0,0.007287569358580437
2389,0,0.011969400095608485
2399,0,0.020097848500665705
2409,0,0.030139905071853823
2419,0,0.03777403210601288
2429,0,0.04355440080042783
2439,0,0.042957267730285076
2449,0,0.04669159036071996
2459,0,0.05202943079076677
2469,0,0.05666451384636528
2479,0,0.06296695990825046
2489,0,0.06051651488314863
2499,0,0.04925996565801105
2509,0,0.04622655358864858
2519,0,0.04520989952134241
2529,0,0.04231192739331929
2539,0,0.03962752962956395
2549,0,0.026016926269801732
2559,0,0.02832438160543782
2569,0,0.02764966958617948
2579,0,0.0239264395506949
2589,0,0.019264761722770696
2599,0,0.01240280073944755
2609,0,0.008895177114877195
2619,0,0.0001631873256359162
2629,0,0.00789103427350335
2639,0,0.008970019905969573
2649,0,0.020793945791187263
2659,0,0.03215636246084941
2669,0,0.04080207777736439
2679,0,0.04651116820352447
2689,0,0.0542290499019461
2699,0,0.06258634779605843
2709,0,0.05768507187593336
2719,0,0.07073342963346008
2729,0,0.07427335474960367
2739,0,0.08321652005622554
2749,0,0.08074596044792809
2759,0,0.09300339580975575
2769,0,0.09034051248135155
2779,0,0.074631882346546
2789,0,0.05819367748415927
2799,0,0.048126582352719494
2809,0,0.045691245586935436
2819,0,0.029552489388592507
2829,0,0.018927305416588103
2839,0,0.015349631820607224
2849,0,0.01555067767686874
2859,0,0.017888800093643575
2869,0,0.01845745023705825
2879,0,0.020448669013602372
2889,0,0.022331096008079476
2899,0,0.02214544898156723
2909,0,0.01840649653777654
2919,0,0.019478429904644434
2929,0,0.02473771152798976
2939,0,0.02970952528938231
2949,0,0.0242867234263226
2959,0,0.021195761578705397
2969,0,0.023521065407599018
2979,0,0.025047781035497485
2989,0,0.0240004250011564
2999,0,0.025679780478188474
3009,0,0.02452810062211136
3019,0,0.026108966175455106
3029,0,0.023933120627093296
3039,0,0.015946983440493834
3049,0,0.01391022585449092
3059,0,0.012267233273477396
3069,0,0.01123135534923736
3079,0,0.0102134579300166
3089,0,0.013817358275054648
3099,0,0.020912030660991676
3109,0,0.021597847369224377
3119,0,0.02230387637217046
3129,0,0.013808865132992565
3139,0,0.009193599147395537
3149,0,8.81287508319728e-05
3159,0,0.002893002213969431
3169,0,0.020987989853930467
3179,0,0.03198133119618579
3189,0,0.040860758132612085
3199,0,0.04403025202714794
3209,0,0.04161009415599015
3219,0,0.03767771106478124
3229,0,0.04235896883757262
3239,0,0.04813056105232588
3249,0,0.051710823041853815
3259,0,0.06670628237186133
3269,0,0.07300093832467308
3279,0,0.06725603468059099
3289,0,0.05443371374307471
3299,0,0.05206173233890199
3309,0,0.049808116969132676
3319,0,0.04240162364311606
3329,0,0.035811402230173706
3339,0,0.03415442010277586
3349,0,0.03765532380012637
3359,0,0.04166682417752188
3369,0,0.041836129356802976
3379,0,0.04107186855283618
3389,0,0.04354720432115078
3399,0,0.0420352819534906
3409,0,0.03966496296332356
3419,0,0.04917362007372089
3429,0,0.05906999412728986
3439,0,0.06729588135584508
3449,0,0.06383939320685006
3459,0,0.06489945025475796
3469,0,0.07719993199606162
3479,0,0.08277131292180301
3489,0,0.07904584639066892
3499,0,0.07375026612458124
3509,0,0.0684896090270149
3519,0,0.06280366021033162
3529,0,0.06523328364254943
3539,0,0.056268731234858815
3549,0,0.06054535585176851
3559,0,0.06405543958997206
3569,0,0.06577123958725745
3579,0,0.06349495694617963
3589,0,0.06485003538881567
3599,0,0.07168330582470123
3609,0,0.0701949950627101
3619,0,0.06880974806681894
3629,0,0.06772966658902246
3639,0,0.06058962967183523
3649,0,0.05502677800282735
3659,0,0.04042071131270497
3669,0,0.03058401827592505
3679,0,0.023860771545505532
3689,0,0.019394606167479456
3699,0,0.016732108389856948
3709,0,0.020233423889809865
3719,0,0.028200155904842428
3729,0,0.028624025729735714
3739,0,0.025306561996187915
3749,0,0.01910490640999024
3759,0,0.007837789421874963
3769,0,9.24775333339678e-05
3779,0,7.917024955139684e-05
3789,0,6.923477218301333e-05
3799,0,4.6157428186255345e-05
3809,0,4.4892125592777e-05
3819,0,1.1600881066220481e-05
3829,0,9.37594272947262e-05
3839,0,0.00010061528599997205
3849,0,0.00011901465979197168
3859,0,0.0034759075176250542
3869,0,0.007440047148979445
3879,0,0.007575923236022297
3889,0,9.651703374996545e-05
3899,0,2.365831863027079e-05
3909,0,5.709278694254749e-08
3919,0,3.5800694846654935e-05
3929,0,6.123262570584265e-05
3939,0,0.0021257603242873513
3949,0,8.847275820961231e-05
3959,0,8.802346583008935e-05
3969,0,0.00802060119235437
3979,0,0.011277051581755737
3989,0,0.00577381999538501
3999,0,6.271824967157835e-05
4009,0,2.7154080127655966e-05
4019,0,4.0594745982280855e-05
4029,0,5.1357031948695564e-05
4039,0,6.0267366966682e-05
4049,0,0.005099654356285177
4059,0,0.01836081947213053
4069,0,0.02279446286858594
4079,0,0.017883745475967328
4089,0,0.008755594295910274
4099,0,0.004794804078082637
4109,0,0.00490224328527783
4119,0,0.006648500688179904
4129,0,0.010745442015109297
4139,0,0.012209091411825745
4149,0,0.011266109857718865
4159,0,0.01104725745323254
4169,0,0.008941250314306592
4179,0,0.009130164213159486
4189,0,0.01180886231850925
4199,0,0.009552005320563217
4209,0,0.00983006454991614
4219,0,0.01517976765989787
4229,0,0.01841399528260612
4239,0,0.015295252594325903
4249,0,0.015061196583407377
4259,0,0.01252255333280411
4269,0,0.010345839170400717
4279,0,0.012826698718214125
4289,0,0.015930199922850885
4299,0,0.009401978165547775
4309,0,0.006265120290029014
4319,0,1.8882461353508795e-05
4329,0,8.919037888632797e-05
4339,0,0.00010868733835506239
4349,0,0.0018707868007959427
4359,0,0.004903194966525692
4369,0,0.010670619318824015
4379,0,0.012377139395410575
4389,0,0.007156943362197521
4399,0,0.00010844638506696258
4409,0,6.371701239299421e-05
4419,0,4.933210140323219e-05
4429,0,2.161725202903808e-05
4439,0,2.0160546931435874e-05
4449,0,5.740177277946401e-08
4459,0,4.442318490127661e-05
4469,0,2.0176938416271994e-05
4479,0,1.6029721174093403e-05
4489,0,3.975065871181238e-05
4499,0,0.007060924973382399
4509,0,0.01224141272689322
4519,0,0.014238794274861188
4529,0,0.02091583687530335
4539,0,0.02238635254477528
4549,0,0.011128764964267124
4559,0,7.499710436009721e-08
4569,0,9.919596759500049e-06
4579,0,0.001883067443669173
4589,0,0.009567320965025106
4599,0,0.013549511703807082
4609,0,0.01412364343499073
4619,0,0.0138331353489613
4629,0,0.009550000489254307
4639,0,0.008912824494194227
4649,0,0.006109163253042338
4659,0,7.82836688772992e-05
4669,0,5.625620205468307e-05
4679,0,2.9172300848090416e-05
4689,0,1.1911385411345066e-07
4699,0,2.148709699095752e-05
4709,0,1.4799763739192784e-05
4719,0,1.2406133647002715e-05
4729,0,1.2433544056555945e-05
4739,0,1.9411751514486486e-05
4749,0,6.159928412979854e-05
4759,0,0.002945188740123783
4769,0,7.534266355246899e-05
4779,0,7.442039977290094e-05
4789,0,0.004581091973297147
4799,0,5.3022587813256195e-05
4809,0,1.9572071874918162e-05
4819,0,4.547989588066237e-05
4829,0,7.038936872283408e-05
4839,0,6.698682100853004e-05
4849,0,9.00101313476287e-05
4859,0,0.007427713963413463
4869,0,0.010541999235811395
4879,0,0.010408508616362167
4889,0,0.00888714692834347
4899,0,0.008016019491349557
4909,0,0.0034044376775935747
4919,0,0.003949735173102875
4929,0,0.002426230223716741
4939,0,0.00331599971448171
4949,0,8.375358975976077e-05
4959,0,1.5719406833203386e-05
4969,0,8.868493395486343e-06
4979,0,3.022171699462728e-05
4989,0,7.583937856026068e-05
4999,0,0.005313520093753299
5009,0,0.00876425092864197
5019,0,0.017156239293696363
5029,0,0.02743524671527081
5039,0,0.03318038273722579
5049,0,0.03048230978917954
5059,0,0.023301500078681703
5069,0,0.023952371498458802
5079,0,0.023156494733981514
5089,0,0.018384051325023187
5099,0,0.010440717795417442
5109,0,0.01177089439351936
5119,0,0.01609702621229886
5129,0,0.014282269465404673
5139,0,0.012476428948480667
5149,0,0.00454225188314511
5159,0,6.956666698887393e-05
5169,0,5.038823719039076e-05
5179,0,2.9943422340805714e-05
5189,0,2.836887334878302e-05
5199,0,6.486151677403962e-05
5209,0,6.060776603522555e-05
5219,0,8.63780373144829e-05
5229,0,8.797327967879909e-05
5239,0,8.075778977112424e-05
5249,0,2.5638349909096192e-05
5259,0,7.46498968645648e-06
5269,0,7.310168662866268e-05
5279,0,0.00814957403367672
5289,0,0.013998219171885762
5299,0,0.02093853205371954
5309,0,0.020400696404130614
5319,0,0.01942890554024257
5329,0,0.015097755911783584
5339,0,0.01404744146207687
5349,0,0.009523681578942012
5359,0,0.01790286578708611
5369,0,0.020228978718820567
5379,0,0.014909183278899119
5389,0,0.014361574157117196
5399,0,0.018501877580336223
5409,0,0.01668368056104652
5419,0,0.016070889200659022
5429,0,0.01681588755176666
5439,0,0.017275567746779352
5449,0,0.018540654615462115
5459,0,0.014656337793475693
5469,0,0.011798278879335045
5479,0,0.008057804923252698
5489,0,0.007562589578400669
5499,0,0.009703714729273782
5509,0,0.005060053463142866
5519,0,6.335876883806213e-05
5529,0,3.438580722830986e-05
5539,0,0.006330510992597516
5549,0,0.01162622922899098
5559,0,0.014254441894840597
5569,0,0.013063823241475037
5579,0,0.006413236747967177
5589,0,0.00010355642709508617
5599,0,3.065772982457915e-05
5609,0,5.516208072514628e-05
5619,0,0.0026654375293053145
5629,0,0.004681782295438086
5639,0,9.197308019676109e-05
5649,0,-9.998000982669453e-09
5659,0,4.027924780447556e-05
5669,0,4.317762551003801e-05
5679,0,3.393444574656401e-05
5689,0,1.026860841740751e-05
5699,0,6.653595990291361e-05
5709,0,8.655327486645215e-05
5719,0,0.003933147391748382
5729,0,0.008793848825959905
5739,0,0.011016352523341433
5749,0,0.007688462089867842
5759,0,0.010261303377020747
5769,0,0.01237680053789092
5779,0,0.021090857730328594
5789,0,0.034736348276498685
5799,0,0.03888570836231153
5809,0,0.03756224746949094
5819,0,0.03413698570154272
5829,0,0.03009192340414729
5839,0,0.031191125351875237
5849,0,0.02537839610223891
5859,0,0.020040562190125344
5869,0,0.021602140141249726
5879,0,0.021413717714412916
5889,0,0.01331145468162237
5899,0,0.015545167720120656
5909,0,0.018613439085684524
5919,0,0.021438966315298902
5929,0,0.023075660625357153
5939,0,0.0239086790998031
5949,0,0.025833509788851794
5959,0,0.02455259215079325
5969,0,0.022311948942600635
5979,0,0.019505611294334535
5989,0,0.02213369678782484
5999,0,0.01892655807832405
6009,0,0.009608106390502913
6019,0,0.00391394190283223
6029,0,5.901241077993502e-05
6039,0,0.0037621108885833032
6049,0,0.010706387148039731
6059,0,0.013920038209416674
6069,0,0.014938518291569391
6079,0,0.011503195586717307
6089,0,0.007962018192753495
6099,0,0.007588528081879042
6109,0,0.01266289061573378
6119,0,0.015446782071774579
6129,0,0.014659770986428733
6139,0,0.011513838701758594
6149,0,0.00805455755358575
6159,0,0.002309277304223478
6169,0,3.3338733481991234e-05
6179,0,3.4572743121519256e-05
6189,0,3.89617221311922e-05
6199,0,0.002883387738160048
6209,0,6.18569372519695e-05
6219,0,2.3844486660928865e-05
6229,0,3.805936234257956e-05
6239,0,1.5873672497224156e-05
6249,0,9.098783460637083e-05
6259,0,0.0001222869314968511
6269,0,0.0001143742199528619
6279,0,1.4354660561433086e-05
6289,0,5.236332787744713e-05
6299,0,1.8018395081254024e-05
6309,0,1.2784657487385775e-05
6319,0,3.763294197339784e-05
6329,0,3.6336869732478405e-05
6339,0,1.6443476601346596e-05
6349,0,6.0957549711304626e-05
6359,0,0.00012637063318088337
6369,0,0.00011192197909537516
6379,0,0.00013675275838542778
6389,0,0.006423257482959743
6399,0,0.00813567188004094
6409,0,0.00013755222463440742
6419,0,7.739887894459008e-05
6429,0,3.600357642274954e-05
6439,0,3.6136143988785285e-05
6449,0,5.885492402407655e-05
6459,0,8.613747859931298e-05
6469,0,6.299727321351645e-05
6479,0,7.138979785775712e-05
6489,0,8.781865659696075e-05
6499,0,0.00011945309955724293
6509,0,0.006535461790461217
6519,0,0.012259033774922434
6529,0,0.013363414847081923
6539,0,0.01980258951940056
6549,0,0.021022169813766034
6559,0,0.026059280907192173
6569,0,0.025400190415630797
6579,0,0.029143674512368545
6589,0,0.026460509242552444
6599,0,0.024435302597863584
6609,0,0.02629590409300442
6619,0,0.02278905167194989
6629,0,0.01780309797571733
6639,0,0.01864151420924559
6649,0,0.023553442903453736
6659,0,0.019427695701058567
6669,0,0.005151825207180438
6679,0,0.0023235078874995763
6689,0,0.00230309335820722
6699,0,0.008958301503387223
6709,0,0.00010077682277026545
6719,0,0.00010893456263766366
6729,0,0.0038338859419925764
6739,0,0.012201329074199074
6749,0,0.02478903802474186
6759,0,0.025449816455092367
6769,0,0.027026907492876673
6779,0,0.02342197818703179
6789,0,0.024062061670927004
6799,0,0.03316532061796462
6809,0,0.03551928209758404
6819,0,0.03355556644687663
6829,0,0.031853326770627355
6839,0,0.02859463397111528
6849,0,0.02970723342274867
6859,0,0.033592159311543635
6869,0,0.02760614696597491
6879,0,0.02922679233008213
6889,0,0.02988807026812146
6899,0,0.028785731103124657
6909,0,0.019074254939906776
6919,0,0.014687784415255756
6929,0,0.011518802444980825
6939,0,0.009442637127780817
6949,0,0.010637410004887826
6959,0,0.008068604782996092
6969,0,0.005000100239786309
6979,0,0.006781026176121752
6989,0,0.007658928661715914
6999,0,0.008888996420343964
7009,0,0.004362818624494447
7019,0,0.004995561910374757
7029,0,0.005445261022906045
7039,0,0.0001449933996253705
7049,0,8.251489172472759e-05
7059,0,7.798171366457662e-05
7069,0,9.396284554125112e-05
7079,0,0.00014879981555626642
7089,0,0.00014356841706247847
7099,0,9.922637410486601e-05
7109,0,0.0001136911778243932
7119,0,7.741704975872121e-05
7129,0,7.626420853396043e-05
7139,0,8.804720177751912e-05
7149,0,0.00013923585566127938
7159,0,0.00011310450811102823
7169,0,2.7978977221121415e-05
7179,0,1.1734587920697592e-05
7189,0,2.3740088658796843e-05
7199,0,0.0001499490714517715
7209,0,0.00012066688053674612
7219,0,1.232963254238495e-05
7229,0,0.004053256918386983
7239,0,0.011019619869965469
7249,0,0.0157063397469005
7259,0,0.01090434421807368
7269,0,0.010436065958479401
7279,0,0.01103293656819948
7289,0,0.012488303878768037
7299,0,0.016852577042403116
7309,0,0.020268894879111876
7319,0,0.01739819070886295
7329,0,0.013689024779639347
7339,0,0.01486114659756771
7349,0,0.012817656658475396
7359,0,0.012143707869933074
7369,0,0.005430142340480226
7379,0,0.0078878293950288
7389,0,0.010810836093470444
7399,0,0.01145836439005743
7409,0,0.0018382899711180678
7419,0,6.710489598527047e-05
7429,0,0.0018047132311811431
7439,0,0.003596160250509628
7449,0,6.33084566353248e-05
7459,0,4.298756002285575e-05
7469,0,3.845828398379991e-05
7479,0,9.043778635364763e-06
7489,0,1.0013574303080475e-08
7499,0,1.5084290188760452e-05
7509,0,5.848215532738843e-05
7519,0,0.0014087778494521475
7529,0,0.0018213274641067367
7539,0,0.01177883346568609
7549,0,0.011193591107818146
7559,0,0.006774735588576053
7569,0,0.007215697185226022
7579,0,7.189395412471322e-05
7589,0,3.1340297293236397e-05
7599,0,4.751977604783297e-05
7609,0,8.932975003872468e-06
7619,0,5.2136553477521996e-05
7629,0,0.006128447410109428
7639,0,0.003747303066953922
7649,0,0.0001245195737740734
7659,0,8.895771380507123e-05
7669,0,5.554849187894284e-05
7679,0,7.556486689364039e-05
7689,0,7.789037529448706e-05
7699,0,0.00013033584343180582
7709,0,0.004332938268193309
7719,0,0.0042870325668663
7729,0,0.00013878221156105042
7739,0,0.00010870701393383975
7749,0,9.499047774425007e-05
7759,0,0.00012994374865082925
7769,0,0.001989417996111742
7779,0,0.00010228979543713823
7789,0,7.42544347948626e-05
7799,0,0.0003972043400544134
7809,1,0.004039398760254886
7819,1,0.011238563292607862
7829,1,0.020772490313698988
7839,1,0.030722653164698854
7849,1,0.043709633687846194
7859,1,0.05950854437921027
7869,1,0.0756374679148264
7879,1,0.08296134504508457
7889,1,0.11201398985270872
7899,1,0.09918926746100554
7909,1,0.11257228946974401
7919,1,0.12634230537126656
7929,1,0.14074446803976565
7939,1,0.15546167796833654
7949,1,0.17156110234869287
7959,1,0.18857805843403475
7969,1,0.2058523334157462
7979,1,0.224422205914189
7989,1,0.24096289328694565
7999,1,0.25932647395660297
8009,1,0.29359363149049367
8019,1,0.32538826083067324
8029,1,0.3568146558125882
8039,1,0.39498914151323045
8049,1,0.4084420401064891
8059,1,0.42701030912936044
8069,1,0.4437515694870151
8079,1,0.4793219235008613
8089,1,0.5149020172193286
8099,1,0.5526559789748617
8109,1,0.5955558085286531
8119,1,0.6394449815197982
8129,1,0.6880017289383928
8139,1,0.7415507277311096
8149,1,0.7991766677725873
8159,1,0.8513104374423787
8169,1,0.8930739243052813
8179,1,1.0048078674835266
8189,1,1.0630939041069727
8199,1,1.19719416579518
8209,1,1.2969620296733437
8219,1,1.4214365173728116
8229,1,1.5755444046993288
8239,1,1.7481968583142176
8249,1,-4.452574953014137
8259,1,0.5065433221017004
8269,1,0.5307304931719825
8279,1,3.039146143392897
8289,1,3.754849700252623
8299,1,4.410989079567027
8309,1,4.277123185508005
8319,1,4.4239580702726755
8329,1,4.343615205280907
8339,1,4.242493222063708
8349,1,4.156920993055893
8359,1,4.045657203779166
8369,1,3.945565909423096
8379,1,3.850693196298315
8389,1,3.7606978782538576
8399,1,3.6458717924904267
8409,1,3.545509443220589
8419,1,3.466216111269398
8429,1,3.3523132481830182
8439,1,3.2486486314159815
8449,1,3.1488569143083307
8459,1,3.0529294475830877
8469,1,2.928359585834063
8479,1,2.791801495108254
8489,1,2.68883961090122
8499,1,2.5877347072370354
8509,1,2.494517176164792
8519,1,2.3646098930628923
8529,1,2.2883210667128995
8539,1,2.1901911529604887
8549,1,2.0906517765468333
8559,1,1.9957609831621317
8569,1,1.8959818522108254
8579,1,1.8195308770429741
8589,1,1.7036805165569189
8599,1,1.6059533811606574
8609,1,1.5046934124857478
8619,1,1.3789967995072157
8629,1,1.3008444490352133
8639,1,1.220125986851351
8649,1,1.1242082796543351
8659,1,1.0159010490352653
8669,1,0.933416030782549
8679,1,0.8221255476236924
8689,1,0.7398613367076884
8699,1,0.0009880935095040733
8709,1,0.47835143492729837
8719,1,0.3736241815462772
8729,1,0.3221347794021422
8739,1,0.19833175542131654
8749,1,0.030476992256177282
8759,1,0.04692879051057264
8769,1,-0.04433584595803547
8779,1,0.09451576944240342
8789,1,0.06409897791851354
8799,1,0.08016832404595009
8809,1,0.10066294125768843
8819,1,0.10973170966687845
8829,1,0.14487236614607746
8839,1,0.14047180738343862
8849,1,0.1458152398595825
8859,1,0.13723724482471583
8869,1,0.11102850058926444
8879,1,0.09287372685378775
8889,1,0.09541827168513345
8899,1,0.10733182110191902
8909,1,0.14681742605538983
8919,1,0.14286486361936684
8929,1,0.14504682250584638
8939,1,0.11496134546855935
8949,1,0.08662517212373072
8959,1,0.06563876636775196
8969,1,0.09141454341744204
8979,1,0.08812210923190056
8989,1,0.13081993784277923
8999,1,0.049005768902057545
9009,1,0.035113273080388696
9019,1,0.07370279877543562
9029,1,0.012052704566344552
9039,1,0.003843637445198389
9049,1,0.08140965310310766
9059,1,0.008114970856916148
9069,1,0.003811028894144086
9079,1,0.05729075116656257
9089,1,0.08510333309532436
9099,1,0.008095384916930404
9109,1,0.008531575809779202
9119,1,0.06653878881111464
9129,1,0.008949847435837377
9139,1,0.009073993467649533
9149,1,0.009249307920922656
9159,1,0.045952960695317735
9169,1,0.007446555291301671
9179,1,0.05042848165824887
9189,1,0.07058611033822665
9199,1,0.08072484860563878
9209,1,0.12174379024381088
9219,1,0.24634383356938738
9229,1,0.13330161478501112
9239,1,0.18709729894574423
9249,1,0.14161896546709085
9259,1,0.18082009024651258
9269,1,0.15283426033689407
9279,1,0.1674480615331041
9289,1,0.1817669402503812
9299,1,0.2031423824020554
9309,1,0.21198010591139244
9319,1,0.277614443593461
9329,1,0.300412276929896
9339,1,0.2832772330280278
9349,1,0.5105412410193461
9359,1,0.5375189743225343
9369,1,0.27741171843783063
9379,1,0.3806470567418917
9389,1,0.38663789453384734
9399,1,0.28145469315903193
9409,1,0.7036240335558259
9419,1,0.35482707431518307
9429,1,0.36329780651010773
9439,1,0.6160903726612238
9449,1,0.26889428907357354
9459,1,0.22751430056280475
9469,1,0.16254365231387585
9479,1,0.151808546467609
9489,1,0.19923168242258849
9499,1,0.1490531410835922
9509,1,0.17026322005828232
9519,1,0.16749391216897525
9529,1,0.13813041841607743
9539,1,0.09795309406888414
9549,1,0.1096188056254932
9559,1,0.08528455796457035
9569,1,0.07968457223458575
9579,1,0.14349391868534406
9589,1,0.07370929902152035
9599,1,0.04135210398695016
9609,1,0.009449098147012724
9619,1,0.07612741912698823
9629,1,0.0737559274065055
9639,1,0.03476605489981027
9649,1,0.060834911898898114
9659,1,0.03198614452849913
9669,1,0.09341187446508431
9679,1,0.02960972195174788
9689,1,0.005041649019678129
9699,1,0.02191285189303116
9709,1,0.025157660422970796
9719,1,0.030236061546474513
9729,1,0.03629251387158999
9739,1,0.004705160244193041
9749,1,0.004818461844653232
9759,1,0.005061859054184492
9769,1,0.06227622716154835
9779,1,0.00379966521325531
9789,1,0.005999688891795585
9799,1,0.004902798874009517
9809,1,0.003917978611439943
9819,1,0.0011285906622320874
9829,1,0.01583424118695731
9839,1,0.0014235822601672554
9849,1,0.0013610925120564055
9859,1,0.0014961358679428383
9869,1,0.00024620453513879426
9879,1,0.0032874590373260792
9889,1,0.004509491319434733
9899,1,0.007222501361422329
9909,1,0.10469113981971634
9919,1,0.004665575726124027
9929,1,0.0063100161589388915
9939,1,0.06343111468645635
9949,1,0.00496314513698054
9959,1,0.09641839405938912
9969,1,0.11374668164399948
9979,1,0.053675387024209154
9989,1,0.04536666213782903
9999,1,0.011362044853338027
10009,1,0.058899662829909105
10019,1,0.04784109701920253
10029,1,0.09618027592932238
10039,1,0.14354680203917303
10049,1,0.10001937951863055
10059,1,0.3672301737316045
10069,1,0.18315516548458566
10079,1,0.26534677838975906
10089,1,0.30698315054754466
10099,1,0.26870645439839913
10109,1,0.26766408781820517
10119,1,0.4912752366596549
10129,1,0.21483876835254379
10139,1,0.18150534203573032
10149,1,0.021562288697912102
10159,1,0.11178223637109541
10169,1,0.1264718382944584
10179,1,0.021372280695368506
10189,1,0.11437238403358885
10199,1,0.2437878003849382
10209,1,0.036517385466407815
10219,1,0.06324679244319908
10229,1,0.04478835201760367
10239,1,0.07682112546819259
10249,1,0.1677728258677995
10259,1,0.0509386062482341
10269,1,0.10503462379830975
10279,1,0.032096732917423376
10289,1,0.09740458967766324
10299,1,0.1694183187271482
10309,1,0.28234494375738817
10319,1,0.23903958016670002
10329,1,0.3331266042445712
10339,1,0.2520621087924806
10349,1,0.2710840957506495
10359,1,0.24531961758663
10369,1,0.2932483830168763
10379,1,0.2676630563068231
10389,1,0.30859659330533895
10399,1,0.3449394565015399
10409,1,0.2711990070414124
10419,1,0.1947345015680217
10429,1,0.16427594939261853
10439,1,0.09314078523812042
10449,1,0.027215196799224073
10459,1,0.0788362099148891
10469,1,0.1292696125965891
10479,1,0.033007467778893684
10489,1,0.02307098020960696
10499,1,0.0015360320639046798
10509,1,0.0036665409228708867
10519,1,0.003293076067044376
10529,1,0.012333795627363586
10539,1,0.01803588055612626
10549,1,0.03998299328851296
10559,1,0.04967385362081256
10569,1,0.016302949376862164
10579,1,0.03574191039365687
10589,1,0.1893615439525238
10599,1,0.21005288908034903
10609,1,0.45788584566145685
10619,1,0.1699780634050575
10629,1,0.17222756410890877
10639,1,0.17524340187439302
10649,1,0.34492269471539255
10659,1,0.2919071541513639
10669,1,0.4702997741243543
10679,1,0.24321490442676397
10689,1,0.262294990468802
10699,1,0.6535178044056352
10709,1,0.7309494310837151
10719,1,0.7675897394819586
10729,1,0.6338839306701893
10739,1,0.8836359941851132
10749,1,0.08519484466262633
10759,1,0.9966276256909482
10769,1,0.6274371126106582
10779,1,1.2495826452760306
10789,1,0.6852871663793921
10799,1,1.052462751960098
10809,1,0.8799754109664816
10819,1,1.399862894360849
10829,1,1.4873773924054379
10839,1,1.9751812516491787
10849,1,1.5187642740849543
10859,1,1.8201798188664982
10869,1,1.2427242698910508
10879,1,1.0398672130310302
10889,1,0.6406572853103722
10899,1,0.7693746828106011
10909,1,1.284211550625325
10919,1,0.46020810798650014
10929,1,0.7734950519317433
10939,1,0.778375620106355
10949,1,1.0450902031437606
10959,1,1.31090637119592
10969,1,0.9287463689041296
10979,1,0.9556638859413681
10989,1,1.8741724074726043
10999,1,1.5746223856577986
11009,1,1.1275354929653592
11019,1,1.6258289939225277
11029,1,0.37144985142415077
11039,1,0.865672004947319
11049,1,0.2329587365576048
11059,1,1.0942869207171764
11069,1,0.8756490593991489
11079,1,1.2216628759366261
11089,1,0.9747427206234318
11099,1,0.5919514176625567
11109,1,0.5329357521033077
11119,1,0.5884354352885406
11129,1,0.010255715661856846
11139,1,0.4537248593339987
11149,1,0.015532829452612418
11159,1,0.06912057693936552
11169,1,0.29616614018561493
11179,1,0.38275194467806267
11189,1,0.010278028413545637
11199,1,0.029669398829560545
11209,1,0.11345703349077285
11219,1,0.07305281284700404
11229,1,0.06325533008936024
11239,1,0.034415758613660585
11249,1,0.04938131803443602
11259,1,0.04731815314337273
11269,1,0.10774778519171291
11279,1,0.14068372986770195
11289,1,0.11194554559637937
11299,1,0.06884204030576196
11309,1,0.23993368242402857
11319,1,0.08011893953150778
11329,1,0.09998063392828943
11339,1,0.1372509553603803
11349,1,0.20028691998351522
11359,1,0.5557759157617321
11369,1,0.12216014882796733
11379,1,0.3180210309485556
11389,1,0.429143818239616
11399,1,0.20182799506010263
11409,1,-0.10554024959389341
11419,1,0.08826602886140522
11429,1,0.11520753173672793
11439,1,0.11686986924436937
11449,1,0.09401368069241822
11459,1,0.08153366052407413
11469,1,0.06942362450807044
11479,1,0.08499377816975595
11489,1,0.07231543698828358
11499,1,0.02025080984896932
11509,1,0.061688099578636746
11519,1,0.031252076435930864
11529,1,0.06272852413273666
11539,1,0.0012866950383905174
11549,1,0.030068912303228945
11559,1,0.012714305304612594
11569,1,0.017066245961140702
11579,1,0.0018522792147422917
11589,1,0.05618504734633567
11599,1,0.0008814540948063887
11609,1,0.016200570823893923
11619,1,0.042589871734366236
11629,1,0.15538876219822928
11639,1,0.07623325266212755
11649,1,0.1528866497056926
11659,1,0.09066168626534304
11669,1,0.4539956195667855
11679,1,0.29950249845629573
11689,1,0.17227377890607515
11699,1,0.1721088905309916
11709,1,0.23991974599752802
11719,1,0.47293825015462043
11729,1,0.7314557448678567
11739,1,0.6896770605539986
11749,1,0.7160622758068422
11759,1,0.4565594327660433
11769,1,0.3179680341518417
11779,1,0.671522871553067
11789,1,0.4939625673949204
11799,1,0.6437810735059357
11809,1,0.4109930591178566
11819,1,0.8404527969233975
11829,1,0.4282715259092545
11839,1,0.6973723810892759
11849,1,0.8849108461774589
11859,1,1.3138209094759863
11869,1,1.1601952612097877
11879,1,1.1783886895704936
11889,1,1.3187678913091143
11899,1,1.646849277109887
11909,1,1.9252550058781588
11919,1,1.4917741432733918
11929,1,1.5594160401404427
11939,1,0.7921915886461346
11949,1,0.5212360313638219
11959,1,1.160857771215511
11969,1,0.7371292707536488
11979,1,1.1206719069246704
11989,1,1.179262283927661
11999,1,0.9199220628668401
12009,1,0.43932438070136887
12019,1,0.09957725642250481
12029,1,0.44683501728189867
12039,1,0.3025627734167649
12049,1,0.6221665243580251
12059,1,0.10828125655967785
12069,1,0.38780426714739274
12079,1,0.6157694803125721
12089,1,0.17081901641609065
12099,1,0.13104224727772662
12109,1,0.027189945642908664
12119,1,-0.013115319951217785
12129,1,0.00029977829637911624
12139,1,0.42861252108939063
12149,1,0.0011306818050452194
12159,1,0.02217733002376443
12169,1,0.05111530414138288
12179,1,-0.04966397436321501
12189,1,0.0014870490943816317
12199,1,0.025167807009044585
12209,1,0.027400588208757404
12219,1,0.025418727151405918
12229,1,0.04784286460868015
12239,1,0.030106225492670557
12249,1,0.031638771916683295
12259,1,0.03180394402233844
12269,1,0.015233206990626302
12279,1,0.04384216307304095
12289,1,0.04374882969280175
12299,1,0.037710454795206516
12309,1,0.03696446911750867
12319,1,0.013642136319608866
12329,1,0.02461485401737179
12339,1,0.016349461571800616
12349,1,0.021313738995042464
12359,1,0.016574331940242493
12369,1,0.011259807836951852
12379,1,0.030587966008427003
12389,1,0.04480712020521055
12399,1,0.07058370250146428
12409,1,0.16707862849350674
12419,1,0.16813123501811134
12429,1,0.1555907445621058
12439,1,0.15289178604204184
12449,1,0.20286716627404372
12459,1,0.21494964439297898
12469,1,0.24051482895326753
12479,1,0.3585417452142948
12489,1,0.2439792028151373
12499,1,0.3061959244697453
12509,1,0.21202145257255695
12519,1,0.23383139097540429
12529,1,0.19513929651232337
12539,1,0.23837672881163874
12549,1,0.17384451484845959
12559,1,0.1650209447191971
12569,1,0.16105719669710822
12579,1,0.16294440127416837
12589,1,0.27868731496276333
12599,1,0.14570181209528582
12609,1,0.15005988362082479
12619,1,0.11184587638704213
12629,1,0.0862877332747033
12639,1,0.06480367752934663
12649,1,0.055136948779373696
12659,1,0.05820550181964351
12669,1,0.05126586059519467
12679,1,0.05934415330964965
12689,1,0.04579746961709685
12699,1,0.08222885390617074
12709,1,-0.06461931094301976
12719,1,0.045177818624072774
12729,1,0.02971588705794731
12739,1,0.029054593924729477
12749,1,0.02551317321564156
12759,1,0.024221247438445448
12769,1,0.025636109477944258
12779,1,0.020414077468487002
12789,1,0.01718064878898662
12799,1,0.018115000302295514
12809,1,0.021495615119342892
12819,1,0.03142788657165241
12829,1,0.047771038356891116
12839,1,0.0716157282840334
12849,1,0.09152716721476395
12859,1,0.11124002269557526
12869,1,0.12691539013132402
12879,1,0.1375856812031923
12889,1,0.13260253703859226
12899,1,0.12583415191761682
12909,1,0.1014736929832743
12919,1,0.09203562985830421
12929,1,0.07678765571371277
12939,1,0.06627641234488574
12949,1,0.06197266386221584
12959,1,0.050365100864018686
12969,1,0.04618262231913728
12979,1,0.0382913037616911
12989,1,0.03997828162296746
12999,1,0.15239610126277708
13009,1,0.043802682329446396
13019,1,0.04150813276853832
13029,1,0.04973878627373379
13039,1,0.0552683705334901
13049,1,0.06635788120269215
13059,1,0.1730146871868632
13069,1,0.1896593693516636
13079,1,0.06505402940764038
13089,1,0.06596910866759859
13099,1,0.1348571564729314
13109,1,0.081416068938994
13119,1,0.09544918041661271
13129,1,0.28022960682781534
13139,1,0.13570529794955732
13149,1,0.16974969564424547
13159,1,0.28794933319125743
13169,1,0.42384032162096363
13179,1,0.24033988588631783
13189,1,0.6730585359618481
13199,1,0.6047731797257223
13209,1,0.6732662769079358
13219,1,0.19622974277687089
13229,1,0.8688267946965327
13239,1,0.12305158399859117
13249,1,0.5922791600954127
13259,1,0.2946203210395999
13269,1,0.34465146878034736
13279,1,0.6259386683786139
13289,1,0.20343783655789216
13299,1,1.0253885053156244
13309,1,0.960536281917924
13319,1,0.6237619504573102
13329,1,0.8286240134950562
13339,1,0.6719855337106948
13349,1,1.1696176736439858
13359,1,0.946679038115385
13369,1,0.3198702567161631
13379,1,1.154001604628557
13389,1,0.9050728329227455
13399,1,0.8062506559933954
13409,1,0.9031652050223542
13419,1,1.4399505205703473
13429,1,0.9631319664870058
13439,1,0.316423301048585
13449,1,0.2844370115687895
13459,1,0.9480633573207353
13469,1,0.509200167224369
13479,1,0.6051456477405666
13489,1,0.4294022272371006
13499,1,0.5673808853900775
13509,1,0.2661318658378661
13519,1,0.22998811178159634
13529,1,0.4686365624016692
13539,1,0.014094985035585872
13549,1,0.10045282394296895
13559,1,-0.009887712770262236
13569,1,0.3495451848622866
13579,1,0.1987725489480927
13589,1,0.2250259504878221
13599,1,0.2569299697056122
13609,1,0.13220972040518103
13619,1,0.28604899422638785
13629,1,0.07643024253314351
13639,1,0.26893662008697833
13649,1,0.06172534958115622
13659,1,0.2824340901244721
13669,1,0.2558148514042114
13679,1,0.0653291686290195
13689,1,0.2081353261186153
13699,1,0.07097978457446957
13709,1,0.11908073160903332
13719,1,0.08975192560364392
13729,1,0.024160899074007758
13739,1,0.021450320821834068
13749,1,0.021337785986800806
13759,1,0.020885643683583255
13769,1,0.020440145884130734
13779,1,0.020290286726992346
13789,1,0.019055420661833522
13799,1,0.016101576633976933
13809,1,0.01279581469886254
13819,1,0.011154758407317944
13829,1,0.00951843389548268
13839,1,0.013812715011126298
13849,1,0.012672693929396461
13859,1,0.012654531954525816
13869,1,0.012127953307016659
13879,1,0.0883594513673217
13889,1,0.010714522526617587
13899,1,0.00869467504269078
13909,1,0.043251041652675015
13919,1,0.006071128672586634
13929,1,0.06467996976536566
13939,1,0.04805130851309336
13949,1,0.06472398843688776
13959,1,0.009419323938353374
13969,1,0.012072858658274399
13979,1,0.01402988983264064
13989,1,0.014666727357092457
13999,1,0.01566042441838572
14009,1,0.016556519385475754
14019,1,0.08410184092718082
14029,1,0.01684329915932098
14039,1,0.06079693287930643
14049,1,0.02467411489333421
14059,1,0.0940139438997541
14069,1,0.026662255397134405
14079,1,0.16113368021576047
14089,1,0.09586375883337817
14099,1,0.1741548251633378
14109,1,0.1400993772574703
14119,1,0.0844431453997026
14129,1,0.12372746532836726
14139,1,0.03210614255892885
14149,1,0.06771301212642761
14159,1,0.012402917644009304
14169,1,0.012551281414859172
14179,1,0.039842775427320676
14189,1,0.022511725120490766
14199,1,0.03988540794852119
14209,1,0.03242706091981845
14219,1,0.07528592679939528
14229,1,0.06759466046629736
14239,1,0.04574394830701817
14249,1,0.050467525882313846
14259,1,0.11418539977033276
14269,1,0.07611117004848578
14279,1,0.13653810535325017
14289,1,0.1039087236967835
14299,1,0.1315561705929939
14309,1,0.12491680830525498
14319,1,0.14403053160163443
14329,1,0.16501352966873217
14339,1,0.0727111218132297
14349,1,0.11113985316199648
14359,1,0.12595315945837776
14369,1,0.16032546307184892
14379,1,0.19800859913406788
14389,1,0.17308178853690465
14399,1,0.18733059164856253
14409,1,0.289731339063549
14419,1,0.2922977740111807
14429,1,0.18879662218311932
14439,1,0.309256613031612
14449,1,0.20846541338962676
14459,1,0.250767600232458
14469,1,0.18147376810103621
14479,1,0.22358970658203026
14489,1,0.2972850964409788
14499,1,0.24684838416599575
14509,1,0.21172163336170735
14519,1,0.24145010988361676
14529,1,0.11287365789275339
14539,1,0.10116961136985186
14549,1,0.007289722305472479
14559,1,0.023879611050990124
14569,1,0.005750491260129997
14579,1,0.04740953546155802
14589,1,0.01179488489083752
14599,1,0.015516726613730991
14609,1,0.03132264843326055
14619,1,0.10565272463264619
14629,1,0.15118007381002202
14639,1,0.12954955185176303
14649,1,0.20651552680452606
14659,1,0.08580837129973257
14669,1,0.1467609968848716
14679,1,0.18697182482925068
14689,1,0.20429851042536268
14699,1,0.2678177095505274
14709,1,0.17990795028951528
14719,1,0.1236995671026212
14729,1,0.17089237554877085
14739,1,0.15689322673933015
14749,1,0.14285713777504766
14759,1,0.09182243919239275
14769,1,0.1184227656183619
14779,1,0.15328177670931747
14789,1,0.15130241709188114
14799,1,0.15517473305908602
14809,1,0.18811788819790348
14819,1,0.14857029982856707
14829,1,0.15983205805874973
14839,1,0.0968752246381901
14849,1,0.009349315366482758
14859,1,0.13774672212466976
14869,1,0.14002138449478763
14879,1,0.159704420331771
14889,1,0.00813114110588442
14899,1,0.07551366618245148
14909,1,0.12689835291920576
14919,1,0.006495886883694901
14929,1,0.005482987807695905
14939,1,0.006172893964506487
14949,1,0.0858359397721643
14959,1,0.08943467928903631
14969,1,0.005668411589194011
14979,1,0.07246704107176155
14989,1,0.07884802807995311
14999,1,0.05280315223288584
15009,1,0.06124602427943354
15019,1,0.04244693455292059
15029,1,0.0447626142765169
15039,1,0.005214205887926038
15049,1,0.01923258898565733
15059,1,0.005253423538593649
15069,1,0.06951514574861217
15079,1,0.04714243229433085
15089,1,0.036725043781704436
15099,1,0.02972823176836009
15109,1,0.025171613230479617
15119,1,0.0008124966440003489
15129,1,0.00039429935859086607
15139,1,0.0012749548870751304
15149,1,0.002732330937172789
15159,1,0.002522433432680604
15169,1,0.0023942144665391463
15179,1,0.0024281684617992183
15189,1,0.001997008242517362
15199,1,0.0020302653736358756
15209,1,0.002291018498064179
15219,1,0.0027693464800437884
15229,1,0.005059074551575227
15239,1,0.007868013671094964
15249,1,0.0029892586448339586
15259,1,0.002090471688328155
15269,1,0.007673994281067409
15279,1,0.0021043075082632923
15289,1,0.002001258781380688
15299,1,0.013317101412823329
15309,1,0.03817549319684432
15319,1,0.034185815371917394
15329,1,0.0029052292381103184
15339,1,0.0010308646966266655
15349,1,0.0007047159958460392
15359,1,0.000692400521219938
15369,1,0.0009903066298123098
15379,1,0.01701432149764931
15389,1,0.001076068063589397
15399,1,0.04594322102554138
15409,1,0.02782772722154092
15419,1,0.025986648045111027
15429,1,0.0007691269285700075
15439,1,0.014282001903533015
15449,1,0.0011146332990856767
15459,1,0.021737218106609446
15469,1,0.012902652542548187
15479,1,0.0013414593828736665
15489,1,0.002355237920566744
15499,1,0.010775077620944373
15509,1,0.023830668542340006
15519,1,0.025538558659062183
15529,1,0.07435831544040689
15539,1,0.07700151110532577
15549,1,0.09977224070521656
15559,1,0.12246002212414836
15569,1,0.12528064004744627
15579,1,0.08763276956245786
15589,1,0.05739099438305695
15599,1,0.010476346310545337
15609,1,0.0005476162283686303
15619,1,0.001533163898755241
15629,1,0.0011493470017031604
15639,1,0.0007588874498217768
15649,1,4.925737024707999e-06
15659,1,0.0008118855757798249
15669,1,6.637454438296331e-06
15679,1,4.9085734415088567e-05
15689,1,0.0003379789322162652
15699,1,0.002100051699358174
15709,1,0.0024518424432941055
15719,1,0.0021794376685480565
15729,1,0.001647489835273408
15739,1,0.0021032669543168403
15749,1,9.897580748002843e-05
15759,1,0.0010103404593985177
15769,1,0.0011457445910929565
15779,1,0.0009562753158872672
15789,1,0.0011732257870705753
15799,1,0.0014847410893514268
15809,1,0.001939722174429448
15819,1,0.0021632877753474666
15829,1,0.0015715982087113334
15839,1,0.0028876464078476105
15849,1,0.0030274182855816734
15859,1,0.002996110571959476
15869,1,0.018488408313562577
15879,1,0.00212055314567422
15889,1,0.0023197620540034714
15899,1,0.0029253921352642154
15909,1,0.0027163629911348686
15919,1,0.002966316488657472
15929,1,0.0030557721556485617
15939,1,0.003594283708015289
15949,1,0.0037162238370874734
15959,1,0.0032546157916645835
15969,1,0.0030223858624468525
15979,1,0.003080247360304822
15989,1,0.0044475490590698
15999,1,0.00572979814731972
16009,1,0.012206553856764835
16019,1,0.06630532507391956
16029,1,0.048084799789070876
16039,1,0.0640236865440515
16049,1,0.09241798894340653
16059,1,0.11473222870462857
16069,1,0.043783075599482135
16079,1,0.05544839378496769
16089,1,0.04064112338898512
16099,1,0.004001071344680973
16109,1,0.0006309819089624358
16119,1,0.0029833642967274088
16129,1,0.004292987695724559
16139,1,0.004167692647707
16149,1,0.003901877487593075
16159,1,0.0032247105695101252
16169,1,0.003646311949682124
16179,1,0.0036597970144248704
16189,1,0.0050661345010387104
16199,1,0.006094768379345028
