T,S,Score
999,0,0.9979733999913046
1009,0,0.9682849772430245
1019,0,1.0225875861559381
1029,0,1.012638744612095
1039,0,1.0532610233121606
1049,0,1.090449793437303
1059,0,1.1519799623979539
1069,0,1.1606600450893854
1079,0,1.1383349512602612
1089,0,1.322738758602143
1099,0,1.2267128752579228
1109,0,1.179191908126758
1119,0,1.1967731088784026
1129,0,1.136922030701549
1139,0,1.218724186800562
1149,0,1.1871388626439312
1159,0,1.2472137474176292
1169,0,1.1464141930932705
1179,0,1.048667086599485
1189,0,1.0325350576437389
1199,0,0.9777485573104302
1209,0,1.0168791162784059
1219,0,1.0197608957766073
1229,0,1.04490329498048
1239,0,1.071561351521045
1249,0,0.9928939926333855
1259,0,0.9689747204571375
1269,0,0.9867294610196791
1279,0,0.8977360302339609
1289,0,0.8958871620748358
1299,0,0.8963098603646593
1309,0,0.8606968964977586
1319,0,0.9205568565668072
1329,0,0.7958793123701492
1339,0,0.9003930164536365
1349,0,0.7926051623580619
1359,0,0.7763341059577492
1369,0,0.8276141711452407
1379,0,0.8479684612542032
1389,0,0.9046138563282727
1399,0,0.9580060012602143
1409,0,0.9539188104794896
1419,0,1.0560027571549957
1429,0,1.1024337158545394
1439,0,0.9725742344035606
1449,0,0.9624812355019219
1459,0,1.0709035688469641
1469,0,0.9085352270543123
1479,0,0.9335201567801755
1489,0,0.8888172607405885
1499,0,0.8963929883026589
1509,0,1.0050425882446314
1519,0,0.8629840272026518
1529,0,0.7715460296974661
1539,0,0.9259944392549202
1549,0,0.8406908315209836
1559,0,0.8166949002757339
1569,0,0.8182818338577507
1579,0,0.8337608664396253
1589,0,0.9053602274086785
1599,0,0.8813910648642617
1609,0,0.8788811212732294
1619,0,0.7952848412812119
1629,0,0.9512127805901464
1639,0,0.9494461683009945
1649,0,0.9837507780270452
1659,0,0.9041384780479129
1669,0,0.7925355187390838
1679,0,0.8681933193175532
1689,0,0.8179269258246157
1699,0,0.8778227997741747
1709,0,0.9398122729438048
1719,0,1.0298961200482015
1729,0,0.9592396942169109
1739,0,0.9368181430327255
1749,0,1.0814801511475485
1759,0,1.0194003046760596
1769,0,0.990878731679039
1779,0,1.0258465287397083
1789,0,1.0284572448331986
1799,0,0.9981823802459561
1809,0,1.0633112621210818
1819,0,0.9640015825945754
1829,0,1.0045286009820331
1839,0,1.079890471873753
1849,0,1.0754583633086894
1859,0,1.0062120881849128
1869,0,1.0097913591200522
1879,0,1.0211971453442232
1889,0,0.894153012037738
1899,0,0.9857120943877578
1909,0,0.9844150414909109
1919,0,0.9256409911390323
1929,0,0.9993601853880608
1939,0,1.0161614736669136
1949,0,1.0191406520544728
1959,0,1.0505379652880404
1969,0,1.1899811674847836
1979,0,1.072410449703582
1989,0,1.0926054729535961
1999,0,1.0976322693632403
2009,0,1.285410124386411
2019,0,1.172491439976761
2029,0,1.209856802076014
2039,0,1.1173892955822557
2049,0,1.1639721937637693
2059,0,1.045977415094991
2069,0,1.179591650834837
2079,0,1.3097458633643022
2089,0,1.263700193017436
2099,0,1.3888404752134378
2109,0,1.2423640082128564
2119,0,1.368536651565005
2129,0,1.2213026494799082
2139,0,1.2091644079225126
2149,0,1.3172568011584196
2159,0,1.3305463314514248
2169,0,1.38530928443966
2179,0,1.2671614494048775
2189,0,1.3157435282469818
2199,0,1.132399898918156
2209,0,1.250566393962768
2219,0,1.2905658818198011
2229,0,1.4720988033497435
2239,0,1.409997209192853
2249,0,1.4972825713257427
2259,0,1.5274190284502869
2269,0,1.624627964517041
2279,0,1.5367088033938354
2289,0,1.5758880007001255
2299,0,1.4801611885009027
2309,0,1.4459949540836594
2319,0,1.4139559464388243
2329,0,1.3709624931629474
2339,0,1.5131842240174114
2349,0,1.4125830309329577
2359,0,1.4150681639663578
2369,0,1.3233510176789032
2379,0,1.3535830303989955
2389,0,1.3539627822078415
2399,0,1.2891452607091123
2409,0,1.3489627136985525
2419,0,1.332561613031808
2429,0,1.3120329140162714
2439,0,1.3393786799801701
2449,0,1.3423720239742898
2459,0,1.2884326097237466
2469,0,1.1904495643102948
2479,0,1.2072169535915664
2489,0,1.1529069689097353
2499,0,1.2306409319918026
2509,0,1.1968857968649904
2519,0,1.1938432247876012
2529,0,1.1702291637477487
2539,0,1.2238854289565342
2549,0,1.111722546482858
2559,0,1.2041791634057635
2569,0,1.2135591231734904
2579,0,1.0971088112578535
2589,0,1.1877668321683401
2599,0,1.1226386859003352
2609,0,1.0412584074238582
2619,0,1.0094043057122528
2629,0,0.83244713843186
2639,0,0.9339170677051652
2649,0,0.8023378257977748
2659,0,0.8973215348127699
2669,0,0.8861821990932244
2679,0,0.8663250691362179
2689,0,0.9100864184824662
2699,0,1.0325158335235747
2709,0,1.0168908275012818
2719,0,1.0245529332446872
2729,0,1.1161702265380955
2739,0,1.0799272834501197
2749,0,1.1172236783833416
2759,0,1.107846690114192
2769,0,1.1731721664738668
2779,0,1.2365419376444018
2789,0,1.4382192248980483
2799,0,1.2243698436819412
2809,0,1.3725490130380742
2819,0,1.257671670036391
2829,0,1.2188341574281651
2839,0,1.185809936881087
2849,0,1.0558486505416036
2859,0,1.1191454489708226
2869,0,1.1856113019084296
2879,0,1.185407921225056
2889,0,1.1922384008184286
2899,0,1.1628095401546974
2909,0,1.2076108857546337
2919,0,1.1562546829453633
2929,0,1.1425525045515625
2939,0,1.1462076318775463
2949,0,1.2350368455876601
2959,0,1.2771931047540257
2969,0,1.2835450250112248
2979,0,1.1805559962797214
2989,0,1.225850758986282
2999,0,1.0195133423006904
3009,0,1.0770921133410154
3019,0,1.0776669702005741
3029,0,1.0852471984776342
3039,0,1.0951403774034538
3049,0,1.113448655588283
3059,0,1.2499974624227987
3069,0,1.207022559012423
3079,0,1.060499528563867
3089,0,1.1680847709627578
3099,0,0.9625272002941789
3109,0,0.8635034506218661
3119,0,0.917005999262855
3129,0,0.8575486452387339
3139,0,1.0287919126358487
3149,0,1.073325112585998
3159,0,0.9055481655490213
3169,0,0.8643171166440777
3179,0,0.9950990740939325
3189,0,0.9393699164202315
3199,0,1.17518812590721
3209,0,0.9622980973525966
3219,0,1.1050668381176303
3229,0,1.1151269543356046
3239,0,1.2681287282778715
3249,0,1.1209095970924128
3259,0,1.1601043958056296
3269,0,1.1015281138510609
3279,0,1.1159617985413783
3289,0,1.0871986609796023
3299,0,1.1010601475167823
3309,0,1.1105092959650273
3319,0,0.8967071344079365
3329,0,0.9151686742546012
3339,0,1.0458480267189778
3349,0,0.9972537708759533
3359,0,1.0136741542449519
3369,0,0.8480431723321471
3379,0,1.0142318695397798
3389,0,0.9162844157865937
3399,0,0.9864823510654501
3409,0,0.9654248572735735
3419,0,0.9008986056485494
3429,0,0.9412148848569373
3439,0,0.957049389511928
3449,0,0.9077149812714859
3459,0,1.045448256585356
3469,0,1.0966539187688646
3479,0,0.976886102105332
3489,0,0.9279028096582087
3499,0,0.8525742913919069
3509,0,1.0137441699257645
3519,0,0.9413334309631225
3529,0,0.9264312809427895
3539,0,0.9845395454355229
3549,0,1.042956776054679
3559,0,0.9953268596221208
3569,0,0.9548833276638166
3579,0,1.0459656253052554
3589,0,1.0743530231221494
3599,0,0.9691375733590962
3609,0,1.1116712039893726
3619,0,1.0182472939218594
3629,0,1.182691539224288
3639,0,1.2846630357599076
3649,0,1.0794102397957475
3659,0,1.124215520388304
3669,0,1.1361738195708035
3679,0,1.1740778867888297
3689,0,1.1044328205095661
3699,0,1.0795114392349965
3709,0,1.1971537356891035
3719,0,1.132819723174134
3729,0,1.2458063480875528
3739,0,1.3092213106051613
3749,0,1.3157921831272108
3759,0,1.3869290975741113
3769,0,1.3006920836792528
3779,0,1.3376199384898981
3789,0,1.2135726099228132
3799,0,1.0968572509763117
3809,0,1.2157233287044305
3819,0,1.2102118859128985
3829,0,1.1315800304086305
3839,0,1.1776667575078645
3849,0,1.0823172779360783
3859,0,1.0789893432082893
3869,0,1.1310243050605207
3879,0,1.1851275848526686
3889,0,1.2024512072661817
3899,0,1.097830148123102
3909,0,1.0929363012770976
3919,0,0.9144272256181754
3929,0,1.0093014722510776
3939,0,0.8684013490094514
3949,0,0.98317685725416
3959,0,1.090385342716485
3969,0,1.0329053290607173
3979,0,1.054956439557071
3989,0,0.9452385288519461
3999,0,1.1008098999026237
4009,0,1.0332149228316887
4019,0,0.9830305402483388
4029,0,1.0622546768661039
4039,0,1.1196012990791258
4049,0,1.187174024772743
4059,0,1.111601871348027
4069,0,1.2855324616464627
4079,0,1.2383809638189083
4089,0,1.1827874878611526
4099,0,1.1707713098961012
4109,0,1.2297261379200242
4119,0,1.265166330967468
4129,0,1.4163313413485579
4139,0,1.4339469574283321
4149,0,1.3477176360193488
4159,0,1.2626455504749567
4169,0,1.034745680552572
4179,0,1.227177215936551
4189,0,1.0316319050440677
4199,0,1.0628620374668434
4209,0,1.1944755032091094
4219,0,1.0882175204883564
4229,0,1.0543473857781915
4239,0,1.1496930449148384
4249,0,1.2738084417108289
4259,0,1.2008550577000965
4269,0,1.1087980690101624
4279,0,1.168281975882455
4289,0,1.098369391686992
4299,0,1.133333376953659
4309,0,0.9937896035650139
4319,0,0.9425649017039547
4329,0,0.973685239765347
4339,0,0.918699531622386
4349,0,1.0049063997950078
4359,0,1.1386746306089113
4369,0,1.1402240979553224
4379,0,1.1704724096131953
4389,0,1.2235054704051325
4399,0,1.2226463288557576
4409,0,0.9940518764646421
4419,0,1.1956751056536479
4429,0,1.1543763119341237
4439,0,1.0682185378170468
4449,0,1.2684961011537472
4459,0,1.3684351872655738
4469,0,1.2087137818786784
4479,0,1.236098569160984
4489,0,1.4567985542998418
4499,0,1.3409183444698394
4509,0,1.2246023253067781
4519,0,1.3301403149039188
4529,0,1.320752720623961
4539,0,1.4520934731450674
4549,0,1.6360082870864832
4559,0,1.5065973501919039
4569,0,1.5109184573302639
4579,0,1.4210990905653962
4589,0,1.2257098356752125
4599,0,1.1611530921731528
4609,0,1.141192781208777
4619,0,1.2288024945428302
4629,0,1.146718713582095
4639,0,1.2326582683416696
4649,0,1.2000647535463895
4659,0,1.1426617545836883
4669,0,1.10023433695693
4679,0,1.2116826051032774
4689,0,1.2202610415260249
4699,0,1.008204688717988
4709,0,1.161611749886175
4719,0,1.058436154985869
4729,0,1.1152151857035706
4739,0,1.0849536686134162
4749,0,1.2231727349074912
4759,0,1.3781788153379697
4769,0,1.1795076517769711
4779,0,1.0499028274961577
4789,0,1.038784610086497
4799,0,0.9914703714789966
4809,0,1.1038050232113568
4819,0,1.127245127356174
4829,0,1.07208750855249
4839,0,1.0909365066808576
4849,0,1.0115884972844866
4859,0,0.9978625709394462
4869,0,0.8868670602302673
4879,0,0.9575156720929947
4889,0,0.9610862222845009
4899,0,1.063046334749011
4909,0,1.0011358040814669
4919,0,1.1533366434220815
4929,0,1.2050169396382737
4939,0,1.094505130749388
4949,0,1.1237420408847292
4959,0,1.1136804523886554
4969,0,1.0339851873947243
4979,0,1.137940448714844
4989,0,1.1366864182582332
4999,0,1.166344985446229
5009,0,1.1885829870487505
5019,0,1.1453993731448278
5029,0,1.0072820641274152
5039,0,1.0259872734571198
5049,0,1.0110288607591809
5059,0,1.0355407350700236
5069,0,1.1069300986199972
5079,0,1.0429200479855791
5089,0,0.9729546709112801
5099,0,0.9997831041306638
5109,0,0.9124892415557994
5119,0,1.009787211822252
5129,0,0.8817208720370396
5139,0,0.8793397343152344
5149,0,0.8748301214377506
5159,0,0.895948032746434
5169,0,0.9154998179768473
5179,0,0.8922249390225254
5189,0,0.9643123883896498
5199,0,0.9084112045959754
5209,0,0.9574439738915806
5219,0,1.0680859942367402
5229,0,1.0109174916433963
5239,0,1.0685175536755378
5249,0,1.1836129585446447
5259,0,1.1669689778701073
5269,0,1.1382077208638326
5279,0,1.1154514055749902
5289,0,1.059856390255621
5299,0,0.9454342863433467
5309,0,1.1784154787419912
5319,0,1.098812616295608
5329,0,1.0438869795693382
5339,0,1.134762274232444
5349,0,1.1397582139469051
5359,0,0.9503192771766005
5369,0,0.9521742375931043
5379,0,0.9976862517401371
5389,0,0.9900592274644137
5399,0,1.0015159092996626
5409,0,0.9834068398096248
5419,0,0.9539368058372351
5429,0,0.9667665148299296
5439,0,0.9985980407153324
5449,0,0.9444772616257451
5459,0,1.0034454723663506
5469,0,0.9265587795247938
5479,0,0.9765827956748259
5489,0,1.0173807646654356
5499,0,1.1010618624233293
5509,0,1.1372671126645586
5519,0,1.0521121363738573
5529,0,1.0903859243084566
5539,0,1.026421018893927
5549,0,1.076938197570744
5559,0,1.0174744038372203
5569,0,0.8928609680516458
5579,0,1.0126908462451256
5589,0,1.0359548556126397
5599,0,0.8816295097078954
5609,0,0.9643930678828203
5619,0,0.8463298864043534
5629,0,0.9504538246404626
5639,0,0.8580838180773324
5649,0,0.799450913419267
5659,0,0.9277201177938046
5669,0,0.9059722609615245
5679,0,0.9636848712154517
5689,0,0.9407061513173154
5699,0,0.9972615126031898
5709,0,1.042526650836109
5719,0,1.0142656563725612
5729,0,0.9803148980488877
5739,0,0.9383096687307809
5749,0,1.1478212661584128
5759,0,1.177769162546013
5769,0,1.144915028333508
5779,0,1.1799969878810308
5789,0,1.1741981502577312
5799,0,1.1178281441720546
5809,0,1.2289267116528584
5819,0,1.1589019018624662
5829,0,0.9661270572504048
5839,0,1.0345103867711927
5849,0,1.0235185250515242
5859,0,0.9357237468301849
5869,0,0.9151745399306881
5879,0,0.8585800437841151
5889,0,0.9245118959075351
5899,0,0.9213252778292691
5909,0,0.9913621126631572
5919,0,0.8074482842365833
5929,0,0.8438610097776424
5939,0,0.839232752433273
5949,0,0.935898859613084
5959,0,1.0399352066924474
5969,0,0.9496910028510288
5979,0,0.8900841941519746
5989,0,0.8231500958155908
5999,0,0.9202700839305231
6009,0,0.9857499335620272
6019,0,1.0379277110306273
6029,0,0.9997544950404599
6039,0,0.8628306986773856
6049,0,0.9810320597524724
6059,0,1.0308716712737964
6069,0,0.9273925282827972
6079,0,0.8943802795773474
6089,0,0.941891862000402
6099,0,0.831219158119026
6109,0,0.9522600310859699
6119,0,1.0303607524483769
6129,0,0.8693408872267351
6139,0,1.0198486583685782
6149,0,1.123704846259343
6159,0,1.0562386480748729
6169,0,1.152002350292423
6179,0,1.1146910412665112
6189,0,1.0800152527923876
6199,0,1.0900486252944284
6209,0,1.087016015213613
6219,0,0.9978665671065924
6229,0,1.05043691952063
6239,0,1.138396305959775
6249,0,1.1150800839176378
6259,0,1.253519087544471
6269,0,1.2298970211156994
6279,0,1.2532149606404843
6289,0,1.2590625418342634
6299,0,1.2265731978530645
6309,0,1.1328254959734145
6319,0,1.293922821631202
6329,0,1.2066810129297052
6339,0,1.095258339416873
6349,0,1.0148450717111492
6359,0,1.0651631467623375
6369,0,1.1220596708052548
6379,0,1.0331363516663934
6389,0,0.9357253756314836
6399,0,0.9208377413322211
6409,0,0.9451278385661703
6419,0,0.8482512475379291
6429,0,0.8177070756681546
6439,0,0.8677365549976339
6449,0,0.8897761260016082
6459,0,0.9279420788398701
6469,0,0.895502593277402
6479,0,1.0045696350479314
6489,0,0.98718342824047
6499,0,1.042424831547769
6509,0,1.0252398534557166
6519,0,1.0093812137951779
6529,0,0.996325637611992
6539,0,0.9879247569868508
6549,0,0.9576208688795399
6559,0,1.0263024079102867
6569,0,1.0652302367489344
6579,0,0.9886785748864434
6589,0,1.0913791232219623
6599,0,1.028798147026332
6609,0,0.849737443125527
6619,0,1.0364768497391565
6629,0,0.9351621395767764
6639,0,0.9464068306436025
6649,0,0.9419634203810276
6659,0,1.0714633121713248
6669,0,1.0189932382695388
6679,0,0.9788462760620392
6689,0,1.0242156255829136
6699,0,0.9427543933623409
6709,0,0.8153701646086908
6719,0,0.7914254153232726
6729,0,0.9253138082690355
6739,0,0.8271105148565061
6749,0,0.7946843181496606
6759,0,0.8885715289854015
6769,0,0.8862015817881561
6779,0,0.8952406714498693
6789,0,1.0194414802366345
6799,0,0.9967531957184393
6809,0,0.9675408302932237
6819,0,1.0543686219795765
6829,0,1.0138726668168594
6839,0,0.8831268270894805
6849,0,1.0080019205696522
6859,0,0.9758679146863878
6869,0,0.9765346686348925
6879,0,1.0074017101740704
6889,0,0.97409229551377
6899,0,0.9701630587778438
6909,0,1.0209039431200342
6919,0,0.9111951037258171
6929,0,0.9525949623580302
6939,0,0.9360565157472224
6949,0,0.9179026669164234
6959,0,0.9853859155185135
6969,0,0.9541497517895104
6979,0,0.9958197984939738
6989,0,0.9235930679596303
6999,0,0.8912688816962802
7009,0,0.979169750797497
7019,0,0.9659922755942335
7029,0,1.0595099833625017
7039,0,1.0001800501446738
7049,0,1.0935576450635895
7059,0,1.1517187883166602
7069,0,1.1456083160182622
7079,0,0.8918962473879506
7089,0,1.1273513207260384
7099,0,1.101304247343718
7109,0,0.9896343897491136
7119,0,1.0218532013373862
7129,0,1.093025682483967
7139,0,1.1221463797192213
7149,0,1.2071845963953345
7159,0,1.0514915954486548
7169,0,1.1745116164144325
7179,0,1.1673807336958126
7189,0,1.2382767245878257
7199,0,1.0920299721158977
7209,0,1.056245219048813
7219,0,1.0548486194908109
7229,0,1.065368299991384
7239,0,1.1182967864455102
7249,0,1.0824318860625375
7259,0,1.0420950898081114
7269,0,1.072086075500545
7279,0,0.9821553129724582
7289,0,1.0474279878983832
7299,0,1.0077258804362512
7309,0,1.031657586361257
7319,0,0.9999459791297897
7329,0,0.9659036405570217
7339,0,0.853496708392215
7349,0,0.956418933114622
7359,0,0.9273402038040283
7369,0,0.8980680277416415
7379,0,0.8732501450250808
7389,0,0.9001174958232545
7399,0,0.9166243578574103
7409,0,0.9548223126706856
7419,0,0.8663219425230559
7429,0,0.9086157476416933
7439,0,0.9812326467235749
7449,0,1.025628354795534
7459,0,0.8933462272707631
7469,0,0.9099124447100686
7479,0,0.9306419161398675
7489,0,1.0700580043860053
7499,0,0.9557536778889265
7509,0,1.0112169595951639
7519,0,1.1149653531651866
7529,0,1.177122229010022
7539,0,0.9293551237421361
7549,0,1.065103816618184
7559,0,1.1018198749162036
7569,0,1.102502579855551
7579,0,0.9945829267064403
7589,0,1.0136888579985
7599,0,1.0599695573246213
7609,0,1.0252217447508576
7619,0,1.0508429121282714
7629,0,1.117161363005409
7639,0,1.1005991975569793
7649,1,1.2301288916792126
7659,1,1.179507395287036
7669,1,1.1674879512088332
7679,1,1.2542997364513098
7689,1,1.3659867713875975
7699,1,1.4263005432149949
7709,1,1.4521516972820228
7719,1,1.599643403519288
7729,1,1.6010770839058726
7739,1,1.621637354512396
7749,1,1.7579768367816364
7759,1,1.8179221761406212
7769,1,1.9779183750198064
7779,1,1.9129803792339282
7789,1,2.090479800511802
7799,1,2.26853427695205
7809,1,2.363061990458435
7819,1,2.269967718282773
7829,1,2.3436324190196824
7839,1,2.556206207684584
7849,1,2.588992495180949
7859,1,2.612215632646529
7869,1,2.7650584747712603
7879,1,2.916651110092534
7889,1,3.0130846370834554
7899,1,3.2355684058629763
7909,1,3.229525782371912
7919,1,3.358323808575874
7929,1,3.5192694996300125
7939,1,3.6924291001478378
7949,1,3.8210000727622804
7959,1,4.011927373281008
7969,1,4.094929980265004
7979,1,4.140209697896817
7989,1,4.44092583672059
7999,1,4.583734935224545
8009,1,4.830102242942207
8019,1,4.836908558197345
8029,1,5.005687382257932
8039,1,5.372995015511163
8049,1,5.703236894346741
8059,1,5.7728856260583035
8069,1,5.983168278760665
8079,1,6.226275095167135
8089,1,6.287490398280399
8099,1,6.4313218352259405
8109,1,6.552807712951148
8119,1,6.954511787194573
8129,1,7.2075532177754145
8139,1,7.458064596015595
8149,1,7.717690347577597
8159,1,7.666068205003701
8169,1,7.662623658014033
8179,1,7.536487431426449
8189,1,7.361442248869281
8199,1,7.218704490962953
8209,1,6.924898232604573
8219,1,6.753370350399765
8229,1,6.462593573779558
8239,1,6.3997150980079685
8249,1,6.17029545317882
8259,1,5.869149173140224
8269,1,5.711330758741037
8279,1,5.570337053485253
8289,1,5.459953644383157
8299,1,5.224989616009016
8309,1,5.262885885094779
8319,1,5.076995585348621
8329,1,4.7940193491952225
8339,1,4.654245225958315
8349,1,4.411025134615503
8359,1,4.331081606380758
8369,1,4.1334167048372725
8379,1,4.032936512646245
8389,1,3.8329084211144764
8399,1,3.827017703748588
8409,1,3.6507126478476097
8419,1,3.5376571159380155
8429,1,3.2730345478471694
8439,1,3.305906003889783
8449,1,3.064347313972813
8459,1,3.084480373314994
8469,1,3.060713455176503
8479,1,3.035583556285043
8489,1,2.9036247300944757
8499,1,3.1051010728417037
8509,1,2.8819798302982393
8519,1,2.780698542390427
8529,1,2.875889858869456
8539,1,2.7856438415290885
8549,1,2.7310918696862947
8559,1,2.7502448598365765
8569,1,2.691005119851054
8579,1,2.8652408897374118
8589,1,2.78741196525659
8599,1,2.9385920255436186
8609,1,2.9761387213784474
8619,1,3.116856020556737
8629,1,3.1733613430981205
8639,1,2.972438332630116
8649,1,2.869465776877619
8659,1,3.020998319736541
8669,1,3.1701280337679685
8679,1,3.481792199385202
8689,1,3.8379311129269658
8699,1,3.885030524900314
8709,1,3.881526001334364
8719,1,3.58180885012659
8729,1,3.525794686101395
8739,1,3.2730831844808894
8749,1,3.3983868018169607
8759,1,3.239922472082421
8769,1,3.090493807770036
8779,1,3.0303752082116375
8789,1,3.031181951390267
8799,1,2.9829475672583126
8809,1,2.878020151895095
8819,1,2.895166956909406
8829,1,2.727667027109642
8839,1,2.7017111883299405
8849,1,2.489630352478067
8859,1,2.409797817896319
8869,1,2.387015382154946
8879,1,2.2657504452312685
8889,1,2.327505901767515
8899,1,2.167138449881909
8909,1,2.2413302659977523
8919,1,2.484945872630377
8929,1,2.2951323333795335
8939,1,2.623818713666303
8949,1,2.470340309365506
8959,1,2.5681709914674595
8969,1,2.704428766360933
8979,1,2.9573020793000984
8989,1,2.924830237588056
8999,1,3.1150601152176263
9009,1,3.269294515498237
9019,1,3.5351618069088677
9029,1,3.4126358014975184
9039,1,3.5624178560254416
9049,1,3.3995271122999005
9059,1,3.663678363607479
9069,1,3.933286927461749
9079,1,3.9565463355101254
9089,1,4.10500131389728
9099,1,4.469575632542385
9109,1,4.555708783383549
9119,1,4.586041817551095
9129,1,4.766842615237349
9139,1,5.022946492839109
9149,1,5.269547208239446
9159,1,5.157678831351555
9169,1,5.218771641696692
9179,1,5.136549383376442
9189,1,4.968865173339302
9199,1,5.054554107612706
9209,1,5.209773376868599
9219,1,5.110525810366694
9229,1,5.301065939229451
9239,1,5.335471559924745
9249,1,4.931256709130809
9259,1,5.064571780364717
9269,1,4.910278281566741
9279,1,4.773274434728124
9289,1,4.872826813402978
9299,1,5.02705768213428
9309,1,4.799687218923659
9319,1,4.821979041807838
9329,1,4.831159347458661
9339,1,4.542942405889313
9349,1,4.5082451881433965
9359,1,4.462516203493543
9369,1,4.392463250915844
9379,1,4.653481119328616
9389,1,4.706742944509125
9399,1,4.557020473070856
9409,1,4.151192715918661
9419,1,3.936593058640706
9429,1,3.9284519458798814
9439,1,3.866857842176807
9449,1,3.613710397362596
9459,1,3.9168422102531713
9469,1,4.007566195056789
9479,1,4.060256820622652
9489,1,3.901930620853541
9499,1,3.9920029757938957
9509,1,3.6126781047031358
9519,1,3.4500443889221146
9529,1,3.3228014334517533
9539,1,3.3386895557065985
9549,1,3.5716798561457743
9559,1,3.474327663215746
9569,1,3.2882783169277734
9579,1,3.043700826749722
9589,1,3.1953302140585427
9599,1,3.032206840640149
9609,1,2.844490593147361
9619,1,2.6592817361211454
9629,1,2.628136723137395
9639,1,2.659937060149879
9649,1,2.8527821921526337
9659,1,2.9350346286187894
9669,1,3.0699710014008277
9679,1,3.103270889831097
9689,1,2.9831607037900127
9699,1,2.9784255474475776
9709,1,2.969502164149074
9719,1,3.015557272799893
9729,1,2.880986464775047
9739,1,2.862859819278095
9749,1,2.892911652887377
9759,1,2.8339021682919587
9769,1,2.5816105898459654
9779,1,2.344618004213271
9789,1,2.189476324875777
9799,1,2.164484222860242
9809,1,2.1484605862027744
9819,1,1.786492992907275
9829,1,1.7357440522217618
9839,1,1.8438174224891224
9849,1,1.7132810794826436
9859,1,1.6702593434433857
9869,1,1.5047631125744667
9879,1,1.5558828940291536
9889,1,1.4897990638854872
9899,1,1.4801326457275128
9909,1,1.383539012963493
9919,1,1.437722997912427
9929,1,1.3765536732022303
9939,1,1.4369677881975533
9949,1,1.4676648040949338
9959,1,1.412502094024363
9969,1,1.3683450116162852
9979,1,1.405732624798252
9989,1,1.2990397500839046
9999,1,1.342112161424497
10009,1,1.2345223462496067
10019,1,1.304451429832797
10029,1,1.2497228940380143
10039,1,1.3464886501990432
10049,1,1.1302327654513404
10059,1,1.0915832028429384
10069,1,1.201336941488016
10079,1,1.2584267454173832
10089,1,1.1372060156930908
10099,1,1.2332343971670832
10109,1,1.3140513717031646
10119,1,1.446759034311519
10129,1,1.2757586052786098
10139,1,1.4482375054025745
10149,1,1.2461630464262663
10159,1,1.3256879568495277
10169,1,1.4379432812731707
10179,1,1.3586962789612615
10189,1,1.462814984815193
10199,1,1.3865223067829717
10209,1,1.3666900832519164
10219,1,1.4018002182354785
10229,1,1.2249305199349423
10239,1,1.1848366400837747
10249,1,1.2354287222858575
10259,1,1.4449149956749168
10269,1,1.377679126471418
10279,1,1.3704803923537254
10289,1,1.4379439407662298
10299,1,1.554990331723632
10309,1,1.5312286441899636
10319,1,1.5965554827825337
10329,1,1.3617222068542245
10339,1,1.5000360402693091
10349,1,1.4546623985854426
10359,1,1.738232504552831
10369,1,1.7226425729790502
10379,1,1.6695620220074032
10389,1,1.722744950155558
10399,1,1.866187260895148
10409,1,1.8636384250371083
10419,1,2.168435095338073
10429,1,2.2605619274184807
10439,1,2.3358615497792155
10449,1,2.2204732472542563
10459,1,2.6823003151791793
10469,1,2.5896660005666385
10479,1,2.4895484047218073
10489,1,2.4895937139666806
10499,1,2.5047402839134243
10509,1,2.676098267838125
10519,1,2.3783796017653778
10529,1,2.6363565002076763
10539,1,2.677568039139004
10549,1,2.5657382237239448
10559,1,2.6953288328152976
10569,1,2.7689935365485434
10579,1,2.8606284790629237
10589,1,2.8017868270274566
10599,1,2.7944216983554115
10609,1,2.6115666510407003
10619,1,2.520756062245878
10629,1,2.5308541272807252
10639,1,2.726713238676978
10649,1,2.674795315790468
10659,1,2.830678555618631
10669,1,2.858199862197428
10679,1,2.436823681798595
10689,1,2.4323829583217202
10699,1,2.2643676672316353
10709,1,2.2230313816673704
10719,1,2.3385082555919183
10729,1,2.450448700059369
10739,1,2.5426224037108653
10749,1,2.6218801638402116
10759,1,2.5446020557503477
10769,1,2.388110830362358
10779,1,2.324473860548732
10789,1,2.1467046745198424
10799,1,2.4262179307727805
10809,1,2.6561972238523675
10819,1,2.5994960109916745
10829,1,2.844057301808278
10839,1,2.767809642891334
10849,1,2.5477516094235977
10859,1,2.542611347290473
10869,1,2.5628274850188975
10879,1,2.637467517310296
10889,1,2.3940746391327465
10899,1,2.2634720032302873
10909,1,2.1498555068586738
10919,1,2.0918928990629264
10929,1,2.240642619934471
10939,1,2.131537043219878
10949,1,1.9680201042987437
10959,1,1.7467669404465949
10969,1,1.8026626672154855
10979,1,1.6974200396862258
10989,1,1.6014751372394087
10999,1,1.40167980182745
11009,1,1.531869932921943
11019,1,1.7016577283849619
11029,1,1.7813662384376059
11039,1,1.5930998777175644
11049,1,1.5157844183213884
11059,1,1.46965019165847
11069,1,1.7342889663792018
11079,1,1.68025554169528
11089,1,1.5807226160710115
11099,1,1.6261791130854517
11109,1,1.546629100298808
11119,1,1.392630843786113
11129,1,1.345097902817542
11139,1,1.3550705182291707
11149,1,1.2765010471116516
11159,1,1.1894125327643996
11169,1,1.330529921269185
11179,1,1.1888393523491394
11189,1,1.369059048835378
11199,1,1.3719793843867465
11209,1,1.3125697057266326
11219,1,1.4114129813554428
11229,1,1.1949408860407713
11239,1,1.3454394889229861
11249,1,1.2573299463752148
11259,1,1.274827062389946
11269,1,1.4426178048211626
11279,1,1.4621800712042885
11289,1,1.3870681051097724
11299,1,1.4535463904487633
11309,1,1.5974601932519845
11319,1,1.6266107376224834
11329,1,1.536403259437312
11339,1,1.4257538562364978
11349,1,1.5420664579293974
11359,1,1.577601887958558
11369,1,1.5117920292771407
11379,1,1.4557340675956691
11389,1,1.708823248356976
11399,1,1.5748247653911918
11409,1,1.739575877543108
11419,1,1.7044937330528644
11429,1,1.9104572762261787
11439,1,1.847248461750109
11449,1,1.9014170399469779
11459,1,2.169966200243371
11469,1,2.04369823955128
11479,1,2.187411823727243
11489,1,2.2760958518206076
11499,1,1.9632836617013512
11509,1,1.9085450043466876
11519,1,2.0942972077186424
11529,1,1.994829778766176
11539,1,2.0525528233577175
11549,1,1.819464577199327
11559,1,1.6831315371757978
11569,1,1.6718375884502552
11579,1,1.8431530980237665
11589,1,1.5791661465982323
11599,1,1.3554912164566706
11609,1,1.2953559535900916
11619,1,1.272339280931845
11629,1,1.1133522892858523
11639,1,1.160102015716487
11649,1,1.1617681057736544
11659,1,1.228327715509926
11669,1,1.2251903715237047
11679,1,1.352163631662065
11689,1,1.2447875094161527
11699,1,1.2205981749269499
11709,1,1.3387631372236073
11719,1,1.292837298476159
11729,1,1.243568402953871
11739,1,1.3664992371495082
11749,1,1.461261473241246
11759,1,1.31529548576597
11769,1,1.124497477346143
11779,1,1.1633398522633842
11789,1,1.0834351553476405
11799,1,1.0475011162297634
11809,1,1.1576529390078758
11819,1,1.1126967832088053
11829,1,1.179224058372588
11839,1,1.1393370383833141
11849,1,1.4085026792542485
11859,1,1.4252017732370428
11869,1,1.3886226725836177
11879,1,1.5479861325239515
11889,1,1.4830606847295542
11899,1,1.8518663089332081
11909,1,1.9725099692100578
11919,1,2.331415674496184
11929,1,2.6044653717128035
11939,1,2.9290903643885056
11949,1,2.9211934406636537
11959,1,3.506206672944282
11969,1,3.5357581079987472
11979,1,3.639905452929751
11989,1,3.474332728184189
11999,1,3.1739548972941636
12009,1,3.1052757860926956
12019,1,3.0691052700513586
12029,1,3.0110236733208557
12039,1,3.0299830312029323
12049,1,2.8816819447787108
12059,1,2.7602504522509443
12069,1,2.601198764648009
12079,1,2.6336426468280134
12089,1,2.6113416998052603
12099,1,2.615082464859709
12109,1,2.5177652486110027
12119,1,2.147987488075003
12129,1,2.046094014071783
12139,1,1.9565365568126283
12149,1,2.009448058678532
12159,1,2.118005307205836
12169,1,2.1965799901561995
12179,1,2.3093367497897486
12189,1,2.3000781948534827
12199,1,2.545845551085802
12209,1,2.7245619326239607
12219,1,2.5538818736122284
12229,1,2.375363698701591
12239,1,2.326979977058845
12249,1,2.2786062115449472
12259,1,2.42294272732932
12269,1,2.687131246974249
12279,1,2.8715148888498865
12289,1,3.0420849051106877
12299,1,2.9226900647388483
12309,1,3.030247422095857
12319,1,2.9702435654201835
12329,1,3.016023113301258
12339,1,2.7277589048442445
12349,1,2.5916143943696848
12359,1,2.694145407362099
12369,1,2.438459723950375
12379,1,2.214615128862029
12389,1,2.3661160969348147
12399,1,2.2508281275511437
12409,1,2.3174599586504296
12419,1,2.4499060017903553
12429,1,2.375003790112288
12439,1,2.1674207435101662
12449,1,2.3056599969064067
12459,1,2.4323253818829054
12469,1,2.5990597678611396
12479,1,2.8966097759183844
12489,1,2.8009699717236707
12499,1,2.934310990962049
12509,1,3.1302115261800836
12519,1,2.835037922257195
12529,1,2.591158168509546
12539,1,2.556135837460274
12549,1,2.6536858069216622
12559,1,2.3628428532890213
12569,1,2.1749746557693275
12579,1,1.9397420973557147
12589,1,1.9434986867568207
12599,1,2.1638600854495937
12609,1,2.2272970455834304
12619,1,2.154987139372458
12629,1,2.006891156461574
12639,1,2.1040935196156294
12649,1,1.997886025738234
12659,1,1.8021293317144695
12669,1,1.5282353652089988
12679,1,1.51032774021358
12689,1,1.3064364295562454
12699,1,1.2887044954653606
12709,1,1.4009681858572638
12719,1,1.3102051710308669
12729,1,1.3428991886315755
12739,1,1.2681790385050071
12749,1,1.2348340288030066
12759,1,1.4040417350317034
12769,1,1.0635999042891098
12779,1,1.0210682096247368
12789,1,0.9679078374857105
12799,1,0.9340753646406166
12809,1,0.8515536581284484
12819,1,1.081372077655471
12829,1,1.1649440319519768
12839,1,1.1744407307795428
12849,1,1.108564886777741
12859,1,1.1268869222335638
12869,1,0.9774136422773552
12879,1,1.0229705598586911
12889,1,0.9681830403482006
12899,1,1.1253784959271727
12909,1,1.0203564742013618
12919,1,1.1152939520158427
12929,1,0.9722663612966915
12939,1,1.1612220663590398
12949,1,1.019303334150048
12959,1,1.223294628778214
12969,1,1.17276720435207
12979,1,1.0523116760605864
12989,1,0.9336588638535258
12999,1,0.8267920318120875
13009,1,0.8867313726718902
13019,1,0.93236434437437
13029,1,1.0587568865933998
13039,1,1.084354729058039
13049,1,1.021073081133647
13059,1,1.2612036070513628
13069,1,1.2401286008042507
13079,1,1.4750389746883046
13089,1,1.4618716020248927
13099,1,1.3859855799090288
13109,1,1.270273680265123
13119,1,1.5365128262305043
13129,1,1.314862772358943
13139,1,1.2904106553893717
13149,1,1.29880030688538
13159,1,1.4208628768624165
13169,1,1.4475571802644276
13179,1,1.191801856237438
13189,1,1.1613351378906605
13199,1,1.2410534095457328
13209,1,1.2959913736592186
13219,1,1.3600178941387935
13229,1,1.2637867078371492
13239,1,1.4367457708454856
13249,1,1.4276734409925012
13259,1,1.4828740360017032
13269,1,1.4701109672719783
13279,1,1.3556615623184216
13289,1,1.2838448515860432
13299,1,1.3543085454228538
13309,1,1.391130875172596
13319,1,1.3999670382713407
13329,1,1.350872951411672
13339,1,1.427374995561758
13349,1,1.2791588099511724
13359,1,1.169938029890703
13369,1,1.1679092102399191
13379,1,1.2014269730184002
13389,1,1.1299632857310051
13399,1,1.0485047824475902
13409,1,1.0956547515739303
13419,1,1.0498223904903987
13429,1,1.08856426644323
13439,1,1.2682775178052577
13449,1,1.4679069068414514
13459,1,1.4960353442066443
13469,1,1.4152323187327036
13479,1,1.3197336193762996
13489,1,1.3848373503373632
13499,1,1.2760046534154559
13509,1,1.1146492119249836
13519,1,1.164930674599645
13529,1,1.0150433926312488
13539,1,0.9764142925412668
13549,1,1.1764901462402058
13559,1,1.1254708888924019
13569,1,1.299115916188504
13579,1,1.488240699336455
13589,1,1.4731390478763675
13599,1,1.5553792280880026
13609,1,1.5318778384671858
13619,1,1.6869322384299121
13629,1,1.529281275013658
13639,1,1.5034602944728863
13649,1,1.6403452420764342
13659,1,1.389618102974416
13669,1,1.526957729272909
13679,1,1.6037466000962326
13689,1,1.461368472037665
13699,1,1.5907893794193237
13709,1,1.4712756665192033
13719,1,1.5818736085317981
13729,1,1.3743125885793146
13739,1,1.510341232119389
13749,1,1.481693408714424
13759,1,1.4925885087320616
13769,1,1.5313741403475711
13779,1,1.8214080711387128
13789,1,1.650703432907675
13799,1,1.7389717500402904
13809,1,1.8428425162466069
13819,1,1.886314132657759
13829,1,2.114322959425531
13839,1,1.9467359604397474
13849,1,2.2408434325293505
13859,1,2.1420258326262784
13869,1,1.9705099676661222
13879,1,1.6515219945351343
13889,1,1.7427236853580357
13899,1,1.7917524476176425
13909,1,1.7073357988618965
13919,1,1.7329142611232258
13929,1,1.6415805993216368
13939,1,1.5151640906527497
13949,1,1.5458075687129913
13959,1,1.5932683059425787
13969,1,1.6181960760525698
13979,1,1.6126870141498029
13989,1,1.8515715344531023
13999,1,1.7124814573255573
14009,1,1.8494083957703136
14019,1,1.9038971125333457
14029,1,1.5810464107021243
14039,1,1.497942268766521
14049,1,1.5337023175125466
14059,1,1.3314674705872458
14069,1,1.4198063028341303
14079,1,1.443574085619104
14089,1,1.1908726126995293
14099,1,1.2224902151903014
14109,1,1.303370714145178
14119,1,1.3650440033531288
14129,1,1.221098632222368
14139,1,1.4367650958397542
14149,1,1.4740239386146738
14159,1,1.403543643362449
14169,1,1.248403432488756
14179,1,1.136516278860148
14189,1,1.1555982171517898
14199,1,0.9514597430646553
14209,1,0.9741296990611193
14219,1,1.028963316881286
14229,1,1.0305621876392324
14239,1,1.0639797271457485
14249,1,1.1093712429214948
14259,1,1.1007177096223288
14269,1,1.2054146835984394
14279,1,1.374086665107644
14289,1,1.261943111142106
14299,1,1.2775866352688703
14309,1,1.1265846830113224
14319,1,0.983553646441561
14329,1,1.042106942615899
14339,1,1.066352496514266
14349,1,1.0520653549894683
14359,1,1.2967978339834996
14369,1,1.2334319515762817
14379,1,1.1737196260737424
14389,1,1.2986024840589847
14399,1,1.2753644368749952
14409,1,1.2650486114370139
14419,1,1.6820452589165094
14429,1,1.75057530194185
14439,1,1.7427886891039788
14449,1,1.5546464742598605
14459,1,1.4061666530447448
14469,1,1.4400343536615763
14479,1,1.5267701146800996
14489,1,1.4150286044669373
14499,1,1.5945434180132514
14509,1,1.750144645832094
14519,1,1.8972789358923876
14529,1,1.8288750400002198
14539,1,1.805587242342653
14549,1,2.1387805433270826
14559,1,1.9655550988072024
14569,1,2.115817422126042
14579,1,2.1014916803317103
14589,1,2.1667681696015206
14599,1,2.015721340771223
14609,1,2.1188703134932645
14619,1,2.4854645255454715
14629,1,2.7002595707885284
14639,1,2.9100532395632017
14649,1,3.3425693314941363
14659,1,3.045004851358507
14669,1,3.000320214287565
14679,1,2.7653719668564607
14689,1,2.729061986512378
14699,1,2.450530020664894
14709,1,2.2952188059828726
14719,1,2.3981347167170983
14729,1,2.496615867678279
14739,1,2.9712004182150973
14749,1,3.1621547723035546
14759,1,3.5159437186802602
14769,1,3.7771889448127647
14779,1,3.6239641122893436
14789,1,3.431899234462585
14799,1,3.1365381460982116
14809,1,2.9123522817537384
14819,1,2.6783815810015947
14829,1,2.806444918075501
14839,1,3.0031567325755817
14849,1,3.0122561134624926
14859,1,2.972567061098608
14869,1,2.9763925316238744
14879,1,2.907264636764517
14889,1,2.5586044519920756
14899,1,2.6297505567408006
14909,1,2.286272768896713
14919,1,2.2802343441880346
14929,1,2.098389386759874
14939,1,2.1607965514238714
14949,1,2.241271848954227
14959,1,2.0635692412888504
14969,1,1.6529753283378732
14979,1,1.7427687680862527
14989,1,1.516753981217275
14999,1,1.5136943254980213
15009,1,1.4847281096065232
15019,1,1.2838230012670262
15029,1,1.190535945496217
15039,1,1.1078978301483824
15049,1,1.0927762634568594
15059,1,0.9505928406060488
15069,1,0.9491843655231771
15079,1,1.0138077171021669
15089,1,0.9531604474466449
15099,1,1.1108532458691731
15109,1,0.9508427490524557
15119,1,1.1192929891941854
15129,1,1.0538158160568574
15139,1,1.0492254266125816
15149,1,1.265428612647361
15159,1,1.3000820221168203
15169,1,1.1863385734297025
15179,1,1.3962792546562723
15189,1,1.1513250896927618
15199,1,1.0650560741812858
15209,1,1.1173661806980681
15219,1,1.2932226197914554
15229,1,1.340046444403626
15239,1,1.5594655757847642
15249,1,1.7026335411194067
15259,1,1.8644163102565456
15269,1,1.9532621164338404
15279,1,1.864357920233267
15289,1,1.7486135411249832
15299,1,1.6868438969536896
15309,1,1.6427502708591302
15319,1,1.5349224526004952
15329,1,1.7177483923254688
15339,1,1.8991566495535384
15349,1,1.9284317492438137
15359,1,2.1744998938543203
15369,1,1.9633664063053937
15379,1,1.895354968650695
15389,1,1.6868040170033065
15399,1,1.6489104343559224
15409,1,1.6262943136766408
15419,1,1.9229161585079877
15429,1,1.6553247419911483
15439,1,1.4662317136407534
15449,1,1.613512082995406
15459,1,1.5969825583687878
15469,1,1.5661814382890216
15479,1,1.8499340225527046
15489,1,1.9119473781323273
15499,1,1.865275863789942
15509,1,1.944101383091448
15519,1,2.019274202450468
15529,1,1.9836195098978648
15539,1,1.8080252277251574
15549,1,1.6636202079650027
15559,1,1.5879217903196208
15569,1,1.4568319412703663
15579,1,1.3239226678397227
15589,1,1.2257233999398207
15599,1,1.1929399737193793
15609,1,1.160920108868614
15619,1,1.0358711236882465
15629,1,1.2116156845596884
15639,1,1.0434503065315002
15649,1,0.8694076255409479
15659,1,0.9220576369210924
15669,1,0.9836817242261328
15679,1,1.0337774028111304
15689,1,0.9882169398080916
15699,1,1.0008143017818272
15709,1,1.0520760130828233
15719,1,1.241600632835908
15729,1,1.4178612219372089
15739,1,1.435381352739827
15749,1,1.2245293838754037
15759,1,1.2035209000612213
15769,1,1.2369702790306183
15779,1,1.2403919843353974
15789,1,1.1926723636856487
15799,1,1.2789477943900887
15809,1,1.2716583642162362
15819,1,1.3112086034704158
15829,1,1.3818268879969222
15839,1,1.6020905881120637
15849,1,1.7442060888158333
15859,1,1.9017761978371839
15869,1,1.6659960533409734
15879,1,1.7502477771187
15889,1,1.6741883230277956
15899,1,1.948152576757944
15909,1,1.8614494673171234
15919,1,1.8227506672772997
15929,1,1.748849533312435
15939,1,1.9238048903854474
15949,1,1.8845723648093728
15959,1,2.017491818842533
15969,1,2.135576418297866
15979,1,2.323575271109413
15989,1,2.359475390361342
15999,1,2.55892069287715
16009,1,2.9539528239113895
16019,1,2.866958734831319
16029,1,2.8975670353045757
16039,1,2.9471604139672394
16049,1,3.316056155076352
16059,1,3.213425669444638
16069,1,3.2818845407821042
16079,1,3.5154628136504016
16089,1,3.4276650755260487
16099,1,3.3745195206291685
16109,1,3.3886735358221642
16119,1,3.4870799726178987
16129,1,3.713498364711647
16139,1,3.3730999702925617
16149,1,3.268054314230958
16159,1,2.975621242314478
16169,1,2.685894538702755
16179,1,2.43813966055157
16189,1,2.356255071938033
16199,1,2.366979398321697
