T,S,Score
399,0.0,-0.24438143
409,0.0,0.16883308
419,0.0,-0.23216438
429,0.0,0.20769107
439,0.0,0.027765453
449,0.0,-0.030659258
459,0.0,0.15992409
469,0.0,-0.030098915
479,0.0,-0.29240763
489,0.0,-0.15160722
499,0.0,-0.38169944
509,0.0,-0.50068134
519,0.0,-0.50002766
529,0.0,-0.6051423
539,0.0,-0.7478935
549,0.0,-0.7493863
559,0.0,-0.610438
569,0.0,-0.6044679
579,0.0,-0.52268016
589,0.0,-0.32627124
599,0.0,-0.35061526
609,0.0,0.04035783
619,0.0,0.049491584
629,0.0,-0.15783668
639,0.0,-0.40266317
649,0.0,0.06614405
659,0.0,0.62203
669,0.0,0.7904174
679,0.0,1.0222104
689,0.0,0.5264903
699,0.0,0.012234569
709,0.0,0.13938272
719,0.0,0.32877445
729,0.0,0.0220325
739,0.0,-0.43463892
749,0.0,-0.18814433
759,0.0,-0.5477123
769,0.0,-0.4371736
779,0.0,-0.2509554
789,0.0,-0.5599548
799,0.0,-0.26137555
809,1.0,-0.3702194
819,1.0,-0.01598084
829,1.0,0.011664391
839,1.0,0.27431697
849,1.0,0.54467994
859,1.0,0.9559278
869,1.0,1.0635264
879,1.0,2.067443
889,1.0,2.4712572
899,1.0,3.0366197
909,1.0,3.3669863
919,1.0,3.489419
929,1.0,3.8933961
939,1.0,4.4936266
949,1.0,5.106722
959,1.0,5.6299706
969,1.0,6.4847302
979,1.0,6.630616
989,1.0,7.8637743
999,1.0,8.78554
1009,1.0,9.59894
1019,1.0,8.530628
1029,1.0,8.586676
1039,1.0,9.074335
1049,1.0,9.064854
1059,1.0,8.134392
1069,1.0,6.8234873
1079,1.0,6.2053757
1089,1.0,5.0898886
1099,1.0,3.2104526
1109,1.0,1.4460053
1119,1.0,0.9942202
1129,1.0,0.95057756
1139,1.0,0.6679077
1149,1.0,0.20812374
1159,1.0,0.43341452
1169,1.0,0.6847911
1179,1.0,1.0782259
1189,1.0,2.4415648
1199,1.0,4.0677643
1209,1.0,5.8197393
1219,1.0,6.920662
1229,1.0,8.004895
1239,1.0,9.021094
1249,1.0,10.241296
1259,1.0,8.447765
1269,1.0,8.767621
1279,1.0,8.778261
1289,1.0,8.964483
1299,1.0,8.97406
1309,1.0,8.100941
1319,1.0,7.1767273
1329,1.0,6.156041
1339,1.0,5.7455664
1349,1.0,4.577669
1359,1.0,4.6679606
1369,1.0,4.1877356
1379,1.0,3.003093
1389,1.0,2.4598489
1399,1.0,2.1113021
1409,1.0,1.6599164
1419,1.0,1.316483
1429,1.0,0.90208936
1439,1.0,0.41521585
1449,1.0,0.45664763
1459,1.0,-0.16762865
1469,1.0,-0.30589396
1479,1.0,-0.7859209
1489,0.0,-0.14066738
1499,0.0,-0.33882117
1509,0.0,-0.1931771
1519,0.0,-0.2629587
1529,0.0,-0.2443499
1539,0.0,-0.12836063
1549,0.0,0.11408925
1559,0.0,0.35177177
1569,0.0,0.23128623
1579,0.0,0.07278639
1589,0.0,0.3711003
1599,0.0,0.3004086
1609,0.0,0.6014663
1619,0.0,0.768773
1629,0.0,0.5406548
1639,0.0,-0.078933895
1649,0.0,0.06770527
1659,0.0,-0.07905978
1669,0.0,-0.36514395
1679,0.0,-0.022455692
1689,0.0,-0.06672299
1699,0.0,-0.007097304
1709,0.0,-0.58981705
1719,0.0,-0.74172825
1729,0.0,-0.44403905
1739,0.0,-0.32995498
1749,0.0,-0.23136336
1759,0.0,-0.021625757
1769,0.0,0.06480247
1779,0.0,-0.39636832
1789,0.0,0.15676242
1799,0.0,0.24409229
1809,0.0,0.7980684
1819,0.0,1.2006578
1829,0.0,1.3119074
1839,0.0,1.0262786
1849,0.0,1.1439588
1859,0.0,0.9030355
1869,0.0,0.5533845
1879,0.0,0.24709779
1889,0.0,-0.025200784
1899,0.0,-0.05335033
1909,0.0,-0.4789045
1919,0.0,-0.30666834
1929,0.0,-0.78144777
1939,0.0,-0.6978775
1949,0.0,-0.53469425
1959,0.0,-0.17275763
1969,0.0,-0.6135114
1979,0.0,-0.39762926
1989,0.0,-0.16227776
1999,0.0,0.12279469
2009,0.0,0.07626432
2019,0.0,0.5386873
2029,0.0,0.7154822
2039,0.0,0.5179346
2049,0.0,0.6922517
2059,0.0,0.6290348
2069,0.0,0.6271074
2079,0.0,1.0900426
2089,0.0,0.93925315
2099,0.0,0.6815275
2109,0.0,0.2887932
2119,0.0,0.46279925
2129,0.0,0.09459686
2139,0.0,0.34042567
2149,0.0,-0.091691375
2159,0.0,-0.2480706
2169,0.0,-0.54385245
2179,0.0,-0.3531316
2189,0.0,-0.48154485
2199,0.0,-0.66447276
2209,0.0,-0.380908
2219,0.0,-0.7657775
2229,0.0,-0.7310533
2239,0.0,-0.57663536
2249,0.0,-0.6730164
2259,0.0,-0.74315035
2269,0.0,-0.51652914
2279,0.0,-0.21513969
2289,0.0,-0.42771894
2299,0.0,-0.40161955
2309,0.0,-0.70716155
2319,0.0,-0.509769
2329,0.0,-0.6105732
2339,0.0,-0.662927
2349,0.0,-0.46651596
2359,0.0,-0.40122068
2369,0.0,-0.32260847
2379,0.0,0.09682351
2389,0.0,-0.07878238
2399,0.0,-0.033012986
2409,0.0,-0.04214132
2419,0.0,0.16250557
2429,0.0,-0.10316771
2439,0.0,0.33472544
2449,0.0,0.26917303
2459,0.0,0.50693303
2469,0.0,0.25004113
2479,0.0,0.35223067
2489,0.0,0.20317751
2499,0.0,-0.370179
2509,0.0,-0.61473453
2519,0.0,-0.6961246
2529,0.0,-0.6795271
2539,0.0,-0.52677226
2549,0.0,-0.5330839
2559,0.0,-0.47242343
2569,0.0,0.27831578
2579,0.0,0.016270459
2589,0.0,-0.045793176
2599,0.0,0.04164028
2609,0.0,0.30539918
2619,0.0,0.28584105
2629,0.0,-0.062092185
2639,0.0,0.16753674
2649,0.0,0.007800162
2659,0.0,0.1947766
2669,0.0,0.08049536
2679,0.0,0.17622095
2689,0.0,0.34993654
2699,0.0,0.28396136
2709,0.0,0.36744875
2719,0.0,0.31824428
2729,0.0,0.22705662
2739,0.0,0.12114793
2749,0.0,0.548542
2759,0.0,0.40975797
2769,0.0,0.086361766
2779,0.0,-0.16919303
2789,0.0,-0.14316279
2799,0.0,-0.13636065
2809,0.0,-0.31326586
2819,0.0,0.043535948
2829,0.0,-0.059229016
2839,0.0,-0.32156193
2849,0.0,0.08869845
2859,0.0,0.07180989
2869,0.0,-0.14415288
2879,0.0,-0.4932865
2889,0.0,0.08252597
2899,0.0,-0.085029244
2909,0.0,0.3038451
2919,0.0,0.5676889
2929,0.0,-0.1876657
2939,0.0,-0.1400255
2949,0.0,0.249475
2959,0.0,0.0072106123
2969,0.0,-0.0765875
2979,0.0,0.050052226
2989,0.0,-0.23045278
2999,0.0,-0.6014642
3009,0.0,-0.48223555
3019,0.0,-0.5500274
3029,0.0,-0.6845272
3039,0.0,-0.7049468
3049,0.0,-0.2705925
3059,0.0,-0.20110166
3069,0.0,-0.12367141
3079,0.0,0.017827392
3089,0.0,-0.32686138
3099,0.0,-0.3857295
3109,0.0,-0.29389393
3119,0.0,-0.024101496
3129,0.0,0.12795997
3139,0.0,0.34587044
3149,0.0,0.47772205
3159,0.0,0.6895656
3169,0.0,1.6376879
3179,0.0,0.6090943
3189,0.0,0.9420645
3199,0.0,0.8113595
3209,0.0,0.7128107
3219,0.0,1.1217835
3229,0.0,0.6610677
3239,0.0,1.0393965
3249,0.0,0.8082213
3259,0.0,0.27612942
3269,0.0,-0.12909329
3279,0.0,-0.44880772
3289,0.0,-0.3779571
3299,0.0,-0.5705117
3309,0.0,-0.45084673
3319,0.0,-0.65316296
3329,0.0,-0.24889511
3339,0.0,-0.68887836
3349,0.0,-0.37933707
3359,0.0,-0.11631119
3369,0.0,-0.024832666
3379,0.0,-0.22838521
3389,0.0,-0.3982855
3399,0.0,-0.2572276
3409,0.0,-0.2507444
3419,0.0,-0.20044607
3429,0.0,-0.12051153
3439,0.0,4.4703484e-05
3449,0.0,0.0803684
3459,0.0,0.052459
3469,0.0,-0.047829986
3479,0.0,-0.5440896
3489,0.0,-0.48249733
3499,0.0,-0.6924779
3509,0.0,-0.54695815
3519,0.0,-0.41899437
3529,0.0,-0.44987994
3539,0.0,-0.49872786
3549,0.0,-0.21175009
3559,0.0,-0.5008872
3569,0.0,-0.056959927
3579,0.0,-0.15342927
3589,0.0,-0.07247609
3599,0.0,-0.21144688
3609,0.0,0.06898135
3619,0.0,0.018531919
3629,0.0,-0.19439572
3639,0.0,0.3677711
3649,0.0,0.26708335
3659,0.0,0.5544667
3669,0.0,0.10053772
3679,0.0,0.30302334
3689,0.0,0.2498594
3699,0.0,0.18080395
3709,0.0,0.07701045
3719,0.0,0.028365731
3729,0.0,0.59390646
3739,0.0,0.24859929
3749,0.0,0.52039754
3759,0.0,0.20748341
3769,0.0,0.30100048
3779,0.0,0.5452427
3789,0.0,0.6797193
3799,0.0,0.4813496
3809,0.0,0.14161909
3819,0.0,-0.46084994
3829,0.0,-0.543247
3839,0.0,-0.19032496
3849,0.0,-0.5980408
3859,0.0,-0.5185573
3869,0.0,-0.32141072
3879,0.0,-0.45721072
3889,0.0,-0.034281492
3899,0.0,-0.22500348
3909,0.0,0.27454358
3919,0.0,0.28896797
3929,0.0,0.7429649
3939,0.0,0.5855193
3949,0.0,0.99307567
3959,0.0,-0.15799057
3969,0.0,0.41657877
3979,0.0,0.33325988
3989,0.0,0.74738264
3999,0.0,0.9513628
4009,0.0,0.4290347
4019,0.0,1.0134057
4029,0.0,0.6324313
4039,0.0,0.53990287
4049,0.0,0.47830355
4059,0.0,0.5226299
4069,0.0,0.8599218
4079,0.0,-0.03614223
4089,0.0,-0.13419813
4099,0.0,-0.19699019
4109,0.0,-0.6619473
4119,0.0,-0.15473807
4129,0.0,-0.22787416
4139,0.0,-0.11628604
4149,0.0,0.2797026
4159,0.0,-0.39662367
4169,0.0,-0.0036312342
4179,0.0,0.24078786
4189,0.0,0.049530864
4199,0.0,-0.20291364
4209,0.0,0.2850151
4219,0.0,0.37477648
4229,0.0,0.6424839
4239,0.0,0.36476588
4249,0.0,0.1672808
4259,0.0,0.933752
4269,0.0,0.55237526
4279,0.0,0.31385922
4289,0.0,0.37627774
4299,0.0,0.3066665
4309,0.0,0.049223423
4319,0.0,-0.16321182
4329,0.0,-0.1434378
4339,0.0,-0.21521759
4349,0.0,-0.11545372
4359,0.0,0.25823754
4369,0.0,0.17008406
4379,0.0,0.08696705
4389,0.0,0.100871384
4399,0.0,0.12703347
4409,0.0,0.3107586
4419,0.0,-0.14833999
4429,0.0,-0.18323863
4439,0.0,-0.38326156
4449,0.0,0.009355307
4459,0.0,0.3732304
4469,0.0,0.34692287
4479,0.0,0.21500951
4489,0.0,-0.061851025
4499,0.0,-0.17168462
4509,0.0,-0.3427506
4519,0.0,-0.2501685
4529,0.0,-0.1328007
4539,0.0,-0.012201488
4549,0.0,0.1912036
4559,0.0,-0.1578542
4569,0.0,-0.29608792
4579,0.0,-0.39118963
4589,0.0,-0.29412746
4599,0.0,0.1597395
4609,0.0,0.21774381
4619,0.0,-0.3036803
4629,0.0,-0.08398646
4639,0.0,0.06251007
4649,0.0,0.16578186
4659,0.0,0.24782938
4669,0.0,0.35421985
4679,0.0,0.053638518
4689,0.0,0.30016196
4699,0.0,-0.015778542
4709,0.0,0.08357543
4719,0.0,-0.33776426
4729,0.0,0.07530081
4739,0.0,0.1472683
4749,0.0,0.40015626
4759,0.0,-0.04876846
4769,0.0,0.13181663
4779,0.0,0.2659518
4789,0.0,-0.3423471
4799,0.0,-0.37075323
4809,0.0,-0.13050431
4819,0.0,-0.14222986
4829,0.0,-0.2700678
4839,0.0,-0.24785364
4849,0.0,-0.14287192
4859,0.0,-0.03580433
4869,0.0,-0.089562654
4879,0.0,-0.5294292
4889,0.0,-0.13530374
4899,0.0,-0.17474097
4909,0.0,-0.3307594
4919,0.0,-0.2990768
4929,0.0,-0.08680314
4939,0.0,0.34152806
4949,0.0,0.5012514
4959,0.0,0.8541186
4969,0.0,0.7545807
4979,0.0,0.23562157
4989,0.0,0.38897622
4999,0.0,0.54328996
5009,0.0,0.16138375
5019,0.0,0.23679513
5029,0.0,-0.06701988
5039,0.0,-0.1415956
5049,0.0,-0.29469705
5059,0.0,-0.17920214
5069,0.0,-0.2362225
5079,0.0,-0.6172776
5089,0.0,-0.73147845
5099,0.0,-0.36501145
5109,0.0,-0.37099755
5119,0.0,-0.201541
5129,0.0,-0.49167532
5139,0.0,0.060784817
5149,0.0,-0.034329534
5159,0.0,0.4055885
5169,0.0,0.036896467
5179,0.0,0.0044498444
5189,0.0,0.13965124
5199,0.0,-0.21644276
5209,0.0,0.5053532
5219,0.0,0.64256203
5229,0.0,0.5759887
5239,0.0,0.6379684
5249,0.0,0.27717382
5259,0.0,-0.5797528
5269,0.0,-0.6431763
5279,0.0,-0.45905024
5289,0.0,-0.42606717
5299,0.0,-0.29471242
5309,0.0,-0.15426993
5319,0.0,0.03308785
5329,0.0,-0.08599639
5339,0.0,-0.09867871
5349,0.0,0.08481991
5359,0.0,0.11770338
5369,0.0,0.4673481
5379,0.0,0.26264423
5389,0.0,0.05259615
5399,0.0,0.055336833
5409,0.0,-0.35427016
5419,0.0,-0.1724459
5429,0.0,0.0047714114
5439,0.0,-0.25827932
5449,0.0,-0.2838832
5459,0.0,-0.3551175
5469,0.0,-0.5884681
5479,0.0,-0.35048336
5489,0.0,-0.25378
5499,0.0,0.027345479
5509,0.0,0.016589463
5519,0.0,0.23904234
5529,0.0,-0.15222085
5539,0.0,-0.19285691
5549,0.0,-0.024455726
5559,0.0,0.45228064
5569,0.0,0.46242464
5579,0.0,0.52410513
5589,0.0,0.4603067
5599,0.0,0.6018292
5609,0.0,0.15440631
5619,0.0,0.3152753
5629,0.0,0.2500103
5639,0.0,0.305843
5649,0.0,0.03988248
5659,0.0,-0.2823367
5669,0.0,-0.13455755
5679,0.0,-0.10754961
5689,0.0,-0.06568664
5699,0.0,-0.13120848
5709,0.0,-0.6670651
5719,0.0,-0.44234556
5729,0.0,-0.5885377
5739,0.0,-0.70536715
5749,0.0,-0.59689116
5759,0.0,-0.6280549
5769,0.0,-0.58240306
5779,0.0,-0.528617
5789,0.0,-0.29969084
5799,0.0,-0.5015481
5809,0.0,-0.7306369
5819,0.0,-0.32692236
5829,0.0,-0.82288146
5839,0.0,-0.1366871
5849,0.0,-0.33572268
5859,0.0,-0.14687079
5869,0.0,-0.31448984
5879,0.0,0.0470863
5889,0.0,0.055581987
5899,0.0,0.5415036
5909,0.0,0.018704653
5919,0.0,-0.091221154
5929,0.0,-0.3068177
5939,0.0,-0.73155606
5949,0.0,-0.6853617
5959,0.0,-0.7956895
5969,0.0,-0.432782
5979,0.0,-0.37603462
5989,0.0,-0.27491963
5999,0.0,-0.4769786
6009,1.0,-0.49286902
6019,1.0,-0.6110142
6029,1.0,-0.3010642
6039,1.0,-0.122938216
6049,1.0,0.31862658
6059,1.0,0.4474535
6069,1.0,1.4142102
6079,1.0,2.0384333
6089,1.0,1.9880519
6099,1.0,2.0844548
6109,1.0,2.707292
6119,1.0,3.1214304
6129,1.0,3.570205
6139,1.0,4.258084
6149,1.0,5.1347885
6159,1.0,5.558811
6169,1.0,5.964384
6179,1.0,6.579325
6189,1.0,7.537796
6199,1.0,8.205656
6209,1.0,8.535467
6219,1.0,8.482341
6229,1.0,8.948288
6239,1.0,8.927122
6249,1.0,9.8571615
6259,1.0,8.35075
6269,1.0,7.0531416
6279,1.0,5.7619514
6289,1.0,4.3204975
6299,1.0,3.0829856
6309,1.0,1.819535
6319,1.0,1.2382157
6329,1.0,0.90867466
6339,1.0,0.66559964
6349,1.0,0.09097803
6359,1.0,0.7463273
6369,1.0,1.0078073
6379,1.0,1.2123804
6389,1.0,2.415119
6399,1.0,3.0442495
6409,1.0,4.691229
6419,1.0,6.1661787
6429,1.0,7.6763105
6439,1.0,9.65675
6449,1.0,10.049206
6459,1.0,8.524474
6469,1.0,8.640465
6479,1.0,8.592514
6489,1.0,10.007802
6499,1.0,7.7264137
6509,1.0,6.963193
6519,1.0,6.75184
6529,1.0,6.768569
6539,1.0,5.3764544
6549,1.0,5.0288057
6559,1.0,5.0968766
6569,1.0,3.872478
6579,1.0,3.436911
6589,1.0,2.9193342
6599,1.0,2.1150458
6609,1.0,1.8651214
6619,1.0,1.6709492
6629,1.0,1.7527347
6639,1.0,1.1154962
6649,1.0,1.1723602
6659,1.0,1.121083
6669,1.0,0.669408
6679,1.0,0.3087368
6689,0.0,0.28461027
6699,0.0,0.22715104
6709,0.0,-0.10706693
6719,0.0,0.022376478
6729,0.0,0.16034466
6739,0.0,0.5549508
6749,0.0,0.10199785
6759,0.0,-0.34341705
6769,0.0,0.022302568
6779,0.0,-0.541554
6789,0.0,-0.35258204
6799,0.0,-0.42967802
6809,0.0,-0.056296706
6819,0.0,-0.20793164
6829,0.0,-0.23989975
6839,0.0,-0.21422601
6849,0.0,-0.10098547
6859,0.0,0.17196
6869,0.0,0.36876643
6879,0.0,-0.038737774
6889,0.0,0.24844372
6899,0.0,0.46616817
6909,0.0,0.041397274
6919,0.0,0.011480808
6929,0.0,0.44094038
6939,0.0,0.739097
6949,0.0,0.019206882
6959,0.0,-0.42890316
6969,0.0,-0.55631906
6979,0.0,-0.28443813
6989,0.0,-0.15183216
6999,0.0,-0.40067697
7009,0.0,-0.07624799
7019,0.0,-0.082543254
7029,0.0,0.2578374
7039,0.0,-0.21017754
7049,0.0,-0.4509049
7059,0.0,-0.53734
7069,0.0,-0.63672525
7079,0.0,-0.60565
7089,0.0,-0.1924932
7099,0.0,-0.26384163
7109,0.0,-0.6925626
7119,0.0,-0.40908432
7129,0.0,-0.36969304
7139,0.0,-0.22918826
7149,0.0,-0.19326234
7159,0.0,-0.34539098
7169,0.0,-0.12522525
7179,0.0,-0.12713438
7189,0.0,-0.09712416
7199,0.0,-0.07220346
7209,0.0,-0.16267294
7219,0.0,-0.21453625
7229,0.0,-0.07864702
7239,0.0,0.29329777
7249,0.0,0.1439333
7259,0.0,0.28566188
7269,0.0,-0.033084214
7279,0.0,0.13090593
7289,0.0,0.3795992
7299,0.0,0.30968338
7309,0.0,-0.2391246
7319,0.0,-0.37392092
7329,0.0,-0.11844069
7339,0.0,-0.35080808
7349,0.0,-0.16442442
7359,0.0,0.028742492
7369,0.0,0.049193144
7379,0.0,-0.21420991
7389,0.0,-0.031068563
7399,0.0,0.39083958
7409,0.0,-0.35122973
7419,0.0,-0.44820178
7429,0.0,-0.6955703
7439,0.0,-0.43298888
7449,0.0,-0.117059946
7459,0.0,0.008516729
7469,0.0,0.18053472
7479,0.0,0.26896065
7489,0.0,-0.008466899
7499,0.0,-0.31058067
7509,0.0,-0.35336334
7519,0.0,-0.09266633
7529,0.0,-0.044785082
7539,0.0,-0.43707585
7549,0.0,-0.12808079
7559,0.0,-0.30303264
7569,0.0,0.22306377
7579,0.0,0.08554578
7589,0.0,0.23239237
7599,0.0,-0.04878038
7609,0.0,0.18644595
7619,0.0,-0.23094153
7629,0.0,-0.19002587
7639,0.0,-0.19001234
7649,0.0,-0.47444034
7659,0.0,-0.4280601
7669,0.0,-0.47772992
7679,0.0,-0.9230153
7689,0.0,-0.8826993
7699,0.0,-0.8666179
7709,0.0,-0.76411223
7719,0.0,-0.42388964
7729,0.0,-0.4802996
7739,0.0,-0.31534058
7749,0.0,-0.64338505
7759,0.0,-0.12512243
7769,0.0,-0.30781507
7779,0.0,-0.07924801
7789,0.0,0.013456702
7799,0.0,-0.021223545
7809,0.0,-0.060718596
7819,0.0,-0.38393712
7829,0.0,-0.55823374
7839,0.0,-0.49125344
7849,0.0,-0.2335459
7859,0.0,-0.6697671
7869,0.0,-0.7928605
7879,0.0,-1.0702151
7889,0.0,-0.90041244
7899,0.0,-0.48094398
7909,0.0,-0.55418473
7919,0.0,-0.40530348
7929,0.0,-0.4264428
7939,0.0,0.21397662
7949,0.0,0.40713048
7959,0.0,0.16174173
7969,0.0,-0.14494193
7979,0.0,0.04082805
7989,0.0,0.11777246
7999,0.0,-0.10594708
8009,0.0,0.2307195
8019,0.0,0.3411305
8029,0.0,0.3618905
8039,0.0,0.087346315
8049,0.0,-0.051371396
8059,0.0,0.0112274885
8069,0.0,0.08288902
8079,0.0,0.18034917
8089,0.0,0.49726313
8099,0.0,0.29769868
8109,0.0,0.04400283
8119,0.0,0.36558056
8129,0.0,-0.044735193
8139,0.0,0.018465161
8149,0.0,-0.3859855
8159,0.0,-0.5074354
8169,0.0,-0.5056248
8179,0.0,-0.40110606
8189,0.0,-0.19659412
8199,0.0,-0.19530553
8209,0.0,-0.24445158
8219,0.0,-0.1713171
8229,0.0,-0.07468474
8239,0.0,0.33495063
8249,0.0,0.14124459
8259,0.0,0.5776988
8269,0.0,0.32654673
8279,0.0,0.437729
8289,0.0,0.49622202
8299,0.0,0.41238898
8309,0.0,0.26756418
8319,0.0,0.1964519
8329,0.0,0.8013702
8339,0.0,0.06122887
8349,0.0,0.41432458
8359,0.0,0.33501726
8369,0.0,0.23213261
8379,0.0,0.28797567
8389,0.0,0.09808648
8399,0.0,-0.08865744
8409,0.0,-0.23308283
8419,0.0,0.48372328
8429,0.0,0.82706314
8439,0.0,0.5988292
8449,0.0,0.17224193
8459,0.0,0.29281962
8469,0.0,0.16769439
8479,0.0,0.4071334
8489,0.0,0.3745994
8499,0.0,0.25180006
8509,0.0,-0.093012154
8519,0.0,0.20504123
8529,0.0,0.22037077
8539,0.0,-0.27088916
8549,0.0,0.07016021
8559,0.0,0.062022746
8569,0.0,-0.06956589
8579,0.0,0.037832797
8589,0.0,-0.21778435
8599,0.0,-0.35421824
8609,0.0,-0.14043087
8619,0.0,-0.21402133
8629,0.0,0.18876731
8639,0.0,0.14001781
8649,0.0,0.16077793
8659,0.0,0.44993722
8669,0.0,1.181747
8679,0.0,2.0934906
8689,0.0,1.216279
8699,0.0,0.9677182
8709,0.0,0.7073351
8719,0.0,0.4565208
8729,0.0,1.0207478
8739,0.0,0.5841976
8749,0.0,0.21824604
8759,0.0,0.5837653
8769,0.0,0.6713421
8779,0.0,0.37233204
8789,0.0,0.4065181
8799,0.0,0.7426565
8809,0.0,0.10728812
8819,0.0,0.20660985
8829,0.0,0.116078556
8839,0.0,-0.017846942
8849,0.0,0.08771229
8859,0.0,-0.24012375
8869,0.0,-0.625024
8879,0.0,-0.076300144
8889,0.0,-0.14481801
8899,0.0,-0.13830572
8909,0.0,-0.056664526
8919,0.0,-0.35881364
8929,0.0,-0.007591963
8939,0.0,-0.017083943
8949,0.0,-0.29195434
8959,0.0,-0.15379912
8969,0.0,-0.26046687
8979,0.0,-0.37046486
8989,0.0,-0.094388306
8999,0.0,-0.09094268
9009,0.0,0.076331615
9019,0.0,-0.14816642
9029,0.0,0.2784691
9039,0.0,0.40722114
9049,0.0,0.6491073
9059,0.0,0.27510178
9069,0.0,0.5413768
9079,0.0,0.5673344
9089,0.0,0.5879038
9099,0.0,0.4602996
9109,0.0,0.02169025
9119,0.0,-0.11544514
9129,0.0,-0.13550514
9139,0.0,0.13681251
9149,0.0,-0.11787802
9159,0.0,-0.14569998
9169,0.0,0.063830316
9179,0.0,-0.0021850467
9189,0.0,0.32307088
9199,0.0,0.05011809
9209,0.0,0.14996225
9219,0.0,0.022607803
9229,0.0,-0.0040177107
9239,0.0,0.37681746
9249,0.0,0.36141837
9259,0.0,-0.1079815
9269,0.0,0.28368467
9279,0.0,0.49812895
9289,0.0,0.51869494
9299,0.0,0.11489725
9309,0.0,0.28286886
9319,0.0,-0.048739016
9329,0.0,0.63211393
9339,0.0,0.7211102
9349,0.0,0.3248636
9359,0.0,-0.1360414
9369,0.0,0.41465372
9379,0.0,0.47629774
9389,0.0,0.52848244
9399,0.0,0.35349745
9409,0.0,0.4903984
9419,0.0,0.4859715
9429,0.0,0.6839699
9439,0.0,0.18764776
9449,0.0,0.31261522
9459,0.0,0.14810115
9469,0.0,0.8446364
9479,0.0,0.5122462
9489,0.0,0.2976942
9499,0.0,0.05111599
9509,0.0,-0.40796065
9519,0.0,-0.03386867
9529,0.0,-0.5696697
9539,0.0,-0.3487146
9549,0.0,-0.7219608
9559,0.0,-0.58452696
9569,0.0,-0.35607606
9579,0.0,-0.3373211
9589,0.0,-0.3499775
9599,0.0,-0.2294969
9609,0.0,-0.25025707
9619,0.0,-0.3055426
9629,0.0,-0.6742263
9639,0.0,-0.70795417
9649,0.0,-0.8701624
9659,0.0,-0.5740437
9669,0.0,-0.30467492
9679,0.0,-0.3012722
9689,0.0,0.053451717
9699,0.0,0.447506
9709,0.0,0.19724536
9719,0.0,-0.08082372
9729,0.0,0.04787326
9739,0.0,-0.12934583
9749,0.0,-0.35035175
9759,0.0,-0.28786916
9769,0.0,-0.21141219
9779,0.0,-0.34705257
9789,0.0,0.10715264
9799,0.0,-0.19446105
9809,0.0,-0.07781297
9819,0.0,-0.2098319
9829,0.0,-0.8709944
9839,0.0,-1.1418188
9849,0.0,-0.48530418
9859,0.0,-0.69950426
9869,0.0,-0.75621665
9879,0.0,-0.6404116
9889,0.0,-0.24206066
9899,0.0,-0.4330302
9909,0.0,-0.5095215
9919,0.0,-0.41458613
9929,0.0,-0.35425192
9939,0.0,0.1427077
9949,0.0,0.27526087
9959,0.0,-0.019389927
9969,0.0,0.3635407
9979,0.0,0.6365629
9989,0.0,0.17456537
9999,0.0,0.09910232
10009,0.0,-0.15722495
10019,0.0,-0.2081464
10029,0.0,-0.07875413
10039,0.0,-0.1564104
10049,0.0,-0.098276794
10059,0.0,-0.322208
10069,0.0,-0.3207814
10079,0.0,-0.5977221
10089,0.0,-0.45126015
10099,0.0,-0.6167763
10109,0.0,-0.5986812
10119,0.0,-0.5233314
10129,0.0,-0.8945254
10139,0.0,-0.91424155
10149,0.0,-0.36104316
10159,0.0,-0.13834095
10169,0.0,0.3563655
10179,0.0,0.5017963
10189,0.0,-0.12477571
10199,0.0,0.025458872
10209,0.0,-0.33097947
10219,0.0,-0.38570613
10229,0.0,-0.51887476
10239,0.0,-0.10142338
10249,0.0,-0.052233875
10259,0.0,-0.46815395
10269,0.0,0.02487421
10279,0.0,0.09174949
10289,0.0,-0.16290253
10299,0.0,-0.055518687
10309,0.0,-0.6148122
10319,0.0,-0.6245125
10329,0.0,-0.7053564
10339,0.0,-0.43069613
10349,0.0,-0.2710502
10359,0.0,-0.27528048
10369,0.0,-0.4603994
10379,0.0,-0.24189496
10389,0.0,0.06543732
10399,0.0,0.06385422
10409,0.0,-0.31512952
10419,0.0,-0.28921467
10429,0.0,-0.26617217
10439,0.0,-0.45362872
10449,0.0,-0.5197221
10459,0.0,-0.4372686
10469,0.0,-0.30880362
10479,0.0,-0.41079688
10489,0.0,0.061558127
10499,0.0,-0.21205908
10509,0.0,-0.2884841
10519,0.0,-0.50975716
10529,0.0,-0.5982266
10539,0.0,-0.49411023
10549,0.0,-0.39421183
10559,0.0,-0.6049038
10569,0.0,-0.4566089
10579,0.0,-0.31455755
10589,0.0,-0.1633814
10599,0.0,-0.5728106
10609,0.0,0.015128076
10619,0.0,-0.24649191
10629,0.0,-0.062011003
10639,0.0,0.21643305
10649,0.0,0.34838903
10659,0.0,-0.2776085
10669,0.0,0.09384924
10679,0.0,-0.099714756
10689,0.0,0.26376384
10699,0.0,0.070391536
10709,0.0,0.08768153
10719,0.0,0.18455416
10729,0.0,0.4442824
10739,0.0,0.36589038
10749,0.0,0.222296
10759,0.0,0.11523652
10769,0.0,0.3180558
10779,0.0,0.5506467
10789,0.0,0.71748704
10799,0.0,0.2991289
10809,0.0,0.05114734
10819,0.0,0.20001477
10829,0.0,0.62152857
10839,0.0,0.30937874
10849,0.0,0.5856376
10859,0.0,0.112329364
10869,0.0,-0.23124373
10879,0.0,-0.089939654
10889,0.0,-0.33276993
10899,0.0,-0.13811004
10909,0.0,0.20301467
10919,0.0,-0.031992435
10929,0.0,-0.037696958
10939,0.0,0.026323676
10949,0.0,-0.32199848
10959,0.0,0.27005315
10969,0.0,0.40922117
10979,0.0,0.9464596
10989,0.0,1.0213308
10999,0.0,0.7957336
11009,0.0,0.50864697
11019,0.0,0.103953004
11029,0.0,-0.22751474
11039,0.0,0.06799966
11049,0.0,0.39266157
11059,0.0,0.78121185
11069,0.0,0.76652485
11079,0.0,0.3213392
11089,0.0,0.068938375
11099,0.0,0.39024395
11109,0.0,-0.25542235
11119,0.0,0.14601797
11129,0.0,-0.4345852
11139,0.0,-0.40504527
11149,0.0,-0.08757377
11159,0.0,-0.21396339
11169,0.0,-0.20938712
11179,0.0,-0.11241269
11189,0.0,0.2709821
11199,0.0,0.7080571
11209,1.0,0.53867334
11219,1.0,0.79495835
11229,1.0,0.76855814
11239,1.0,1.0973642
11249,1.0,1.4789987
11259,1.0,1.8816038
11269,1.0,1.9110155
11279,1.0,2.1853883
11289,1.0,2.8514218
11299,1.0,3.2057035
11309,1.0,3.5233827
11319,1.0,4.469504
11329,1.0,4.1937385
11339,1.0,4.3626766
11349,1.0,5.602326
11359,1.0,5.940702
11369,1.0,6.140326
11379,1.0,7.026252
11389,1.0,8.745482
11399,1.0,8.954419
11409,1.0,8.858519
11419,1.0,8.624772
11429,1.0,8.576887
11439,1.0,8.380602
11449,1.0,9.671793
11459,1.0,8.943206
11469,1.0,6.4477143
11479,1.0,5.6339774
11489,1.0,3.2920463
11499,1.0,2.4261127
11509,1.0,1.7608242
11519,1.0,0.7253004
11529,1.0,0.5349388
11539,1.0,0.57695395
11549,1.0,0.42862225
11559,1.0,0.6492199
11569,1.0,1.354039
11579,1.0,1.3133278
11589,1.0,2.8380508
11599,1.0,4.4778166
11609,1.0,5.868537
11619,1.0,6.50963
11629,1.0,8.304342
11639,1.0,10.101973
11649,1.0,10.23274
11659,1.0,8.575701
11669,1.0,8.774661
11679,1.0,8.574223
11689,1.0,8.959656
11699,1.0,8.476538
11709,1.0,7.6837187
11719,1.0,7.1810207
11729,1.0,5.7881155
11739,1.0,4.7897763
11749,1.0,4.506997
11759,1.0,4.0283623
11769,1.0,3.5062218
11779,1.0,2.3580656
11789,1.0,2.479195
11799,1.0,1.9378402
11809,1.0,1.9030564
11819,1.0,1.4143281
11829,1.0,1.0347234
11839,1.0,0.67711955
11849,1.0,0.3857386
11859,1.0,0.03473699
11869,1.0,-0.17170644
11879,0.0,-0.14706391
11889,0.0,0.06599307
11899,0.0,-0.31475186
11909,0.0,0.15144765
11919,0.0,0.33936524
11929,0.0,0.49529845
11939,0.0,0.13068008
11949,0.0,-0.049400568
11959,0.0,0.18759322
11969,0.0,0.83741456
11979,0.0,1.0052338
11989,0.0,0.6621699
11999,0.0,0.45238692
12009,0.0,0.6743667
12019,0.0,0.6644882
12029,0.0,0.71031386
12039,0.0,0.5864514
12049,0.0,0.54876393
12059,0.0,0.016590953
12069,0.0,-0.06205827
12079,0.0,-0.2453757
12089,0.0,-0.31613833
12099,0.0,-0.5386464
12109,0.0,-0.39275813
12119,0.0,-0.14484209
12129,0.0,0.099696696
12139,0.0,0.194605
12149,0.0,0.1300416
12159,0.0,-0.12861961
12169,0.0,0.057577014
12179,0.0,0.43275803
12189,0.0,0.66575044
12199,0.0,0.23356676
12209,0.0,0.6883059
12219,0.0,0.28431726
12229,0.0,-0.1032083
12239,0.0,0.0486632
12249,0.0,0.23151731
12259,0.0,-0.2353155
12269,0.0,-0.53953475
12279,0.0,-0.5023692
12289,0.0,-0.4212247
12299,0.0,-0.53562
12309,0.0,-0.70126337
12319,0.0,-0.4419468
12329,0.0,-0.13469332
12339,0.0,0.015906394
12349,0.0,-0.06290877
12359,0.0,-0.18932974
12369,0.0,0.86558783
12379,0.0,0.548305
12389,0.0,0.83140546
12399,0.0,1.2060939
12409,0.0,1.6628401
12419,0.0,0.7756643
12429,0.0,0.99201214
12439,0.0,1.2682216
12449,0.0,0.86374414
12459,0.0,0.90368736
12469,0.0,0.9728178
12479,0.0,0.74051356
12489,0.0,0.9029257
12499,0.0,0.46114224
12509,0.0,0.01118803
12519,0.0,0.06479907
12529,0.0,-0.09113258
12539,0.0,0.4911456
12549,0.0,0.20442063
12559,0.0,0.2639898
12569,0.0,0.27912474
12579,0.0,0.03651154
12589,0.0,0.20771748
12599,0.0,0.63412315
12609,0.0,-0.040028453
12619,0.0,0.12901598
12629,0.0,0.6413371
12639,0.0,0.5370353
12649,0.0,0.50012094
12659,0.0,0.3054539
12669,0.0,0.19454646
12679,0.0,0.3248598
12689,0.0,0.35070062
12699,0.0,0.6714148
12709,0.0,0.5574926
12719,0.0,0.30156922
12729,0.0,0.04498124
12739,0.0,0.38220632
12749,0.0,0.48470283
12759,0.0,0.29656398
12769,0.0,0.05710745
12779,0.0,-0.021609187
12789,0.0,-0.25995612
12799,0.0,-0.5711385
12809,0.0,-0.23038453
12819,0.0,-0.53715664
12829,0.0,-0.6940308
12839,0.0,-0.41314632
12849,0.0,-0.607457
12859,0.0,-0.59438145
12869,0.0,-0.38251507
12879,0.0,-0.65263397
12889,0.0,-0.43615466
12899,0.0,-0.29958695
12909,0.0,0.18957067
12919,0.0,0.16108614
12929,0.0,-0.33450526
12939,0.0,-0.05025363
12949,0.0,0.422069
12959,0.0,0.58001566
12969,0.0,0.51211905
12979,0.0,0.58864105
12989,0.0,0.04956925
12999,0.0,-0.08133012
13009,0.0,0.021833718
13019,0.0,-0.18403769
13029,0.0,-0.08801973
13039,0.0,-0.09277713
13049,0.0,0.42812324
13059,0.0,0.079013705
13069,0.0,-0.401412
13079,0.0,-0.1507991
13089,0.0,-0.27107757
13099,0.0,-0.31482482
13109,0.0,-0.43403107
13119,0.0,0.016171455
13129,0.0,-0.19674158
13139,0.0,0.5986554
13149,0.0,0.6288514
13159,0.0,0.71272594
13169,0.0,0.48237085
13179,0.0,0.34363323
13189,0.0,0.5860459
13199,0.0,0.18440884
13209,0.0,0.25691366
13219,0.0,0.6962131
13229,0.0,0.14749038
13239,0.0,0.12905759
13249,0.0,0.028239667
13259,0.0,-0.10510248
13269,0.0,-0.10177219
13279,0.0,-0.32045275
13289,0.0,-0.05058956
13299,0.0,0.12196779
13309,0.0,-0.05613762
13319,0.0,-0.43852597
13329,0.0,0.09528035
13339,0.0,-0.08091581
13349,0.0,-0.51877725
13359,0.0,-0.30327636
13369,0.0,-0.7939785
13379,0.0,-0.46258587
13389,0.0,-0.72553694
13399,0.0,-0.33555615
13409,0.0,-0.3552608
13419,0.0,-0.5498265
13429,0.0,-0.44080436
13439,0.0,-0.28028715
13449,0.0,-0.20513922
13459,0.0,-0.7587878
13469,0.0,-0.23141462
13479,0.0,-0.51566386
13489,0.0,-0.723508
13499,0.0,-0.5864966
13509,0.0,-0.41660422
13519,0.0,-0.5546534
13529,0.0,-0.6189637
13539,0.0,-0.5374553
13549,0.0,-0.89872116
13559,0.0,-0.23415726
13569,0.0,-0.39112455
13579,0.0,-0.3423285
13589,0.0,-0.14440507
13599,0.0,-0.0044776797
13609,0.0,-0.11425215
13619,0.0,0.24378532
13629,0.0,0.2373017
13639,0.0,0.59068024
13649,0.0,0.63134044
13659,0.0,0.32486832
13669,0.0,0.008272707
13679,0.0,-0.2775551
13689,0.0,0.07594514
13699,0.0,-0.35227227
13709,0.0,-0.051546633
13719,0.0,0.26618433
13729,0.0,-0.043541193
13739,0.0,-0.11175877
13749,0.0,0.06890148
13759,0.0,-0.17382497
13769,0.0,0.18122703
13779,0.0,-0.108186245
13789,0.0,0.12973648
13799,0.0,-0.038731337
13809,0.0,-0.06801158
13819,0.0,-0.30566072
13829,0.0,-0.2763886
13839,0.0,-0.17046052
13849,0.0,-0.29493552
13859,0.0,-0.91676056
13869,0.0,-0.45472127
13879,0.0,-0.6389624
13889,0.0,-0.44703698
13899,0.0,-0.052950025
13909,0.0,-0.09837985
13919,0.0,0.35054582
13929,0.0,0.21901643
13939,0.0,-0.14232033
13949,0.0,-0.27893376
13959,0.0,-0.18512332
13969,0.0,-0.17082727
13979,0.0,0.0612967
13989,0.0,0.11949378
13999,0.0,0.30705196
14009,0.0,-0.042386174
14019,0.0,0.49336952
14029,0.0,0.1329537
14039,0.0,0.3656944
14049,0.0,0.26979333
14059,0.0,0.2857746
14069,0.0,0.7366316
14079,0.0,0.3389061
14089,0.0,0.8509485
14099,0.0,0.75398505
14109,0.0,0.5202585
14119,0.0,0.5178985
14129,0.0,0.037563264
14139,0.0,0.08876699
14149,0.0,-0.2537322
14159,0.0,0.48974407
14169,0.0,-0.23849005
14179,0.0,0.230008
14189,0.0,-0.10797697
14199,0.0,-0.4705236
14209,0.0,-0.08999103
14219,0.0,-0.6314376
14229,0.0,-0.17902595
14239,0.0,-0.3900442
14249,0.0,-0.30620378
14259,0.0,0.47585845
14269,0.0,0.14959353
14279,0.0,0.4677722
14289,0.0,0.17908579
14299,0.0,0.6011664
14309,0.0,0.38633806
14319,0.0,0.12234759
14329,0.0,0.29864222
14339,0.0,0.23329931
14349,0.0,0.055046797
14359,0.0,1.261159
14369,0.0,1.4805491
14379,0.0,1.5235009
14389,0.0,1.5969316
14399,0.0,1.1830872
14409,0.0,1.0785158
14419,0.0,1.4776435
14429,0.0,0.7459672
14439,0.0,1.1345663
14449,0.0,0.75320345
14459,0.0,0.3334002
14469,0.0,0.18458712
14479,0.0,0.08934486
14489,0.0,0.12298775
14499,0.0,-0.32254726
14509,0.0,0.040155113
14519,0.0,0.14259493
14529,0.0,0.07734966
14539,0.0,-0.089453995
14549,0.0,-0.35865963
14559,0.0,-0.15346038
14569,0.0,0.54376566
14579,0.0,0.40305954
14589,0.0,0.5007316
14599,0.0,0.3697151
14609,0.0,0.14923346
14619,0.0,0.9574021
14629,0.0,0.4493472
14639,0.0,0.39115214
14649,0.0,0.20628148
14659,0.0,-0.03730446
14669,0.0,-0.011793196
14679,0.0,0.28113896
14689,0.0,-0.026580751
14699,0.0,-0.42355156
14709,0.0,-0.54592806
14719,0.0,-0.16589671
14729,0.0,0.46727765
14739,0.0,-0.44037235
14749,0.0,-0.25095814
14759,0.0,-0.5479584
14769,0.0,-0.34956074
14779,0.0,-0.4094534
14789,0.0,-0.6488442
14799,0.0,-0.3561424
14809,0.0,-0.26950812
14819,0.0,-0.13359177
14829,0.0,-0.46815592
14839,0.0,-0.24923325
14849,0.0,-0.3853323
14859,0.0,-0.046003103
14869,0.0,-0.4882049
14879,0.0,-0.611542
14889,0.0,-0.11647868
14899,0.0,0.17689776
14909,0.0,0.8256857
14919,0.0,0.6400545
14929,0.0,0.24241072
14939,0.0,0.92352295
14949,0.0,0.5518406
14959,0.0,0.5734148
14969,0.0,0.2859015
14979,0.0,0.29932928
14989,0.0,0.0481143
14999,0.0,0.38366872
15009,0.0,-0.18992299
15019,0.0,-0.062873065
15029,0.0,-0.112030864
15039,0.0,-0.3733487
15049,0.0,-0.4962356
15059,0.0,-0.5733307
15069,0.0,-0.33778727
15079,0.0,-0.14733988
15089,0.0,-0.3329286
15099,0.0,-0.35683995
15109,0.0,-0.072722316
15119,0.0,-0.33344525
15129,0.0,-0.06869185
15139,0.0,0.27372098
15149,0.0,-0.28331023
15159,0.0,-0.31020325
15169,0.0,-0.23739862
15179,0.0,-0.3201552
15189,0.0,-0.16766095
15199,0.0,0.2596469
15209,0.0,0.0497123
15219,0.0,0.18870199
15229,0.0,0.17193723
15239,0.0,0.8093228
15249,0.0,0.6059614
15259,0.0,0.41818523
15269,0.0,0.7913836
15279,0.0,0.9520362
15289,0.0,0.19606948
15299,0.0,0.22948492
15309,0.0,0.24428576
15319,0.0,-0.47124547
15329,0.0,0.30012572
15339,0.0,0.5324678
15349,0.0,0.4794101
15359,0.0,0.16806144
15369,0.0,0.013114512
15379,0.0,0.14010787
15389,0.0,-0.1001122
15399,0.0,0.09512019
15409,0.0,-0.14222914
15419,0.0,0.103236735
15429,0.0,0.15797633
15439,0.0,0.44976807
15449,0.0,0.76209396
15459,0.0,0.44977123
15469,0.0,0.3477471
15479,0.0,0.2215175
15489,0.0,0.09306568
15499,0.0,0.44182944
15509,0.0,0.2470792
15519,0.0,0.26381636
15529,0.0,0.12312192
15539,0.0,0.45130754
15549,0.0,0.54346967
15559,0.0,0.5100029
15569,0.0,0.055992782
15579,0.0,0.03999096
15589,0.0,-0.4337502
15599,0.0,-0.35699886
15609,0.0,-0.18997836
15619,0.0,-0.5612577
15629,0.0,-0.6478501
15639,0.0,-0.72024906
15649,0.0,-0.37913787
15659,0.0,-0.5227225
15669,0.0,-0.41642064
15679,0.0,-0.35692984
15689,0.0,-0.19550914
15699,0.0,-0.11520952
15709,0.0,-0.10055953
15719,0.0,-0.24296069
15729,0.0,-0.12797195
15739,0.0,-0.18649054
15749,0.0,-0.23946142
15759,0.0,0.37276214
15769,0.0,0.12400603
15779,0.0,0.008505642
15789,0.0,0.033720553
15799,0.0,-0.14892584
15809,0.0,-0.22149414
15819,0.0,-0.2663777
15829,0.0,-0.42196548
15839,0.0,-0.098151624
15849,0.0,-0.6365752
15859,0.0,-0.57760257
15869,0.0,-0.83092487
15879,0.0,-0.43568057
15889,0.0,-0.31900406
15899,0.0,-0.15572941
15909,0.0,0.109893024
15919,0.0,0.085104644
15929,0.0,0.40905577
15939,0.0,-0.16962922
15949,0.0,0.17453945
15959,0.0,0.23879409
15969,0.0,0.34716827
15979,0.0,0.52519065
15989,0.0,0.074041486
15999,0.0,0.23661184
16009,0.0,0.20897287
16019,0.0,0.4928636
16029,0.0,0.42336643
16039,0.0,0.45195585
16049,0.0,-0.24324358
16059,0.0,-0.0578112
16069,0.0,-0.08987796
16079,0.0,-0.04398322
16089,0.0,0.0045863986
16099,0.0,-0.2596678
16109,0.0,0.089229405
16119,0.0,0.1791439
16129,0.0,0.2379297
16139,0.0,-0.028586864
16149,0.0,0.5692723
16159,0.0,0.619097
16169,0.0,0.2828536
16179,0.0,0.1753493
16189,0.0,0.7064443
16199,0.0,0.23363107
16209,0.0,0.09041101
16219,0.0,0.43709582
16229,0.0,0.4506653
16239,0.0,0.7916147
16249,0.0,0.737549
16259,0.0,0.413482
16269,0.0,0.20709729
16279,0.0,0.4551685
16289,0.0,0.15752679
16299,0.0,-0.3504045
16309,0.0,-0.4944008
16319,0.0,-0.54444605
16329,0.0,-0.32389355
16339,0.0,0.44634908
16349,0.0,0.21287352
16359,0.0,0.18274331
16369,0.0,0.15577906
16379,0.0,0.07834464
16389,0.0,-0.071504354
16399,0.0,-0.3325888
16409,1.0,0.034446776
16419,1.0,-0.16460568
16429,1.0,0.4136284
16439,1.0,0.82501346
16449,1.0,0.9936981
16459,1.0,1.3466958
16469,1.0,2.0882459
16479,1.0,2.344934
16489,1.0,3.1814153
16499,1.0,4.14055
16509,1.0,3.7898278
16519,1.0,3.9657052
16529,1.0,4.5797334
16539,1.0,5.5899754
16549,1.0,4.8467484
16559,1.0,5.9657354
16569,1.0,7.0122356
16579,1.0,8.703333
16589,1.0,9.354523
16599,1.0,8.9495735
16609,1.0,8.663657
16619,1.0,8.702068
16629,1.0,9.601315
16639,1.0,10.600356
16649,1.0,9.1504135
16659,1.0,8.458025
16669,1.0,6.3792562
16679,1.0,5.2518845
16689,1.0,3.702652
16699,1.0,2.6580312
16709,1.0,1.3013775
16719,1.0,0.6601718
16729,1.0,0.23529452
16739,1.0,0.16625094
16749,1.0,0.14038992
16759,1.0,0.723668
16769,1.0,1.7563462
16779,1.0,2.132755
16789,1.0,3.4025283
16799,1.0,4.5888567
16809,1.0,6.300065
16819,1.0,7.565682
16829,1.0,8.79339
16839,1.0,8.925598
16849,1.0,9.940916
16859,1.0,8.877013
16869,1.0,8.847662
16879,1.0,9.364545
16889,1.0,9.561016
16899,1.0,7.910655
16909,1.0,6.529517
16919,1.0,6.0183954
16929,1.0,5.610427
16939,1.0,5.0230007
16949,1.0,4.801451
16959,1.0,4.161101
16969,1.0,3.122171
16979,1.0,2.986578
16989,1.0,2.607716
16999,1.0,2.0129945
17009,1.0,2.1230097
17019,1.0,1.6078322
17029,1.0,1.3620197
17039,1.0,1.5947821
17049,1.0,0.6028436
17059,1.0,0.35776097
17069,1.0,0.10056484
17079,0.0,0.016728759
17089,0.0,-0.20522761
17099,0.0,0.1024667
17109,0.0,-0.10966855
17119,0.0,0.059228063
17129,0.0,0.36539692
17139,0.0,0.76820374
17149,0.0,0.43572658
17159,0.0,-0.043958247
17169,0.0,-0.21902305
17179,0.0,-0.004328549
17189,0.0,-0.09333336
17199,0.0,-0.081012845
17209,0.0,-0.3277653
17219,0.0,-0.27113646
17229,0.0,-0.42106473
17239,0.0,0.37024587
17249,0.0,0.090667605
17259,0.0,0.05270493
17269,0.0,0.18933254
17279,0.0,-0.1473617
17289,0.0,-0.20437747
17299,0.0,0.07794255
17309,0.0,0.36929268
17319,0.0,0.100161254
17329,0.0,0.8042091
17339,0.0,0.91314125
17349,0.0,0.41689402
17359,0.0,0.3421812
17369,0.0,-0.017849505
17379,0.0,-0.34628516
17389,0.0,-0.17301917
17399,0.0,-0.19291168
17409,0.0,0.020733356
17419,0.0,-0.5147091
17429,0.0,-0.5212034
17439,0.0,-0.29321122
17449,0.0,-0.18175632
17459,0.0,-0.10992104
17469,0.0,-0.076716185
17479,0.0,0.111762285
17489,0.0,-0.08438742
17499,0.0,0.054273903
17509,0.0,-0.25025958
17519,0.0,-0.36296195
17529,0.0,-0.5064467
17539,0.0,-0.04222387
17549,0.0,-0.45580423
17559,0.0,-0.3571561
17569,0.0,-0.62844425
17579,0.0,-0.27779514
17589,0.0,-0.3445884
17599,0.0,-0.13491595
17609,0.0,-0.051722348
17619,0.0,-0.19476706
17629,0.0,0.03325826
17639,0.0,0.08496666
17649,0.0,0.2076059
17659,0.0,0.29715878
17669,0.0,0.3455869
17679,0.0,0.38964754
17689,0.0,0.044788778
17699,0.0,0.01032418
17709,0.0,-0.08474296
17719,0.0,-0.40763116
17729,0.0,-0.34195638
17739,0.0,0.08620769
17749,0.0,-0.088947296
17759,0.0,-0.3296557
17769,0.0,0.043157816
17779,0.0,0.10429007
17789,0.0,0.29364604
17799,0.0,0.2028597
17809,0.0,0.5338616
17819,0.0,0.107684076
17829,0.0,-0.0668143
17839,0.0,0.18371052
17849,0.0,0.4095866
17859,0.0,0.360259
17869,0.0,0.35115176
17879,0.0,0.16933852
17889,0.0,0.36709875
17899,0.0,0.024255037
17909,0.0,-0.52807707
17919,0.0,-0.24917465
17929,0.0,-0.28861117
17939,0.0,0.1413889
17949,0.0,-0.22410738
17959,0.0,-0.21009624
17969,0.0,-0.15432674
17979,0.0,-0.052204072
17989,0.0,-0.08918989
17999,0.0,0.22964972
18009,0.0,-0.022494018
18019,0.0,0.20350116
18029,0.0,0.06992096
18039,0.0,-0.15112889
18049,0.0,-0.10220921
18059,0.0,-0.1969086
18069,0.0,0.1700123
18079,0.0,-0.06806201
18089,0.0,-0.30161893
18099,0.0,0.16252226
18109,0.0,-0.3070767
18119,0.0,-0.63701916
18129,0.0,-0.29121947
18139,0.0,-0.2158553
18149,0.0,-0.44169837
18159,0.0,-0.21357673
18169,0.0,-0.25546885
18179,0.0,-0.014432073
18189,0.0,-0.32836705
18199,0.0,-0.0034668446
18209,0.0,0.10547775
18219,0.0,-0.10575652
18229,0.0,0.004664719
18239,0.0,-0.08036202
18249,0.0,0.32249695
18259,0.0,-0.06519389
18269,0.0,-0.026304841
18279,0.0,0.09536171
18289,0.0,-0.17638284
18299,0.0,-0.032898128
18309,0.0,-0.74824125
18319,0.0,-0.1037063
18329,0.0,-0.22793943
18339,0.0,-0.37747693
18349,0.0,-0.5611541
18359,0.0,-0.65309817
18369,0.0,-0.23247391
18379,0.0,-0.1271162
18389,0.0,-0.67163765
18399,0.0,-0.32235497
18409,0.0,-0.25500202
18419,0.0,0.13153398
18429,0.0,0.25792766
18439,0.0,0.2149412
18449,0.0,0.7192041
18459,0.0,0.31421387
18469,0.0,0.4939378
18479,0.0,0.16963482
18489,0.0,0.32279837
18499,0.0,-0.04038948
18509,0.0,-0.40606993
18519,0.0,0.12823337
18529,0.0,-0.18064672
18539,0.0,0.17924047
18549,0.0,-0.31670308
18559,0.0,-0.044115007
18569,0.0,-0.22654921
18579,0.0,0.0062405467
18589,0.0,0.027175128
18599,0.0,0.16610813
18609,0.0,-0.09461337
18619,0.0,-0.7736662
18629,0.0,-0.10768676
18639,0.0,0.06808013
18649,0.0,-0.023792446
18659,0.0,-0.5609638
18669,0.0,-0.06360841
18679,0.0,-0.18960512
18689,0.0,0.39317834
18699,0.0,0.12363523
18709,0.0,-0.09915626
18719,0.0,-0.06947547
18729,0.0,-0.22228128
18739,0.0,-0.32329834
18749,0.0,-0.47411406
18759,0.0,-0.34281558
18769,0.0,-0.49314994
18779,0.0,-0.08429295
18789,0.0,0.45805782
18799,0.0,0.33866835
18809,0.0,-0.14789099
18819,0.0,0.2931918
18829,0.0,-0.6497151
18839,0.0,-0.24309582
18849,0.0,0.07028264
18859,0.0,0.1489371
18869,0.0,-0.15427697
18879,0.0,-0.31649595
18889,0.0,-0.17292422
18899,0.0,-0.34692782
18909,0.0,-0.25452387
18919,0.0,-0.45233154
18929,0.0,0.076147854
18939,0.0,0.65806586
18949,0.0,0.9986823
18959,0.0,0.87195385
18969,0.0,0.47598457
18979,0.0,0.059115827
18989,0.0,0.70779175
18999,0.0,0.5221706
19009,0.0,0.064558625
19019,0.0,0.20534688
19029,0.0,0.33272302
19039,0.0,0.23959047
19049,0.0,-0.09726572
19059,0.0,0.1335904
19069,0.0,0.030550897
19079,0.0,0.3023088
19089,0.0,-0.07158077
19099,0.0,0.13269413
19109,0.0,0.33970702
19119,0.0,0.41606742
19129,0.0,-0.028302908
19139,0.0,-0.35421616
19149,0.0,-0.21469247
19159,0.0,-0.26287848
19169,0.0,-0.33683133
19179,0.0,-0.112148404
19189,0.0,0.28117156
19199,0.0,0.4206202
19209,0.0,0.6722353
19219,0.0,0.78964126
19229,0.0,0.84505427
19239,0.0,0.16558415
19249,0.0,-0.17954636
19259,0.0,-0.10594571
19269,0.0,-0.27464652
19279,0.0,-0.34092385
19289,0.0,-0.7950454
19299,0.0,0.08694017
19309,0.0,0.26569635
19319,0.0,0.15488422
19329,0.0,0.0485847
19339,0.0,-0.47904128
19349,0.0,-0.24440295
19359,0.0,-0.14746308
19369,0.0,0.36267167
19379,0.0,-0.25559175
19389,0.0,-0.083910644
19399,0.0,0.16098154
19409,0.0,-0.025314331
19419,0.0,-0.16324544
19429,0.0,-0.10627097
19439,0.0,-0.15241718
19449,0.0,-0.25883532
19459,0.0,0.14655292
19469,0.0,-0.14529991
19479,0.0,-0.16000015
19489,0.0,-0.20252943
19499,0.0,-0.16625714
19509,0.0,-0.44605595
19519,0.0,-0.20430428
19529,0.0,-0.2676497
19539,0.0,-0.28869742
19549,0.0,-0.14431715
19559,0.0,-0.35416543
19569,0.0,-0.44896346
19579,0.0,-0.3878914
19589,0.0,-0.26513433
19599,0.0,-0.43079937
19609,0.0,-0.30190516
19619,0.0,-0.22068226
19629,0.0,-0.4624632
19639,0.0,-0.5127289
19649,0.0,-0.3513453
19659,0.0,-0.03272599
19669,0.0,-0.043608367
19679,0.0,-0.13790113
19689,0.0,0.67326707
19699,0.0,0.5069284
19709,0.0,0.3277467
19719,0.0,0.20407659
19729,0.0,-0.22519344
19739,0.0,0.12509835
19749,0.0,0.1707555
19759,0.0,-0.12509245
19769,0.0,-0.26727557
19779,0.0,-0.2986794
19789,0.0,-0.70508426
19799,0.0,-0.6404441
19809,0.0,-0.10690713
19819,0.0,-0.29648197
19829,0.0,-0.45269436
19839,0.0,-0.051072538
19849,0.0,0.13390535
19859,0.0,0.08496183
19869,0.0,0.21611011
19879,0.0,0.3037086
19889,0.0,0.3435952
19899,0.0,0.089984894
19909,0.0,0.20128179
19919,0.0,-0.5957863
19929,0.0,-0.22538412
19939,0.0,-0.3703279
19949,0.0,-0.15770882
19959,0.0,-0.47915262
19969,0.0,-0.27480012
19979,0.0,-0.3308385
19989,0.0,-0.2798205
19999,0.0,-0.5129725
20009,0.0,-0.4947989
20019,0.0,-0.42941862
20029,0.0,-0.49570727
20039,0.0,-0.016062438
20049,0.0,-0.03703791
20059,0.0,0.059438348
20069,0.0,0.38924146
20079,0.0,0.8953996
20089,0.0,0.8351314
20099,0.0,0.8054341
20109,0.0,0.7066085
20119,0.0,1.1083753
20129,0.0,0.5483202
20139,0.0,0.6486398
20149,0.0,0.594917
20159,0.0,0.62093884
20169,0.0,0.6231492
20179,0.0,0.52414685
20189,0.0,0.40346605
20199,0.0,0.12849146
20209,0.0,-0.16163963
20219,0.0,-0.18288535
20229,0.0,-0.2100181
20239,0.0,-0.40582597
20249,0.0,-0.33830506
20259,0.0,-0.37998104
20269,0.0,-0.34303075
20279,0.0,-0.08742046
20289,0.0,-0.3529287
20299,0.0,-0.24778819
20309,0.0,-0.3382306
20319,0.0,-0.08167064
20329,0.0,-0.5290652
20339,0.0,-0.43632317
20349,0.0,0.02323693
20359,0.0,0.14492726
20369,0.0,-0.08212495
20379,0.0,-0.10749912
20389,0.0,-0.31250024
20399,0.0,-0.16449302
20409,0.0,-0.683935
20419,0.0,-0.9542736
20429,0.0,-0.51103246
20439,0.0,-0.24063802
20449,0.0,-0.41086876
20459,0.0,-0.3968438
20469,0.0,-0.48678213
20479,0.0,-0.022161245
20489,0.0,0.1275267
20499,0.0,-0.09092373
20509,0.0,0.08653617
20519,0.0,-0.20414275
20529,0.0,-0.29213732
20539,0.0,-0.4572032
20549,0.0,-0.11780119
20559,0.0,0.009401023
20569,0.0,-0.40234578
20579,0.0,-0.52865624
20589,0.0,-1.0002241
20599,0.0,-0.55007917
20609,0.0,-0.58108073
20619,0.0,-0.27928442
20629,0.0,-0.52099544
20639,0.0,-0.2699287
20649,0.0,-0.15768361
20659,0.0,0.04941511
20669,0.0,-0.25865495
20679,0.0,-0.07376182
20689,0.0,0.13466942
20699,0.0,-0.11398399
20709,0.0,-0.10930997
20719,0.0,-0.060793042
20729,0.0,0.11657673
20739,0.0,0.020754516
20749,0.0,0.16897959
20759,0.0,0.34291613
20769,0.0,0.2816602
20779,0.0,0.07673472
20789,0.0,0.26947188
20799,0.0,0.2887342
20809,0.0,0.6344287
20819,0.0,0.29779756
20829,0.0,0.35044283
20839,0.0,-0.23926634
20849,0.0,-0.06345028
20859,0.0,-0.4306422
20869,0.0,-0.46121573
20879,0.0,-0.1322326
20889,0.0,0.019366264
20899,0.0,-0.041786015
20909,0.0,-0.179133
20919,0.0,-0.35503662
20929,0.0,-0.2847545
20939,0.0,0.2460475
20949,0.0,0.4266318
20959,0.0,0.37888283
20969,0.0,0.33289188
20979,0.0,0.35647565
20989,0.0,0.15890491
20999,0.0,0.3764754
21009,0.0,0.23380077
21019,0.0,0.60474735
21029,0.0,0.6549626
21039,0.0,0.4400624
21049,0.0,0.2914763
21059,0.0,0.47324145
21069,0.0,-0.057602584
21079,0.0,-0.20908976
21089,0.0,-0.28488988
21099,0.0,-0.08037561
21109,0.0,-0.4185692
21119,0.0,-0.25208133
21129,0.0,-0.12880147
21139,0.0,-0.541434
21149,0.0,-0.62427306
21159,0.0,-0.71903026
21169,0.0,-0.53161365
21179,0.0,-0.8533044
21189,0.0,-0.7675413
21199,0.0,-0.5502331
21209,0.0,-0.45177203
21219,0.0,-0.32452315
21229,0.0,-0.64765936
21239,0.0,-0.52562124
21249,0.0,-0.4919467
21259,0.0,-0.43123972
21269,0.0,-0.76304543
21279,0.0,-0.50582165
21289,0.0,-0.19344896
21299,0.0,-0.40287358
21309,0.0,-0.49087703
21319,0.0,-0.40895665
21329,0.0,0.047493458
21339,0.0,-0.21400362
21349,0.0,0.3604527
21359,0.0,0.020569444
21369,0.0,0.6630326
21379,0.0,0.84978336
21389,0.0,0.28589994
21399,0.0,0.22166109
21409,0.0,-0.17172885
21419,0.0,-0.3001156
21429,0.0,-0.39089257
21439,0.0,-0.42382175
21449,0.0,-0.41891944
21459,0.0,-1.0890603
21469,0.0,-0.705448
21479,0.0,-0.95089144
21489,0.0,-0.44538844
21499,0.0,-0.45642507
21509,0.0,-0.5139018
21519,0.0,-0.77177674
21529,0.0,-0.8015083
21539,0.0,-0.627381
21549,0.0,-0.32112646
21559,0.0,0.18172836
21569,0.0,0.5213629
21579,0.0,0.6235319
21589,1.0,0.3732236
21599,1.0,0.31869978
21609,1.0,0.376091
21619,1.0,0.23645449
21629,1.0,1.1811314
21639,1.0,0.95750505
21649,1.0,1.347096
21659,1.0,1.7993217
21669,1.0,2.5657272
21679,1.0,2.5470808
21689,1.0,2.9754431
21699,1.0,3.15575
21709,1.0,3.7344995
21719,1.0,4.158625
21729,1.0,5.1533976
21739,1.0,5.3803644
21749,1.0,7.46626
21759,1.0,8.283936
21769,1.0,9.389282
21779,1.0,10.0746155
21789,1.0,8.360222
21799,1.0,8.975809
21809,1.0,8.603873
21819,1.0,9.634576
21829,1.0,8.452121
21839,1.0,8.3533325
21849,1.0,7.150421
21859,1.0,6.717334
21869,1.0,5.0819855
21879,1.0,3.8600152
21889,1.0,2.472506
21899,1.0,1.270412
21909,1.0,0.7022663
21919,1.0,0.5270994
21929,1.0,0.5659115
21939,1.0,1.1130793
21949,1.0,1.8039298
21959,1.0,2.3956902
21969,1.0,3.4328392
21979,1.0,4.2019954
21989,1.0,5.2495193
21999,1.0,6.407686
22009,1.0,7.9714584
22019,1.0,9.659145
22029,1.0,9.105815
22039,1.0,8.847837
22049,1.0,8.639107
22059,1.0,8.767438
22069,1.0,9.660468
22079,1.0,8.376719
22089,1.0,7.507104
22099,1.0,6.770991
22109,1.0,5.9841833
22119,1.0,4.7804265
22129,1.0,4.227221
22139,1.0,4.419459
22149,1.0,3.728292
22159,1.0,3.6066382
22169,1.0,2.8370144
22179,1.0,2.258075
22189,1.0,1.6301494
22199,1.0,1.60078
22209,1.0,0.75836635
22219,1.0,0.36075842
22229,1.0,0.023861647
22239,1.0,-0.062231064
22249,1.0,-0.20233518
22259,1.0,-0.6242089
22269,0.0,-0.55936617
22279,0.0,-0.7372566
22289,0.0,-0.7882953
22299,0.0,-0.3948452
22309,0.0,-0.5774462
22319,0.0,-0.5660365
22329,0.0,-0.71508414
22339,0.0,-0.8345938
22349,0.0,-0.6460519
22359,0.0,-0.6876048
22369,0.0,-0.12677157
22379,0.0,-0.19425166
22389,0.0,-0.0015137196
22399,0.0,-0.27477705
22409,0.0,-0.061024547
22419,0.0,-0.3006401
22429,0.0,-0.5971246
22439,0.0,-0.21162117
22449,0.0,-0.1558876
22459,0.0,-0.12164277
22469,0.0,-0.5837747
22479,0.0,-0.26111847
22489,0.0,-0.6877411
22499,0.0,-0.49922967
22509,0.0,-0.11465579
22519,0.0,0.118828535
22529,0.0,0.12868339
22539,0.0,0.3031522
22549,0.0,0.14702362
22559,0.0,0.3642454
22569,0.0,0.30678153
22579,0.0,0.28056633
22589,0.0,0.091644466
22599,0.0,0.22951883
22609,0.0,0.3474959
22619,0.0,0.12459409
22629,0.0,0.01251322
22639,0.0,-0.23315746
22649,0.0,-0.4565512
22659,0.0,-0.45472407
22669,0.0,-0.475204
22679,0.0,-0.15494406
22689,0.0,-0.53261924
22699,0.0,-0.59862256
22709,0.0,-0.09749609
22719,0.0,-0.43564075
22729,0.0,-0.43153858
22739,0.0,-0.17860746
22749,0.0,-0.38254154
22759,0.0,-0.3333845
22769,0.0,-0.2654426
22779,0.0,-0.3337974
22789,0.0,-0.42707336
22799,0.0,-0.23310488
22809,0.0,0.113546014
22819,0.0,-0.40315294
22829,0.0,-0.41903377
22839,0.0,-0.38645828
22849,0.0,-0.6801988
22859,0.0,-0.3383866
22869,0.0,-0.68133485
22879,0.0,-0.6330304
22889,0.0,-0.6968668
22899,0.0,-0.2656281
22909,0.0,-0.29301488
22919,0.0,-0.31570274
22929,0.0,-0.37963486
22939,0.0,-0.21420527
22949,0.0,-0.08286965
22959,0.0,-0.48470682
22969,0.0,0.05907452
22979,0.0,-0.22757292
22989,0.0,-0.21807611
22999,0.0,-0.26248366
23009,0.0,-0.18111509
23019,0.0,-0.3421315
23029,0.0,-0.16086799
23039,0.0,-0.47588915
23049,0.0,-0.53989726
23059,0.0,-0.65073967
23069,0.0,-0.83901626
23079,0.0,-0.73402256
23089,0.0,-0.5550718
23099,0.0,-0.3706643
23109,0.0,-0.21881205
23119,0.0,-0.20070201
23129,0.0,0.023635447
23139,0.0,-0.18918031
23149,0.0,0.078666866
23159,0.0,0.05183518
23169,0.0,0.034016073
23179,0.0,-0.5881946
23189,0.0,-0.20749295
23199,0.0,-0.21755916
23209,0.0,-0.19520903
23219,0.0,-0.13219988
23229,0.0,-0.64053434
23239,0.0,-0.1750871
23249,0.0,-0.41359007
23259,0.0,-0.26284575
23269,0.0,-0.057335317
23279,0.0,-0.66387576
23289,0.0,-0.20171505
23299,0.0,-0.022270858
23309,0.0,0.47119355
23319,0.0,-0.1471594
23329,0.0,0.22246408
23339,0.0,0.22696531
23349,0.0,0.3736264
23359,0.0,0.1759606
23369,0.0,0.25216496
23379,0.0,-0.12127513
23389,0.0,0.407772
23399,0.0,-0.03724283
23409,0.0,0.24256152
23419,0.0,0.10240626
23429,0.0,-0.13773441
23439,0.0,0.11315507
23449,0.0,0.23697239
23459,0.0,0.19233894
23469,0.0,0.026034594
23479,0.0,-0.33803207
23489,0.0,-0.37267315
23499,0.0,-0.15490955
23509,0.0,-0.15515512
23519,0.0,-0.5406112
23529,0.0,-0.09211773
23539,0.0,-0.014202476
23549,0.0,0.061392844
23559,0.0,-0.023484826
23569,0.0,-0.03127283
23579,0.0,-0.22653234
23589,0.0,-0.6036921
23599,0.0,-0.38088208
23609,0.0,-0.21009171
23619,0.0,-0.15683585
23629,0.0,0.27736598
23639,0.0,0.4668616
23649,0.0,1.2510428
23659,0.0,1.0829684
23669,0.0,0.8216134
23679,0.0,0.22992426
23689,0.0,0.51104015
23699,0.0,0.44653654
23709,0.0,0.06906968
23719,0.0,-0.13841802
23729,0.0,-0.15386361
23739,0.0,-0.14874852
23749,0.0,-0.12602985
23759,0.0,-0.36192095
23769,0.0,-0.29669732
23779,0.0,0.006807983
23789,0.0,0.24640709
23799,0.0,0.46666026
23809,0.0,0.65360504
23819,0.0,1.1017134
23829,0.0,1.3869163
23839,0.0,1.9783237
23849,0.0,2.5787897
23859,0.0,2.1102543
23869,0.0,1.9785228
23879,0.0,1.6411057
23889,0.0,1.6362287
23899,0.0,1.3933368
23909,0.0,1.7611129
23919,0.0,1.6241163
23929,0.0,0.96141475
23939,0.0,0.29894423
23949,0.0,0.38079995
23959,0.0,0.18742138
23969,0.0,0.22359407
23979,0.0,0.190058
23989,0.0,0.2568258
23999,0.0,0.42953908
24009,0.0,0.17208546
24019,0.0,0.31501472
24029,0.0,0.14400381
24039,0.0,0.6959378
24049,0.0,0.86246586
24059,0.0,0.5340963
24069,0.0,0.37899756
24079,0.0,0.44844407
24089,0.0,-0.31938416
24099,0.0,-0.27859372
24109,0.0,0.14533329
24119,0.0,-0.21533537
24129,0.0,-0.2762413
24139,0.0,-0.7201462
24149,0.0,-0.49103492
24159,0.0,-0.18287516
24169,0.0,-0.0740757
24179,0.0,-0.10460335
24189,0.0,0.005913198
24199,0.0,-0.11721027
24209,0.0,-0.43856394
24219,0.0,-0.7934117
24229,0.0,-0.43935484
24239,0.0,0.1879456
24249,0.0,-0.22686303
24259,0.0,-0.17949194
24269,0.0,-0.38313144
24279,0.0,-0.060429156
24289,0.0,-0.14246058
24299,0.0,-0.4507389
24309,0.0,-0.41065687
24319,0.0,-0.0848766
24329,0.0,-0.07539672
24339,0.0,-0.67788476
24349,0.0,-0.27916896
24359,0.0,-0.27621078
24369,0.0,-0.06250358
24379,0.0,0.09421611
24389,0.0,0.12250304
24399,0.0,-0.026076674
24409,0.0,0.03191483
24419,0.0,0.0011140108
24429,0.0,0.20220804
24439,0.0,0.39102584
24449,0.0,0.84138405
24459,0.0,0.16873074
24469,0.0,0.7897332
24479,0.0,0.6436068
24489,0.0,0.9457928
24499,0.0,0.9076719
24509,0.0,1.0547597
24519,0.0,1.3400614
24529,0.0,0.89107335
24539,0.0,0.30902654
24549,0.0,0.7332936
24559,0.0,0.2509126
24569,0.0,0.18347788
24579,0.0,0.0036332011
24589,0.0,-0.4206791
24599,0.0,-0.032912374
24609,0.0,0.11994892
24619,0.0,0.18179917
24629,0.0,0.12971234
24639,0.0,0.056473494
24649,0.0,0.17412966
24659,0.0,0.4778337
24669,0.0,0.40909553
24679,0.0,0.40831333
24689,0.0,-0.031751573
24699,0.0,-0.16986746
24709,0.0,-0.14408976
24719,0.0,1.0330584
24729,0.0,0.46362764
24739,0.0,0.5253283
24749,0.0,0.60828096
24759,0.0,0.40588158
24769,0.0,-0.08889413
24779,0.0,0.06346226
24789,0.0,-0.40571678
24799,0.0,0.2209776
24809,0.0,-0.065478444
24819,0.0,-0.522435
24829,0.0,-0.17369789
24839,0.0,-0.50498325
24849,0.0,-0.56262976
24859,0.0,-0.18088001
24869,0.0,-0.4617601
24879,0.0,-0.2783491
24889,0.0,-0.06908655
24899,0.0,-0.19273633
24909,0.0,-0.26504833
24919,0.0,-0.123062134
24929,0.0,0.07502639
24939,0.0,-0.14628923
24949,0.0,-0.014798224
24959,0.0,-0.14547086
24969,0.0,-0.25307387
24979,0.0,-0.48874205
24989,0.0,-0.540596
24999,0.0,-0.10393274
25009,0.0,-0.033275306
25019,0.0,-0.42664337
25029,0.0,-0.1319347
25039,0.0,-0.20602024
25049,0.0,-0.17729151
25059,0.0,-0.66499853
25069,0.0,0.018171728
25079,0.0,0.16817361
25089,0.0,0.30243552
25099,0.0,-0.025526166
25109,0.0,-0.38289928
25119,0.0,-0.21198589
25129,0.0,-0.13007075
25139,0.0,-0.3999452
25149,0.0,-0.09144825
25159,0.0,-0.0964846
25169,0.0,-0.26481962
25179,0.0,0.35434747
25189,0.0,0.66744804
25199,0.0,1.0195372
25209,0.0,0.54091793
25219,0.0,0.48888397
25229,0.0,0.14342546
25239,0.0,0.040270567
25249,0.0,-0.00041490793
25259,0.0,0.1331765
25269,0.0,0.03625661
25279,0.0,-0.37896383
25289,0.0,-0.46739727
25299,0.0,-0.0683707
25309,0.0,0.3221116
25319,0.0,0.15230465
25329,0.0,-0.038799584
25339,0.0,-0.08979994
25349,0.0,-0.34726083
25359,0.0,-0.058939278
25369,0.0,-0.06413925
25379,0.0,-0.3277828
25389,0.0,-0.22172904
25399,0.0,-0.008298337
25409,0.0,-0.049771667
25419,0.0,0.3605957
25429,0.0,0.20328617
25439,0.0,-0.11684239
25449,0.0,-0.05281949
25459,0.0,0.23122013
25469,0.0,-0.18725455
25479,0.0,-0.30319053
25489,0.0,-0.13233525
25499,0.0,-0.026776254
25509,0.0,-0.2164895
25519,0.0,-0.25083292
25529,0.0,-0.14661288
25539,0.0,0.09114969
25549,0.0,0.32883918
25559,0.0,0.23762345
25569,0.0,0.19243085
25579,0.0,-0.4680305
25589,0.0,-0.08605373
25599,0.0,-0.35669237
25609,0.0,-0.32364398
25619,0.0,-0.32038885
25629,0.0,-0.051825523
25639,0.0,-0.112395465
25649,0.0,-0.26151407
25659,0.0,-0.05666566
25669,0.0,-0.3067332
25679,0.0,0.04261434
25689,0.0,0.3105396
25699,0.0,-0.029682755
25709,0.0,-0.3939854
25719,0.0,-0.13180488
25729,0.0,0.13881063
25739,0.0,0.07560736
25749,0.0,0.8379433
25759,0.0,0.92521983
25769,0.0,0.8636138
25779,0.0,1.1017218
25789,0.0,1.0895412
25799,0.0,1.0991156
25809,0.0,1.2494843
25819,0.0,0.9093542
25829,0.0,0.77418303
25839,0.0,0.023151636
25849,0.0,0.24340147
25859,0.0,0.32606292
25869,0.0,-0.40758818
25879,0.0,-0.24702418
25889,0.0,-0.097987354
25899,0.0,-0.19952655
25909,0.0,-0.34161508
25919,0.0,-0.48786807
25929,0.0,-0.2541092
25939,0.0,-0.14827293
25949,0.0,-0.10658413
25959,0.0,-0.14883113
25969,0.0,-0.028661907
25979,0.0,0.068743765
25989,0.0,-0.15022892
25999,0.0,0.04399234
26009,0.0,0.57337755
26019,0.0,0.39104187
26029,0.0,0.26178885
26039,0.0,0.9727564
26049,0.0,0.9012165
26059,0.0,1.3004084
26069,0.0,0.82393986
26079,0.0,0.90838915
26089,0.0,0.82902807
26099,0.0,0.7684492
26109,0.0,0.43999624
26119,0.0,0.31167918
26129,0.0,0.20226431
26139,0.0,-0.082995296
26149,0.0,0.20277125
26159,0.0,0.2191971
26169,0.0,0.036091268
26179,0.0,0.09084755
26189,0.0,0.055280387
26199,0.0,0.13650864
26209,0.0,-0.06367874
26219,0.0,0.3090102
26229,0.0,-0.071269095
26239,0.0,0.23760962
26249,0.0,0.16752768
26259,0.0,-0.1156891
26269,0.0,-0.054297805
26279,0.0,0.4804544
26289,0.0,-0.016395748
26299,0.0,-0.011044264
26309,0.0,0.112329185
26319,0.0,-0.12933314
26329,0.0,-0.14467442
26339,0.0,-0.028862357
26349,0.0,-0.14415902
26359,0.0,-0.5502848
26369,0.0,0.060856164
26379,0.0,-0.19712865
26389,0.0,-0.11108917
26399,0.0,-0.16329879
26409,0.0,0.11051649
26419,0.0,-0.1049726
26429,0.0,-0.087308764
26439,0.0,-0.056707025
26449,0.0,-0.09380984
26459,0.0,0.5376564
26469,0.0,0.31333864
26479,0.0,0.23929965
26489,0.0,0.01646632
26499,0.0,0.23830861
26509,0.0,0.3933798
26519,0.0,0.36245424
26529,0.0,0.4146443
26539,0.0,0.37965912
26549,0.0,0.24099308
26559,0.0,-0.13351947
26569,0.0,0.23979807
26579,0.0,0.06086141
26589,0.0,0.27722228
26599,0.0,0.043159068
26609,0.0,0.17324859
26619,0.0,0.079588294
26629,0.0,0.13404024
26639,0.0,-0.20173866
26649,0.0,-0.38864183
26659,0.0,-0.056460798
26669,0.0,-0.11928016
26679,0.0,0.027573109
26689,0.0,-0.038662016
26699,0.0,-0.030556083
26709,0.0,0.011294365
26719,0.0,0.047680497
26729,0.0,-0.06232685
26739,0.0,-0.3005528
26749,0.0,-0.43140525
26759,0.0,-0.15055287
26769,0.0,-0.1835962
26779,0.0,0.17032564
26789,1.0,-0.06439072
26799,1.0,-0.24542695
26809,1.0,0.050499797
26819,1.0,0.2885328
26829,1.0,0.16500914
26839,1.0,1.0869627
26849,1.0,1.6042421
26859,1.0,2.1363196
26869,1.0,2.291195
26879,1.0,2.5585167
26889,1.0,3.3415756
26899,1.0,3.2488763
26909,1.0,3.7230036
26919,1.0,4.4318285
26929,1.0,4.7432966
26939,1.0,5.3072085
26949,1.0,6.045295
26959,1.0,7.462623
26969,1.0,8.13592
26979,1.0,8.649984
26989,1.0,8.679403
26999,1.0,8.675845
27009,1.0,8.673727
27019,1.0,9.641758
27029,1.0,9.584903
27039,1.0,9.583717
27049,1.0,7.665097
27059,1.0,5.5841217
27069,1.0,4.488157
27079,1.0,3.2750432
27089,1.0,2.223209
27099,1.0,1.1137428
27109,1.0,0.633529
27119,1.0,0.18157238
27129,1.0,-0.068463326
27139,1.0,-0.105679035
27149,1.0,0.8616582
27159,1.0,1.3545494
27169,1.0,2.1310709
27179,1.0,3.7984784
27189,1.0,5.744982
27199,1.0,7.1284637
27209,1.0,7.985197
27219,1.0,9.713453
27229,1.0,10.219465
27239,1.0,8.937359
27249,1.0,8.547277
27259,1.0,8.440939
27269,1.0,8.416077
27279,1.0,8.8049965
27289,1.0,8.366147
27299,1.0,7.2934957
27309,1.0,5.7306724
27319,1.0,5.0167055
27329,1.0,4.4657807
27339,1.0,4.139807
27349,1.0,4.147752
27359,1.0,3.011119
27369,1.0,3.1707222
27379,1.0,2.3983808
27389,1.0,1.9980832
27399,1.0,1.7022979
27409,1.0,1.476771
27419,1.0,0.87252074
27429,1.0,0.83986473
27439,1.0,0.6775253
27449,1.0,0.24713242
27459,0.0,-0.04435569
27469,0.0,0.08154124
27479,0.0,0.12683493
27489,0.0,-0.07953006
27499,0.0,-0.4056126
27509,0.0,-0.08094257
27519,0.0,-0.051542044
27529,0.0,-0.009485006
27539,0.0,0.02919197
27549,0.0,0.08191085
27559,0.0,0.020364285
27569,0.0,-0.45334244
27579,0.0,-0.27259135
27589,0.0,-0.728472
27599,0.0,0.034444213
27609,0.0,-0.19514155
27619,0.0,-0.21844542
27629,0.0,-0.17918968
27639,0.0,-0.30768776
27649,0.0,0.05613172
27659,0.0,-0.04385245
27669,0.0,-0.12884402
27679,0.0,-0.12906551
27689,0.0,-0.13615084
27699,0.0,-0.04016751
27709,0.0,-0.06402588
27719,0.0,0.22750944
27729,0.0,0.722687
27739,0.0,0.60156995
27749,0.0,0.4312538
27759,0.0,0.16147864
27769,0.0,0.44078076
27779,0.0,0.09005004
27789,0.0,-0.26935172
27799,0.0,0.008594871
27809,0.0,-0.39016694
27819,0.0,-0.11888027
27829,0.0,-0.4734972
27839,0.0,-0.18230832
27849,0.0,-0.090195656
27859,0.0,-0.24224043
27869,0.0,-0.14627534
27879,0.0,-0.030986786
27889,0.0,-0.344918
27899,0.0,-0.13737333
27909,0.0,-0.2564218
27919,0.0,-0.012435138
27929,0.0,0.021943152
27939,0.0,-0.27879292
27949,0.0,-0.073140144
27959,0.0,-0.21819645
27969,0.0,0.17825246
27979,0.0,-0.39687395
27989,0.0,-0.50070983
27999,0.0,-0.5148563
28009,0.0,-0.40779436
28019,0.0,-0.35626137
28029,0.0,-0.73816675
28039,0.0,-0.5923311
28049,0.0,-0.45165342
28059,0.0,-0.65052027
28069,0.0,-0.036845624
28079,0.0,0.10319805
28089,0.0,-0.0214113
28099,0.0,0.10362226
28109,0.0,0.36042762
28119,0.0,0.6323552
28129,0.0,0.13156563
28139,0.0,-0.14659119
28149,0.0,0.06185025
28159,0.0,0.15404308
28169,0.0,-0.034839332
28179,0.0,-0.2009691
28189,0.0,-0.29928446
28199,0.0,-0.43599528
28209,0.0,0.003272891
28219,0.0,0.04185015
28229,0.0,-0.02320218
28239,0.0,0.44941038
28249,0.0,0.33244073
28259,0.0,0.3404376
28269,0.0,0.20600694
28279,0.0,0.32542777
28289,0.0,0.31608474
28299,0.0,-0.060108244
28309,0.0,0.19298863
28319,0.0,0.4638089
28329,0.0,0.8231136
28339,0.0,0.4453857
28349,0.0,0.23065633
28359,0.0,0.21887016
28369,0.0,0.11565125
28379,0.0,0.3483249
28389,0.0,-0.39524317
28399,0.0,-0.081008255
28409,0.0,-0.30092996
28419,0.0,-0.01328969
28429,0.0,-0.22835171
28439,0.0,0.006789863
28449,0.0,-0.016344309
28459,0.0,0.061190844
28469,0.0,-0.24436021
28479,0.0,-0.16080177
28489,0.0,-0.11895543
28499,0.0,-0.63239294
28509,0.0,-0.47638202
28519,0.0,-0.23012733
28529,0.0,-0.32849622
28539,0.0,-0.024189353
28549,0.0,0.28689122
28559,0.0,0.041606605
28569,0.0,-0.10906005
28579,0.0,0.12551212
28589,0.0,-0.13711262
28599,0.0,-0.10841215
28609,0.0,0.010966778
28619,0.0,0.3123247
28629,0.0,0.5051794
28639,0.0,0.09062463
28649,0.0,0.2188862
28659,0.0,-0.110254526
28669,0.0,0.045386076
28679,0.0,-0.08027053
28689,0.0,-0.119734585
28699,0.0,-0.017623484
28709,0.0,-0.27361584
28719,0.0,-0.36347437
28729,0.0,-0.7535454
28739,0.0,-0.39143574
28749,0.0,-0.48337775
28759,0.0,-0.5308824
28769,0.0,-0.72190875
28779,0.0,-0.60508513
28789,0.0,-0.5246003
28799,0.0,-0.41650742
28809,0.0,-0.6647343
28819,0.0,-0.4481132
28829,0.0,-0.33564746
28839,0.0,-0.16099244
28849,0.0,-0.06427562
28859,0.0,0.07062113
28869,0.0,-0.005427599
28879,0.0,0.15420216
28889,0.0,-0.07251406
28899,0.0,-0.16489917
28909,0.0,-0.056391954
28919,0.0,0.05586928
28929,0.0,0.27528554
28939,0.0,0.39243126
28949,0.0,0.17761976
28959,0.0,0.009957135
28969,0.0,0.38121146
28979,0.0,0.43388885
28989,0.0,0.07690573
28999,0.0,0.23743361
29009,0.0,-0.30007905
29019,0.0,-0.062278807
29029,0.0,0.06970328
29039,0.0,0.0911535
29049,0.0,0.33162135
29059,0.0,0.10573524
29069,0.0,0.31960964
29079,0.0,-0.19681275
29089,0.0,-0.11221534
29099,0.0,-0.0665583
29109,0.0,-0.22049177
29119,0.0,-0.4534791
29129,0.0,-0.30239373
29139,0.0,-0.19844794
29149,0.0,-0.20449567
29159,0.0,-0.14059252
29169,0.0,0.10762471
29179,0.0,-0.37183303
29189,0.0,-0.7005058
29199,0.0,-0.52593386
29209,0.0,-0.13205653
29219,0.0,0.04236406
29229,0.0,-0.12883484
29239,0.0,-0.22093964
29249,0.0,-0.12384719
29259,0.0,0.39257926
29269,0.0,0.17412448
29279,0.0,0.33437502
29289,0.0,0.28951633
29299,0.0,0.24491823
29309,0.0,0.45714426
29319,0.0,-0.09375191
29329,0.0,0.2089935
29339,0.0,-0.15954149
29349,0.0,-0.049212396
29359,0.0,-0.07813829
29369,0.0,0.021144211
29379,0.0,0.0023661852
29389,0.0,-0.33543277
29399,0.0,0.04535085
29409,0.0,0.18740278
29419,0.0,0.3466546
29429,0.0,-0.3305338
29439,0.0,-0.22368777
29449,0.0,-0.3747207
29459,0.0,-0.45887285
29469,0.0,-0.63275635
29479,0.0,-0.2919463
29489,0.0,-0.16634494
29499,0.0,0.058665097
29509,0.0,-0.2924071
29519,0.0,-0.28408724
29529,0.0,-0.38611323
29539,0.0,-0.5089765
29549,0.0,-0.48101366
29559,0.0,-0.41897684
29569,0.0,-0.579782
29579,0.0,-0.25973827
29589,0.0,-0.3169405
29599,0.0,-0.13248634
29609,0.0,-0.0020941496
29619,0.0,-0.320117
29629,0.0,-0.2945245
29639,0.0,-0.4731276
29649,0.0,-0.31223625
29659,0.0,-0.059886217
29669,0.0,0.040473104
29679,0.0,0.018808246
29689,0.0,-0.06866151
29699,0.0,0.25913632
29709,0.0,0.02661854
29719,0.0,0.17007172
29729,0.0,0.4398051
29739,0.0,0.24703014
29749,0.0,0.38340724
29759,0.0,0.17734724
29769,0.0,1.158611
29779,0.0,0.7752756
29789,0.0,0.8013873
29799,0.0,0.69661796
29809,0.0,0.5185147
29819,0.0,0.49940217
29829,0.0,0.43275183
29839,0.0,0.6549656
29849,0.0,0.71162987
29859,0.0,0.814384
29869,0.0,0.15113956
29879,0.0,-0.013342321
29889,0.0,-0.06636691
29899,0.0,-0.30757385
29909,0.0,-0.14247209
29919,0.0,0.029863715
29929,0.0,0.11537504
29939,0.0,-0.1739788
29949,0.0,-0.3915679
29959,0.0,-0.2897349
29969,0.0,-0.3927005
29979,0.0,-0.52089626
29989,0.0,-0.20001805
29999,0.0,0.32582384
30009,0.0,0.07413846
30019,0.0,-0.19322717
30029,0.0,-0.11731446
30039,0.0,0.24364364
30049,0.0,0.2868895
30059,0.0,0.24340361
30069,0.0,0.079957604
30079,0.0,0.43503773
30089,0.0,0.36107975
30099,0.0,0.6812927
30109,0.0,0.7472714
30119,0.0,1.1561773
30129,0.0,0.5471804
30139,0.0,0.058796585
30149,0.0,-0.025803447
30159,0.0,-0.3124019
30169,0.0,-0.4766174
30179,0.0,-0.3274119
30189,0.0,0.027560115
30199,0.0,0.05810249
30209,0.0,-0.088772595
30219,0.0,-0.11942184
30229,0.0,-0.17812198
30239,0.0,-0.212726
30249,0.0,-0.46897495
30259,0.0,-0.1429252
30269,0.0,0.006595671
30279,0.0,-0.38803375
30289,0.0,-0.22128677
30299,0.0,-0.13293707
30309,0.0,-0.3035854
30319,0.0,-0.36390913
30329,0.0,-0.51455337
30339,0.0,-0.47377628
30349,0.0,-0.23780859
30359,0.0,-0.15619242
30369,0.0,-0.26717877
30379,0.0,-0.26370287
30389,0.0,0.22816461
30399,0.0,0.10395062
30409,0.0,0.010038972
30419,0.0,-0.19151717
30429,0.0,-0.39269233
30439,0.0,-0.21158004
30449,0.0,-0.024819732
30459,0.0,0.250156
30469,0.0,0.46203297
30479,0.0,0.03603953
30489,0.0,0.23509598
30499,0.0,0.6109559
30509,0.0,0.24203533
30519,0.0,0.12307185
30529,0.0,-0.4959494
30539,0.0,-0.10592955
30549,0.0,-0.0145023465
30559,0.0,-0.43008018
30569,0.0,0.13222057
30579,0.0,-0.14489073
30589,0.0,0.15020269
30599,0.0,-0.28042638
30609,0.0,-0.17036182
30619,0.0,-0.030935585
30629,0.0,0.043929636
30639,0.0,0.23923749
30649,0.0,0.540322
30659,0.0,0.0697878
30669,0.0,-0.039877236
30679,0.0,0.3598107
30689,0.0,0.35038686
30699,0.0,0.42007858
30709,0.0,0.16051912
30719,0.0,0.018790543
30729,0.0,0.033957183
30739,0.0,-0.062088907
30749,0.0,0.046104014
30759,0.0,-0.12628031
30769,0.0,-0.52199
30779,0.0,-0.5759654
30789,0.0,-0.6320274
30799,0.0,-0.9039261
30809,0.0,-0.44492906
30819,0.0,-0.1311093
30829,0.0,-0.28372127
30839,0.0,0.111772776
30849,0.0,0.6643895
30859,0.0,0.08670974
30869,0.0,-0.031647325
30879,0.0,0.071094394
30889,0.0,0.87386376
30899,0.0,0.5412484
30909,0.0,0.57836103
30919,0.0,0.21202815
30929,0.0,-0.38211244
30939,0.0,-0.19966096
30949,0.0,-0.44111884
30959,0.0,-0.426345
30969,0.0,-0.67301685
30979,0.0,-0.52925384
30989,0.0,-0.3379894
30999,0.0,0.33122563
31009,0.0,0.046590626
31019,0.0,0.35847586
31029,0.0,0.40770918
31039,0.0,0.123924315
31049,0.0,0.35109854
31059,0.0,-0.12598991
31069,0.0,-0.05632949
31079,0.0,0.34788626
31089,0.0,0.33270842
31099,0.0,0.48186105
31109,0.0,0.017184496
31119,0.0,-0.05353725
31129,0.0,-0.31177652
31139,0.0,-0.15155345
31149,0.0,-0.64010906
31159,0.0,-0.31775153
31169,0.0,-0.09967238
31179,0.0,-0.17397094
31189,0.0,0.06657374
31199,0.0,0.11494553
31209,0.0,-0.21708286
31219,0.0,-0.10544455
31229,0.0,0.35203958
31239,0.0,0.2651778
31249,0.0,-0.2754628
31259,0.0,-0.47301298
31269,0.0,-0.37224698
31279,0.0,-0.45444047
31289,0.0,-0.3054974
31299,0.0,-0.30629492
31309,0.0,-0.4199869
31319,0.0,-0.17709517
31329,0.0,-0.26613504
31339,0.0,-0.25120354
31349,0.0,-0.13758081
31359,0.0,0.15859091
31369,0.0,0.2211296
31379,0.0,0.3146624
31389,0.0,0.57113945
31399,0.0,0.43064517
31409,0.0,0.46507174
31419,0.0,0.19958234
31429,0.0,0.60945207
31439,0.0,0.4606353
31449,0.0,0.01276505
31459,0.0,0.0031997561
31469,0.0,0.18042445
31479,0.0,-0.032123387
31489,0.0,0.62403804
31499,0.0,0.21083343
31509,0.0,-0.17214644
31519,0.0,-0.31044918
31529,0.0,-0.19872743
31539,0.0,-0.21171993
31549,0.0,0.13451898
31559,0.0,-0.041288376
31569,0.0,0.14757317
31579,0.0,0.18968117
31589,0.0,0.52938807
31599,0.0,0.53588575
31609,0.0,0.3315388
31619,0.0,0.16357738
31629,0.0,0.5548216
31639,0.0,-0.13311344
31649,0.0,0.0026568174
31659,0.0,0.33823943
31669,0.0,0.37044472
31679,0.0,0.57371557
31689,0.0,0.3820678
31699,0.0,0.17532408
31709,0.0,-0.0066329837
31719,0.0,-0.35203093
31729,0.0,-0.07714969
31739,0.0,-0.05795765
31749,0.0,-0.4065184
31759,0.0,-0.06374949
31769,0.0,-0.23759556
31779,0.0,0.080097914
31789,0.0,-0.110492826
31799,0.0,-0.2954647
31809,0.0,-0.25054973
31819,0.0,0.021045864
31829,0.0,-0.018808424
31839,0.0,-0.40471923
31849,0.0,0.00810045
31859,0.0,0.23680979
31869,0.0,0.26186603
31879,0.0,0.97216046
31889,0.0,0.35777706
31899,0.0,0.005498171
31909,0.0,0.24459523
31919,0.0,-0.09771663
31929,0.0,-0.3101955
31939,0.0,-0.64805746
31949,0.0,-0.19027454
31959,0.0,-0.37303162
31969,0.0,-0.26362908
31979,0.0,-0.20821226
31989,1.0,-0.58770907
31999,1.0,-0.01967293
32009,1.0,0.1156162
32019,1.0,0.24243772
32029,1.0,0.8340735
32039,1.0,1.3739145
32049,1.0,1.2866595
32059,1.0,2.1473403
32069,1.0,2.5533888
32079,1.0,3.2839608
32089,1.0,3.2290945
32099,1.0,4.398388
32109,1.0,4.7549553
32119,1.0,5.0125484
32129,1.0,5.692917
32139,1.0,5.7935715
32149,1.0,6.7319946
32159,1.0,7.089982
32169,1.0,7.498025
32179,1.0,9.1376915
32189,1.0,8.522866
32199,1.0,8.760903
32209,1.0,9.105218
32219,1.0,7.952779
32229,1.0,9.241075
32239,1.0,8.308563
32249,1.0,6.306006
32259,1.0,5.082495
32269,1.0,3.4647787
32279,1.0,2.3874798
32289,1.0,1.9046524
32299,1.0,1.0000583
32309,1.0,0.72364366
32319,1.0,0.44220507
32329,1.0,0.6807885
32339,1.0,0.70603234
32349,1.0,1.0328666
32359,1.0,1.5488325
32369,1.0,2.4536076
32379,1.0,4.2191586
32389,1.0,5.7769985
32399,1.0,6.386695
32409,1.0,8.048521
32419,1.0,8.888041
32429,1.0,9.734501
32439,1.0,8.715992
32449,1.0,8.5547905
32459,1.0,8.412381
32469,1.0,9.597263
32479,1.0,8.41201
32489,1.0,7.0995264
32499,1.0,6.215618
32509,1.0,5.53631
32519,1.0,5.192975
32529,1.0,4.85462
32539,1.0,4.1223145
32549,1.0,3.9328263
32559,1.0,3.1363502
32569,1.0,2.41532
32579,1.0,1.9183545
32589,1.0,1.4156806
32599,1.0,0.56738645
32609,1.0,0.31038487
32619,1.0,0.4367016
32629,1.0,-0.017665148
32639,1.0,-0.22105867
32649,1.0,-0.28115463
32659,0.0,0.026097953
32669,0.0,-0.20161593
32679,0.0,-0.18875206
32689,0.0,0.22258037
32699,0.0,0.34502488
32709,0.0,0.16806883
32719,0.0,0.3582651
32729,0.0,0.38242453
32739,0.0,0.94749796
32749,0.0,0.9503268
32759,0.0,0.76147777
32769,0.0,0.67531127
32779,0.0,0.6744974
32789,0.0,0.2186746
32799,0.0,0.36765903
32809,0.0,0.42456305
32819,0.0,1.0071678
32829,0.0,0.5252289
32839,0.0,0.7299252
32849,0.0,0.49116737
32859,0.0,0.6455166
32869,0.0,1.264589
32879,0.0,0.7553463
32889,0.0,0.26501
32899,0.0,0.19104093
32909,0.0,0.2504843
32919,0.0,0.13267493
32929,0.0,-0.20475352
32939,0.0,0.2162233
32949,0.0,0.23918366
32959,0.0,0.70896304
32969,0.0,0.19994718
32979,0.0,-0.24108791
32989,0.0,0.1525827
32999,0.0,0.021476567
33009,0.0,0.044294417
33019,0.0,0.32797688
33029,0.0,-0.013787091
33039,0.0,0.65984803
33049,0.0,0.801063
33059,0.0,0.7727906
33069,0.0,0.39337206
33079,0.0,0.089159966
33089,0.0,0.22119123
33099,0.0,0.44205338
33109,0.0,0.57810545
33119,0.0,0.39613175
33129,0.0,0.061283708
33139,0.0,-0.009609878
33149,0.0,0.6137426
33159,0.0,1.0166154
33169,0.0,0.7495557
33179,0.0,0.4657256
33189,0.0,0.32382482
33199,0.0,0.5483257
33209,0.0,0.5466516
33219,0.0,0.15587342
33229,0.0,0.31458187
33239,0.0,0.03931105
33249,0.0,0.11083734
33259,0.0,-0.07478374
33269,0.0,-0.06392735
33279,0.0,-0.092727184
33289,0.0,-0.17257524
33299,0.0,0.05399692
33309,0.0,0.18688887
33319,0.0,-0.019849539
33329,0.0,-0.048717618
33339,0.0,0.049523354
33349,0.0,0.08826393
33359,0.0,0.37238955
33369,0.0,0.40073746
33379,0.0,0.39793825
33389,0.0,-0.022180438
33399,0.0,0.5353857
33409,0.0,0.7251268
33419,0.0,0.07655293
33429,0.0,0.03923917
33439,0.0,-0.29172814
33449,0.0,-0.7597472
33459,0.0,-0.3036437
33469,0.0,-0.23415357
33479,0.0,-0.24124008
33489,0.0,-0.20319313
33499,0.0,0.18737566
33509,0.0,-0.22783273
33519,0.0,-0.10377061
33529,0.0,0.04043752
33539,0.0,-0.21541399
33549,0.0,-0.58600396
33559,0.0,-0.42966712
33569,0.0,-0.46590835
33579,0.0,-0.31098807
33589,0.0,-0.33835602
33599,0.0,-0.31364912
33609,0.0,-0.08719599
33619,0.0,-0.20161802
33629,0.0,-0.27072924
33639,0.0,-0.10803336
33649,0.0,0.01259923
33659,0.0,-0.15803224
33669,0.0,-0.31782246
33679,0.0,-0.25827068
33689,0.0,-0.34045136
33699,0.0,0.16305709
33709,0.0,0.11277032
33719,0.0,0.7879809
33729,0.0,0.49305475
33739,0.0,0.9730045
33749,0.0,0.41421002
33759,0.0,-0.29512954
33769,0.0,-0.35653716
33779,0.0,-0.27063906
33789,0.0,-0.119921565
33799,0.0,0.5026855
33809,0.0,0.00081032515
33819,0.0,-0.13463545
33829,0.0,0.22396958
33839,0.0,-0.12760615
33849,0.0,-0.13113159
33859,0.0,-0.51428616
33869,0.0,-0.031178713
33879,0.0,-0.28249198
33889,0.0,0.09935868
33899,0.0,0.16527277
33909,0.0,-0.3851273
33919,0.0,0.55820173
33929,0.0,0.39753407
33939,0.0,0.37291348
33949,0.0,0.44775832
33959,0.0,-0.14228046
33969,0.0,-0.12726194
33979,0.0,0.5390901
33989,0.0,-0.05098045
33999,0.0,0.3924032
34009,0.0,0.3369856
34019,0.0,0.23456663
34029,0.0,0.39071506
34039,0.0,-0.019755602
34049,0.0,-0.10803157
34059,0.0,-0.20467132
34069,0.0,0.025316536
34079,0.0,0.06420612
34089,0.0,0.023102522
34099,0.0,0.34965384
34109,0.0,0.5757378
34119,0.0,0.31888145
34129,0.0,0.2655186
34139,0.0,-0.3038559
34149,0.0,0.012736797
34159,0.0,0.27334672
34169,0.0,0.24617594
34179,0.0,-0.15594423
34189,0.0,0.3496989
34199,0.0,0.03218478
34209,0.0,-0.11189461
34219,0.0,0.09437871
34229,0.0,0.055604815
34239,0.0,-0.3786041
34249,0.0,-0.3377233
34259,0.0,-0.22062731
34269,0.0,0.18626183
34279,0.0,0.07079351
34289,0.0,0.17950612
34299,0.0,0.38031292
34309,0.0,0.46314436
34319,0.0,0.042424202
34329,0.0,0.06761193
34339,0.0,-0.010970831
34349,0.0,-0.093406916
34359,0.0,-0.234644
34369,0.0,0.21923131
34379,0.0,0.019066572
34389,0.0,0.041436493
34399,0.0,-0.029947937
34409,0.0,0.11088812
34419,0.0,0.3225624
34429,0.0,0.37015176
34439,0.0,0.18549734
34449,0.0,0.35953194
34459,0.0,0.30604857
34469,0.0,0.24270451
34479,0.0,-0.35403442
34489,0.0,-0.28814065
34499,0.0,0.07651764
34509,0.0,-0.18243492
34519,0.0,-0.30438626
34529,0.0,-0.11300975
34539,0.0,-0.28113496
34549,0.0,-0.7391837
34559,0.0,-0.30223382
34569,0.0,-0.57471395
34579,0.0,-0.34983867
34589,0.0,-0.157296
34599,0.0,-0.25496334
34609,0.0,-0.14187211
34619,0.0,0.3552478
34629,0.0,0.23668408
34639,0.0,-0.01214999
34649,0.0,-0.5357462
34659,0.0,0.33847344
34669,0.0,-0.30485266
34679,0.0,-0.009941578
34689,0.0,0.22234756
34699,0.0,-0.13666469
34709,0.0,-0.30271626
34719,0.0,-0.44720703
34729,0.0,-0.6354989
34739,0.0,-0.7150121
34749,0.0,-0.8590509
34759,0.0,-0.9472778
34769,0.0,-0.644475
34779,0.0,-0.8256935
34789,0.0,-0.48608077
34799,0.0,-0.62866193
34809,0.0,-0.5769688
34819,0.0,-0.44374824
34829,0.0,-0.14601135
34839,0.0,-0.0742268
34849,0.0,-0.58005244
34859,0.0,-0.18937856
34869,0.0,-0.09817904
34879,0.0,0.06538838
34889,0.0,-0.07898235
34899,0.0,-0.037452698
34909,0.0,-0.297288
34919,0.0,-0.4274459
34929,0.0,-0.25704765
34939,0.0,-0.13789654
34949,0.0,-0.44007856
34959,0.0,-0.541397
34969,0.0,-0.26924306
34979,0.0,-0.28278023
34989,0.0,-0.4236226
34999,0.0,-0.11426121
35009,0.0,0.085638285
35019,0.0,0.055677176
35029,0.0,0.0069444776
35039,0.0,0.017974257
35049,0.0,0.33640027
35059,0.0,0.2794342
35069,0.0,-0.28842086
35079,0.0,-0.4966814
35089,0.0,-0.75808126
35099,0.0,-0.6770313
35109,0.0,-0.5767694
35119,0.0,-0.14955556
35129,0.0,-0.61253285
35139,0.0,-0.39976978
35149,0.0,-0.5649859
35159,0.0,0.055125117
35169,0.0,0.008161366
35179,0.0,0.31050527
35189,0.0,0.49072558
35199,0.0,0.41799682
35209,0.0,0.8822664
35219,0.0,0.72191536
35229,0.0,0.8440474
35239,0.0,0.60542196
35249,0.0,0.6597073
35259,0.0,0.6990315
35269,0.0,0.21707791
35279,0.0,0.18919092
35289,0.0,0.20723963
35299,0.0,0.11775172
35309,0.0,-0.028672695
35319,0.0,-0.71796554
35329,0.0,-0.09694153
35339,0.0,-0.35719365
35349,0.0,-0.29275656
35359,0.0,-0.4282264
35369,0.0,-0.4049809
35379,0.0,-0.2280103
35389,0.0,-0.5986288
35399,0.0,-0.14425862
35409,0.0,-0.17198199
35419,0.0,-0.31291366
35429,0.0,-0.03969252
35439,0.0,-0.36716908
35449,0.0,-0.52210724
35459,0.0,-0.2658013
35469,0.0,0.20018178
35479,0.0,-0.5051127
35489,0.0,-0.081822515
35499,0.0,0.14950812
35509,0.0,0.004188895
35519,0.0,0.0774287
35529,0.0,0.4118697
35539,0.0,0.20633262
35549,0.0,0.24524307
35559,0.0,0.024276495
35569,0.0,0.11652768
35579,0.0,-0.19992834
35589,0.0,-0.054937363
35599,0.0,-0.30050784
35609,0.0,-0.2363528
35619,0.0,-0.22258115
35629,0.0,-0.35324466
35639,0.0,-0.44749665
35649,0.0,-0.07383633
35659,0.0,-0.052816987
35669,0.0,0.08400339
35679,0.0,-0.19859624
35689,0.0,-0.5140002
35699,0.0,-0.5774687
35709,0.0,-0.39725477
35719,0.0,-0.08119053
35729,0.0,0.1886357
35739,0.0,0.047044396
35749,0.0,-0.06430006
35759,0.0,-0.18096673
35769,0.0,-0.1842134
35779,0.0,-0.041864395
35789,0.0,-0.22851348
35799,0.0,-0.26327682
35809,0.0,0.14365375
35819,0.0,0.46049637
35829,0.0,-0.012704074
35839,0.0,0.23206103
35849,0.0,0.1083861
35859,0.0,0.40805572
35869,0.0,0.36603582
35879,0.0,0.17439234
35889,0.0,0.4433664
35899,0.0,0.16672683
35909,0.0,0.45872128
35919,0.0,0.16262221
35929,0.0,-0.14791805
35939,0.0,-0.30315948
35949,0.0,-0.35595232
35959,0.0,-0.6379079
35969,0.0,-0.5206406
35979,0.0,-0.8002401
35989,0.0,-0.65743256
35999,0.0,-0.41339415
36009,0.0,-0.018160105
36019,0.0,0.14778292
36029,0.0,0.6180995
36039,0.0,0.14958763
36049,0.0,0.09839529
36059,0.0,-0.11115956
36069,0.0,0.33641118
36079,0.0,0.27793407
36089,0.0,0.33664185
36099,0.0,0.60634166
36109,0.0,0.11528134
36119,0.0,0.37289923
36129,0.0,0.15684694
36139,0.0,0.2539419
36149,0.0,-0.013185084
36159,0.0,-0.094218254
36169,0.0,-0.4218331
36179,0.0,-0.39885545
36189,0.0,-0.10004687
36199,0.0,-0.30929947
36209,0.0,0.06514591
36219,0.0,0.5142147
36229,0.0,0.07532334
36239,0.0,0.23419064
36249,0.0,0.31602377
36259,0.0,-0.051389337
36269,0.0,-0.32178098
36279,0.0,-0.3566125
36289,0.0,0.07382244
36299,0.0,-0.4065649
36309,0.0,-0.29197526
36319,0.0,-0.31856185
36329,0.0,-0.18856293
36339,0.0,-0.2450605
36349,0.0,-0.3286159
36359,0.0,-0.308726
36369,0.0,-0.33994466
36379,0.0,-0.25405294
36389,0.0,-0.121414244
36399,0.0,-0.31266809
36409,0.0,-0.20537013
36419,0.0,0.30284768
36429,0.0,-0.3194059
36439,0.0,0.1911717
36449,0.0,0.08133167
36459,0.0,-0.24092126
36469,0.0,-0.5341413
36479,0.0,-0.45761216
36489,0.0,-0.4316731
36499,0.0,-0.15769285
36509,0.0,-0.27544373
36519,0.0,-0.73086095
36529,0.0,-0.5960351
36539,0.0,-0.8326373
36549,0.0,-0.5952209
36559,0.0,-0.8695022
36569,0.0,-0.7481703
36579,0.0,-0.3863725
36589,0.0,-0.32620907
36599,0.0,-0.3206464
36609,0.0,0.0007609129
36619,0.0,0.32678294
36629,0.0,0.13772249
36639,0.0,-0.20619464
36649,0.0,-0.19702315
36659,1.0,-0.17284185
36669,1.0,0.22970599
36679,1.0,0.30221003
36689,1.0,0.85918033
36699,1.0,0.90241647
36709,1.0,1.2030569
36719,1.0,1.2698654
36729,1.0,1.8736331
36739,1.0,2.2980485
36749,1.0,3.05334
36759,1.0,2.8026247
36769,1.0,3.6578174
36779,1.0,4.142647
36789,1.0,4.659147
36799,1.0,5.2321806
36809,1.0,5.4685593
36819,1.0,6.69018
36829,1.0,7.5678434
36839,1.0,7.8522105
36849,1.0,8.617869
36859,1.0,8.624161
36869,1.0,8.666824
36879,1.0,8.556551
36889,1.0,9.994179
36899,1.0,10.255196
36909,1.0,8.145693
36919,1.0,6.797257
36929,1.0,6.170788
36939,1.0,4.670186
36949,1.0,3.5836308
36959,1.0,1.9670157
36969,1.0,1.2368593
36979,1.0,0.40492797
36989,1.0,0.77247554
36999,1.0,0.7973555
37009,1.0,1.0030909
37019,1.0,1.0650508
37029,1.0,2.2229044
37039,1.0,3.3694468
37049,1.0,4.1258874
37059,1.0,5.42855
37069,1.0,7.7162027
37079,1.0,8.384062
37089,1.0,10.111532
37099,1.0,8.895036
37109,1.0,8.972677
37119,1.0,8.568471
37129,1.0,9.4983635
37139,1.0,8.74253
37149,1.0,7.4302034
37159,1.0,6.680136
37169,1.0,5.4635277
37179,1.0,5.2035284
37189,1.0,5.0675616
37199,1.0,4.3485994
37209,1.0,4.066468
37219,1.0,3.4355297
37229,1.0,3.8711567
37239,1.0,3.2032309
37249,1.0,2.4153645
37259,1.0,2.676957
37269,1.0,1.546298
37279,1.0,1.7479849
37289,1.0,1.0172212
37299,1.0,0.9057291
37309,1.0,0.38845664
37319,1.0,0.01835078
37329,0.0,-0.052556038
37339,0.0,-0.24019814
37349,0.0,-0.21214491
37359,0.0,-0.43012577
37369,0.0,-0.27555895
37379,0.0,0.26075792
37389,0.0,-0.043096304
37399,0.0,0.31761593
37409,0.0,0.05597669
37419,0.0,0.015524149
37429,0.0,0.6587993
37439,0.0,-0.053858876
37449,0.0,0.1781398
37459,0.0,-0.051209807
37469,0.0,-0.13226557
37479,0.0,-0.15706265
37489,0.0,-0.10197568
37499,0.0,-0.050121665
37509,0.0,-0.2630676
37519,0.0,-0.045648456
37529,0.0,-0.033025682
37539,0.0,-0.2747333
37549,0.0,0.0770154
37559,0.0,0.07114434
37569,0.0,0.38596916
37579,0.0,0.27037555
37589,0.0,0.8134947
37599,0.0,0.68580204
37609,0.0,0.37051672
37619,0.0,0.14801079
37629,0.0,0.059536695
37639,0.0,-0.51968265
37649,0.0,-0.4673643
37659,0.0,-0.7569608
37669,0.0,-0.9173116
37679,0.0,-0.6110536
37689,0.0,-0.45751715
37699,0.0,-0.5787489
37709,0.0,-0.37987834
37719,0.0,-0.27460158
37729,0.0,0.0060189366
37739,0.0,0.0520491
37749,0.0,0.47063088
37759,0.0,0.5638021
37769,0.0,0.82807124
37779,0.0,0.4516592
37789,0.0,0.56987023
37799,0.0,0.8491254
37809,0.0,0.3398522
37819,0.0,0.6680127
37829,0.0,0.16477668
37839,0.0,-0.17143387
37849,0.0,-0.3400097
37859,0.0,-0.19195747
37869,0.0,-0.31062275
37879,0.0,-0.39661443
37889,0.0,-0.12667441
37899,0.0,-0.43555224
37909,0.0,-0.37378103
37919,0.0,-0.5003471
37929,0.0,-0.11147869
37939,0.0,-0.23388696
37949,0.0,0.30259055
37959,0.0,0.43011808
37969,0.0,0.24292117
37979,0.0,0.6305967
37989,0.0,1.3741934
37999,0.0,1.0562053
38009,0.0,0.2767853
38019,0.0,0.45316088
38029,0.0,-0.058087826
38039,0.0,0.07826471
38049,0.0,-0.20800513
38059,0.0,0.2354837
38069,0.0,-0.008670032
38079,0.0,0.3864975
38089,0.0,-0.25980943
38099,0.0,-0.17818743
38109,0.0,-0.16573739
38119,0.0,-0.07899028
38129,0.0,-0.20157188
38139,0.0,-0.30855268
38149,0.0,0.25255162
38159,0.0,-0.13906914
38169,0.0,0.2990548
38179,0.0,0.50294983
38189,0.0,0.3400178
38199,0.0,0.9409758
38209,0.0,0.9746464
38219,0.0,1.5947893
38229,0.0,0.7996857
38239,0.0,0.75824654
38249,0.0,0.54400986
38259,0.0,0.6790461
38269,0.0,-0.017898142
38279,0.0,0.2566476
38289,0.0,-0.094805
38299,0.0,-0.50769454
38309,0.0,-0.36263645
38319,0.0,-0.44462824
38329,0.0,-0.5418906
38339,0.0,-0.24541664
38349,0.0,-0.6361766
38359,0.0,-0.5959157
38369,0.0,-0.15606517
38379,0.0,0.28086567
38389,0.0,-0.4170075
38399,0.0,-0.09110749
38409,0.0,0.17928821
38419,0.0,0.5526502
38429,0.0,0.4231022
38439,0.0,0.49164158
38449,0.0,0.3038063
38459,0.0,0.16183007
38469,0.0,0.3048907
38479,0.0,0.41322
38489,0.0,-0.28113365
38499,0.0,-0.39934653
38509,0.0,-0.21080905
38519,0.0,0.15357709
38529,0.0,-0.088000834
38539,0.0,-0.6085287
38549,0.0,-0.44534492
38559,0.0,-0.52720827
38569,0.0,-0.15804476
38579,0.0,-0.07651496
38589,0.0,-0.032748044
38599,0.0,0.13782418
38609,0.0,-0.20500064
38619,0.0,0.12947631
38629,0.0,-0.16616309
38639,0.0,-0.33020228
38649,0.0,-0.5546577
38659,0.0,0.025293171
38669,0.0,0.16373283
38679,0.0,0.38768387
38689,0.0,0.21961528
38699,0.0,0.15162438
38709,0.0,-0.041784883
38719,0.0,-0.29606563
38729,0.0,-0.41715634
38739,0.0,-0.55697584
38749,0.0,-0.68700606
38759,0.0,-0.16015726
38769,0.0,-0.07783419
38779,0.0,-0.15760064
38789,0.0,0.113477945
38799,0.0,-0.33713937
38809,0.0,-0.548381
38819,0.0,-0.17060655
38829,0.0,-0.15177733
38839,0.0,0.20189106
38849,0.0,0.31563312
38859,0.0,0.26570606
38869,0.0,0.1171546
38879,0.0,1.1710236
38889,0.0,0.2698704
38899,0.0,-0.075470805
38909,0.0,-0.23356473
38919,0.0,-0.2988026
38929,0.0,-0.7225244
38939,0.0,0.0056004524
38949,0.0,-0.057007194
38959,0.0,0.033723593
38969,0.0,0.23525679
38979,0.0,0.12642294
38989,0.0,0.9817005
38999,0.0,0.47109628
39009,0.0,0.6348168
39019,0.0,0.43942916
39029,0.0,0.49922246
39039,0.0,0.44596052
39049,0.0,0.15870953
39059,0.0,-0.3245349
39069,0.0,-0.08660263
39079,0.0,0.16806209
39089,0.0,-0.17947036
39099,0.0,-0.34386903
39109,0.0,-0.48632246
39119,0.0,-0.5182897
39129,0.0,-0.5800638
39139,0.0,-0.14626956
39149,0.0,-0.35150868
39159,0.0,-0.16467148
39169,0.0,-0.12592667
39179,0.0,0.07454282
39189,0.0,0.19456571
39199,0.0,0.12216222
39209,0.0,0.20555907
39219,0.0,0.25916517
39229,0.0,0.07071853
39239,0.0,0.14019185
39249,0.0,-0.11635351
39259,0.0,0.11054897
39269,0.0,-0.1832267
39279,0.0,-0.2663498
39289,0.0,-0.16586185
39299,0.0,-0.22843462
39309,0.0,0.11151379
39319,0.0,0.38497692
39329,0.0,0.20322305
39339,0.0,-0.105394185
39349,0.0,0.41715562
39359,0.0,0.38553333
39369,0.0,0.3439088
39379,0.0,0.29350674
39389,0.0,0.27859682
39399,0.0,0.36131692
39409,0.0,0.39887297
39419,0.0,0.11068845
39429,0.0,0.065395534
39439,0.0,-0.18538696
39449,0.0,0.07914364
39459,0.0,-0.039583564
39469,0.0,0.04434067
39479,0.0,-0.2493118
39489,0.0,-0.11234671
39499,0.0,0.073890984
39509,0.0,0.37356383
39519,0.0,-0.16951787
39529,0.0,-0.30508733
39539,0.0,-0.26128083
39549,0.0,-0.12496513
39559,0.0,0.4955588
39569,0.0,0.38886094
39579,0.0,0.42199284
39589,0.0,0.52305704
39599,0.0,0.3105728
39609,0.0,-0.10817176
39619,0.0,0.17502159
39629,0.0,-0.29029197
39639,0.0,0.09066439
39649,0.0,-0.38740706
39659,0.0,-0.3439139
39669,0.0,-0.09299624
39679,0.0,0.006430149
39689,0.0,-0.48230886
39699,0.0,-0.15224516
39709,0.0,-0.38686687
39719,0.0,-0.2308644
39729,0.0,-0.40696943
39739,0.0,-0.68919384
39749,0.0,-0.6920693
39759,0.0,-0.31705916
39769,0.0,-0.27034348
39779,0.0,0.13078922
39789,0.0,-0.14830047
39799,0.0,-0.08721161
39809,0.0,-0.13258702
39819,0.0,-0.32991642
39829,0.0,-0.26538455
39839,0.0,-0.10423809
39849,0.0,-0.016112208
39859,0.0,0.06607175
39869,0.0,0.5979436
39879,0.0,0.4763049
39889,0.0,0.46496236
39899,0.0,0.08049476
39909,0.0,-0.17621654
39919,0.0,-0.06100756
39929,0.0,-0.23069477
39939,0.0,0.14813542
39949,0.0,-0.12784088
39959,0.0,-0.06079936
39969,0.0,-0.0928089
39979,0.0,-0.08639139
39989,0.0,0.24055934
39999,0.0,0.09304476
40009,0.0,-0.28510863
40019,0.0,0.6074061
40029,0.0,0.53161174
40039,0.0,0.15768075
40049,0.0,-0.0946635
40059,0.0,-0.042615533
40069,0.0,0.05627054
40079,0.0,-0.1837604
40089,0.0,-0.22544634
40099,0.0,0.025686026
40109,0.0,-0.1284104
40119,0.0,0.12288785
40129,0.0,-0.13759255
40139,0.0,-0.26767707
40149,0.0,0.11740488
40159,0.0,-0.1631046
40169,0.0,-0.124871075
40179,0.0,-0.43240982
40189,0.0,-0.29862487
40199,0.0,-0.06562656
40209,0.0,-0.52026725
40219,0.0,-0.57562286
40229,0.0,0.040462732
40239,0.0,-0.34107685
40249,0.0,-0.21576929
40259,0.0,-0.57788086
40269,0.0,-0.5129765
40279,0.0,-0.38572156
40289,0.0,-0.57908654
40299,0.0,-0.4876815
40309,0.0,-0.14653939
40319,0.0,0.04606086
40329,0.0,0.09535569
40339,0.0,-0.07163179
40349,0.0,-0.3921566
40359,0.0,-0.27790147
40369,0.0,-0.049476445
40379,0.0,-0.27819073
40389,0.0,-0.13460487
40399,0.0,-0.608725
40409,0.0,-0.31757247
40419,0.0,-0.50584626
40429,0.0,-0.100970924
40439,0.0,-0.16022801
40449,0.0,0.13014662
40459,0.0,-0.34312522
40469,0.0,-0.43901503
40479,0.0,-0.4635759
40489,0.0,-0.4429528
40499,0.0,-0.010233223
40509,0.0,-0.059720635
40519,0.0,-0.01734668
40529,0.0,-0.11058593
40539,0.0,-0.31574452
40549,0.0,-0.31185782
40559,0.0,-0.26579458
40569,0.0,-0.17617136
40579,0.0,-0.16578943
40589,0.0,-0.15073365
40599,0.0,-0.3243975
40609,0.0,-0.09958655
40619,0.0,-0.17520642
40629,0.0,-0.12956053
40639,0.0,0.017504632
40649,0.0,0.3149615
40659,0.0,0.38210213
40669,0.0,0.42815918
40679,0.0,1.0004997
40689,0.0,1.0314167
40699,0.0,1.225625
40709,0.0,0.92602247
40719,0.0,1.0702446
40729,0.0,0.7618699
40739,0.0,0.75484395
40749,0.0,0.44164944
40759,0.0,0.59833634
40769,0.0,0.060775876
40779,0.0,-0.1829449
40789,0.0,-0.15129143
40799,0.0,-0.002277553
40809,0.0,-0.1416266
40819,0.0,-0.4067672
40829,0.0,-0.14160329
40839,0.0,-0.070753396
40849,0.0,-0.0016198754
40859,0.0,0.13231033
40869,0.0,0.09153342
40879,0.0,0.13324809
40889,0.0,0.44012338
40899,0.0,0.2884783
40909,0.0,0.04832226
40919,0.0,0.4340614
40929,0.0,0.7415721
40939,0.0,0.71916837
40949,0.0,0.6814982
40959,0.0,0.48967642
40969,0.0,0.67152995
40979,0.0,0.11650932
40989,0.0,0.034157753
40999,0.0,-0.21045184
41009,0.0,-0.02994448
41019,0.0,-0.3384338
41029,0.0,-0.06806564
41039,0.0,-0.16814417
41049,0.0,0.27660108
41059,0.0,0.5619843
41069,0.0,0.3314265
41079,0.0,-0.16481626
41089,0.0,-0.26724917
41099,0.0,-0.16899115
41109,0.0,-0.64380544
41119,0.0,-0.62784255
41129,0.0,-0.048468053
41139,0.0,-0.15317029
41149,0.0,-0.2326132
41159,0.0,0.13798511
41169,0.0,0.2919312
41179,0.0,-0.45121586
41189,0.0,-0.25996685
41199,0.0,-0.042930424
41209,0.0,0.010506451
41219,0.0,-0.06274468
41229,0.0,-0.23114413
41239,0.0,-0.020549
41249,0.0,0.3327641
41259,0.0,-0.0035504103
41269,0.0,-0.09895319
41279,0.0,-0.12819892
41289,0.0,0.06621283
41299,0.0,-0.18789291
41309,0.0,-0.5485366
41319,0.0,-0.41703528
41329,0.0,-0.2757885
41339,0.0,0.1731599
41349,0.0,0.22766703
41359,0.0,0.28576005
41369,0.0,0.3972767
41379,0.0,0.37024248
41389,0.0,0.036375344
41399,0.0,0.13552159
41409,0.0,-0.12259525
41419,0.0,-0.24829745
41429,0.0,0.021089733
41439,0.0,-0.15730262
41449,0.0,0.037701666
41459,0.0,0.03820765
41469,0.0,-0.44882447
41479,0.0,-0.471294
41489,0.0,-0.24030203
41499,0.0,-0.39304698
41509,0.0,-0.5274747
41519,0.0,-0.27025622
41529,0.0,0.26814067
41539,0.0,0.58084756
41549,0.0,0.46062422
41559,0.0,0.63391334
41569,0.0,0.7047358
41579,0.0,1.1503637
41589,0.0,0.9338785
41599,0.0,0.23545533
41609,0.0,0.10370427
41619,0.0,0.40206826
41629,0.0,0.8176475
41639,0.0,-0.13468134
41649,0.0,0.15416378
41659,0.0,0.2917679
41669,0.0,0.00962317
41679,0.0,-0.13442916
41689,0.0,-0.39129657
41699,0.0,-0.69525045
41709,0.0,-0.34878075
41719,0.0,-0.3831544
41729,0.0,-0.19510937
41739,0.0,-0.31172776
41749,0.0,0.12705809
41759,0.0,0.0070661902
41769,0.0,-0.008325696
41779,0.0,-0.18259335
41789,0.0,-0.08264172
41799,0.0,-0.1890682
41809,0.0,-0.17648566
41819,0.0,0.18768847
41829,0.0,0.15226251
41839,0.0,0.2436825
41849,0.0,-0.01415652
41859,1.0,0.66486263
41869,1.0,0.13663453
41879,1.0,0.53670126
41889,1.0,1.3375307
41899,1.0,1.2405338
41909,1.0,2.010129
41919,1.0,2.1412394
41929,1.0,2.3649654
41939,1.0,3.054614
41949,1.0,2.8864021
41959,1.0,3.5247972
41969,1.0,3.6362586
41979,1.0,4.6569366
41989,1.0,5.007226
41999,1.0,5.076988
42009,1.0,5.648379
42019,1.0,6.0363736
42029,1.0,7.4503107
42039,1.0,8.841303
42049,1.0,9.02261
42059,1.0,8.653414
42069,1.0,8.726315
42079,1.0,9.268649
42089,1.0,9.265683
42099,1.0,7.3937755
42109,1.0,7.4044967
42119,1.0,6.3756986
42129,1.0,5.650565
42139,1.0,2.8032591
42149,1.0,1.8330414
42159,1.0,1.1952869
42169,1.0,0.7874502
42179,1.0,0.37651366
42189,1.0,0.6110458
42199,1.0,-0.08396077
42209,1.0,0.32226348
42219,1.0,1.1009493
42229,1.0,1.7803528
42239,1.0,3.650022
42249,1.0,4.93526
42259,1.0,6.538413
42269,1.0,7.761145
42279,1.0,9.569149
42289,1.0,9.255042
42299,1.0,8.663659
42309,1.0,8.756918
42319,1.0,8.798941
42329,1.0,9.384851
42339,1.0,8.823376
42349,1.0,7.083926
42359,1.0,6.422118
42369,1.0,6.072772
42379,1.0,5.3238935
42389,1.0,4.168017
42399,1.0,4.0008917
42409,1.0,3.4660847
42419,1.0,3.009104
42429,1.0,2.8474915
42439,1.0,2.7450993
42449,1.0,2.1645412
42459,1.0,1.7269571
42469,1.0,1.2106806
42479,1.0,0.61738044
42489,1.0,0.1338104
42499,1.0,0.17034292
42509,1.0,0.69797635
42519,1.0,-0.38086963
42529,0.0,0.15134281
42539,0.0,0.09498757
42549,0.0,0.08762562
42559,0.0,-0.18805039
42569,0.0,-0.16425633
42579,0.0,-0.25642127
42589,0.0,-0.48385483
42599,0.0,-0.4495445
42609,0.0,-0.4194197
42619,0.0,-0.39381713
42629,0.0,-0.47809196
42639,0.0,-0.46485436
42649,0.0,0.002260089
42659,0.0,-0.36322886
42669,0.0,0.119321406
42679,0.0,-0.18683738
42689,0.0,0.22258097
42699,0.0,0.5391259
42709,0.0,0.47117585
42719,0.0,0.31213158
42729,0.0,1.5128304
42739,0.0,1.1257131
42749,0.0,1.2651275
42759,0.0,0.24684125
42769,0.0,0.38257182
42779,0.0,0.0032075047
42789,0.0,0.14066261
42799,0.0,0.7124392
42809,0.0,0.7646438
42819,0.0,0.51210123
42829,0.0,0.5396117
42839,0.0,0.49379224
42849,0.0,0.2699541
42859,0.0,0.3078105
42869,0.0,0.13545316
42879,0.0,0.5022228
42889,0.0,0.5112547
42899,0.0,0.14300793
42909,0.0,0.12557721
42919,0.0,-0.15968257
42929,0.0,0.37264758
42939,0.0,0.23375756
42949,0.0,0.18712723
42959,0.0,0.1957516
42969,0.0,-0.31510437
42979,0.0,-0.3568709
42989,0.0,-0.39571607
42999,0.0,0.22941893
43009,0.0,0.2662837
43019,0.0,-0.0074107647
43029,0.0,0.4594614
43039,0.0,0.28842545
43049,0.0,0.26459086
43059,0.0,0.358577
43069,0.0,0.10094315
43079,0.0,0.22945744
43089,0.0,-0.032757938
43099,0.0,-0.17974204
43109,0.0,-0.38931996
43119,0.0,-0.35094714
43129,0.0,-0.83876383
43139,0.0,-0.5925771
43149,0.0,-0.6205148
43159,0.0,-0.76099867
43169,0.0,-0.4206537
43179,0.0,-0.71777326
43189,0.0,-0.34085202
43199,0.0,0.09313774
43209,0.0,0.32696253
43219,0.0,0.64139944
43229,0.0,0.67039
43239,0.0,0.45207328
43249,0.0,0.7284941
43259,0.0,0.3820486
43269,0.0,0.21087545
43279,0.0,0.4543134
43289,0.0,0.6552111
43299,0.0,0.7405358
43309,0.0,0.20363283
43319,0.0,0.32719725
43329,0.0,0.018012524
43339,0.0,0.041051388
43349,0.0,-0.037466645
43359,0.0,0.018909693
