T,S,Score
399,1.0,8.020428
409,1.0,7.2809725
419,1.0,6.6744957
429,1.0,6.285308
439,1.0,6.267556
449,1.0,4.7074413
459,1.0,4.490118
469,1.0,3.541421
479,1.0,3.2406359
489,1.0,2.2661655
499,1.0,2.2291296
509,1.0,2.0197217
519,1.0,2.408828
529,1.0,1.9633689
539,1.0,2.2626247
549,1.0,2.4153469
559,1.0,2.5213406
569,1.0,1.9823401
579,0.0,1.8858862
589,0.0,2.8021972
599,0.0,2.6376252
609,0.0,1.7957816
619,0.0,1.957536
629,0.0,1.8976699
639,0.0,1.0340915
649,0.0,1.0915211
659,0.0,0.92216206
669,0.0,0.5725847
679,0.0,0.041962504
689,0.0,0.076138675
699,0.0,-0.17853051
709,0.0,0.07890344
719,0.0,0.6264174
729,0.0,0.34444082
739,0.0,0.936403
749,0.0,1.4406707
759,0.0,1.1299416
769,0.0,0.9476554
779,0.0,1.3502464
789,0.0,1.3195503
799,0.0,1.4625466
809,0.0,1.0843318
819,0.0,1.4519596
829,0.0,1.9749786
839,0.0,1.1547186
849,0.0,0.9704815
859,0.0,0.39264834
869,0.0,0.623144
879,0.0,0.027631164
889,0.0,0.35483634
899,0.0,-0.29833055
909,0.0,-0.5500484
919,0.0,-0.012369454
929,0.0,-0.30149388
939,0.0,-0.30881596
949,0.0,-0.33352864
959,0.0,-0.10034132
969,0.0,-0.0040273666
979,0.0,-0.49725497
989,0.0,-0.74598646
999,0.0,-0.2985525
1009,0.0,-0.45874375
1019,0.0,-0.20938444
1029,0.0,-0.30152774
1039,0.0,-0.30846578
1049,0.0,-0.5769571
1059,0.0,-0.5053195
1069,0.0,-0.27346587
1079,0.0,-0.11223894
1089,0.0,0.0638656
1099,0.0,-0.13435173
1109,0.0,0.24730176
1119,0.0,0.41957772
1129,0.0,0.560188
1139,0.0,0.3954944
1149,0.0,0.9366551
1159,0.0,1.104337
1169,0.0,1.7180676
1179,0.0,2.0678418
1189,0.0,2.7492402
1199,0.0,2.8475902
1209,0.0,3.8176517
1219,0.0,4.5748835
1229,0.0,4.1511364
1239,0.0,4.4589715
1249,0.0,3.5354238
1259,0.0,1.9518235
1269,0.0,2.063356
1279,0.0,1.4649982
1289,0.0,0.86351633
1299,0.0,0.741741
1309,0.0,0.34283674
1319,0.0,0.3303969
1329,0.0,0.10848713
1339,0.0,0.13400805
1349,0.0,-0.14208531
1359,0.0,0.042905033
1369,0.0,-0.3644678
1379,0.0,-0.3558154
1389,0.0,-0.018444717
1399,0.0,0.15458429
1409,0.0,0.62902707
1419,0.0,0.74129987
1429,0.0,0.6063153
1439,0.0,0.83391714
1449,0.0,0.1357739
1459,0.0,0.117313504
1469,0.0,-0.038419843
1479,0.0,0.12168634
1489,0.0,0.22447866
1499,0.0,0.36699337
1509,0.0,0.43197298
1519,0.0,0.91743016
1529,0.0,0.56630987
1539,0.0,0.45324773
1549,0.0,0.8384979
1559,0.0,0.8033259
1569,0.0,0.34053797
1579,0.0,0.063090146
1589,0.0,0.022332907
1599,0.0,-0.1151039
1609,0.0,-0.0875839
1619,0.0,-0.03588444
1629,0.0,-0.31339514
1639,0.0,-0.07830715
1649,0.0,-0.16429329
1659,0.0,-0.0022619367
1669,0.0,-0.15592754
1679,0.0,-0.32718873
1689,0.0,-0.09464401
1699,0.0,-0.06390965
1709,0.0,0.114254355
1719,0.0,-0.016387284
1729,0.0,-0.08646208
1739,0.0,0.49345344
1749,0.0,0.8502227
1759,0.0,1.017154
1769,0.0,1.2258475
1779,0.0,2.308735
1789,0.0,2.53552
1799,0.0,1.8271995
1809,0.0,1.5072205
1819,0.0,0.4944198
1829,0.0,0.4200228
1839,0.0,0.33535492
1849,0.0,0.08880973
1859,0.0,0.33519888
1869,0.0,0.13076872
1879,0.0,-0.0012693405
1889,0.0,0.16015202
1899,0.0,-0.03776145
1909,0.0,0.02867937
1919,0.0,-0.11098313
1929,0.0,0.19215441
1939,0.0,1.222037
1949,0.0,1.6591179
1959,0.0,2.1783495
1969,0.0,2.6198711
1979,0.0,3.3930793
1989,0.0,4.064163
1999,0.0,3.9250512
2009,0.0,3.4447088
2019,0.0,2.7589054
2029,0.0,2.5344863
2039,0.0,3.1787038
2049,0.0,2.8773122
2059,0.0,2.7358043
2069,0.0,2.4677348
2079,0.0,2.0056806
2089,0.0,1.0599763
2099,0.0,0.65197825
2109,0.0,0.7258865
2119,0.0,0.543699
2129,0.0,0.44522768
2139,0.0,0.20848525
2149,0.0,0.28573143
2159,0.0,-0.15707529
2169,0.0,-0.42806232
2179,0.0,-0.5529958
2189,0.0,-0.57793736
2199,0.0,0.056795835
2209,0.0,-0.5521491
2219,0.0,-0.20917898
2229,0.0,-0.24941087
2239,0.0,-0.017836511
2249,0.0,0.24058568
2259,0.0,0.3223753
2269,0.0,0.30604285
2279,0.0,0.052321374
2289,0.0,-0.055423856
2299,0.0,-0.10130072
2309,0.0,0.45656025
2319,0.0,1.0834149
2329,0.0,0.23136717
2339,0.0,0.7579769
2349,0.0,0.7091324
2359,0.0,0.99503154
2369,0.0,0.4283074
2379,0.0,1.0705014
2389,0.0,0.7449617
2399,0.0,0.73712355
2409,0.0,1.2253363
2419,0.0,1.625405
2429,0.0,0.9348902
2439,0.0,0.5779295
2449,0.0,0.6529654
2459,0.0,0.82833797
2469,0.0,0.95797896
2479,0.0,0.7466396
2489,0.0,-0.30047315
2499,0.0,0.11812782
2509,0.0,-0.14848381
2519,0.0,-0.4880578
2529,0.0,-0.43415356
2539,0.0,-0.39838278
2549,0.0,-0.27401048
2559,0.0,-0.036288083
2569,0.0,-0.0020891428
2579,0.0,0.30317324
2589,0.0,-0.20187706
2599,0.0,0.79170835
2609,0.0,0.6748123
2619,0.0,0.23224837
2629,0.0,0.81603724
2639,0.0,1.2827768
2649,0.0,0.88103175
2659,0.0,1.543442
2669,0.0,1.5448339
2679,0.0,1.4479327
2689,0.0,1.2353089
2699,0.0,2.1535058
2709,0.0,2.0545378
2719,0.0,2.0192163
2729,0.0,1.8128824
2739,0.0,1.6516023
2749,0.0,2.4292371
2759,0.0,2.979887
2769,0.0,2.1448216
2779,0.0,2.6997309
2789,0.0,2.2775452
2799,0.0,2.5584137
2809,0.0,1.9387009
2819,0.0,1.8905805
2829,0.0,2.1633472
2839,0.0,1.7298807
2849,0.0,1.5491042
2859,0.0,1.6577191
2869,0.0,1.2767618
2879,0.0,0.84512407
2889,0.0,0.56061864
2899,0.0,0.21592957
2909,0.0,-0.28220487
2919,0.0,-0.2113812
2929,0.0,-0.43203425
2939,0.0,0.0364725
2949,0.0,-0.66011864
2959,0.0,-0.49784362
2969,0.0,-0.83018374
2979,0.0,-0.7493312
2989,0.0,-0.69373035
2999,0.0,-0.4273256
3009,0.0,-0.2802804
3019,0.0,0.0045606494
3029,0.0,0.25095344
3039,0.0,0.37044495
3049,0.0,0.4691292
3059,0.0,0.08833176
3069,0.0,0.49553204
3079,0.0,0.72973055
3089,0.0,1.0712094
3099,0.0,0.2440325
3109,0.0,0.13675207
3119,0.0,-0.011538625
3129,0.0,0.05940491
3139,0.0,0.17653847
3149,0.0,0.039444327
3159,0.0,-0.23054588
3169,1.0,-0.48690385
3179,1.0,-0.2100898
3189,1.0,0.20376897
3199,1.0,0.49529535
3209,1.0,0.45382732
3219,1.0,0.6157514
3229,1.0,1.2146308
3239,1.0,0.9892987
3249,1.0,2.0157819
3259,1.0,2.4609544
3269,1.0,3.2590628
3279,1.0,3.7153745
3289,1.0,4.593374
3299,1.0,4.943719
3309,1.0,5.199292
3319,1.0,5.7018585
3329,1.0,6.276455
3339,1.0,6.859806
3349,1.0,8.186447
3359,1.0,9.959707
3369,1.0,8.8311
3379,1.0,8.759696
3389,1.0,8.692831
3399,1.0,8.416135
3409,1.0,8.49017
3419,1.0,6.6910386
3429,1.0,5.864771
3439,1.0,4.358947
3449,1.0,3.4925551
3459,1.0,2.692566
3469,1.0,2.073583
3479,1.0,1.092534
3489,1.0,0.40919685
3499,1.0,0.46185327
3509,1.0,0.79465985
3519,1.0,1.6485412
3529,1.0,2.4815922
3539,1.0,3.755386
3549,1.0,5.2445135
3559,1.0,6.8625803
3569,1.0,8.6791525
3579,1.0,8.631521
3589,1.0,8.825672
3599,1.0,8.774765
3609,1.0,8.671408
3619,1.0,8.903385
3629,1.0,7.750517
3639,1.0,7.3779097
3649,1.0,6.4695873
3659,1.0,6.6915607
3669,1.0,5.5738873
3679,1.0,4.77264
3689,1.0,4.3867383
3699,1.0,3.5865984
3709,1.0,3.2702487
3719,1.0,2.1024346
3729,1.0,1.9889889
3739,1.0,2.090021
3749,1.0,1.3563913
3759,1.0,1.1114893
3769,1.0,0.5347234
3779,1.0,0.5573719
3789,1.0,0.007180214
3799,1.0,-0.16087353
3809,0.0,-0.21219796
3819,0.0,-0.015062213
3829,0.0,-0.34418303
3839,0.0,-0.5666154
3849,0.0,-0.1462965
3859,0.0,0.24495691
3869,0.0,0.03660065
3879,0.0,0.3970412
3889,0.0,0.68246126
3899,0.0,0.7403146
3909,0.0,1.2144592
3919,0.0,0.8734553
3929,0.0,0.9339795
3939,0.0,1.7168224
3949,0.0,2.2336295
3959,0.0,1.779241
3969,0.0,1.5828793
3979,0.0,1.9435787
3989,0.0,1.1880122
3999,0.0,1.0984792
4009,0.0,0.7299067
4019,0.0,0.47914797
4029,0.0,0.5951714
4039,0.0,0.56502414
4049,0.0,1.0557725
4059,0.0,1.3639702
4069,0.0,2.0872233
4079,0.0,1.3393054
4089,0.0,0.70099664
4099,0.0,0.37295824
4109,0.0,0.14494514
4119,0.0,0.19277322
4129,0.0,0.020365953
4139,0.0,-0.20146805
4149,0.0,0.04737687
4159,0.0,0.19775665
4169,0.0,0.09446061
4179,0.0,0.084055245
4189,0.0,-0.2957403
4199,0.0,-0.4575535
4209,0.0,-0.29032612
4219,0.0,-0.16241354
4229,0.0,-0.19881314
4239,0.0,-0.25969452
4249,0.0,-0.3040799
4259,0.0,0.1197021
4269,0.0,0.45291573
4279,0.0,0.43800217
4289,0.0,0.22207344
4299,0.0,0.06071657
4309,0.0,0.14480233
4319,0.0,0.1845187
4329,0.0,0.011627138
4339,0.0,-0.30306953
4349,0.0,-0.03196448
4359,0.0,0.034760416
4369,0.0,-0.019866109
4379,0.0,-0.35140026
4389,0.0,-0.14093965
4399,0.0,-0.18294263
4409,0.0,-0.46706903
4419,0.0,0.04993552
4429,0.0,0.09687197
4439,0.0,0.3028158
4449,0.0,0.6050163
4459,0.0,1.0023065
4469,0.0,0.7377457
4479,0.0,0.26628357
4489,0.0,0.2281897
4499,0.0,-0.119163275
4509,0.0,-0.2116887
4519,0.0,0.10459107
4529,0.0,-0.11867273
4539,0.0,-0.045951247
4549,0.0,-0.07548189
4559,0.0,0.05291736
4569,0.0,-0.2271946
4579,0.0,-0.22131348
4589,0.0,-0.10428709
4599,0.0,0.26872838
4609,0.0,0.16006994
4619,0.0,0.12766063
4629,0.0,0.3692438
4639,0.0,0.15808547
4649,0.0,0.21490908
4659,0.0,0.44434685
4669,0.0,0.836633
4679,0.0,0.90479463
4689,0.0,0.79493886
4699,0.0,0.5562566
4709,0.0,0.088995874
4719,0.0,-0.008889139
4729,0.0,-0.119291544
4739,0.0,-0.18355137
4749,0.0,0.10257316
4759,0.0,-0.09485239
4769,0.0,-0.3901013
4779,0.0,-0.2113033
4789,0.0,-0.25158542
4799,0.0,-0.61670977
4809,0.0,-0.3336861
4819,0.0,-0.5002142
4829,0.0,-0.71349365
4839,0.0,-0.44760078
4849,0.0,-0.42266703
4859,0.0,0.26475143
4869,0.0,0.35129273
4879,0.0,0.42623097
4889,0.0,0.32177007
4899,0.0,0.05305326
4909,0.0,-0.3361414
4919,0.0,-0.088427365
4929,0.0,0.30333316
4939,0.0,0.110007465
4949,0.0,-0.1393699
4959,0.0,-0.23653764
4969,0.0,0.22375566
4979,0.0,0.7761451
4989,0.0,0.8387893
4999,0.0,0.6054318
5009,0.0,0.6800191
5019,0.0,0.3881501
5029,0.0,0.6541765
5039,0.0,0.47299552
5049,0.0,0.3152784
5059,0.0,0.39336562
5069,0.0,0.26227146
5079,0.0,0.33416367
5089,0.0,0.8647143
5099,0.0,0.78333384
5109,0.0,0.54982066
5119,0.0,-0.0030565262
5129,0.0,0.39745998
5139,0.0,0.3002755
5149,0.0,0.27206647
5159,0.0,0.2267484
5169,0.0,0.9383346
5179,0.0,0.920238
5189,0.0,1.8838251
5199,0.0,2.1211913
5209,0.0,1.902296
5219,0.0,1.5231881
5229,0.0,0.859734
5239,0.0,0.5321409
5249,0.0,0.25276148
5259,0.0,0.04662782
5269,0.0,-0.32534844
5279,0.0,0.026347816
5289,0.0,0.3867849
5299,0.0,0.12299818
5309,0.0,0.52402246
5319,0.0,-0.038457394
5329,0.0,0.11672276
5339,0.0,0.09969342
5349,0.0,-0.039306164
5359,0.0,-0.12857246
5369,0.0,0.046322465
5379,0.0,0.5595538
5389,0.0,0.5470324
5399,0.0,0.51697576
5409,0.0,0.92999953
5419,0.0,0.59287715
5429,0.0,0.5667254
5439,0.0,0.5148658
5449,0.0,0.10218954
5459,0.0,0.115584314
5469,0.0,0.3208995
5479,0.0,0.7167141
5489,0.0,0.37491077
5499,0.0,0.28682584
5509,0.0,0.64898396
5519,0.0,0.6052908
5529,0.0,0.44261712
5539,0.0,0.81809634
5549,0.0,0.7046451
5559,0.0,0.47871107
5569,0.0,0.80056256
5579,0.0,0.4892851
5589,0.0,0.39675272
5599,0.0,-0.060588837
5609,0.0,0.11380333
5619,0.0,0.41741544
5629,0.0,0.49191868
5639,0.0,0.63090926
5649,0.0,0.40055406
5659,0.0,0.38172728
5669,0.0,0.39887196
5679,0.0,0.23983896
5689,0.0,0.6886095
5699,0.0,0.54582494
5709,0.0,-0.10308492
5719,0.0,0.018958151
5729,0.0,0.11132467
5739,0.0,-0.16162366
5749,0.0,0.09470099
5759,0.0,0.17333984
5769,0.0,0.44708484
5779,0.0,0.22111166
5789,0.0,-0.059369445
5799,0.0,-0.08773744
5809,0.0,-0.33574843
5819,0.0,0.49715483
5829,0.0,0.410711
5839,0.0,0.43510783
5849,0.0,0.35323733
5859,0.0,0.27201998
5869,0.0,0.19762546
5879,0.0,0.019579172
5889,0.0,0.4048304
5899,0.0,1.3062586
5909,0.0,1.0388961
5919,0.0,0.99571514
5929,0.0,1.2588487
5939,0.0,1.7862036
5949,0.0,1.4745637
5959,0.0,1.7528249
5969,0.0,1.5289767
5979,0.0,1.3260884
5989,0.0,1.5971928
5999,0.0,1.8539729
6009,0.0,1.1196747
6019,0.0,1.2456591
6029,0.0,0.4299187
6039,0.0,-0.15142632
6049,0.0,0.50131166
6059,0.0,-0.08086896
6069,0.0,0.19325054
6079,0.0,-0.12043524
6089,0.0,-0.24666685
6099,0.0,-0.72364336
6109,0.0,-0.92717564
6119,0.0,-0.85369825
6129,0.0,-0.40365398
6139,0.0,0.03696859
6149,0.0,-0.2961967
6159,0.0,0.08293241
6169,0.0,0.2870506
6179,0.0,0.965419
6189,0.0,0.8917863
6199,0.0,0.9216127
6209,0.0,0.97748923
6219,0.0,1.0105689
6229,0.0,1.3956301
6239,0.0,1.4031463
6249,0.0,1.8011909
6259,0.0,2.0101576
6269,0.0,1.7767432
6279,0.0,1.3424764
6289,0.0,1.1143689
6299,0.0,0.8974124
6309,0.0,0.35368246
6319,0.0,-0.26988053
6329,0.0,-0.76487565
6339,0.0,-0.5320484
6349,0.0,-0.123588026
6359,0.0,-0.12677187
6369,0.0,-0.7581531
6379,0.0,-1.029788
6389,1.0,-0.7035216
6399,1.0,-0.598779
6409,1.0,-0.5365609
6419,1.0,-0.065666795
6429,1.0,0.59788233
6439,1.0,0.8875948
6449,1.0,1.3515556
6459,1.0,1.8974731
6469,1.0,2.2686033
6479,1.0,3.0844202
6489,1.0,3.368006
6499,1.0,3.844337
6509,1.0,4.6655188
6519,1.0,4.318276
6529,1.0,5.047936
6539,1.0,4.9036617
6549,1.0,5.8052673
6559,1.0,6.762454
6569,1.0,8.440163
6579,1.0,9.460125
6589,1.0,8.724217
6599,1.0,8.707939
6609,1.0,8.637787
6619,1.0,8.572943
6629,1.0,8.327971
6639,1.0,7.377888
6649,1.0,6.4154615
6659,1.0,4.7281885
6669,1.0,3.8088334
6679,1.0,3.8582273
6689,1.0,2.780547
6699,1.0,2.934105
6709,1.0,1.6690345
6719,1.0,1.7058101
6729,1.0,1.2404842
6739,1.0,2.219739
6749,1.0,3.130657
6759,1.0,3.911683
6769,1.0,5.8631415
6779,1.0,6.4593334
6789,1.0,8.129721
6799,1.0,8.222202
6809,1.0,8.563659
6819,1.0,8.697874
6829,1.0,8.558519
6839,1.0,9.352027
6849,1.0,8.49367
6859,1.0,7.688717
6869,1.0,6.5996127
6879,1.0,6.7137213
6889,1.0,5.704092
6899,1.0,5.3859134
6909,1.0,4.158128
6919,1.0,4.680618
6929,1.0,4.2727723
6939,1.0,3.54499
6949,1.0,3.0405264
6959,1.0,2.8359618
6969,1.0,2.978519
6979,1.0,3.058929
6989,1.0,2.9591184
6999,1.0,1.881747
7009,1.0,1.6660508
7019,1.0,1.2665966
7029,1.0,0.725937
7039,0.0,0.2983904
7049,0.0,0.30074728
7059,0.0,0.076744676
7069,0.0,0.18277216
7079,0.0,-0.1555593
7089,0.0,-0.33998144
7099,0.0,-0.29065728
7109,0.0,-0.49252057
7119,0.0,-0.664765
7129,0.0,-0.5556326
7139,0.0,-0.24849188
7149,0.0,-0.31042147
7159,0.0,-0.44715726
7169,0.0,-0.4007157
7179,0.0,-0.4892059
7189,0.0,-0.4092881
7199,0.0,-0.2077592
7209,0.0,-0.10547233
7219,0.0,-0.37517446
7229,0.0,-0.14664513
7239,0.0,-0.054383874
7249,0.0,-0.053539515
7259,0.0,0.36507922
7269,0.0,0.20999724
7279,0.0,-0.17272222
7289,0.0,0.06367636
7299,0.0,0.33594388
7309,0.0,0.34570187
7319,0.0,-0.07686895
7329,0.0,0.052115858
7339,0.0,0.21552777
7349,0.0,-0.055488825
7359,0.0,0.43863642
7369,0.0,0.47776175
7379,0.0,0.112915754
7389,0.0,0.52249
7399,0.0,0.60678005
7409,0.0,1.0391746
7419,0.0,0.99366844
7429,0.0,0.9900184
7439,0.0,0.73615515
7449,0.0,1.3240495
7459,0.0,0.797937
7469,0.0,0.5419643
7479,0.0,0.20756292
7489,0.0,-0.12644577
7499,0.0,0.21583939
7509,0.0,0.23472899
7519,0.0,0.04665166
7529,0.0,-0.09784961
7539,0.0,-0.2571609
7549,0.0,-0.48450065
7559,0.0,-0.27504057
7569,0.0,-0.75480115
7579,0.0,-0.6293656
7589,0.0,-0.44942296
7599,0.0,-0.18804455
7609,0.0,0.40051377
7619,0.0,0.37959474
7629,0.0,-0.023531318
7639,0.0,0.049154222
7649,0.0,0.7871756
7659,0.0,0.78542495
7669,0.0,0.6671518
7679,0.0,0.45060366
7689,0.0,0.49627084
7699,0.0,0.5272951
7709,0.0,0.45570666
7719,0.0,-0.24034584
7729,0.0,0.060320973
7739,0.0,-0.27679282
7749,0.0,-0.49073505
7759,0.0,-0.41399568
7769,0.0,-0.47019297
7779,0.0,-0.045820594
7789,0.0,-0.09443343
7799,0.0,0.36950278
7809,0.0,0.79336923
7819,0.0,0.77980834
7829,0.0,0.5016366
7839,0.0,0.35035652
7849,0.0,0.75616235
7859,0.0,0.64476746
7869,0.0,1.2141218
7879,0.0,0.60401577
7889,0.0,1.2060239
7899,0.0,1.0303209
7909,0.0,0.62801164
7919,0.0,0.32157952
7929,0.0,0.65748465
7939,0.0,0.8775579
7949,0.0,1.0647931
7959,0.0,1.0921044
7969,0.0,0.8607191
7979,0.0,0.54360116
7989,0.0,0.5633484
7999,0.0,0.5822223
8009,0.0,0.46127015
8019,0.0,0.079824865
8029,0.0,-0.41793907
8039,0.0,-0.2209
8049,0.0,-0.34476918
8059,0.0,-0.061923504
8069,0.0,-0.17170328
8079,0.0,-0.24925232
8089,0.0,-0.4107157
8099,0.0,-0.5691928
8109,0.0,-0.46063608
8119,0.0,-0.40355915
8129,0.0,-0.28683913
8139,0.0,0.0032114387
8149,0.0,0.11066687
8159,0.0,0.6769991
8169,0.0,0.26828283
8179,0.0,1.153572
8189,0.0,1.4568819
8199,0.0,2.2154608
8209,0.0,2.7918937
8219,0.0,2.4219074
8229,0.0,2.3634887
8239,0.0,2.8692412
8249,0.0,3.501123
8259,0.0,3.4110067
8269,0.0,3.8126378
8279,0.0,3.6897655
8289,0.0,2.4306026
8299,0.0,2.1495454
8309,0.0,2.4670715
8319,0.0,3.222107
8329,0.0,1.4675096
8339,0.0,1.508672
8349,0.0,0.553431
8359,0.0,-0.058676302
8369,0.0,-0.17460066
8379,0.0,-0.30738932
8389,0.0,-0.2726227
8399,0.0,0.041662335
8409,0.0,0.63977313
8419,0.0,0.8119099
8429,0.0,0.8398888
8439,0.0,1.5313857
8449,0.0,2.5564454
8459,0.0,2.175262
8469,0.0,2.2995093
8479,0.0,2.5971146
8489,0.0,2.0449467
8499,0.0,2.0103166
8509,0.0,2.533032
8519,0.0,3.9936972
8529,0.0,3.6282012
8539,0.0,3.003881
8549,0.0,1.7643042
8559,0.0,1.4044923
8569,0.0,1.0786204
8579,0.0,0.51424026
8589,0.0,-0.10701656
8599,0.0,-0.52652216
8609,0.0,-0.37093377
8619,0.0,-0.15160108
8629,0.0,-0.26506114
8639,0.0,-0.018963456
8649,0.0,0.43241912
8659,0.0,0.5631089
8669,0.0,0.63074327
8679,0.0,0.7744761
8689,0.0,0.8557484
8699,0.0,1.3052102
8709,0.0,1.5382518
8719,0.0,1.8017027
8729,0.0,1.8883595
8739,0.0,1.6116319
8749,0.0,0.99934417
8759,0.0,0.58163536
8769,0.0,0.6895218
8779,0.0,0.33858484
8789,0.0,0.18590057
8799,0.0,0.1350379
8809,0.0,0.07674992
8819,0.0,0.6931936
8829,0.0,0.5241143
8839,0.0,0.8463458
8849,0.0,0.370228
8859,0.0,0.31073034
8869,0.0,0.22694528
8879,0.0,0.1533274
8889,0.0,0.35319567
8899,0.0,0.16885585
8909,0.0,0.074325085
8919,0.0,0.5524065
8929,0.0,0.84666514
8939,0.0,0.25152433
8949,0.0,0.34008813
8959,0.0,0.063648224
8969,0.0,0.16637665
8979,0.0,-0.30734807
8989,0.0,-0.2648316
8999,0.0,0.014650941
9009,0.0,0.4283355
9019,0.0,0.45310128
9029,0.0,0.8042783
9039,0.0,1.1711411
9049,0.0,0.86774695
9059,0.0,0.5281277
9069,0.0,0.04025042
9079,0.0,0.21823657
9089,0.0,-0.17180651
9099,0.0,-0.3387031
9109,0.0,0.19115227
9119,0.0,-0.009606123
9129,0.0,0.20544499
9139,0.0,0.67866766
9149,0.0,0.6794239
9159,0.0,0.31256092
9169,0.0,0.5139282
9179,0.0,0.30541736
9189,0.0,0.62005484
9199,0.0,0.75585794
9209,0.0,0.5927983
9219,0.0,0.35995704
9229,0.0,0.25763077
9239,0.0,0.54390997
9249,0.0,0.8293843
9259,0.0,0.7997922
9269,0.0,0.59669155
9279,0.0,0.41484195
9289,0.0,0.21753287
9299,0.0,-0.29384536
9309,0.0,-0.22482508
9319,0.0,-0.26293302
9329,0.0,-0.49572563
9339,0.0,-0.37493426
9349,0.0,-0.27725732
9359,0.0,-0.31425166
9369,0.0,-0.10010135
9379,0.0,-0.5089405
9389,0.0,-0.47695088
9399,0.0,-0.20324045
9409,0.0,0.06771636
9419,0.0,0.17516685
9429,0.0,-0.1004259
9439,0.0,-0.055103064
9449,0.0,-0.16220194
9459,0.0,-0.05807942
9469,0.0,-0.22959876
9479,0.0,-0.30344802
9489,0.0,-0.07345998
9499,0.0,-0.5431984
9509,0.0,-0.5736819
9519,0.0,-0.0537917
9529,0.0,0.02712512
9539,0.0,0.038693786
9549,0.0,0.24636358
9559,0.0,0.16907185
9569,0.0,0.51583964
9579,0.0,0.15549666
9589,0.0,0.29558194
9599,0.0,0.68888384
9609,0.0,0.5375561
9619,0.0,0.3165002
9629,1.0,0.7276769
9639,1.0,1.2176409
9649,1.0,1.488678
9659,1.0,1.4977846
9669,1.0,1.7145776
9679,1.0,1.8942869
9689,1.0,2.8568783
9699,1.0,2.2623122
9709,1.0,2.8717928
9719,1.0,3.7349253
9729,1.0,5.5332227
9739,1.0,6.1397796
9749,1.0,6.159416
9759,1.0,6.2807093
9769,1.0,6.908344
9779,1.0,6.8060555
9789,1.0,8.088227
9799,1.0,8.131646
9809,1.0,7.6672916
9819,1.0,9.983751
9829,1.0,8.722521
9839,1.0,8.640763
9849,1.0,8.583766
9859,1.0,8.6562
9869,1.0,8.277084
9879,1.0,6.8210845
9889,1.0,5.9401693
9899,1.0,4.966873
9909,1.0,3.458859
9919,1.0,2.525818
9929,1.0,1.6059765
9939,1.0,1.2264378
9949,1.0,1.0057976
9959,1.0,0.8704023
9969,1.0,1.2465737
9979,1.0,2.4916716
9989,1.0,3.8778124
9999,1.0,4.7034492
10009,1.0,5.3378186
10019,1.0,6.8250046
10029,1.0,8.078674
10039,1.0,8.644433
10049,1.0,8.665641
10059,1.0,8.65408
10069,1.0,8.513878
10079,1.0,10.175451
10089,1.0,8.513315
10099,1.0,7.670164
10109,1.0,6.438135
10119,1.0,6.0972595
10129,1.0,5.377694
10139,1.0,4.518562
10149,1.0,4.3938413
10159,1.0,4.54031
10169,1.0,4.20442
10179,1.0,3.8113325
10189,1.0,3.6781216
10199,1.0,3.4469428
10209,1.0,2.66475
10219,1.0,1.4638923
10229,1.0,1.1932092
10239,1.0,0.8401759
10249,1.0,0.7797189
10259,1.0,0.77714103
10269,0.0,0.5302728
10279,0.0,0.3972177
10289,0.0,0.26961255
10299,0.0,0.53671837
10309,0.0,0.12973922
10319,0.0,-0.029475749
10329,0.0,0.06174487
10339,0.0,-0.03568107
10349,0.0,0.04135108
10359,0.0,0.48811865
10369,0.0,0.5003175
10379,0.0,0.27535915
10389,0.0,0.35602504
10399,0.0,0.6193623
10409,0.0,0.046592593
10419,0.0,-0.42496097
10429,0.0,0.021919966
10439,0.0,0.14366245
10449,0.0,0.1815632
10459,0.0,-0.35967904
10469,0.0,0.4911964
10479,0.0,0.4851728
10489,0.0,0.45812368
10499,0.0,0.26234037
10509,0.0,0.015062332
10519,0.0,0.07755154
10529,0.0,-0.0053442717
10539,0.0,0.08864474
10549,0.0,0.6464159
10559,0.0,0.897946
10569,0.0,0.6292009
10579,0.0,1.1651071
10589,0.0,1.1595564
10599,0.0,1.3694601
10609,0.0,1.4965291
10619,0.0,1.053313
10629,0.0,0.945395
10639,0.0,0.50984997
10649,0.0,0.6541655
10659,0.0,1.1043742
10669,0.0,0.902565
10679,0.0,0.83855265
10689,0.0,0.3223747
10699,0.0,0.13092202
10709,0.0,0.36008012
10719,0.0,0.7293287
10729,0.0,0.9950645
10739,0.0,0.58493197
10749,0.0,0.36354047
10759,0.0,0.41278803
10769,0.0,0.20063901
10779,0.0,0.28173715
10789,0.0,-0.29914796
10799,0.0,-0.32426685
10809,0.0,-0.15071696
10819,0.0,-0.40229702
10829,0.0,0.084997416
10839,0.0,-0.011577964
10849,0.0,0.032467186
10859,0.0,-0.064870894
10869,0.0,0.01744759
10879,0.0,0.5244187
10889,0.0,0.40369648
10899,0.0,-0.22339475
10909,0.0,0.61203647
10919,0.0,0.13786823
10929,0.0,0.41148573
10939,0.0,0.3347609
10949,0.0,0.5163893
10959,0.0,0.24284106
10969,0.0,0.5604944
10979,0.0,0.14785832
10989,0.0,0.37431884
10999,0.0,0.039534688
11009,0.0,-0.3875593
11019,0.0,-0.009176433
11029,0.0,0.02222389
11039,0.0,-0.37631404
11049,0.0,-0.3059883
11059,0.0,-0.021170557
11069,0.0,0.10210216
11079,0.0,0.02957493
11089,0.0,0.26660812
11099,0.0,-0.35243565
11109,0.0,-0.12000328
11119,0.0,0.3066209
11129,0.0,0.40508127
11139,0.0,1.0592232
11149,0.0,1.9078591
11159,0.0,2.5814724
11169,0.0,2.8205402
11179,0.0,2.8512268
11189,0.0,3.381955
11199,0.0,2.4611065
11209,0.0,2.8300378
11219,0.0,2.368357
11229,0.0,2.0566905
11239,0.0,2.080301
11249,0.0,1.8252872
11259,0.0,1.6900969
11269,0.0,1.8168248
11279,0.0,1.5202789
11289,0.0,1.1780795
11299,0.0,1.908601
11309,0.0,2.251617
11319,0.0,0.9849478
11329,0.0,0.45418018
11339,0.0,0.51395917
11349,0.0,0.37541902
11359,0.0,-0.048083186
11369,0.0,-0.32100862
11379,0.0,-0.5074527
11389,0.0,-0.16959757
11399,0.0,-0.01003772
11409,0.0,0.3078702
11419,0.0,-0.1028415
11429,0.0,-0.20355183
11439,0.0,0.13923663
11449,0.0,0.52932155
11459,0.0,0.63259417
11469,0.0,1.0077479
11479,0.0,0.8149287
11489,0.0,1.0446703
11499,0.0,1.728226
11509,0.0,2.2542734
11519,0.0,1.2987616
11529,0.0,1.0779496
11539,0.0,1.440352
11549,0.0,1.4510427
11559,0.0,1.3281704
11569,0.0,1.3632116
11579,0.0,1.1568043
11589,0.0,1.1072154
11599,0.0,0.83686817
11609,0.0,1.9004707
11619,0.0,2.4270365
11629,0.0,2.4268003
11639,0.0,2.4916503
11649,0.0,1.859637
11659,0.0,1.2952864
11669,0.0,1.0070133
11679,0.0,0.7087119
11689,0.0,0.47944552
11699,0.0,-0.07887912
11709,0.0,0.00081706047
11719,0.0,0.107450604
11729,0.0,-0.14020407
11739,0.0,-0.50791305
11749,0.0,-0.31276518
11759,0.0,-0.2383169
11769,0.0,-0.4715441
11779,0.0,-0.34913445
11789,0.0,-0.17108697
11799,0.0,-0.6806183
11809,0.0,0.3080812
11819,0.0,-0.07945639
11829,0.0,0.022877693
11839,0.0,0.18874568
11849,0.0,-0.17349052
11859,0.0,0.33360094
11869,0.0,0.24941933
11879,0.0,-0.2731465
11889,0.0,-0.32237476
11899,0.0,-0.27930248
11909,0.0,-0.7607875
11919,0.0,-0.280805
11929,0.0,-0.14660287
11939,0.0,-0.1095078
11949,0.0,-0.20105803
11959,0.0,0.08751613
11969,0.0,0.4323597
11979,0.0,0.39387846
11989,0.0,0.4259165
11999,0.0,0.83414286
12009,0.0,0.6531742
12019,0.0,0.4818442
12029,0.0,0.08655065
12039,0.0,-0.23413968
12049,0.0,0.05607927
12059,0.0,0.22856146
12069,0.0,0.5158916
12079,0.0,0.32232374
12089,0.0,0.33101487
12099,0.0,0.11647838
12109,0.0,-0.21494627
12119,0.0,-0.35400945
12129,0.0,-0.7069298
12139,0.0,-0.29835486
12149,0.0,-0.62345743
12159,0.0,-0.45107865
12169,0.0,-0.45642203
12179,0.0,-0.37013763
12189,0.0,-0.7066325
12199,0.0,-0.3176437
12209,0.0,-0.34200865
12219,0.0,-0.45471787
12229,0.0,-0.46183258
12239,0.0,-0.3242458
12249,0.0,-0.07673395
12259,0.0,-0.052524805
12269,0.0,0.098706245
12279,0.0,0.1620785
12289,0.0,0.22517914
12299,0.0,0.06784797
12309,0.0,0.120290875
12319,0.0,-0.10696864
12329,0.0,-0.303994
12339,0.0,-0.31705236
12349,0.0,-0.1893034
12359,0.0,-0.3361603
12369,0.0,-0.27076757
12379,0.0,-0.21450126
12389,0.0,0.24395305
12399,0.0,0.1178661
12409,0.0,0.2978983
12419,0.0,0.72763157
12429,0.0,0.88563716
12439,0.0,0.8909265
12449,0.0,0.63573205
12459,0.0,0.6005377
12469,0.0,0.75341874
12479,0.0,0.75591195
12489,0.0,0.07877052
12499,0.0,-0.22819966
12509,0.0,-0.035076797
12519,0.0,-0.16937059
12529,0.0,-0.26147544
12539,0.0,-0.37890035
12549,0.0,-0.34424382
12559,0.0,-0.32387114
12569,0.0,-0.07874465
12579,0.0,-0.3277864
12589,0.0,-0.19153231
12599,0.0,0.19643939
12609,0.0,0.58520657
12619,0.0,0.55724376
12629,0.0,0.7326446
12639,0.0,1.019933
12649,0.0,0.8171697
12659,0.0,0.6407266
12669,0.0,1.1077082
12679,0.0,0.3215543
12689,0.0,0.49215448
12699,1.0,0.5722314
12709,1.0,0.8529192
12719,1.0,1.153782
12729,1.0,1.6040633
12739,1.0,1.5967851
12749,1.0,1.5778387
12759,1.0,2.2981448
12769,1.0,2.1113348
12779,1.0,2.4979327
12789,1.0,2.8938315
12799,1.0,2.9298148
12809,1.0,3.810752
12819,1.0,4.208274
12829,1.0,4.6155252
12839,1.0,5.776162
12849,1.0,6.2980623
12859,1.0,6.971275
12869,1.0,7.6711254
12879,1.0,8.468936
12889,1.0,9.503283
12899,1.0,8.656467
12909,1.0,8.745555
12919,1.0,8.135019
12929,1.0,8.060328
12939,1.0,7.6739283
12949,1.0,5.702743
12959,1.0,4.8582015
12969,1.0,4.19499
12979,1.0,3.5399218
12989,1.0,2.057382
12999,1.0,1.4331346
13009,1.0,1.6684468
13019,1.0,1.1294062
13029,1.0,1.0338442
13039,1.0,1.4070587
13049,1.0,2.473633
13059,1.0,3.4772153
13069,1.0,4.3798676
13079,1.0,6.014179
13089,1.0,7.8231344
13099,1.0,8.375717
13109,1.0,8.785299
13119,1.0,8.72012
13129,1.0,8.519241
13139,1.0,8.888693
13149,1.0,7.6963077
13159,1.0,7.2690887
13169,1.0,6.9974985
13179,1.0,6.587967
13189,1.0,5.3261547
13199,1.0,4.921622
13209,1.0,4.6089106
13219,1.0,4.2764754
13229,1.0,3.8671565
13239,1.0,3.4927378
13249,1.0,3.3390675
13259,1.0,3.302244
13269,1.0,3.67107
13279,1.0,3.4187171
13289,1.0,2.614702
13299,1.0,2.1181548
13309,1.0,1.6687417
13319,1.0,1.63435
13329,1.0,1.9918687
13339,0.0,2.6241972
13349,0.0,3.5999503
13359,0.0,3.0320196
13369,0.0,2.0886998
13379,0.0,2.4667265
13389,0.0,2.6477976
13399,0.0,3.2080705
13409,0.0,2.834919
13419,0.0,2.3836007
13429,0.0,2.051618
13439,0.0,2.9312415
13449,0.0,3.2337606
13459,0.0,3.382413
13469,0.0,3.2674363
13479,0.0,3.6395051
13489,0.0,3.4158893
13499,0.0,3.3116257
13509,0.0,2.3363757
13519,0.0,2.221929
13529,0.0,2.2874455
13539,0.0,2.041129
13549,0.0,2.3703237
13559,0.0,1.9006677
13569,0.0,1.4067795
13579,0.0,0.5214125
13589,0.0,0.40348047
13599,0.0,0.65759194
13609,0.0,0.43063873
13619,0.0,0.5860021
13629,0.0,0.4979679
13639,0.0,0.14295125
13649,0.0,0.24832147
13659,0.0,-0.19975597
13669,0.0,0.03311932
13679,0.0,0.10789579
13689,0.0,0.08301926
13699,0.0,0.37408054
13709,0.0,0.38806915
13719,0.0,0.3590799
13729,0.0,0.55908215
13739,0.0,0.5047509
13749,0.0,0.58507425
13759,0.0,-0.035960257
13769,0.0,-0.30129576
13779,0.0,-0.1259104
13789,0.0,-0.22977781
13799,0.0,-0.17002976
13809,0.0,0.053927064
13819,0.0,0.2861731
13829,0.0,0.064474404
13839,0.0,0.40879458
13849,0.0,0.8805825
13859,0.0,1.2502403
13869,0.0,0.9723515
13879,0.0,1.4832761
13889,0.0,1.2909966
13899,0.0,0.54554576
13909,0.0,0.66241676
13919,0.0,0.79901856
13929,0.0,0.6751434
13939,0.0,0.28581935
13949,0.0,0.33020407
13959,0.0,0.28952312
13969,0.0,-0.4940673
13979,0.0,-0.3670535
13989,0.0,-0.0804525
13999,0.0,0.15113354
14009,0.0,0.07803035
14019,0.0,0.066958606
14029,0.0,0.18858212
14039,0.0,0.20569694
14049,0.0,0.41826433
14059,0.0,0.5445371
14069,0.0,0.5845063
14079,0.0,0.9428787
14089,0.0,0.7988014
14099,0.0,0.4648652
14109,0.0,-0.04907787
14119,0.0,0.05606997
14129,0.0,0.123079896
14139,0.0,-0.6196727
14149,0.0,0.06720483
14159,0.0,-0.20067346
14169,0.0,-0.25390518
14179,0.0,-0.34023738
14189,0.0,0.022389054
14199,0.0,0.59569186
14209,0.0,0.40951818
14219,0.0,0.35072464
14229,0.0,0.39303976
14239,0.0,0.25462997
14249,0.0,0.43670964
14259,0.0,0.59401655
14269,0.0,0.56349075
14279,0.0,0.56025237
14289,0.0,0.3666135
14299,0.0,0.62357634
14309,0.0,0.44286436
14319,0.0,0.11122525
14329,0.0,0.52260685
14339,0.0,0.54897666
14349,0.0,0.684345
14359,0.0,0.8309207
14369,0.0,0.815194
14379,0.0,0.92613393
14389,0.0,0.8308417
14399,0.0,1.2727101
14409,0.0,1.021442
14419,0.0,0.722424
14429,0.0,0.3250454
14439,0.0,1.0818644
14449,0.0,1.1172642
14459,0.0,2.2524915
14469,0.0,2.0055294
14479,0.0,1.9688232
14489,0.0,2.138602
14499,0.0,1.7368274
14509,0.0,1.0270327
14519,0.0,1.448117
14529,0.0,1.1120198
14539,0.0,0.54200965
14549,0.0,0.82316065
14559,0.0,0.228971
14569,0.0,0.07057375
14579,0.0,0.17334402
14589,0.0,0.08029884
14599,0.0,-0.51532143
14609,0.0,-0.261181
14619,0.0,-0.36316347
14629,0.0,-0.7789556
14639,0.0,-0.5419686
14649,0.0,0.06884825
14659,0.0,0.65924543
14669,0.0,1.2692553
14679,0.0,1.5494847
14689,0.0,1.5031588
14699,0.0,1.3268486
14709,0.0,1.9119806
14719,0.0,2.526027
14729,0.0,2.7160954
14739,0.0,3.2832062
14749,0.0,3.6104193
14759,0.0,3.1536763
14769,0.0,3.48589
14779,0.0,3.7680397
14789,0.0,3.8754096
14799,0.0,4.648491
14809,0.0,3.8953295
14819,0.0,3.946246
14829,0.0,3.7654302
14839,0.0,3.766128
14849,0.0,2.4671693
14859,0.0,2.902536
14869,0.0,2.5038996
14879,0.0,1.8306786
14889,0.0,1.2961321
14899,0.0,0.8446903
14909,0.0,0.6256103
14919,0.0,0.76549613
14929,0.0,0.8495942
14939,0.0,1.181633
14949,0.0,0.72675747
14959,0.0,0.2923969
14969,0.0,-0.30203038
14979,0.0,-0.050358713
14989,0.0,-0.042075217
14999,0.0,-0.07364249
15009,0.0,0.26118267
15019,0.0,0.75311476
15029,0.0,1.2302588
15039,0.0,1.0210657
15049,0.0,0.8284445
15059,0.0,0.6930112
15069,0.0,1.2434769
15079,0.0,0.9252278
15089,0.0,0.8593757
15099,0.0,0.8420798
15109,0.0,1.0521774
15119,0.0,1.0602453
15129,0.0,1.4974922
15139,0.0,1.9080867
15149,0.0,1.8223424
15159,0.0,1.7125273
15169,0.0,1.7199799
15179,0.0,0.96875125
15189,0.0,0.66646147
15199,0.0,-0.059274137
15209,0.0,0.4117139
15219,0.0,0.33386642
15229,0.0,0.16549194
15239,0.0,0.30242378
15249,0.0,0.24933994
15259,0.0,-0.21478891
15269,0.0,-0.024627805
15279,0.0,0.32176858
15289,0.0,-0.38890564
15299,0.0,-0.51130354
15309,0.0,-0.73629564
15319,0.0,-0.42849588
15329,0.0,-0.38593072
15339,0.0,-0.17807955
15349,0.0,0.03890574
15359,0.0,-0.18441653
15369,0.0,0.22312796
15379,0.0,0.29300463
15389,0.0,0.33859545
15399,0.0,0.44642937
15409,0.0,0.91006404
15419,0.0,0.81793004
15429,0.0,0.3670475
15439,0.0,0.23966026
15449,0.0,0.64796346
15459,0.0,1.2233133
15469,0.0,0.7716984
15479,0.0,0.45896608
15489,0.0,0.83918905
15499,0.0,1.5585947
15509,0.0,2.1036217
15519,0.0,1.9488556
15529,0.0,3.1040573
15539,0.0,3.41355
15549,0.0,3.1706505
15559,0.0,4.205682
15569,0.0,4.231827
15579,0.0,4.2184525
15589,0.0,5.152487
15599,0.0,5.9119186
15609,0.0,6.593034
15619,0.0,7.973955
15629,0.0,7.477703
15639,0.0,6.223915
15649,0.0,5.1139107
15659,0.0,4.51378
15669,0.0,4.1857915
15679,0.0,3.6046612
15689,0.0,3.0483155
15699,0.0,2.6759949
15709,0.0,2.3794274
15719,0.0,2.070764
15729,0.0,1.7800133
15739,0.0,1.5505769
15749,0.0,1.3629646
15759,0.0,1.8716536
15769,0.0,1.6918626
15779,0.0,1.3158162
15789,0.0,0.6218967
15799,0.0,0.3765911
15809,0.0,0.3340119
15819,0.0,0.4968884
15829,0.0,0.70980173
15839,0.0,1.1048781
15849,0.0,1.5221593
15859,0.0,0.83401155
15869,0.0,0.37783146
15879,0.0,0.11260098
15889,0.0,0.2174921
15899,0.0,-0.08919823
15909,0.0,-0.14187765
15919,1.0,-0.1158365
15929,1.0,0.21153218
15939,1.0,0.5992796
15949,1.0,0.9853462
15959,1.0,1.0203048
15969,1.0,1.2684333
15979,1.0,2.3058565
15989,1.0,2.431926
15999,1.0,2.0286498
16009,1.0,2.6080408
16019,1.0,3.2706628
16029,1.0,3.949377
16039,1.0,4.219864
16049,1.0,5.0622163
16059,1.0,5.785701
16069,1.0,6.2464466
16079,1.0,6.709528
16089,1.0,7.436507
16099,1.0,7.591332
16109,1.0,9.287062
16119,1.0,8.6369915
16129,1.0,8.634539
16139,1.0,8.841239
16149,1.0,8.246005
16159,1.0,8.35276
16169,1.0,6.7448354
16179,1.0,6.2214527
16189,1.0,4.8068633
16199,1.0,3.9744992
16209,1.0,2.646275
16219,1.0,1.1258136
16229,1.0,0.81029737
16239,1.0,1.0785072
16249,1.0,1.246889
16259,1.0,1.7036145
16269,1.0,2.6357665
16279,1.0,2.9183445
16289,1.0,3.8568852
16299,1.0,5.288292
16309,1.0,6.3870564
16319,1.0,8.398052
16329,1.0,8.56663
16339,1.0,8.645096
16349,1.0,8.717989
16359,1.0,8.703224
16369,1.0,8.619851
16379,1.0,7.4314504
16389,1.0,7.1182394
16399,1.0,5.8053646
16409,1.0,5.390551
16419,1.0,5.253746
16429,1.0,4.0008717
16439,1.0,3.9829526
16449,1.0,3.6799269
16459,1.0,3.2176585
16469,1.0,2.7512016
16479,1.0,2.1343265
16489,1.0,1.6955085
16499,1.0,1.1902846
16509,1.0,0.937125
16519,1.0,0.6650933
16529,1.0,0.44010055
16539,1.0,-0.025872469
16549,1.0,-0.062526405
16559,0.0,-0.027418613
16569,0.0,0.078825116
16579,0.0,0.16513246
16589,0.0,-0.30368865
16599,0.0,0.33428693
16609,0.0,0.1811195
16619,0.0,0.28091186
16629,0.0,-0.023354769
16639,0.0,-0.044134617
16649,0.0,0.005979717
16659,0.0,0.53344864
16669,0.0,0.48608005
16679,0.0,1.3233869
16689,0.0,1.4837586
16699,0.0,1.6727765
16709,0.0,1.7928219
16719,0.0,1.7971044
16729,0.0,1.3465666
16739,0.0,0.7268833
16749,0.0,1.2405933
16759,0.0,0.4699639
16769,0.0,0.4801581
16779,0.0,0.57289106
16789,0.0,-0.07226968
16799,0.0,0.21797574
16809,0.0,-0.10262889
16819,0.0,0.118581474
16829,0.0,-0.16775262
16839,0.0,0.0964663
16849,0.0,-0.31867784
16859,0.0,-0.23597115
16869,0.0,-0.22782004
16879,0.0,0.029084384
16889,0.0,-0.15817243
16899,0.0,-0.3304066
16909,0.0,-0.25747
16919,0.0,-0.2132082
16929,0.0,-0.2828352
16939,0.0,-0.27811205
16949,0.0,-0.001318574
16959,0.0,0.3300436
16969,0.0,0.21441633
16979,0.0,-0.29079455
16989,0.0,-0.1977697
16999,0.0,-0.02538544
17009,0.0,-0.23632944
17019,0.0,-0.012693703
17029,0.0,-0.036422968
17039,0.0,0.06637055
17049,0.0,-0.2381922
17059,0.0,-0.42134142
17069,0.0,-0.18010569
17079,0.0,-0.13024497
17089,0.0,-0.6325619
17099,0.0,-0.35749424
17109,0.0,-0.32745004
17119,0.0,-0.14552307
17129,0.0,-0.1682334
17139,0.0,0.07824278
17149,0.0,0.54930097
17159,0.0,0.521432
17169,0.0,0.07195449
17179,0.0,-0.022442162
17189,0.0,0.118115544
17199,0.0,-0.25226474
17209,0.0,-0.1381824
17219,0.0,0.17847341
17229,0.0,-0.32391244
17239,0.0,-0.46926832
17249,0.0,-0.46514076
17259,0.0,0.04396844
17269,0.0,-0.04179907
17279,0.0,-0.25239092
17289,0.0,-0.22452903
17299,0.0,-0.056966543
17309,0.0,-0.4213904
17319,0.0,0.13618726
17329,0.0,0.16179961
17339,0.0,0.03575605
17349,0.0,0.24313098
17359,0.0,0.5047834
17369,0.0,-0.016973794
17379,0.0,0.26511323
17389,0.0,0.119719625
17399,0.0,0.3465342
17409,0.0,0.41728914
17419,0.0,0.16928947
17429,0.0,0.039207995
17439,0.0,-0.20572495
17449,0.0,0.18866777
17459,0.0,0.2536419
17469,0.0,0.4214068
17479,0.0,0.71467847
17489,0.0,0.86388034
17499,0.0,0.42963076
17509,0.0,0.6402699
17519,0.0,0.6396631
17529,0.0,0.5849699
17539,0.0,0.57067627
17549,0.0,0.3441975
17559,0.0,0.55190176
17569,0.0,0.45534492
17579,0.0,0.13567543
17589,0.0,0.24655885
17599,0.0,0.4255525
17609,0.0,0.20892155
17619,0.0,0.6737372
17629,0.0,0.58885425
17639,0.0,0.34859473
17649,0.0,0.90362144
17659,0.0,0.9095829
17669,0.0,1.188612
17679,0.0,2.0409963
17689,0.0,2.235477
17699,0.0,2.0120835
17709,0.0,2.362002
17719,0.0,2.7212713
17729,0.0,1.9264498
17739,0.0,1.3282652
17749,0.0,1.3294146
17759,0.0,1.2582321
17769,0.0,1.6004388
17779,0.0,1.0710073
17789,0.0,0.6492445
17799,0.0,0.45458257
17809,0.0,0.4154011
17819,0.0,0.33043623
17829,0.0,0.93654704
17839,0.0,0.95596373
17849,0.0,0.83807975
17859,0.0,0.9861929
17869,0.0,1.0718348
17879,0.0,1.7662449
17889,0.0,2.2457154
17899,0.0,2.3411648
17909,0.0,1.8516921
17919,0.0,1.9702203
17929,0.0,2.2085645
17939,0.0,1.7898395
17949,0.0,1.5610673
17959,0.0,2.2483082
17969,0.0,2.8155122
17979,0.0,2.4781485
17989,0.0,1.7325687
17999,0.0,1.246332
18009,0.0,1.1450933
18019,0.0,1.29988
18029,0.0,0.8208751
18039,0.0,0.8895206
18049,0.0,0.5504412
18059,0.0,0.1892544
18069,0.0,0.18423307
18079,0.0,0.025251508
18089,0.0,-0.13685846
18099,0.0,-0.23052353
18109,0.0,-0.30037212
18119,0.0,0.042863965
18129,0.0,-0.3812883
18139,0.0,-0.2099958
18149,0.0,-0.4663232
18159,0.0,-0.4257244
18169,0.0,-0.5455339
18179,0.0,-0.28133124
18189,0.0,-0.31286806
18199,0.0,-0.09414238
18209,0.0,-0.10666907
18219,0.0,0.47368753
18229,0.0,0.49970055
18239,0.0,0.6235096
18249,0.0,0.65873873
18259,0.0,0.24296302
18269,0.0,0.82941806
18279,0.0,0.6166777
18289,0.0,0.2762106
18299,0.0,-0.046405435
18309,0.0,-0.05069083
18319,0.0,-0.3111483
18329,0.0,-0.06207478
18339,0.0,-0.3293888
18349,0.0,-0.20266676
18359,0.0,-0.2276439
18369,0.0,-0.5389848
18379,0.0,-0.10449189
18389,0.0,-0.055378497
18399,0.0,-0.117180705
18409,0.0,-0.33183688
18419,0.0,0.030264795
18429,0.0,-0.061140418
18439,0.0,-0.12599784
18449,0.0,0.1354065
18459,0.0,-0.035176873
18469,0.0,0.26145536
18479,0.0,0.4196245
18489,0.0,0.34456033
18499,0.0,0.2571537
18509,0.0,-0.061567664
18519,0.0,0.1312325
18529,0.0,-0.055626392
18539,0.0,0.069143236
18549,0.0,0.5690967
18559,0.0,0.9211507
18569,0.0,1.2037983
18579,0.0,1.0229602
18589,0.0,0.45256078
18599,0.0,0.45441896
18609,0.0,0.39846343
18619,0.0,0.44699645
18629,0.0,0.22605509
18639,0.0,0.85842055
18649,0.0,1.0580206
18659,0.0,0.7350354
18669,0.0,0.92076993
18679,0.0,0.7270121
18689,0.0,1.2556661
18699,0.0,1.4739438
18709,0.0,1.4210938
18719,0.0,1.7850949
18729,0.0,2.0766425
18739,0.0,1.4617379
18749,0.0,0.9411751
18759,0.0,0.71687376
18769,0.0,0.5261058
18779,0.0,0.83248407
18789,0.0,1.2579226
18799,0.0,0.85825175
18809,0.0,1.0375364
18819,0.0,0.9910407
18829,0.0,1.6710554
18839,0.0,1.0691897
18849,0.0,0.5908788
18859,0.0,0.57504076
18869,0.0,0.14460355
18879,0.0,0.106630445
18889,0.0,0.09712845
18899,0.0,0.11052823
18909,0.0,0.09948808
18919,0.0,0.13849449
18929,0.0,-0.14821857
18939,0.0,0.18088537
18949,0.0,-0.3010118
18959,0.0,-0.044929147
18969,0.0,0.08860552
18979,0.0,0.7228399
18989,0.0,0.81347185
18999,0.0,0.88320816
19009,0.0,0.52383363
19019,0.0,1.094592
19029,0.0,1.8395487
19039,0.0,1.4854236
19049,0.0,1.4547827
19059,0.0,1.0873878
19069,0.0,0.7006805
19079,0.0,-0.13499558
19089,0.0,-0.5015042
19099,0.0,-0.26337528
19109,0.0,-0.1471284
19119,0.0,-0.030610621
19129,0.0,-0.48137403
19139,1.0,-0.8322979
19149,1.0,-0.24328846
19159,1.0,0.17398804
19169,1.0,0.67180246
19179,1.0,0.9544427
19189,1.0,1.3217845
19199,1.0,1.7493665
19209,1.0,2.3468661
19219,1.0,2.4694538
19229,1.0,3.3297427
19239,1.0,3.651434
19249,1.0,4.1887836
19259,1.0,4.571399
19269,1.0,4.5944004
19279,1.0,4.6032534
19289,1.0,4.8177824
19299,1.0,5.4667807
19309,1.0,6.045376
19319,1.0,7.3566995
19329,1.0,8.385834
19339,1.0,8.569962
19349,1.0,8.75494
19359,1.0,8.632919
19369,1.0,8.692394
19379,1.0,8.439466
19389,1.0,7.1958084
19399,1.0,6.06404
19409,1.0,5.171376
19419,1.0,4.3360834
19429,1.0,3.3480067
19439,1.0,2.6117535
19449,1.0,1.1738033
19459,1.0,1.0690646
19469,1.0,1.4595348
19479,1.0,1.3541508
19489,1.0,1.9962971
19499,1.0,2.4690187
19509,1.0,3.7624168
19519,1.0,4.6207285
19529,1.0,6.108058
19539,1.0,8.0900345
19549,1.0,8.905825
19559,1.0,9.016628
19569,1.0,8.710785
19579,1.0,8.306531
19589,1.0,8.396736
19599,1.0,9.712915
19609,1.0,9.561073
19619,1.0,9.419197
19629,1.0,9.375477
19639,1.0,9.081312
19649,1.0,7.0972114
19659,1.0,5.3350024
19669,1.0,5.323886
19679,1.0,4.8230186
19689,1.0,3.590124
19699,1.0,2.9265518
19709,1.0,2.177068
19719,1.0,1.5431042
19729,1.0,1.4309264
19739,1.0,1.5592799
19749,1.0,0.9170465
19759,1.0,0.2593702
19769,1.0,0.32776815
19779,1.0,0.20891726
19789,0.0,0.66814107
19799,0.0,0.5255112
19809,0.0,0.13662279
19819,0.0,0.12128919
19829,0.0,0.4624682
19839,0.0,0.26307398
19849,0.0,1.2249334
19859,0.0,1.7792351
19869,0.0,1.3878125
19879,0.0,1.1299996
19889,0.0,1.319293
19899,0.0,0.98990065
19909,0.0,0.98457867
19919,0.0,0.51866347
19929,0.0,0.16498959
19939,0.0,0.53175926
19949,0.0,0.6752013
19959,0.0,0.80716914
19969,0.0,1.1854243
19979,0.0,0.8274624
19989,0.0,0.6197219
19999,0.0,0.9904652
20009,0.0,1.2528825
20019,0.0,0.41235614
20029,0.0,0.29995656
20039,0.0,0.23228306
20049,0.0,-0.46425933
20059,0.0,0.0034040213
20069,0.0,-0.114414215
20079,0.0,0.16866612
20089,0.0,0.3766939
20099,0.0,0.50784224
20109,0.0,0.085523665
20119,0.0,0.29359114
20129,0.0,-0.13568676
20139,0.0,-0.15932363
20149,0.0,-0.18023866
20159,0.0,-0.46080345
20169,0.0,-0.43004107
20179,0.0,-0.2179234
20189,0.0,0.076114714
20199,0.0,0.36527723
20209,0.0,0.47037464
20219,0.0,1.3225739
20229,0.0,1.1320293
20239,0.0,0.8937094
20249,0.0,0.03260243
20259,0.0,-0.13067424
20269,0.0,0.21413577
20279,0.0,-0.18890047
20289,0.0,0.019688189
20299,0.0,-0.08537674
20309,0.0,0.11476213
20319,0.0,-0.34095174
20329,0.0,-0.29632503
20339,0.0,-0.29209548
20349,0.0,-0.64984274
20359,0.0,-0.890677
20369,0.0,-0.67240024
20379,0.0,-0.40056574
20389,0.0,-0.37359303
20399,0.0,-0.48308736
20409,0.0,0.045597672
20419,0.0,-0.047911167
20429,0.0,-0.2989667
20439,0.0,-0.09822643
20449,0.0,-0.28602564
20459,0.0,-0.5218715
20469,0.0,-0.4283312
20479,0.0,-0.31563222
20489,0.0,-0.5997181
20499,0.0,-0.5555828
20509,0.0,-0.25138015
20519,0.0,-0.38099456
20529,0.0,-0.4913249
20539,0.0,-0.3466856
20549,0.0,-0.18965244
20559,0.0,0.005815804
20569,0.0,0.14485317
20579,0.0,0.33036506
20589,0.0,0.3463838
20599,0.0,0.6340417
20609,0.0,1.220099
20619,0.0,1.4864225
20629,0.0,1.3400104
20639,0.0,0.63516366
20649,0.0,0.72115886
20659,0.0,0.29385847
20669,0.0,0.057908893
20679,0.0,-0.18902177
20689,0.0,-0.026625752
20699,0.0,0.011582613
20709,0.0,0.107548535
20719,0.0,0.2528609
20729,0.0,0.46174818
20739,0.0,0.6310664
20749,0.0,0.83502764
20759,0.0,0.54788476
20769,0.0,0.6606056
20779,0.0,0.46320254
20789,0.0,0.56782335
20799,0.0,0.23960304
20809,0.0,0.7029429
20819,0.0,-0.08365625
20829,0.0,-0.06680852
20839,0.0,-0.30201095
20849,0.0,0.13698024
20859,0.0,-0.13829255
20869,0.0,-0.046437263
20879,0.0,-0.19010627
20889,0.0,-0.25185257
20899,0.0,0.082154214
20909,0.0,0.48369682
20919,0.0,0.13567084
20929,0.0,0.22980112
20939,0.0,0.4726889
20949,0.0,0.33262545
20959,0.0,0.39301366
20969,0.0,0.14460868
20979,0.0,-0.27107167
20989,0.0,-0.48524022
20999,0.0,-0.2861001
21009,0.0,0.121208906
21019,0.0,-0.25917113
21029,0.0,0.039746046
21039,0.0,-0.06856072
21049,0.0,0.08243847
21059,0.0,0.61090416
21069,0.0,0.451254
21079,0.0,0.21894693
21089,0.0,0.17646807
21099,0.0,0.28970718
21109,0.0,0.8539902
21119,0.0,0.78312147
21129,0.0,0.5146467
21139,0.0,0.6191497
21149,0.0,0.22193414
21159,0.0,0.021534085
21169,0.0,0.24581623
21179,0.0,0.0046302676
21189,0.0,-0.40619642
21199,0.0,-0.24903768
21209,0.0,0.024314284
21219,0.0,-0.047988117
21229,0.0,-0.008347273
21239,0.0,0.20271593
21249,0.0,0.36091155
21259,0.0,0.30159694
21269,0.0,0.4106037
21279,0.0,0.25962478
21289,0.0,0.4800691
21299,0.0,0.272107
21309,0.0,0.14420986
21319,0.0,-0.102976024
21329,0.0,0.2119059
21339,0.0,0.061287045
21349,0.0,-0.06616169
21359,0.0,-0.32969135
21369,0.0,-0.047384262
21379,0.0,-0.018958032
21389,0.0,0.33092278
21399,0.0,-0.0856902
21409,0.0,-0.03644055
21419,0.0,-0.2692356
21429,0.0,-0.30840588
21439,0.0,-0.093013644
21449,0.0,-0.18472767
21459,0.0,0.23133749
21469,0.0,0.28270096
21479,0.0,1.5291069
21489,0.0,1.1617922
21499,0.0,0.6326761
21509,0.0,0.8871681
21519,0.0,1.1318898
21529,0.0,0.8086198
21539,0.0,0.29022837
21549,0.0,-0.14708114
21559,0.0,0.09015745
21569,0.0,0.1795193
21579,0.0,-0.06528312
21589,0.0,-0.07528067
21599,0.0,0.5297525
21609,0.0,0.47754663
21619,0.0,0.0802896
21629,0.0,-0.18509579
21639,0.0,-0.14017534
21649,0.0,-0.5277802
21659,0.0,-0.33908957
21669,0.0,-0.253151
21679,0.0,-0.2122879
21689,0.0,-0.23573625
21699,0.0,-0.29744548
21709,0.0,-0.01300019
21719,0.0,-0.17316413
21729,0.0,-0.19093883
21739,0.0,-0.32968944
21749,0.0,-0.17452157
21759,0.0,-0.16472661
21769,0.0,-0.22863346
21779,0.0,0.09224552
21789,0.0,-0.39270204
21799,0.0,-0.33186793
21809,0.0,-0.59436977
21819,0.0,-0.23492384
21829,0.0,-0.13788623
21839,0.0,-0.24008596
21849,0.0,-0.28628147
21859,0.0,0.17072737
21869,0.0,0.11326158
21879,0.0,0.03406799
21889,0.0,0.13766003
21899,0.0,-0.17245877
21909,0.0,0.044327855
21919,0.0,-0.13091242
21929,0.0,0.4203241
21939,0.0,0.034706473
21949,0.0,0.2536968
21959,0.0,0.40640962
21969,0.0,1.1342671
21979,0.0,1.0037324
21989,0.0,0.4100557
21999,0.0,0.59319174
22009,0.0,0.7556025
22019,0.0,1.0725889
22029,0.0,1.2068727
22039,0.0,1.544128
22049,0.0,0.9779231
22059,0.0,1.3505821
22069,0.0,1.9355651
22079,0.0,2.5173507
22089,0.0,2.3354757
22099,0.0,2.365498
22109,0.0,1.8293091
22119,0.0,1.6131287
22129,0.0,0.88498956
22139,0.0,0.7329314
22149,0.0,0.74570304
22159,0.0,0.23131508
22169,0.0,0.64105666
22179,0.0,0.36204815
22189,0.0,-0.0476529
22199,0.0,-0.13125533
22209,0.0,-0.10020071
22219,0.0,-0.42567307
22229,0.0,-0.17107564
22239,0.0,-0.33481145
22249,0.0,0.021328688
22259,0.0,-0.20197725
22269,0.0,-0.014961958
22279,0.0,0.56258917
22289,0.0,0.24079949
22299,0.0,0.25903046
22309,0.0,0.7078378
22319,0.0,0.071172476
22329,0.0,0.0046408772
22339,0.0,0.22055423
22349,0.0,0.3541628
22359,0.0,0.32579416
22369,0.0,0.17508769
22379,1.0,0.63713837
22389,1.0,0.67911583
22399,1.0,0.71358305
22409,1.0,0.47772366
22419,1.0,0.9672781
22429,1.0,0.6992794
22439,1.0,1.2363822
22449,1.0,1.4948578
22459,1.0,2.3593285
22469,1.0,2.3597593
22479,1.0,2.5366752
22489,1.0,3.8167944
22499,1.0,4.0429
22509,1.0,4.8596425
22519,1.0,4.6783876
22529,1.0,5.474698
22539,1.0,5.956806
22549,1.0,6.562977
22559,1.0,7.0013885
22569,1.0,7.9727635
22579,1.0,8.738928
22589,1.0,8.612908
22599,1.0,8.015678
22609,1.0,8.277073
22619,1.0,8.351789
22629,1.0,7.0664773
22639,1.0,5.911231
22649,1.0,4.8490696
22659,1.0,3.6239777
22669,1.0,2.676816
22679,1.0,1.9168965
22689,1.0,1.0532267
22699,1.0,0.8861507
22709,1.0,0.51626503
22719,1.0,1.6533606
22729,1.0,2.818411
22739,1.0,3.7002852
22749,1.0,4.523048
22759,1.0,5.638891
22769,1.0,6.4123726
22779,1.0,8.156459
22789,1.0,8.235731
22799,1.0,8.597481
22809,1.0,8.680588
22819,1.0,8.720859
22829,1.0,8.66822
22839,1.0,7.9669557
22849,1.0,7.319872
22859,1.0,6.325165
22869,1.0,5.380856
22879,1.0,4.852604
22889,1.0,5.051694
22899,1.0,3.6105468
22909,1.0,3.7162492
22919,1.0,3.748948
22929,1.0,3.2842243
22939,1.0,2.4093053
22949,1.0,1.7207143
22959,1.0,1.7107003
22969,1.0,1.3553438
22979,1.0,1.0124915
22989,1.0,0.90074426
22999,1.0,0.66320074
23009,1.0,-0.046628952
23019,0.0,-0.33826375
23029,0.0,-0.08386874
23039,0.0,-0.3456713
23049,0.0,-0.3037827
23059,0.0,-0.59453064
23069,0.0,-0.6185529
23079,0.0,-0.8694037
23089,0.0,-0.60987747
23099,0.0,-0.63857484
23109,0.0,-0.13879901
23119,0.0,0.08322692
23129,0.0,-0.106128514
23139,0.0,-0.10556865
23149,0.0,0.02135837
23159,0.0,0.3801946
23169,0.0,0.28501308
23179,0.0,0.9590976
23189,0.0,1.0544746
23199,0.0,1.2656906
23209,0.0,1.3178158
23219,0.0,0.9193776
23229,0.0,0.74886614
23239,0.0,0.7255752
23249,0.0,0.66365707
23259,0.0,0.3448289
23269,0.0,0.39695203
23279,0.0,0.3335547
23289,0.0,0.19616449
23299,0.0,0.009801447
23309,0.0,-0.27335393
23319,0.0,0.2766738
23329,0.0,0.0010226369
23339,0.0,-0.13652396
23349,0.0,-0.18982387
23359,0.0,-0.1964311
23369,0.0,0.0126565695
23379,0.0,-0.075713515
23389,0.0,0.38322514
23399,0.0,0.3283903
23409,0.0,0.6365147
23419,0.0,-0.084596515
23429,0.0,0.15177894
23439,0.0,-0.16064316
23449,0.0,0.32221627
23459,0.0,-0.06004536
23469,0.0,0.3390485
23479,0.0,0.42107755
23489,0.0,-0.22021759
23499,0.0,0.120541215
23509,0.0,0.0728932
23519,0.0,0.3953386
23529,0.0,0.029155195
23539,0.0,0.14106238
23549,0.0,0.62872237
23559,0.0,0.15054071
23569,0.0,-0.13923669
23579,0.0,0.017599404
23589,0.0,-0.18450147
23599,0.0,-0.06649554
23609,0.0,0.22578877
23619,0.0,0.18988633
23629,0.0,0.10871959
23639,0.0,0.32491708
23649,0.0,0.19428408
23659,0.0,0.10900962
23669,0.0,1.0288247
23679,0.0,1.6813369
23689,0.0,1.0808642
23699,0.0,0.61542314
23709,0.0,0.9321012
23719,0.0,1.059274
23729,0.0,1.6957642
23739,0.0,1.6487327
23749,0.0,1.4744843
23759,0.0,1.6960998
23769,0.0,0.7681585
23779,0.0,0.24125957
23789,0.0,-0.31136376
23799,0.0,-0.5902504
23809,0.0,0.03908074
23819,0.0,0.41479367
23829,0.0,0.30855387
23839,0.0,0.43382114
23849,0.0,0.4004389
23859,0.0,-0.26017463
23869,0.0,-0.13766575
23879,0.0,-0.28372538
23889,0.0,-0.6848961
23899,0.0,-0.4297462
23909,0.0,-0.41770154
23919,0.0,-0.43608594
23929,0.0,-0.3410951
23939,0.0,-0.095182836
23949,0.0,-0.3218205
23959,0.0,-0.17391825
23969,0.0,-0.4540804
23979,0.0,-0.46970004
23989,0.0,-0.34632415
23999,0.0,-0.43606985
24009,0.0,-0.74543124
24019,0.0,-0.55082643
24029,0.0,-0.34410548
24039,0.0,-0.27765495
24049,0.0,0.0031753778
24059,0.0,0.2132029
24069,0.0,-0.5554892
24079,0.0,-0.47939116
24089,0.0,-0.3638044
24099,0.0,-0.299388
24109,0.0,-0.19269949
24119,0.0,-0.110732794
24129,0.0,0.06321269
24139,0.0,0.3118658
24149,0.0,0.7713593
24159,0.0,0.59000593
24169,0.0,0.8534843
24179,0.0,1.8240994
24189,0.0,2.5259418
24199,0.0,3.6403942
24209,0.0,4.0032825
24219,0.0,4.134874
24229,0.0,4.1535687
24239,0.0,4.145936
24249,0.0,2.3740358
24259,0.0,1.422607
24269,0.0,1.2896624
24279,0.0,0.707796
24289,0.0,0.4313162
24299,0.0,0.2230457
24309,0.0,0.107966006
24319,0.0,-0.6902854
24329,0.0,-0.4728654
24339,0.0,-0.49939394
24349,0.0,-0.25861233
24359,0.0,-0.6504607
24369,0.0,-0.05025053
24379,0.0,0.6733102
24389,0.0,1.3042789
24399,0.0,2.7892838
24409,0.0,3.1184833
24419,0.0,4.133335
24429,0.0,4.2433887
24439,0.0,4.9360256
24449,0.0,4.4252243
24459,0.0,3.3116865
24469,0.0,3.852046
24479,0.0,2.8999887
24489,0.0,2.3039312
24499,0.0,2.045127
24509,0.0,1.4036486
24519,0.0,1.0952358
24529,0.0,1.0960466
24539,0.0,1.3519924
24549,0.0,1.2939847
24559,0.0,1.3592191
24569,0.0,1.1492351
24579,0.0,0.44107652
24589,0.0,0.2787696
24599,0.0,0.36072057
24609,0.0,0.271307
24619,0.0,0.08417499
24629,0.0,0.46635956
24639,0.0,0.15279478
24649,0.0,-0.045182228
24659,0.0,0.22187817
24669,0.0,0.5251797
24679,0.0,0.3659134
24689,0.0,0.41896468
24699,0.0,-0.048367918
24709,0.0,0.1506117
24719,0.0,0.07757646
24729,0.0,-0.09536171
24739,0.0,0.13865852
24749,0.0,-0.0024940372
24759,0.0,0.27614635
24769,0.0,0.38336223
24779,0.0,-0.03255856
24789,0.0,-0.08822
24799,0.0,-0.090311706
24809,0.0,0.20967788
24819,0.0,0.554844
24829,0.0,0.9467136
24839,0.0,0.99211127
24849,0.0,0.7855005
24859,0.0,1.412576
24869,0.0,1.6080083
24879,0.0,2.1785147
24889,0.0,1.9228663
24899,0.0,1.4006187
24909,0.0,1.1763301
24919,0.0,1.3009417
24929,0.0,0.9451048
24939,0.0,1.1682506
24949,0.0,1.1714525
24959,0.0,0.94666296
24969,0.0,0.93111354
24979,0.0,0.5870667
24989,0.0,0.90977687
24999,0.0,0.46243685
25009,0.0,1.0651748
25019,0.0,1.7615428
25029,0.0,1.973618
25039,0.0,1.0772114
25049,0.0,-0.22365952
25059,0.0,-0.37435043
25069,0.0,0.0101796985
25079,0.0,-0.06724465
25089,0.0,0.21206307
25099,0.0,0.24897224
25109,0.0,0.18799907
25119,0.0,0.08542031
25129,0.0,0.8836444
25139,0.0,0.6664515
25149,0.0,0.35907394
25159,0.0,0.6740746
25169,0.0,0.41552413
25179,0.0,0.4290278
25189,0.0,0.3928913
25199,0.0,0.3852787
25209,0.0,1.17313
25219,0.0,1.9120146
25229,0.0,1.953085
25239,0.0,1.4234737
25249,0.0,0.8356587
25259,0.0,0.307513
25269,0.0,0.23896098
25279,0.0,0.6491037
25289,0.0,0.54303026
25299,0.0,0.34302747
25309,0.0,0.1726157
25319,0.0,-0.28204095
25329,0.0,-0.1566701
25339,0.0,0.06605774
25349,0.0,-0.31975818
25359,0.0,0.026346684
25369,0.0,-0.2467342
25379,0.0,-0.04626137
25389,0.0,0.16864091
25399,0.0,0.10448921
25409,0.0,0.25097245
25419,0.0,0.22183508
25429,0.0,0.30219978
25439,0.0,-0.22264141
25449,0.0,0.30624264
25459,0.0,-0.19037235
25469,0.0,-0.16764468
25479,0.0,0.10663855
25489,0.0,0.026710749
25499,0.0,0.031614423
25509,0.0,-0.06084454
25519,0.0,-0.2655822
25529,0.0,0.49984056
25539,0.0,0.03211111
25549,0.0,0.27774405
25559,0.0,0.56888914
25569,0.0,0.7578999
25579,0.0,0.0951345
25589,0.0,0.065027416
25599,0.0,-0.09519166
25609,1.0,-0.30403453
25619,1.0,0.5434188
25629,1.0,-0.054489493
25639,1.0,0.8391268
25649,1.0,1.2325125
25659,1.0,1.8005195
25669,1.0,2.5418935
25679,1.0,2.2198598
25689,1.0,2.8194823
25699,1.0,3.2074764
25709,1.0,3.764936
25719,1.0,4.4130244
25729,1.0,5.5729456
25739,1.0,6.051217
25749,1.0,6.433384
25759,1.0,7.1604815
25769,1.0,8.312145
25779,1.0,9.094496
25789,1.0,10.0569105
25799,1.0,9.854637
25809,1.0,8.631202
25819,1.0,8.724619
25829,1.0,8.743376
25839,1.0,8.446408
25849,1.0,7.9600334
25859,1.0,6.5073967
25869,1.0,6.1497326
25879,1.0,5.3878446
25889,1.0,4.9140625
25899,1.0,3.7593718
25909,1.0,2.6409035
25919,1.0,2.237245
25929,1.0,1.6989825
25939,1.0,1.6906685
25949,1.0,1.3400677
25959,1.0,2.1269846
25969,1.0,2.9501326
25979,1.0,3.1806667
25989,1.0,5.3282175
25999,1.0,6.671919
26009,1.0,8.897442
26019,1.0,8.896416
26029,1.0,8.701513
26039,1.0,8.644747
26049,1.0,8.932417
26059,1.0,8.862565
26069,1.0,7.633589
26079,1.0,7.148018
26089,1.0,7.4522657
26099,1.0,6.266416
26109,1.0,5.54257
26119,1.0,4.6947355
26129,1.0,4.415419
26139,1.0,3.9576762
26149,1.0,3.4881475
26159,1.0,2.346064
26169,1.0,1.7214853
26179,1.0,1.5728989
26189,1.0,1.4816937
26199,1.0,1.2983681
26209,1.0,0.7898364
26219,1.0,0.26718765
26229,1.0,-0.02470696
26239,1.0,-0.37462306
26249,0.0,-0.69598037
26259,0.0,-0.43364227
26269,0.0,-0.4549361
26279,0.0,-0.25994205
26289,0.0,0.20432222
26299,0.0,-0.07565105
26309,0.0,-0.12165463
26319,0.0,-0.41043139
26329,0.0,-0.3663174
26339,0.0,-0.46166158
26349,0.0,-0.20151699
26359,0.0,-0.29570895
26369,0.0,0.04703009
26379,0.0,0.86901385
26389,0.0,1.1096361
26399,0.0,0.9587679
26409,0.0,1.0214055
26419,0.0,1.3620927
26429,0.0,1.1068461
26439,0.0,1.1232061
26449,0.0,1.5995343
26459,0.0,1.9818833
26469,0.0,2.1951747
26479,0.0,1.6494843
26489,0.0,1.3060741
26499,0.0,1.2526582
26509,0.0,0.6746697
26519,0.0,0.39708406
26529,0.0,0.55625117
26539,0.0,0.7435415
26549,0.0,1.4169071
26559,0.0,1.1692587
26569,0.0,1.5658786
26579,0.0,1.0993649
26589,0.0,1.0957506
26599,0.0,0.8843394
26609,0.0,0.95554173
26619,0.0,0.8298897
26629,0.0,0.76506037
26639,0.0,0.87233734
26649,0.0,0.6901485
26659,0.0,0.5185508
26669,0.0,1.1177573
26679,0.0,0.5969629
26689,0.0,0.91807467
26699,0.0,0.61470616
26709,0.0,0.9166091
26719,0.0,0.71550953
26729,0.0,-0.53271234
26739,0.0,-0.48034966
26749,0.0,-0.2072295
26759,0.0,-0.22269917
26769,0.0,-0.5130042
26779,0.0,-0.08933371
26789,0.0,0.019486666
26799,0.0,-0.66346425
26809,0.0,-0.13541847
26819,0.0,0.22883499
26829,0.0,0.25889868
26839,0.0,-0.22405088
26849,0.0,-0.18907464
26859,0.0,0.085243285
26869,0.0,0.035797417
26879,0.0,0.051690638
26889,0.0,0.48808908
26899,0.0,-0.11013633
26909,0.0,0.040046692
26919,0.0,-0.027932346
26929,0.0,0.2526648
26939,0.0,0.6950563
26949,0.0,0.85159326
26959,0.0,0.57522166
26969,0.0,0.37766898
26979,0.0,0.34909964
26989,0.0,0.625621
26999,0.0,0.7194458
27009,0.0,-0.031561017
27019,0.0,-0.2043522
27029,0.0,-0.33208752
27039,0.0,-0.24323326
27049,0.0,-0.2600717
27059,0.0,-0.25017965
27069,0.0,-0.3781858
27079,0.0,-0.3941868
27089,0.0,-0.47855347
27099,0.0,-0.3596486
27109,0.0,-0.42698318
27119,0.0,-0.7064549
27129,0.0,-0.54881656
27139,0.0,-0.29408973
27149,0.0,-0.21047378
27159,0.0,0.29486603
27169,0.0,0.30864257
27179,0.0,0.0545727
27189,0.0,0.6261977
27199,0.0,1.4177568
27209,0.0,1.169902
27219,0.0,0.4689446
27229,0.0,-0.14838672
27239,0.0,0.070777476
27249,0.0,0.43048292
27259,0.0,0.5315601
27269,0.0,0.20342726
27279,0.0,0.10306078
27289,0.0,0.6069158
27299,0.0,1.0999546
27309,0.0,0.6579541
27319,0.0,0.30784166
27329,0.0,-0.08648491
27339,0.0,-0.13633806
27349,0.0,-0.0625245
27359,0.0,0.09073168
27369,0.0,-0.27541494
27379,0.0,-0.5126184
27389,0.0,-0.5014317
27399,0.0,0.16533494
27409,0.0,-0.028476
27419,0.0,0.2816409
27429,0.0,0.7474611
27439,0.0,0.34538722
27449,0.0,0.5059062
27459,0.0,0.5393728
27469,0.0,0.43027592
27479,0.0,0.11289859
27489,0.0,0.32104957
27499,0.0,-0.048494577
27509,0.0,-0.15210998
27519,0.0,0.32287776
27529,0.0,0.84276944
27539,0.0,0.3137374
27549,0.0,0.52248913
27559,0.0,0.24503428
27569,0.0,0.13817489
27579,0.0,0.018278003
27589,0.0,0.15193808
27599,0.0,-0.3435384
27609,0.0,-0.14291304
27619,0.0,-0.1719696
27629,0.0,0.052087665
27639,0.0,-0.1251545
27649,0.0,-0.17426157
27659,0.0,-0.39924163
27669,0.0,-0.31234068
27679,0.0,-0.013441801
27689,0.0,0.2671787
27699,0.0,-0.078413844
27709,0.0,0.4097947
27719,0.0,0.7650516
27729,0.0,1.1106349
27739,0.0,1.008837
27749,0.0,0.7373136
27759,0.0,0.3393064
27769,0.0,0.5830762
27779,0.0,0.664574
27789,0.0,0.7300989
27799,0.0,0.90156466
27809,0.0,0.993738
27819,0.0,1.4444675
27829,0.0,0.89878356
27839,0.0,0.6941822
27849,0.0,-0.3005898
27859,0.0,0.0456087
27869,0.0,-0.33453393
27879,0.0,-0.09970665
27889,0.0,-0.13904703
27899,0.0,0.23428744
27909,0.0,0.03553617
27919,0.0,0.5435941
27929,0.0,0.44331163
27939,0.0,-0.06784195
27949,0.0,0.09012544
27959,0.0,0.3267907
27969,0.0,0.35485822
27979,0.0,-0.084421754
27989,0.0,-0.29219246
27999,0.0,0.12794816
28009,0.0,0.056934774
28019,0.0,-0.08288556
28029,0.0,-0.49638504
28039,0.0,-0.47632515
28049,0.0,-0.28316265
28059,0.0,-0.12504953
28069,0.0,-0.07383567
28079,0.0,0.56625414
28089,0.0,0.8645737
28099,0.0,0.9548716
28109,0.0,0.6114092
28119,0.0,1.8747363
28129,0.0,2.5381413
28139,0.0,2.6767824
28149,0.0,2.1889453
28159,0.0,2.7115057
28169,0.0,2.4055014
28179,0.0,1.7638525
28189,0.0,1.7874762
28199,0.0,1.7952828
28209,0.0,0.9416786
28219,0.0,1.0082057
28229,0.0,0.60667014
28239,0.0,0.53975993
28249,0.0,0.7517383
28259,0.0,0.14010054
28269,0.0,0.3961966
28279,0.0,0.24527192
28289,0.0,0.17021358
28299,0.0,-0.20223755
28309,0.0,-0.09928793
28319,0.0,-0.46741873
28329,0.0,0.37072784
28339,0.0,0.12729716
28349,0.0,-0.10630858
28359,0.0,0.5370166
28369,0.0,0.3296703
28379,0.0,0.8740937
28389,0.0,0.67511964
28399,0.0,0.09241384
28409,0.0,0.10830283
28419,0.0,-0.3102699
28429,0.0,0.04946816
28439,0.0,0.26990962
28449,0.0,0.2501102
28459,0.0,0.275055
28469,0.0,0.0033295155
28479,0.0,0.22768384
28489,0.0,0.2523464
28499,0.0,0.2227062
28509,0.0,-0.46966827
28519,0.0,-0.627623
28529,0.0,-0.5505718
28539,0.0,-0.41092247
28549,0.0,-0.37160987
28559,0.0,-0.049242854
28569,0.0,0.0118383765
28579,0.0,0.31402433
28589,0.0,0.94752
28599,0.0,1.4965374
28609,0.0,1.6981611
28619,0.0,2.140564
28629,0.0,2.705263
28639,0.0,2.7792253
28649,0.0,2.553715
28659,0.0,2.515823
28669,0.0,2.2781084
28679,0.0,2.0333188
28689,0.0,2.0259984
28699,0.0,1.6403486
28709,0.0,1.9404246
28719,0.0,2.0547051
28729,0.0,2.051229
28739,0.0,1.8556368
28749,0.0,1.3898711
28759,0.0,0.98172086
28769,0.0,1.6574328
28779,0.0,1.7270586
28789,0.0,1.4092278
28799,0.0,1.5479797
28809,0.0,0.5766044
28819,0.0,1.1192241
28829,1.0,0.72552335
28839,1.0,0.68936443
28849,1.0,0.971235
28859,1.0,0.79543257
28869,1.0,0.8840946
28879,1.0,1.2136049
28889,1.0,1.3376709
28899,1.0,1.4566028
28909,1.0,1.6697793
28919,1.0,2.7572365
28929,1.0,2.7016778
28939,1.0,3.1667697
28949,1.0,3.215035
28959,1.0,3.9373279
28969,1.0,4.2169766
28979,1.0,4.717893
28989,1.0,5.732004
28999,1.0,6.078928
29009,1.0,7.0077896
29019,1.0,8.429443
29029,1.0,8.638021
29039,1.0,8.839832
29049,1.0,8.662353
29059,1.0,8.513374
29069,1.0,8.244062
29079,1.0,7.288906
29089,1.0,7.083971
29099,1.0,5.691207
29109,1.0,4.503735
29119,1.0,3.0413163
29129,1.0,2.19235
29139,1.0,1.5092938
29149,1.0,1.2804456
29159,1.0,1.2188172
29169,1.0,1.2075951
29179,1.0,1.7323534
29189,1.0,2.499205
29199,1.0,4.0979834
29209,1.0,4.859448
29219,1.0,6.0567355
29229,1.0,8.120852
29239,1.0,8.398017
29249,1.0,8.728714
29259,1.0,8.670706
29269,1.0,8.724115
29279,1.0,8.216204
29289,1.0,7.714267
29299,1.0,7.717677
29309,1.0,6.250203
29319,1.0,5.548498
29329,1.0,4.768447
29339,1.0,4.1838293
29349,1.0,3.9131322
29359,1.0,3.9042535
29369,1.0,3.623203
29379,1.0,3.516693
29389,1.0,2.62531
29399,1.0,2.382977
29409,1.0,1.9159458
29419,1.0,1.4491756
29429,1.0,1.3033752
29439,1.0,0.7631392
29449,1.0,0.34846961
29459,1.0,0.40377092
29469,0.0,-0.6180656
29479,0.0,-0.14596337
29489,0.0,-0.5715161
29499,0.0,-0.44164383
29509,0.0,-0.38989103
29519,0.0,-0.06155336
29529,0.0,0.281852
29539,0.0,-0.00040400028
29549,0.0,-0.3989684
29559,0.0,-0.49129182
29569,0.0,-0.47755992
29579,0.0,-0.5134432
29589,0.0,-0.23023254
29599,0.0,-0.23473316
29609,0.0,-0.3935452
29619,0.0,-0.2913552
29629,0.0,-0.16515326
29639,0.0,0.0034480095
29649,0.0,-0.069682
29659,0.0,0.08806306
29669,0.0,-0.099339485
29679,0.0,-0.05788684
29689,0.0,-0.13848233
29699,0.0,-0.10891861
29709,0.0,0.1564871
29719,0.0,0.87118316
29729,0.0,2.216154
29739,0.0,1.1058953
29749,0.0,0.8664732
29759,0.0,0.8537153
29769,0.0,1.2542982
29779,0.0,1.18512
29789,0.0,1.1030068
29799,0.0,1.0285239
29809,0.0,0.94422275
29819,0.0,0.5159375
29829,0.0,0.67997694
29839,0.0,0.57610536
29849,0.0,0.12797934
29859,0.0,-0.19697708
29869,0.0,-0.101563156
29879,0.0,-0.21090728
29889,0.0,-0.17070085
29899,0.0,-0.11673862
29909,0.0,-0.060191214
29919,0.0,-0.20216972
29929,0.0,0.36578417
29939,0.0,-0.17683113
29949,0.0,-0.0969829
29959,0.0,-0.16971648
29969,0.0,-0.16892529
29979,0.0,-0.5330193
29989,0.0,-0.10744727
29999,0.0,-0.0074034333
30009,0.0,0.14954758
30019,0.0,-0.19768965
30029,0.0,-0.19562382
30039,0.0,-0.377882
30049,0.0,-0.10548854
30059,0.0,-0.5188032
30069,0.0,-0.52912915
30079,0.0,-0.6461424
30089,0.0,-1.0787301
30099,0.0,-0.26100415
30109,0.0,-0.43710262
30119,0.0,-0.23328733
30129,0.0,0.045015275
30139,0.0,0.21662182
30149,0.0,-0.16908598
30159,0.0,0.1759367
30169,0.0,-0.092247486
30179,0.0,0.0016465783
30189,0.0,-0.1659447
30199,0.0,-0.04721576
30209,0.0,0.082760036
30219,0.0,0.54561096
30229,0.0,0.512827
30239,0.0,-0.054085076
30249,0.0,0.19707268
30259,0.0,0.48158282
30269,0.0,0.0048476458
30279,0.0,0.2979408
30289,0.0,0.12484008
30299,0.0,0.11421031
30309,0.0,-0.11155254
30319,0.0,-0.17732066
30329,0.0,-0.3845467
30339,0.0,-0.12615234
30349,0.0,0.27045465
30359,0.0,0.3821687
30369,0.0,0.24551779
30379,0.0,0.07312107
30389,0.0,0.064249575
30399,0.0,-0.26024497
30409,0.0,-0.1907562
30419,0.0,0.016063929
30429,0.0,0.17339945
30439,0.0,0.2322796
30449,0.0,-0.0133674145
30459,0.0,0.37686205
30469,0.0,0.6527816
30479,0.0,0.86392987
30489,0.0,0.552933
30499,0.0,0.5111011
30509,0.0,0.47760367
30519,0.0,0.7607383
30529,0.0,0.62974787
30539,0.0,1.2703586
30549,0.0,2.0310626
30559,0.0,3.1189017
30569,0.0,4.0313306
30579,0.0,4.133105
30589,0.0,3.3179142
30599,0.0,3.388889
30609,0.0,2.1464834
30619,0.0,1.7718465
30629,0.0,1.1705275
30639,0.0,1.0683749
30649,0.0,1.0817199
30659,0.0,0.27119434
30669,0.0,0.38566935
30679,0.0,0.18562436
30689,0.0,-0.0035600662
30699,0.0,0.48087913
30709,0.0,0.5626156
30719,0.0,0.2996096
30729,0.0,0.42358255
30739,0.0,-0.053346097
30749,0.0,0.008802414
30759,0.0,0.5167639
30769,0.0,0.891185
30779,0.0,1.1369628
30789,0.0,1.3393512
30799,0.0,1.1621742
30809,0.0,0.6855531
30819,0.0,1.1300049
30829,0.0,0.827011
30839,0.0,0.76084435
30849,0.0,0.86825854
30859,0.0,0.38257778
30869,0.0,0.18203473
30879,0.0,-0.2623844
30889,0.0,0.23850852
30899,0.0,0.07628363
30909,1.0,0.1837359
30919,1.0,0.31100184
30929,1.0,0.31805253
30939,1.0,1.0275583
30949,1.0,1.3708518
30959,1.0,1.9692061
30969,1.0,3.0621548
30979,1.0,3.4498065
30989,1.0,4.153516
30999,1.0,5.2641783
31009,1.0,5.325032
31019,1.0,6.2646203
31029,1.0,6.0725875
31039,1.0,7.1304235
31049,1.0,8.482898
31059,1.0,8.180375
31069,1.0,7.223694
31079,1.0,7.908513
31089,1.0,8.693771
31099,1.0,9.459768
31109,1.0,8.749107
31119,1.0,8.461683
31129,1.0,8.577398
31139,1.0,8.652627
31149,1.0,7.0153217
31159,1.0,5.6419573
31169,1.0,5.1514425
31179,1.0,4.058453
31189,1.0,3.409617
31199,1.0,2.8854327
31209,1.0,2.4136834
31219,1.0,2.9759724
31229,1.0,1.9648621
31239,1.0,3.1043887
31249,1.0,3.5884504
31259,1.0,5.195037
31269,1.0,5.540862
31279,1.0,6.8219457
31289,1.0,6.8263736
31299,1.0,7.713173
31309,1.0,8.422253
31319,1.0,8.794363
31329,1.0,8.738568
31339,1.0,8.610315
31349,1.0,9.702986
31359,1.0,8.330204
31369,1.0,7.2527847
31379,1.0,6.342201
31389,1.0,5.3348937
31399,1.0,5.292773
31409,1.0,4.77773
31419,1.0,5.0308795
31429,1.0,4.09297
31439,1.0,3.4692683
31449,1.0,2.320464
31459,1.0,1.9069202
31469,1.0,1.2747428
31479,1.0,1.3153319
31489,1.0,0.94718546
31499,1.0,0.7620244
31509,1.0,0.0043842793
31519,1.0,0.1304183
31529,1.0,-0.36235803
31539,0.0,-0.48528087
31549,0.0,-0.060270607
31559,0.0,-0.07035571
31569,0.0,-0.19733739
31579,0.0,-0.093805134
31589,0.0,-0.4126621
31599,0.0,-0.34090543
31609,0.0,-0.6245235
31619,0.0,-0.07509416
31629,0.0,0.06636715
31639,0.0,0.40565085
31649,0.0,0.97441936
31659,0.0,1.4984095
31669,0.0,1.8724015
31679,0.0,1.7887062
31689,0.0,2.586849
31699,0.0,3.0195749
31709,0.0,2.4786198
31719,0.0,2.4281151
31729,0.0,2.3549464
31739,0.0,3.0072951
31749,0.0,3.278235
31759,0.0,3.011092
31769,0.0,2.5340304
31779,0.0,1.716572
31789,0.0,1.6076896
31799,0.0,2.3445885
31809,0.0,3.0119946
31819,0.0,1.6488953
31829,0.0,0.9416355
31839,0.0,0.1474247
31849,0.0,-0.15435481
31859,0.0,0.33328938
31869,0.0,0.4884674
31879,0.0,1.0683092
31889,0.0,1.49613
31899,0.0,1.892901
31909,0.0,1.4715537
31919,0.0,1.4629527
31929,0.0,1.0559542
31939,0.0,1.2180752
31949,0.0,0.58023226
31959,0.0,1.2992702
31969,0.0,0.6531546
31979,0.0,0.7926136
31989,0.0,0.57476604
31999,0.0,0.8965076
32009,0.0,1.5079291
32019,0.0,0.92934096
32029,0.0,0.595332
32039,0.0,0.68148476
32049,0.0,0.11882347
32059,0.0,-0.015775442
32069,0.0,-0.06653273
32079,0.0,0.009113193
32089,0.0,0.11837077
32099,0.0,0.30720985
32109,0.0,-0.080135524
32119,0.0,0.036006927
32129,0.0,-0.33236074
32139,0.0,0.016262949
32149,0.0,0.033501446
32159,0.0,0.5371567
32169,0.0,0.23682463
32179,0.0,0.39450878
32189,0.0,0.5130763
32199,0.0,0.04796076
32209,0.0,0.28377044
32219,0.0,0.11533171
32229,0.0,-0.24093157
32239,0.0,0.49674648
32249,0.0,0.44672418
32259,0.0,0.5121797
32269,0.0,0.23357546
32279,0.0,0.08327311
32289,0.0,-0.018392384
32299,0.0,-0.11322236
32309,0.0,0.11617637
32319,0.0,-0.10839522
32329,0.0,-0.29686844
32339,0.0,-0.046717882
32349,0.0,0.10904884
32359,0.0,0.11197996
32369,0.0,-0.2937249
32379,0.0,-0.17213428
32389,0.0,-0.22112763
32399,0.0,-0.03930819
32409,0.0,0.11261088
32419,0.0,-0.35503465
32429,0.0,-0.17981821
32439,0.0,-0.21106994
32449,0.0,-0.0159415
32459,0.0,-0.21656942
32469,0.0,-0.6390083
32479,0.0,-0.53020084
32489,0.0,-0.5607501
32499,0.0,-0.13665736
32509,0.0,0.02578634
32519,0.0,0.011778474
32529,0.0,0.1950044
32539,0.0,0.0010062456
32549,0.0,0.5592081
32559,0.0,1.146544
32569,0.0,2.0600133
32579,0.0,1.8663074
32589,0.0,1.780457
32599,0.0,1.1590004
32609,0.0,1.3242648
32619,0.0,0.8588663
32629,0.0,1.5071555
32639,0.0,1.4150015
32649,0.0,1.7738149
32659,0.0,1.9648753
32669,0.0,1.8150079
32679,0.0,1.430913
32689,0.0,1.5356702
32699,0.0,1.5696476
32709,0.0,0.66420275
32719,0.0,0.583969
32729,0.0,0.075175166
32739,0.0,0.45202446
32749,0.0,-0.05935234
32759,0.0,0.01486069
32769,0.0,-0.30705422
32779,0.0,-0.06362015
32789,0.0,-0.20046306
32799,0.0,-0.16223013
32809,0.0,0.041890442
32819,0.0,-0.16526383
32829,0.0,-0.01951325
32839,0.0,0.22129321
32849,0.0,0.49648768
32859,0.0,0.78963053
32869,0.0,0.74914026
32879,0.0,0.23771715
32889,0.0,0.5346436
32899,0.0,0.9061107
32909,0.0,1.0396359
32919,0.0,0.80261624
32929,0.0,0.60032946
32939,0.0,0.7009487
32949,0.0,1.0150135
32959,0.0,1.2077572
32969,0.0,0.510411
32979,0.0,-0.059024334
32989,0.0,-0.30011803
32999,0.0,0.1907593
33009,0.0,0.09852898
33019,0.0,0.03375739
33029,0.0,-0.054620087
33039,0.0,-0.23490071
33049,0.0,-0.28076762
33059,0.0,-0.3916859
33069,0.0,-0.25495344
33079,0.0,-0.4506318
33089,0.0,0.0136742
33099,0.0,0.68759966
33109,0.0,1.340996
33119,0.0,0.826706
33129,0.0,0.7316994
33139,0.0,1.0225291
33149,0.0,0.5028329
33159,0.0,0.79285264
33169,0.0,0.3029619
33179,0.0,-0.104691386
33189,0.0,-0.46799797
33199,0.0,-0.23024273
33209,0.0,-0.009857297
33219,0.0,-0.325503
33229,0.0,-0.25147504
33239,0.0,-0.100520015
33249,0.0,-0.27273685
33259,0.0,0.2945516
33269,0.0,0.35645926
33279,0.0,0.5804542
33289,0.0,0.5649033
33299,0.0,0.98372525
33309,0.0,1.3539662
33319,0.0,2.0569243
33329,0.0,1.7137012
33339,0.0,1.4776587
33349,0.0,0.91306007
33359,0.0,0.7513862
33369,0.0,0.5550372
33379,0.0,0.19300288
33389,0.0,0.08773875
33399,0.0,0.30769503
33409,0.0,0.551613
33419,0.0,0.040339828
33429,0.0,0.39320302
33439,0.0,-0.01860714
33449,0.0,0.10185325
33459,0.0,0.40426636
33469,0.0,0.4902621
33479,0.0,0.31910247
33489,0.0,0.26361626
33499,0.0,0.1479665
33509,0.0,0.2851811
33519,0.0,0.8484754
33529,0.0,0.51786435
33539,0.0,0.46166468
33549,0.0,0.71182656
33559,0.0,0.5294105
33569,0.0,0.26359808
33579,0.0,0.10915834
33589,0.0,0.016992092
33599,0.0,0.10223222
33609,0.0,-0.108154
33619,0.0,0.07013762
33629,0.0,0.05502677
33639,0.0,0.09598738
33649,0.0,0.16883832
33659,0.0,0.32978123
33669,0.0,-0.051783264
33679,0.0,-0.028945446
33689,0.0,0.5621328
33699,0.0,-0.16883802
33709,0.0,-0.14537227
33719,0.0,-0.15516895
33729,0.0,-0.099692464
33739,0.0,0.41688335
33749,0.0,0.14039278
33759,0.0,0.020092368
33769,0.0,0.12543714
33779,0.0,0.7333479
33789,0.0,0.4456787
33799,0.0,0.31322527
33809,0.0,0.58663094
33819,0.0,0.5577592
33829,0.0,0.16714782
33839,0.0,0.3529306
33849,0.0,0.1496414
33859,0.0,-0.17297089
33869,0.0,0.07186574
33879,0.0,-0.46577603
33889,0.0,0.1666677
33899,0.0,-0.010537982
33909,0.0,-0.27356815
33919,0.0,-0.48511422
33929,0.0,-0.10009688
33939,0.0,0.0068255067
33949,0.0,-0.008599162
33959,0.0,0.4044472
33969,0.0,0.70894504
33979,0.0,0.67417157
33989,0.0,0.7936499
33999,0.0,0.52953136
34009,0.0,0.56457186
34019,0.0,0.48759562
34029,0.0,0.34506285
34039,0.0,0.258497
34049,0.0,0.4083184
34059,0.0,0.080246866
34069,0.0,0.37412417
34079,0.0,0.15304178
34089,0.0,0.10888654
34099,0.0,-0.5481993
34109,0.0,-0.42690474
34119,0.0,-0.15707606
34129,1.0,0.23990613
34139,1.0,0.20309788
34149,1.0,0.6574864
34159,1.0,0.9577177
34169,1.0,0.68788695
34179,1.0,1.2700008
34189,1.0,1.1423233
34199,1.0,1.7399565
34209,1.0,2.04004
34219,1.0,2.2430964
34229,1.0,2.527978
34239,1.0,3.5324419
34249,1.0,3.894246
34259,1.0,4.1905193
34269,1.0,4.7272224
34279,1.0,5.0292144
34289,1.0,5.486101
34299,1.0,6.278717
34309,1.0,7.2796154
34319,1.0,8.2965975
34329,1.0,8.486206
34339,1.0,8.704638
34349,1.0,8.828626
34359,1.0,8.971563
34369,1.0,8.2677765
34379,1.0,7.5847054
34389,1.0,6.162827
34399,1.0,4.5485263
34409,1.0,4.156121
34419,1.0,2.9681315
34429,1.0,2.5759883
34439,1.0,2.4472404
34449,1.0,2.035423
34459,1.0,1.5714967
34469,1.0,1.9703057
34479,1.0,2.7405927
34489,1.0,3.5957766
34499,1.0,4.4480753
34509,1.0,5.6048555
34519,1.0,6.703001
34529,1.0,7.5737467
34539,1.0,8.61954
34549,1.0,8.572662
34559,1.0,8.734062
34569,1.0,8.450889
34579,1.0,8.745396
34589,1.0,8.864161
34599,1.0,7.5007987
34609,1.0,6.429186
34619,1.0,5.240906
34629,1.0,4.855396
34639,1.0,4.326544
34649,1.0,3.7785695
34659,1.0,3.3926053
34669,1.0,3.0256908
34679,1.0,2.57116
34689,1.0,2.3146362
34699,1.0,2.3007383
34709,1.0,1.8984339
34719,1.0,1.385931
34729,1.0,1.204196
34739,1.0,0.2641548
34749,1.0,-0.14456975
34759,1.0,0.012440443
34769,0.0,-0.25702405
34779,0.0,-0.21874726
34789,0.0,-0.14735705
34799,0.0,0.21706778
34809,0.0,0.17436314
34819,0.0,-0.20300078
34829,0.0,0.2842577
34839,0.0,0.02097094
34849,0.0,0.032240927
34859,0.0,-0.38067937
34869,0.0,-0.09349549
34879,0.0,-0.26994294
34889,0.0,-0.41815478
34899,0.0,-0.09175879
34909,0.0,-0.06896043
34919,0.0,0.00086063147
34929,0.0,0.18295223
34939,0.0,-0.15180635
34949,0.0,-0.12918198
34959,0.0,-0.20014167
34969,0.0,-0.3308574
34979,0.0,-0.6949401
34989,0.0,-0.19721198
34999,0.0,-0.19240141
35009,0.0,0.5866895
35019,0.0,0.29572982
35029,0.0,0.05398065
35039,0.0,0.12598222
35049,0.0,0.32803565
35059,0.0,0.22749561
35069,0.0,0.5988708
35079,0.0,0.57882017
35089,0.0,0.1737504
35099,0.0,1.0307014
35109,0.0,0.5036543
35119,0.0,0.43413424
35129,0.0,0.17293525
35139,0.0,0.2865302
35149,0.0,0.3528294
35159,0.0,1.062844
35169,0.0,0.8467121
35179,0.0,1.104799
35189,0.0,0.55659527
35199,0.0,0.31322026
35209,0.0,0.73779863
35219,0.0,0.82067823
35229,0.0,0.7439989
35239,0.0,-0.04129523
35249,0.0,0.14238012
35259,0.0,0.28424734
35269,0.0,0.17449725
35279,0.0,0.0973376
35289,0.0,0.056893647
35299,0.0,0.09754723
35309,0.0,0.13754737
35319,0.0,0.242998
35329,0.0,0.1088649
35339,0.0,0.2689005
35349,0.0,0.87957156
35359,0.0,1.5982927
35369,0.0,1.8504353
35379,0.0,1.5574015
35389,0.0,1.4004717
35399,0.0,1.5100933
35409,0.0,1.7919226
35419,0.0,1.9498403
35429,0.0,2.128393
35439,0.0,1.1267304
35449,0.0,1.214898
35459,0.0,0.80554724
35469,0.0,0.6807685
35479,0.0,0.6104997
35489,0.0,0.5250849
35499,0.0,0.015304089
35509,0.0,0.44462264
35519,0.0,-0.011769593
35529,0.0,0.034182847
35539,0.0,0.37278086
35549,0.0,0.8541281
35559,0.0,1.0632706
35569,0.0,1.7877376
35579,0.0,1.8094877
35589,0.0,2.149961
35599,0.0,2.7283144
35609,0.0,3.45051
35619,0.0,3.163835
35629,0.0,3.5664268
35639,0.0,2.9766674
35649,0.0,2.7839131
35659,0.0,1.8093393
35669,0.0,2.0071652
35679,0.0,2.812152
35689,0.0,2.7592425
35699,0.0,1.8585868
35709,0.0,1.024841
35719,0.0,1.1490974
35729,0.0,0.7441823
35739,0.0,-0.22296649
35749,0.0,-0.27261162
35759,0.0,-0.48356676
35769,0.0,-0.1935966
35779,0.0,-0.35141432
35789,0.0,0.23869205
35799,0.0,0.24137568
35809,0.0,0.54320997
35819,0.0,0.65008086
35829,0.0,0.71834433
35839,0.0,1.0658392
35849,0.0,1.0790637
35859,0.0,1.6036494
35869,0.0,2.2316508
35879,0.0,2.5479913
35889,0.0,3.210256
35899,0.0,2.5909774
35909,0.0,2.9124246
35919,0.0,4.410135
35929,0.0,3.5877616
35939,0.0,3.566741
35949,0.0,2.5802453
35959,0.0,2.3149216
35969,0.0,2.2633986
35979,0.0,1.7010982
35989,0.0,0.886531
35999,0.0,1.7829391
36009,0.0,1.3049688
36019,0.0,1.780141
36029,0.0,1.8194978
36039,0.0,1.2414333
36049,0.0,2.1759868
36059,0.0,1.9454083
36069,0.0,1.5135746
36079,0.0,0.8373486
36089,0.0,0.13642573
36099,0.0,-0.038142204
36109,0.0,-0.005019903
36119,0.0,-0.80517906
36129,0.0,-0.4974634
36139,0.0,-0.2633741
36149,0.0,-0.4200418
36159,0.0,-0.2402699
36169,0.0,0.16772193
36179,0.0,0.31447697
36189,0.0,0.029797673
36199,0.0,0.3307861
36209,0.0,0.4510942
36219,0.0,0.53623146
36229,0.0,0.43362772
36239,0.0,1.003273
36249,0.0,0.6715316
36259,0.0,1.0448581
36269,0.0,1.5854985
36279,0.0,1.168699
36289,0.0,1.1324
36299,0.0,0.63442224
36309,0.0,0.74379736
36319,0.0,0.4223563
36329,0.0,0.37130898
36339,0.0,-0.11853349
36349,0.0,-0.18967801
36359,0.0,0.10402238
36369,0.0,0.19347465
36379,0.0,0.4465418
36389,0.0,1.1561291
36399,0.0,1.350187
36409,0.0,1.7412058
36419,0.0,1.5929105
36429,0.0,2.3481565
36439,0.0,1.3416836
36449,0.0,0.7676468
36459,0.0,0.7214024
36469,0.0,0.8918943
36479,0.0,0.70432854
36489,0.0,0.51857114
36499,0.0,-0.36045706
36509,0.0,-0.199826
36519,0.0,-0.48445553
36529,0.0,-0.40109736
36539,0.0,-0.1692872
36549,0.0,-0.49207163
36559,0.0,-0.36387336
36569,0.0,-0.761211
36579,0.0,-0.5743522
36589,0.0,-0.46223122
36599,0.0,-0.011351585
36609,0.0,0.6900865
36619,0.0,0.36229962
36629,0.0,0.8277744
36639,0.0,0.66642785
36649,0.0,0.6806751
36659,0.0,0.45852125
36669,0.0,0.45023566
36679,0.0,0.36231846
36689,0.0,0.4641763
36699,0.0,0.14058083
36709,0.0,-0.41461754
36719,0.0,-0.39300966
36729,0.0,-0.18674177
36739,0.0,-0.35570896
36749,0.0,-0.23153174
36759,0.0,-0.374107
36769,0.0,-0.05120313
36779,0.0,-0.20613867
36789,0.0,-0.25735968
36799,0.0,0.15875107
36809,0.0,0.63686717
36819,0.0,-0.06832188
36829,0.0,0.10791355
36839,0.0,0.09073901
36849,0.0,0.280693
36859,0.0,0.74369544
36869,0.0,0.6288176
36879,0.0,0.80539966
36889,0.0,0.8209732
36899,0.0,0.23068589
36909,0.0,0.4117573
36919,0.0,-0.28937274
36929,0.0,0.21905684
36939,0.0,0.35014528
36949,0.0,0.42278516
36959,0.0,0.4489764
36969,0.0,-0.0017575622
36979,0.0,0.09473336
36989,0.0,0.5311722
36999,0.0,0.77741396
37009,0.0,0.7738912
37019,0.0,0.42077035
37029,0.0,0.46629262
37039,0.0,0.3390991
37049,0.0,0.0021197796
37059,0.0,0.37678027
37069,0.0,0.43607658
37079,0.0,-0.16274631
37089,0.0,0.075351715
37099,0.0,-0.028737962
37109,0.0,0.28489745
37119,0.0,-0.21642214
37129,0.0,0.29918087
37139,0.0,0.37140405
37149,0.0,0.35760707
37159,0.0,0.5665368
37169,0.0,0.82182366
37179,0.0,0.94845515
37189,0.0,1.020559
37199,0.0,1.4281688
37209,0.0,0.5872649
37219,0.0,0.2882797
37229,0.0,0.10297334
37239,0.0,-0.010893285
37249,0.0,0.24158049
37259,0.0,0.429357
37269,0.0,0.43462622
37279,0.0,-0.09670293
37289,0.0,-0.050772607
37299,0.0,0.0476135
37309,0.0,-0.058580816
37319,0.0,-0.18855631
37329,0.0,0.22800034
37339,0.0,0.06460273
37349,0.0,0.25094688
37359,1.0,0.08416271
37369,1.0,-0.23580354
37379,1.0,0.7496072
37389,1.0,0.51764226
37399,1.0,1.245292
37409,1.0,1.1634121
37419,1.0,1.5035001
37429,1.0,1.8262694
37439,1.0,2.4262536
37449,1.0,2.7384639
37459,1.0,3.2515526
37469,1.0,3.7681637
37479,1.0,4.354405
37489,1.0,4.594509
37499,1.0,5.628929
37509,1.0,5.7670927
37519,1.0,7.042473
37529,1.0,8.540818
37539,1.0,9.208496
37549,1.0,9.632475
37559,1.0,8.535894
37569,1.0,8.668789
37579,1.0,8.8505535
37589,1.0,8.567366
37599,1.0,7.9491615
37609,1.0,6.212689
37619,1.0,5.3904734
37629,1.0,3.6642776
37639,1.0,3.5870314
37649,1.0,2.49973
37659,1.0,1.6452374
37669,1.0,1.6198412
37679,1.0,1.3251454
37689,1.0,1.2336445
37699,1.0,1.412308
37709,1.0,2.5447052
37719,1.0,3.769403
37729,1.0,4.602317
37739,1.0,5.595598
37749,1.0,7.255103
37759,1.0,8.479358
37769,1.0,8.798143
37779,1.0,8.569565
37789,1.0,8.745928
37799,1.0,8.63586
37809,1.0,8.633472
37819,1.0,7.693042
37829,1.0,6.673118
37839,1.0,6.399806
37849,1.0,5.5833974
37859,1.0,4.735747
37869,1.0,4.8952436
37879,1.0,3.749355
37889,1.0,2.7155352
37899,1.0,2.3997707
37909,1.0,2.1619072
37919,1.0,1.8879411
37929,1.0,1.4698434
37939,1.0,1.3035798
37949,1.0,0.91906184
37959,1.0,1.079148
37969,1.0,0.2893098
37979,1.0,0.47248453
37989,1.0,0.12215537
37999,0.0,0.2713511
38009,0.0,0.46797103
38019,0.0,0.40182006
38029,0.0,0.21747965
38039,0.0,0.6524123
38049,0.0,0.9898188
38059,0.0,1.0639371
38069,0.0,1.4660137
38079,0.0,1.3855138
38089,0.0,1.4289633
38099,0.0,1.3031358
38109,0.0,1.9009855
38119,0.0,1.3569161
38129,0.0,1.4132146
38139,0.0,1.6635518
38149,0.0,2.1799293
38159,0.0,3.2830813
38169,0.0,3.16428
38179,0.0,3.3438818
38189,0.0,2.8071349
38199,0.0,2.6694858
38209,0.0,1.9437292
38219,0.0,1.4868984
38229,0.0,1.4245477
38239,0.0,1.3012435
38249,0.0,1.453041
38259,0.0,0.79145414
38269,0.0,0.43781793
38279,0.0,0.20213377
38289,0.0,0.38735706
38299,0.0,0.4015501
38309,0.0,0.15322322
38319,0.0,0.058309734
38329,0.0,0.6919478
38339,0.0,0.15074408
38349,0.0,0.14174092
38359,0.0,0.19573951
38369,0.0,-0.107605636
38379,0.0,-0.29953706
38389,0.0,-0.4753198
38399,0.0,-0.43244165
38409,0.0,-0.5801541
38419,0.0,-0.42905504
38429,0.0,-0.3229357
38439,0.0,-0.5962261
38449,0.0,-0.4720555
38459,0.0,-0.83357817
38469,0.0,-0.5030024
38479,0.0,-1.012537
38489,0.0,-0.3948576
38499,0.0,-0.20552415
38509,0.0,0.12077075
38519,0.0,0.1286009
38529,0.0,0.26343292
38539,0.0,0.6791967
38549,0.0,0.705459
38559,0.0,0.5735329
38569,0.0,0.20666087
38579,0.0,-0.2424401
38589,0.0,-0.31370693
38599,0.0,0.37481958
38609,0.0,0.0108962655
38619,0.0,0.5302886
38629,0.0,0.20252484
38639,0.0,0.30053157
38649,0.0,-0.011570156
38659,0.0,-0.10908961
38669,0.0,0.033581376
38679,0.0,-0.0994221
38689,0.0,0.024681747
38699,0.0,0.18847573
38709,0.0,0.29655182
38719,0.0,0.21953028
38729,0.0,0.40003663
38739,0.0,1.0249152
38749,0.0,1.0135194
38759,0.0,0.4562807
38769,0.0,0.038804293
38779,0.0,-1.3232231e-05
38789,0.0,-0.11503363
38799,0.0,0.0069455504
38809,0.0,0.97231954
38819,0.0,0.7883567
38829,0.0,0.9845938
38839,0.0,1.1615982
38849,0.0,1.0189159
38859,0.0,0.7541025
38869,0.0,0.66783625
38879,0.0,0.50888103
38889,0.0,0.49754232
38899,0.0,0.4475463
38909,0.0,0.60674
38919,0.0,0.5100165
38929,0.0,0.1146971
38939,0.0,0.04601276
38949,0.0,-0.15756643
38959,0.0,0.3606649
38969,0.0,-0.19628978
38979,0.0,-0.24566984
38989,0.0,-0.59343815
38999,0.0,-0.3155926
39009,0.0,-0.551754
39019,0.0,-0.74362737
39029,0.0,-0.16391444
39039,0.0,-0.21136999
39049,0.0,-0.1608187
39059,0.0,0.08989948
39069,0.0,0.13292259
39079,0.0,0.16103595
39089,0.0,0.36742508
39099,0.0,0.54567933
39109,0.0,0.8823278
39119,0.0,0.90500873
39129,0.0,1.8826759
39139,0.0,2.047135
39149,0.0,2.4312873
39159,0.0,3.6479232
39169,0.0,4.4633446
39179,0.0,4.47536
39189,0.0,5.37554
39199,0.0,4.9076376
39209,0.0,3.5387735
39219,0.0,3.5451257
39229,0.0,3.2521555
39239,0.0,3.0044608
39249,0.0,2.36935
39259,0.0,2.8059146
39269,0.0,1.517848
39279,0.0,1.4080217
39289,0.0,1.3905766
39299,0.0,0.6459071
39309,0.0,0.625231
39319,0.0,0.81748205
39329,0.0,0.5555531
39339,0.0,0.00076305866
39349,0.0,0.24740094
39359,0.0,0.37681895
39369,0.0,0.21501756
39379,0.0,0.38033324
39389,0.0,0.55558825
39399,0.0,0.69705045
39409,0.0,-0.012739718
39419,0.0,0.12279141
39429,0.0,0.04275471
39439,0.0,-0.17674398
39449,0.0,0.35188216
39459,0.0,0.21085203
39469,0.0,-0.11624354
39479,0.0,-0.44796038
39489,0.0,-0.36553597
39499,0.0,-0.08430934
39509,0.0,-0.11346352
39519,0.0,-0.03181255
39529,0.0,0.25465614
39539,0.0,-0.042339444
39549,0.0,0.038253784
39559,0.0,0.3631717
39569,0.0,0.47694713
39579,0.0,0.5716649
39589,0.0,0.8087605
39599,0.0,0.4963972
39609,0.0,0.2289052
39619,0.0,0.114126444
39629,0.0,0.2119224
39639,0.0,-0.063402176
39649,0.0,0.066586375
39659,0.0,0.45170784
39669,0.0,0.49038404
39679,0.0,0.83053505
39689,0.0,1.1657674
39699,0.0,0.9268841
39709,0.0,0.40252477
39719,0.0,0.47693175
39729,0.0,0.5006747
39739,0.0,0.47113746
39749,0.0,-0.020829618
39759,0.0,0.14850521
39769,0.0,-0.28184676
39779,0.0,0.4661001
39789,0.0,-0.18212998
39799,0.0,0.57122236
39809,0.0,0.68155026
39819,0.0,0.84415954
39829,0.0,1.0710845
39839,0.0,0.04034841
39849,0.0,-0.13928479
39859,0.0,0.18964356
39869,0.0,-0.4583919
39879,0.0,-0.1381725
39889,0.0,-0.06649244
39899,0.0,-0.30094284
39909,0.0,-0.2307918
39919,0.0,-0.13684773
39929,0.0,0.24221182
39939,0.0,0.28933543
39949,0.0,0.36848527
39959,0.0,0.09523928
39969,0.0,0.067311585
39979,0.0,-0.066482484
39989,0.0,-0.007859111
39999,0.0,0.11245239
40009,0.0,0.26722682
40019,0.0,0.09968233
40029,0.0,0.18468082
40039,0.0,-0.46618342
40049,0.0,-0.15936875
40059,0.0,-0.22681963
40069,0.0,-0.4387737
40079,0.0,0.044119656
40089,0.0,-0.162978
40099,0.0,-0.5208424
40109,0.0,-0.68497133
40119,0.0,-0.30489576
40129,0.0,-0.29880685
40139,0.0,-0.728279
40149,0.0,-0.45108938
40159,0.0,-0.20716828
40169,0.0,-0.22025925
40179,0.0,-0.071851075
40189,0.0,-0.46463448
40199,0.0,-0.5074697
40209,0.0,-0.4888788
40219,0.0,-0.45471466
40229,0.0,-0.2619496
40239,0.0,-0.052304745
40249,0.0,0.34567297
40259,0.0,0.03204602
40269,0.0,0.20348626
40279,0.0,-0.14728004
40289,0.0,0.017835975
40299,0.0,-0.23162997
40309,0.0,-0.4924531
40319,0.0,-0.39331764
40329,0.0,-0.085760176
40339,0.0,-0.47079057
40349,0.0,-0.12520659
40359,0.0,-0.19186342
40369,0.0,0.1670472
40379,0.0,0.0075434446
40389,0.0,-0.124560535
40399,0.0,-0.29187298
40409,0.0,-0.014635503
40419,0.0,-0.05890596
40429,0.0,-0.008924067
40439,0.0,0.033454537
40449,0.0,0.274283
40459,0.0,0.5509822
40469,0.0,0.49840897
40479,0.0,0.54849756
40489,0.0,0.5572108
40499,0.0,0.4789837
40509,0.0,0.36671603
40519,0.0,0.1319173
40529,0.0,-0.27161902
40539,0.0,-0.5705446
40549,0.0,-0.005175948
40559,0.0,0.03543073
40569,0.0,0.26314342
40579,1.0,-0.102288544
40589,1.0,-0.1389088
40599,1.0,0.35086346
40609,1.0,1.10673
40619,1.0,1.3882598
40629,1.0,1.5932819
40639,1.0,2.0561326
40649,1.0,2.5651112
40659,1.0,3.0798395
40669,1.0,4.9744153
40679,1.0,5.190074
40689,1.0,5.797801
40699,1.0,5.710758
40709,1.0,6.269575
40719,1.0,6.8293743
40729,1.0,7.320533
40739,1.0,8.253046
40749,1.0,8.665312
40759,1.0,8.810417
40769,1.0,9.617153
40779,1.0,8.869395
40789,1.0,8.654247
40799,1.0,8.682852
40809,1.0,8.448904
40819,1.0,8.609542
40829,1.0,6.940313
40839,1.0,6.085457
40849,1.0,4.3315487
40859,1.0,3.6154604
40869,1.0,1.6570636
40879,1.0,1.3391614
40889,1.0,1.3289539
40899,1.0,1.18792
40909,1.0,0.84407294
40919,1.0,1.212223
40929,1.0,2.3567588
40939,1.0,3.7904875
40949,1.0,4.5786066
40959,1.0,5.6291924
40969,1.0,6.80526
40979,1.0,8.500622
40989,1.0,8.660252
40999,1.0,8.641364
41009,1.0,8.553986
41019,1.0,8.642413
41029,1.0,10.135603
41039,1.0,8.4085455
41049,1.0,7.2302017
41059,1.0,6.649135
41069,1.0,6.1242304
41079,1.0,5.5340242
41089,1.0,4.56903
41099,1.0,3.9873786
41109,1.0,3.3650455
41119,1.0,3.4742002
41129,1.0,3.3151982
41139,1.0,2.673673
41149,1.0,1.9174395
41159,1.0,0.9646688
41169,1.0,1.3543084
41179,1.0,0.858921
41189,1.0,0.7543899
41199,1.0,0.48239672
41209,1.0,-0.059046924
41219,0.0,-0.20581073
41229,0.0,0.077050924
41239,0.0,0.10519016
41249,0.0,0.03483945
41259,0.0,0.027840018
41269,0.0,0.114358544
41279,0.0,0.43634188
41289,0.0,0.41685653
41299,0.0,0.018999696
41309,0.0,0.0033323765
41319,0.0,0.023213983
41329,0.0,-0.30413568
41339,0.0,-0.22879833
41349,0.0,-0.39495462
41359,0.0,-0.3797081
41369,0.0,-0.25922298
41379,0.0,-0.47505325
41389,0.0,0.04181564
41399,0.0,0.17455566
41409,0.0,0.4241222
41419,0.0,0.2640376
41429,0.0,0.004158616
41439,0.0,-0.17667508
41449,0.0,0.10015911
41459,0.0,-0.0013225079
41469,0.0,0.044616163
41479,0.0,0.5896023
41489,0.0,1.2565229
41499,0.0,1.2383003
41509,0.0,1.2218626
41519,0.0,1.0400472
41529,0.0,0.18523496
41539,0.0,0.2799002
41549,0.0,0.6232031
41559,0.0,1.0608983
41569,0.0,0.8785226
41579,0.0,0.5362548
41589,0.0,-0.019393086
41599,0.0,-0.45530564
41609,0.0,-0.49905068
41619,0.0,-0.30203766
41629,0.0,-0.5750643
41639,0.0,0.06514943
41649,0.0,-0.3248691
41659,0.0,-0.31149876
41669,0.0,-0.41210943
41679,0.0,-0.11406487
41689,0.0,-0.16259551
41699,0.0,-0.2898686
41709,0.0,0.13636512
41719,0.0,0.34867513
41729,0.0,0.29307634
41739,0.0,0.26006216
41749,0.0,0.52552795
41759,0.0,1.0130405
41769,0.0,1.0941923
41779,0.0,0.49676538
41789,0.0,0.5508414
41799,0.0,0.28822517
41809,0.0,0.32355177
41819,0.0,0.48060715
41829,0.0,0.7313497
41839,0.0,1.1819644
41849,0.0,0.8408848
41859,0.0,1.2600548
41869,0.0,1.4810855
41879,0.0,1.2453794
41889,0.0,0.78007704
41899,0.0,0.3853402
41909,0.0,0.46024317
41919,0.0,-0.0838545
41929,0.0,0.1546883
41939,0.0,-0.010654271
41949,0.0,0.13341248
41959,0.0,0.04856205
41969,0.0,-0.19864601
41979,0.0,-0.2607897
41989,0.0,-0.36338377
41999,0.0,-0.22129369
42009,0.0,-0.26479048
42019,0.0,-0.55361265
42029,0.0,-0.4999829
42039,0.0,0.09804815
42049,0.0,0.67819375
42059,0.0,0.7517929
42069,0.0,0.80655485
42079,0.0,1.1239578
42089,0.0,1.4916096
42099,0.0,1.4616675
42109,0.0,1.4363339
42119,0.0,1.9615868
42129,0.0,1.1390786
42139,0.0,1.522604
42149,0.0,1.5821868
42159,0.0,1.9467301
42169,0.0,1.4648447
42179,0.0,1.3400602
42189,0.0,0.86748976
42199,0.0,0.7991014
42209,0.0,1.2450681
42219,0.0,1.1742475
42229,0.0,0.39409548
42239,0.0,0.17502195
42249,0.0,-0.3316031
42259,0.0,0.31809378
42269,0.0,0.08145523
42279,0.0,0.19164705
42289,0.0,0.065329015
42299,0.0,-0.24835634
42309,0.0,-0.20406222
42319,0.0,0.15196294
42329,0.0,-0.060171247
42339,0.0,0.056909084
42349,0.0,-0.024252057
42359,0.0,0.21792573
42369,0.0,0.11508018
42379,0.0,0.2812323
42389,0.0,-0.20584732
42399,0.0,-0.2592063
42409,0.0,0.27932674
42419,0.0,-0.095864594
42429,0.0,0.06547701
42439,0.0,0.32871717
42449,0.0,0.22375792
42459,0.0,0.05683887
42469,0.0,-0.5681556
42479,0.0,-0.54433286
42489,0.0,-0.22786164
42499,0.0,-0.045753956
42509,0.0,-0.26124853
42519,0.0,0.046486795
42529,0.0,-0.12428349
42539,0.0,-0.579742
42549,0.0,0.018714547
42559,0.0,0.34239233
42569,0.0,0.20503414
42579,0.0,0.034704626
42589,0.0,0.0040305853
42599,0.0,0.062005103
42609,0.0,-0.47782898
42619,0.0,-0.42934018
42629,0.0,-0.48681545
42639,0.0,-0.37695622
42649,0.0,-0.19690764
42659,0.0,-0.71332306
42669,0.0,-0.58036625
42679,0.0,-0.39492023
42689,0.0,-0.4840966
42699,0.0,-0.48405355
42709,0.0,-0.2946725
42719,0.0,-0.19446313
42729,0.0,0.17849189
42739,0.0,0.04705149
42749,0.0,0.3755027
42759,0.0,0.3123619
42769,0.0,0.47533768
42779,0.0,0.17556906
42789,0.0,-0.106939256
42799,0.0,-0.36525053
42809,0.0,-0.4551947
42819,0.0,-0.78607595
42829,0.0,-0.5412579
42839,0.0,-0.2627005
42849,0.0,-0.054591835
42859,0.0,-0.18177992
42869,0.0,-0.3930686
42879,0.0,-0.124263525
42889,0.0,-0.088761985
42899,0.0,-0.095493734
42909,0.0,-0.011410058
42919,0.0,0.3679515
42929,0.0,0.5651806
42939,0.0,1.0463495
42949,0.0,1.144201
42959,0.0,1.9211886
42969,0.0,3.2018282
42979,0.0,3.1710334
42989,0.0,2.4140596
42999,0.0,2.3737192
43009,0.0,2.0782065
43019,0.0,1.7146554
43029,0.0,0.9562738
43039,0.0,0.59186375
43049,0.0,0.45930815
43059,0.0,0.3952391
43069,0.0,0.39504004
43079,0.0,0.5185891
43089,0.0,0.758415
