T,S,Score
399,0.0,0.54596984
409,0.0,0.2870226
419,0.0,-0.043735385
429,0.0,0.1712786
439,0.0,0.0139911175
449,0.0,0.062342882
459,0.0,0.38271284
469,0.0,-0.08325189
479,0.0,0.28225762
489,0.0,-0.06652945
499,0.0,-0.44650286
509,0.0,-0.28223544
519,0.0,-0.2732526
529,0.0,-0.301207
539,0.0,-0.46492475
549,0.0,-0.64080805
559,0.0,-0.37154895
569,0.0,-0.35438842
579,0.0,-0.35006142
589,0.0,-0.5168285
599,0.0,-0.46072465
609,0.0,-0.9262995
619,0.0,-0.45910585
629,0.0,-0.9520259
639,0.0,-0.54707795
649,0.0,-0.46058923
659,0.0,-0.5111854
669,0.0,-0.20963275
679,0.0,-0.7200316
689,0.0,-0.19703251
699,0.0,-0.33571047
709,0.0,-0.31959587
719,0.0,-0.590258
729,0.0,-0.69185686
739,0.0,-0.42644292
749,0.0,-0.52419424
759,0.0,-0.5262018
769,0.0,-0.9586791
779,0.0,-0.584452
789,0.0,-0.7015924
799,0.0,-0.49771047
809,0.0,-0.24999487
819,0.0,-0.37270564
829,0.0,-0.26042402
839,0.0,-0.5367108
849,0.0,-0.30889875
859,0.0,-0.047639847
869,0.0,0.18247277
879,0.0,-0.18214262
889,0.0,0.050522804
899,0.0,-0.19784272
909,0.0,-0.089196205
919,0.0,-0.6129411
929,0.0,-0.41614187
939,0.0,-0.6039105
949,0.0,-0.1407175
959,0.0,-0.005184412
969,0.0,-0.20351708
979,0.0,0.18639451
989,0.0,0.11711609
999,0.0,0.24063718
1009,0.0,0.78090227
1019,0.0,0.96674454
1029,0.0,0.7444766
1039,0.0,0.54381496
1049,0.0,0.2755611
1059,0.0,0.3012073
1069,0.0,-0.05276817
1079,0.0,-0.037355065
1089,0.0,-0.3481897
1099,0.0,-0.3093242
1109,0.0,-0.41417164
1119,0.0,-0.6042299
1129,0.0,-0.23048592
1139,0.0,-0.5878895
1149,0.0,-0.08905023
1159,0.0,-0.26782197
1169,0.0,-0.20933199
1179,0.0,-0.41058427
1189,0.0,-0.11383283
1199,0.0,-0.3043186
1209,0.0,0.20398664
1219,0.0,0.5594076
1229,0.0,0.5057306
1239,0.0,0.5110241
1249,0.0,-0.050881147
1259,0.0,-0.108282804
1269,0.0,-0.14321953
1279,0.0,-0.14495373
1289,0.0,-0.102407336
1299,0.0,0.013847232
1309,0.0,0.082582355
1319,0.0,0.2528581
1329,0.0,-0.0051280856
1339,0.0,0.1143496
1349,0.0,0.11351687
1359,0.0,0.20229638
1369,0.0,-0.09893972
1379,0.0,-0.032921314
1389,0.0,0.20241845
1399,0.0,0.203709
1409,0.0,0.09923077
1419,0.0,0.19748014
1429,0.0,0.8221967
1439,0.0,0.5723734
1449,1.0,0.44307023
1459,1.0,0.12031376
1469,1.0,0.66547287
1479,1.0,0.4583302
1489,1.0,0.7742105
1499,1.0,1.3280408
1509,1.0,1.6434975
1519,1.0,2.1184258
1529,1.0,2.334945
1539,1.0,2.8411388
1549,1.0,3.4927397
1559,1.0,3.6487992
1569,1.0,4.051896
1579,1.0,4.6218333
1589,1.0,5.217887
1599,1.0,5.9106603
1609,1.0,6.8830957
1619,1.0,7.3187246
1629,1.0,7.793495
1639,1.0,8.683053
1649,1.0,8.715057
1659,1.0,8.487581
1669,1.0,8.50247
1679,1.0,8.630335
1689,1.0,9.606009
1699,1.0,9.208392
1709,1.0,7.0773373
1719,1.0,5.7585955
1729,1.0,4.3697996
1739,1.0,2.6060941
1749,1.0,1.680127
1759,1.0,1.1143669
1769,1.0,0.430699
1779,1.0,0.5064218
1789,1.0,0.512414
1799,1.0,0.7566251
1809,1.0,1.2902547
1819,1.0,2.478499
1829,1.0,3.2361944
1839,1.0,4.6533136
1849,1.0,5.8865595
1859,1.0,6.713472
1869,1.0,9.047469
1879,1.0,10.201048
1889,1.0,9.882736
1899,1.0,8.632165
1909,1.0,8.477847
1919,1.0,8.5654745
1929,1.0,9.161415
1939,1.0,7.3765163
1949,1.0,6.792364
1959,1.0,5.9958525
1969,1.0,5.7868843
1979,1.0,4.635972
1989,1.0,4.3040886
1999,1.0,3.8061883
2009,1.0,3.387141
2019,1.0,3.115884
2029,1.0,2.5022902
2039,1.0,2.2248325
2049,1.0,1.7474725
2059,1.0,1.3527551
2069,1.0,0.66312075
2079,1.0,0.36450422
2089,1.0,0.5721663
2099,1.0,0.02048409
2109,1.0,-0.13173193
2119,0.0,-0.13087761
2129,0.0,-0.1867339
2139,0.0,-0.016452074
2149,0.0,-0.11458224
2159,0.0,0.0868395
2169,0.0,-0.6093554
2179,0.0,-0.16280675
2189,0.0,-0.45271736
2199,0.0,-0.3452738
2209,0.0,-0.006639838
2219,0.0,-0.32187968
2229,0.0,-0.4520113
2239,0.0,-0.39866388
2249,0.0,-0.2781582
2259,0.0,-0.28721023
2269,0.0,-0.15775633
2279,0.0,0.20380718
2289,0.0,-0.20916659
2299,0.0,0.37692672
2309,0.0,0.3609962
2319,0.0,0.5553608
2329,0.0,0.49632764
2339,0.0,0.88278604
2349,0.0,0.47258216
2359,0.0,0.848951
2369,0.0,1.0554024
2379,0.0,0.7748939
2389,0.0,0.40360606
2399,0.0,0.9874845
2409,0.0,0.56203467
2419,0.0,0.23441476
2429,0.0,0.32777154
2439,0.0,0.37368703
2449,0.0,-0.13978952
2459,0.0,-0.10704923
2469,0.0,-0.12701553
2479,0.0,-0.010666549
2489,0.0,-0.056916058
2499,0.0,-0.35692638
2509,0.0,-0.3438791
2519,0.0,-0.41581845
2529,0.0,-0.6055832
2539,0.0,0.01953417
2549,0.0,-0.18064362
2559,0.0,-0.27394348
2569,0.0,-0.79029965
2579,0.0,-0.006799221
2589,0.0,-0.41249496
2599,0.0,-0.5176402
2609,0.0,-0.024782598
2619,0.0,-0.09660137
2629,0.0,-0.3147571
2639,0.0,-0.32576495
2649,0.0,-0.5947632
2659,0.0,-0.3032148
2669,0.0,-0.075443864
2679,0.0,-0.57508385
2689,0.0,-0.61596745
2699,0.0,-0.4870491
2709,0.0,-0.4291715
2719,0.0,-0.44927663
2729,0.0,-0.22002488
2739,0.0,-0.014468312
2749,0.0,-0.109315395
2759,0.0,-0.05735302
2769,0.0,-0.5160789
2779,0.0,-0.21716511
2789,0.0,-0.7115873
2799,0.0,-0.40964246
2809,0.0,-0.23557407
2819,0.0,-0.206972
2829,0.0,0.016776562
2839,0.0,-0.07754934
2849,0.0,0.010191917
2859,0.0,0.10782844
2869,0.0,-0.15189928
2879,0.0,-0.1919688
2889,0.0,-0.4837215
2899,0.0,-0.13753468
2909,0.0,-0.32803315
2919,0.0,-0.42660624
2929,0.0,0.011612773
2939,0.0,-0.23215723
2949,0.0,-0.101753354
2959,0.0,-0.2589509
2969,0.0,-0.08724105
2979,0.0,0.13993078
2989,0.0,-0.25328946
2999,0.0,-0.51481843
3009,0.0,-0.7701784
3019,0.0,-0.20449579
3029,0.0,-0.4291972
3039,0.0,0.152049
3049,0.0,0.036946177
3059,0.0,-0.2167356
3069,0.0,-0.3043012
3079,0.0,-0.4202448
3089,0.0,-0.3538167
3099,0.0,-0.34739262
3109,0.0,-0.3518383
3119,0.0,-0.58646923
3129,0.0,-0.27176905
3139,0.0,-0.011214495
3149,0.0,-0.5341768
3159,0.0,-0.59156746
3169,0.0,-0.6978056
3179,0.0,-0.6613945
3189,0.0,-0.4388736
3199,0.0,-0.77379453
3209,0.0,-0.3635953
3219,0.0,-0.26600552
3229,0.0,-0.37896937
3239,0.0,-0.087902665
3249,0.0,-0.043261588
3259,0.0,-0.21722317
3269,0.0,-0.04803717
3279,0.0,-0.1065287
3289,0.0,-0.05957383
3299,0.0,-0.20170087
3309,0.0,-0.13453531
3319,0.0,-0.20030457
3329,0.0,-0.5581421
3339,0.0,-0.27246648
3349,0.0,-0.44316387
3359,0.0,-0.05872923
3369,0.0,-0.5449893
3379,0.0,-0.2494095
3389,0.0,-0.8730889
3399,0.0,-0.5190217
3409,0.0,-0.61098355
3419,0.0,-0.48634005
3429,0.0,-0.8039066
3439,0.0,-0.20970964
3449,0.0,-0.26411927
3459,0.0,-0.048139036
3469,0.0,-0.06923854
3479,0.0,0.41365176
3489,0.0,0.0007343888
3499,0.0,0.1955843
3509,0.0,0.031541884
3519,0.0,0.15278333
3529,0.0,0.26634914
3539,0.0,0.23461866
3549,0.0,0.12740439
3559,0.0,-0.13134968
3569,0.0,-0.08893585
3579,0.0,-0.020308614
3589,0.0,-0.05799675
3599,0.0,-0.17404467
3609,0.0,-0.519482
3619,0.0,-0.42870772
3629,0.0,-0.63613313
3639,0.0,-0.30833983
3649,0.0,-0.6913855
3659,0.0,-0.059417367
3669,0.0,-0.10545719
3679,0.0,-0.20332432
3689,0.0,-0.29540616
3699,0.0,-0.37366652
3709,0.0,-0.09041023
3719,0.0,-0.35476655
3729,0.0,0.3459623
3739,0.0,0.18835628
3749,0.0,0.2929392
3759,0.0,0.0033949018
3769,0.0,0.12236065
3779,0.0,0.23454064
3789,0.0,0.5412242
3799,0.0,-0.17540914
3809,0.0,0.16011477
3819,0.0,-0.13208216
3829,0.0,-0.088225305
3839,0.0,-0.36808854
3849,0.0,-0.05048275
3859,0.0,0.15492177
3869,0.0,-0.10977399
3879,0.0,0.4297487
3889,0.0,-0.01539135
3899,0.0,0.28608876
3909,0.0,-0.046774507
3919,0.0,-0.29158926
3929,0.0,-0.057492077
3939,0.0,-0.26277715
3949,0.0,-0.6172796
3959,0.0,0.0069307685
3969,0.0,0.2604674
3979,0.0,0.28001028
3989,0.0,0.19515967
3999,0.0,0.22419244
4009,0.0,0.21020699
4019,0.0,0.2581892
4029,0.0,0.08220333
4039,0.0,0.058314204
4049,0.0,-0.031660736
4059,0.0,0.5330629
4069,0.0,0.93210566
4079,0.0,0.9844799
4089,0.0,0.9441849
4099,0.0,0.393362
4109,0.0,0.1655876
4119,0.0,0.7743985
4129,0.0,0.7734477
4139,0.0,0.3113091
4149,0.0,1.0653164
4159,0.0,1.1835766
4169,0.0,0.9076167
4179,0.0,0.26807183
4189,0.0,0.6211479
4199,0.0,-0.026930034
4209,0.0,0.06134695
4219,0.0,-0.34044904
4229,0.0,-0.37478113
4239,0.0,-0.8775116
4249,0.0,-0.59340614
4259,0.0,-0.51870596
4269,0.0,-0.8555061
4279,0.0,-0.5391251
4289,0.0,-0.5476813
4299,0.0,-0.48535
4309,0.0,-0.41586405
4319,0.0,-0.15734637
4329,0.0,0.4535938
4339,0.0,0.26823914
4349,0.0,0.3687802
4359,0.0,0.7869574
4369,0.0,0.43461168
4379,0.0,0.63296163
4389,0.0,0.9015819
4399,0.0,0.14924055
4409,0.0,-0.29876453
4419,0.0,-0.49584883
4429,0.0,-0.88578546
4439,0.0,-0.2896797
4449,0.0,0.07140684
4459,0.0,-0.45042783
4469,0.0,-0.65409786
4479,0.0,-0.81517696
4489,0.0,-0.73257476
4499,0.0,-0.6609614
4509,0.0,-0.77998567
4519,0.0,-0.18021882
4529,0.0,-0.23867625
4539,0.0,-0.30471194
4549,0.0,-0.3882072
4559,0.0,-0.3205397
4569,0.0,-0.3964988
4579,0.0,-0.5238867
4589,0.0,-0.24089378
4599,0.0,-0.42055827
4609,0.0,-0.7188164
4619,0.0,-0.14970315
4629,0.0,-0.43866706
4639,0.0,-0.53952336
4649,0.0,0.055080593
4659,0.0,-0.50107986
4669,0.0,-0.018547475
4679,0.0,-0.15375215
4689,0.0,-0.40037006
4699,0.0,-0.5743373
4709,0.0,-0.33632195
4719,0.0,-0.12917638
4729,0.0,-0.012095988
4739,0.0,-0.10745126
4749,0.0,-0.14315856
4759,0.0,0.09420824
4769,0.0,-0.4298362
4779,0.0,-0.24767554
4789,0.0,0.051667213
4799,0.0,0.01815182
4809,0.0,0.38384897
4819,0.0,0.4144377
4829,0.0,0.42287225
4839,0.0,0.5667787
4849,0.0,0.5375856
4859,0.0,0.22451228
4869,0.0,0.36704153
4879,0.0,-0.15515739
4889,0.0,0.22137278
4899,0.0,0.4626338
4909,0.0,0.073174894
4919,0.0,-0.07071054
4929,0.0,-0.022269428
4939,0.0,-0.09343648
4949,0.0,0.22764492
4959,0.0,0.03581232
4969,0.0,0.050340712
4979,0.0,0.2706281
4989,0.0,-0.24768299
4999,0.0,-0.1728906
5009,0.0,0.10415465
5019,0.0,-0.28138238
5029,0.0,-0.12962013
5039,0.0,-0.29196638
5049,0.0,-0.036118507
5059,0.0,0.019630373
5069,0.0,-0.12221879
5079,0.0,-0.08702749
5089,0.0,0.24396092
5099,0.0,0.21523178
5109,0.0,0.2312957
5119,0.0,0.34610695
5129,0.0,-0.31311768
5139,0.0,-0.20507962
5149,0.0,-0.60498124
5159,0.0,-0.2901045
5169,0.0,-0.33724958
5179,0.0,0.08698684
5189,0.0,-0.20411384
5199,0.0,-0.39459175
5209,0.0,-0.15903646
5219,0.0,0.27660573
5229,0.0,-0.13005036
5239,0.0,-0.14648235
5249,0.0,-0.16826743
5259,0.0,-0.07185763
5269,0.0,-0.18791604
5279,0.0,-0.048036397
5289,0.0,0.25805777
5299,0.0,-0.29880655
5309,0.0,-0.21473622
5319,0.0,0.037634134
5329,0.0,-0.08314818
5339,0.0,0.03985828
5349,0.0,-0.07828951
5359,0.0,-0.03388685
5369,0.0,0.30835217
5379,0.0,0.46145523
5389,0.0,0.43847078
5399,0.0,0.5842301
5409,0.0,0.8143139
5419,0.0,0.73419815
5429,0.0,0.017057896
5439,0.0,0.07454413
5449,0.0,0.18708599
5459,0.0,0.29154873
5469,0.0,0.22031564
5479,0.0,-0.19195473
5489,0.0,-0.25176126
5499,0.0,-0.66469854
5509,0.0,-0.30228567
5519,0.0,0.07628238
5529,0.0,-0.18416303
5539,0.0,-0.34522915
5549,0.0,-0.29021168
5559,0.0,0.22013175
5569,0.0,0.14806283
5579,0.0,0.3083123
5589,0.0,0.3028751
5599,0.0,0.30001235
5609,0.0,0.9366917
5619,0.0,1.1124915
5629,0.0,0.653215
5639,0.0,0.30018336
5649,0.0,0.3927254
5659,0.0,-0.025782883
5669,0.0,-0.3283546
5679,0.0,-0.057658494
5689,0.0,0.03542173
5699,0.0,0.06820971
5709,0.0,-0.16685396
5719,0.0,-0.20217794
5729,0.0,-0.0034914613
5739,0.0,-0.43634003
5749,0.0,-0.068294704
5759,0.0,-0.03828299
5769,0.0,-0.3827961
5779,0.0,-0.17251354
5789,0.0,-0.3833326
5799,0.0,-0.031227112
5809,0.0,-0.46851838
5819,0.0,-0.2767834
5829,0.0,0.081034064
5839,0.0,-0.1613589
5849,0.0,0.12249333
5859,0.0,-0.17658716
5869,0.0,0.06044686
5879,0.0,-0.030874193
5889,0.0,-0.106910765
5899,0.0,-0.15257859
5909,0.0,-0.29667884
5919,0.0,-0.08650458
5929,0.0,-0.14636743
5939,0.0,-0.5498726
5949,0.0,0.033728898
5959,0.0,0.07861179
5969,0.0,0.3870929
5979,0.0,0.4970029
5989,0.0,0.56369543
5999,0.0,1.1291417
6009,0.0,0.71400017
6019,0.0,0.5651941
6029,0.0,0.25875092
6039,0.0,0.07803559
6049,0.0,-0.19182086
6059,0.0,0.00073218346
6069,0.0,0.00020223856
6079,0.0,0.035218954
6089,0.0,-0.36637372
6099,0.0,-0.3470258
6109,0.0,-0.20008254
6119,0.0,-0.4069605
6129,0.0,-0.14992303
6139,0.0,-0.13617116
6149,0.0,-0.8196299
6159,0.0,-0.31705266
6169,0.0,-0.2161411
6179,0.0,-0.44042665
6189,0.0,-0.34146863
6199,0.0,0.096542
6209,0.0,0.18568122
6219,0.0,0.32466823
6229,0.0,-0.21463871
6239,0.0,-0.26861334
6249,0.0,-0.44663972
6259,0.0,-0.44891232
6269,0.0,-0.37124336
6279,0.0,-0.7106765
6289,0.0,-0.2696188
6299,0.0,0.21420199
6309,0.0,-0.038333118
6319,0.0,0.122356
6329,0.0,0.665782
6339,0.0,0.2879362
6349,0.0,-0.17459941
6359,0.0,0.023672402
6369,0.0,-0.2833128
6379,0.0,-0.20566481
6389,0.0,-0.5210719
6399,0.0,-0.18877101
6409,0.0,0.35554194
6419,0.0,0.29525316
6429,0.0,0.27327514
6439,0.0,0.40591472
6449,0.0,-0.14075673
6459,0.0,-0.0803501
6469,0.0,0.13660651
6479,0.0,-0.09798932
6489,0.0,-0.2903006
6499,0.0,0.045451343
6509,0.0,-0.36188823
6519,0.0,-0.3619058
6529,0.0,-0.052546382
6539,0.0,0.16366607
6549,0.0,-0.07388806
6559,0.0,-0.039470494
6569,0.0,-0.088400245
6579,0.0,-0.2131508
6589,0.0,-0.2109161
6599,0.0,-0.037929952
6609,0.0,-0.21991777
6619,0.0,-0.44390106
6629,1.0,0.21549737
6639,1.0,0.23274726
6649,1.0,0.6289578
6659,1.0,-0.0630219
6669,1.0,0.7380959
6679,1.0,0.9273423
6689,1.0,1.3397036
6699,1.0,2.0844998
6709,1.0,2.4740899
6719,1.0,2.5036712
6729,1.0,2.4682348
6739,1.0,3.1777844
6749,1.0,3.6243546
6759,1.0,4.2426023
6769,1.0,4.8597593
6779,1.0,5.2755594
6789,1.0,6.0132976
6799,1.0,7.1927795
6809,1.0,8.82409
6819,1.0,9.546128
6829,1.0,9.507883
6839,1.0,8.6502695
6849,1.0,8.51271
6859,1.0,9.361105
6869,1.0,9.651058
6879,1.0,9.977413
6889,1.0,7.262809
6899,1.0,5.36695
6909,1.0,4.259616
6919,1.0,2.528323
6929,1.0,1.8281596
6939,1.0,0.55937314
6949,1.0,-0.021490097
6959,1.0,-0.20670253
6969,1.0,0.079546034
6979,1.0,0.8506846
6989,1.0,0.8546331
6999,1.0,2.1851053
7009,1.0,2.6081524
7019,1.0,3.670621
7029,1.0,4.794587
7039,1.0,6.106805
7049,1.0,8.139975
7059,1.0,9.223404
7069,1.0,9.152769
7079,1.0,8.891893
7089,1.0,8.628754
7099,1.0,8.762669
7109,1.0,8.717662
7119,1.0,7.513507
7129,1.0,6.655656
7139,1.0,5.6215215
7149,1.0,5.377801
7159,1.0,4.98075
7169,1.0,4.4280596
7179,1.0,3.876614
7189,1.0,3.4921095
7199,1.0,2.9120817
7209,1.0,2.9631119
7219,1.0,2.2158172
7229,1.0,1.9884276
7239,1.0,1.7139641
7249,1.0,0.9520031
7259,1.0,0.955327
7269,1.0,0.6436791
7279,1.0,0.5715311
7289,1.0,0.48552108
7299,0.0,0.0073950887
7309,0.0,-0.10122228
7319,0.0,-0.19535536
7329,0.0,-0.19639981
7339,0.0,-0.23398393
7349,0.0,-0.42500252
7359,0.0,-0.68894887
7369,0.0,-0.22160035
7379,0.0,0.028166354
7389,0.0,-0.04401028
7399,0.0,-0.11685008
7409,0.0,-0.1153062
7419,0.0,-0.43236238
7429,0.0,0.10520238
7439,0.0,0.09738219
7449,0.0,0.2206167
7459,0.0,0.19481313
7469,0.0,0.43574834
7479,0.0,0.48318142
7489,0.0,0.24554878
7499,0.0,0.70014274
7509,0.0,0.64729786
7519,0.0,0.7608489
7529,0.0,1.1060182
7539,0.0,0.60091287
7549,0.0,0.67330974
7559,0.0,0.66591793
7569,0.0,0.5696151
7579,0.0,0.6954906
7589,0.0,0.79803216
7599,0.0,1.0574262
7609,0.0,0.48136008
7619,0.0,0.22035903
7629,0.0,0.13476074
7639,0.0,0.15059054
7649,0.0,-0.21186554
7659,0.0,0.300785
7669,0.0,-0.07728696
7679,0.0,-0.43576902
7689,0.0,-0.12162
7699,0.0,-0.12199247
7709,0.0,-0.28114635
7719,0.0,0.1276846
7729,0.0,-0.053794563
7739,0.0,-0.26281124
7749,0.0,-1.0360267
7759,0.0,-0.40680295
7769,0.0,-0.35913646
7779,0.0,-0.80496347
7789,0.0,-0.73836684
7799,0.0,-0.47552073
7809,0.0,-0.47062188
7819,0.0,-0.19543046
7829,0.0,-0.61028934
7839,0.0,-0.18781316
7849,0.0,-0.24625772
7859,0.0,-0.26618248
7869,0.0,-0.13539582
7879,0.0,0.33997142
7889,0.0,0.35177028
7899,0.0,0.39873517
7909,0.0,0.19985181
7919,0.0,-0.054210722
7929,0.0,0.36408216
7939,0.0,-0.15922755
7949,0.0,-0.4515596
7959,0.0,0.017664433
7969,0.0,0.011120856
7979,0.0,0.11452466
7989,0.0,0.11534625
7999,0.0,0.31774032
8009,0.0,0.21093267
8019,0.0,-0.02169168
8029,0.0,0.03478223
8039,0.0,-0.048676074
8049,0.0,-0.4172265
8059,0.0,-0.039414942
8069,0.0,-0.17575699
8079,0.0,-0.3685572
8089,0.0,-0.09469074
8099,0.0,0.009372473
8109,0.0,-0.0800488
8119,0.0,-0.027897894
8129,0.0,0.6120211
8139,0.0,0.42419666
8149,0.0,-0.16237205
8159,0.0,0.23553866
8169,0.0,0.055306017
8179,0.0,-0.018163145
8189,0.0,0.26664603
8199,0.0,0.15308571
8209,0.0,-0.02324146
8219,0.0,-0.21490341
8229,0.0,-0.33158457
8239,0.0,0.14775252
8249,0.0,-0.13134223
8259,0.0,0.46175712
8269,0.0,-0.14434123
8279,0.0,-0.24381357
8289,0.0,-0.47650486
8299,0.0,-0.1413216
8309,0.0,-0.014097691
8319,0.0,0.03649509
8329,0.0,-0.010149181
8339,0.0,-0.21778935
8349,0.0,-0.50014
8359,0.0,-0.155397
8369,0.0,-0.09755558
8379,0.0,-0.08175862
8389,0.0,-0.045995235
8399,0.0,-0.0007485151
8409,0.0,0.39579707
8419,0.0,-0.16695482
8429,0.0,0.48780584
8439,0.0,0.8468968
8449,0.0,0.4104932
8459,0.0,0.13463205
8469,0.0,0.31012708
8479,0.0,0.27766794
8489,0.0,-0.04322481
8499,0.0,-0.030348718
8509,0.0,0.007887185
8519,0.0,-0.31347507
8529,0.0,0.13834321
8539,0.0,-0.20588386
8549,0.0,-0.13992298
8559,0.0,-0.0106060505
8569,0.0,-0.14095634
8579,0.0,-0.15659261
8589,0.0,0.12028825
8599,0.0,0.3384198
8609,0.0,0.43669087
8619,0.0,0.26389295
8629,0.0,-0.28764653
8639,0.0,-0.09046626
8649,0.0,-0.28240633
8659,0.0,0.14666021
8669,0.0,-0.06469202
8679,0.0,0.07752967
8689,0.0,0.32380784
8699,0.0,0.00740999
8709,0.0,-0.2043786
8719,0.0,-0.25115633
8729,0.0,-0.2777462
8739,0.0,0.41720968
8749,0.0,0.65548146
8759,0.0,0.9461164
8769,0.0,0.26189333
8779,0.0,0.35890633
8789,0.0,0.62474245
8799,0.0,1.2625561
8809,0.0,0.9932225
8819,0.0,1.1959236
8829,0.0,0.71388984
8839,0.0,0.4744404
8849,0.0,0.36502182
8859,0.0,-0.0023354888
8869,0.0,0.26410997
8879,0.0,-0.03183794
8889,0.0,0.0745697
8899,0.0,-0.27732652
8909,0.0,-0.35971332
8919,0.0,-0.058873594
8929,0.0,-0.012181163
8939,0.0,0.32816285
8949,0.0,-0.085339546
8959,0.0,0.22576159
8969,0.0,-0.23232031
8979,0.0,-0.059147656
8989,0.0,0.1372155
8999,0.0,0.5309381
9009,0.0,0.25947988
9019,0.0,0.0041714907
9029,0.0,-0.14649558
9039,0.0,-0.14595175
9049,0.0,-0.21907645
9059,0.0,-0.34482008
9069,0.0,-0.08065969
9079,0.0,0.18504143
9089,0.0,0.10975981
9099,0.0,-0.2922703
9109,0.0,-0.21124637
9119,0.0,-0.22521633
9129,0.0,-0.25689644
9139,0.0,0.114546955
9149,0.0,-0.0042312145
9159,0.0,0.26577985
9169,0.0,-0.01866287
9179,0.0,-0.2609526
9189,0.0,0.007575035
9199,0.0,-0.35061336
9209,0.0,-0.35551482
9219,0.0,-0.64092416
9229,0.0,-0.70060796
9239,0.0,-0.8882038
9249,0.0,-0.7048635
9259,0.0,-0.050556898
9269,0.0,0.2719249
9279,0.0,0.35421634
9289,0.0,0.66448444
9299,0.0,0.7111892
9309,0.0,0.5005932
9319,0.0,0.7145393
9329,0.0,0.5390172
9339,0.0,0.2909243
9349,0.0,-0.1952042
9359,0.0,0.020115376
9369,0.0,0.030518413
9379,0.0,-0.12694895
9389,0.0,-0.09951204
9399,0.0,-0.7986147
9409,0.0,-0.710992
9419,0.0,-0.7500335
9429,0.0,-0.5651944
9439,0.0,-0.35134155
9449,0.0,-0.7256859
9459,0.0,-0.4780323
9469,0.0,-0.67932516
9479,0.0,-0.205401
9489,0.0,-0.43729085
9499,0.0,0.27909708
9509,0.0,0.7996124
9519,0.0,0.60865706
9529,0.0,0.45386487
9539,0.0,0.017758727
9549,0.0,-0.5742177
9559,0.0,-0.23380768
9569,0.0,-0.11373049
9579,0.0,-0.04478711
9589,0.0,-0.19003582
9599,0.0,0.14866221
9609,0.0,0.2723475
9619,0.0,0.23675388
9629,0.0,-0.041496933
9639,0.0,0.18565196
9649,0.0,0.3093319
9659,0.0,0.4322573
9669,0.0,0.12779278
9679,0.0,0.0065425634
9689,0.0,0.21104002
9699,0.0,0.28076577
9709,0.0,-0.23619753
9719,0.0,-0.3644631
9729,0.0,-0.63503456
9739,0.0,-0.7456237
9749,0.0,-0.90313286
9759,0.0,-0.47401512
9769,0.0,-0.53080255
9779,0.0,-0.5005441
9789,0.0,-0.18926191
9799,0.0,-0.44390213
9809,0.0,-0.35298663
9819,0.0,-0.54807925
9829,0.0,-0.5559082
9839,0.0,-0.07853651
9849,0.0,-0.17517179
9859,0.0,-0.2597543
9869,0.0,-0.07978463
9879,0.0,-0.20956361
9889,0.0,-0.13596052
9899,0.0,0.1267885
9909,0.0,0.017969549
9919,0.0,0.49761623
9929,0.0,0.62846494
9939,0.0,0.42843044
9949,0.0,0.18300909
9959,0.0,0.06300491
9969,0.0,-0.096633315
9979,0.0,-0.18159276
9989,0.0,-0.15984279
9999,0.0,0.03306842
10009,0.0,0.05515617
10019,0.0,-0.15901434
10029,0.0,0.047685146
10039,0.0,-0.008793533
10049,0.0,-0.15220463
10059,0.0,-0.119261324
10069,0.0,-0.12286419
10079,0.0,-0.1334157
10089,0.0,-0.30658358
10099,0.0,-0.40621215
10109,0.0,-0.53459597
10119,0.0,-0.636605
10129,0.0,-0.47504258
10139,0.0,-0.49881554
10149,0.0,-0.6102204
10159,0.0,-0.48870587
10169,0.0,-0.24696064
10179,0.0,-0.6402563
10189,0.0,-0.07373536
10199,0.0,0.008368492
10209,0.0,-0.12639648
10219,0.0,-0.070858
10229,0.0,-0.22062641
10239,0.0,-0.26281184
10249,0.0,-0.17943901
10259,0.0,-0.03319198
10269,0.0,-0.004360497
10279,0.0,-0.52552754
10289,0.0,-0.5209563
10299,0.0,-0.4606611
10309,0.0,-0.23749119
10319,0.0,0.1551795
10329,0.0,-0.071855605
10339,0.0,-0.024283111
10349,0.0,0.012378573
10359,0.0,0.14293379
10369,0.0,0.21596849
10379,0.0,0.29684347
10389,0.0,0.46911937
10399,0.0,0.26183653
10409,0.0,0.34498382
10419,0.0,0.22485054
10429,0.0,0.038993776
10439,0.0,-0.06269324
10449,0.0,0.17112023
10459,0.0,0.4011141
10469,0.0,0.017238855
10479,0.0,0.12418628
10489,0.0,-0.06946707
10499,0.0,-0.40422976
10509,0.0,0.058030725
10519,0.0,-0.21678162
10529,0.0,0.14153081
10539,0.0,0.33709252
10549,0.0,0.44023544
10559,0.0,0.3663696
10569,0.0,1.0545418
10579,0.0,0.6925747
10589,0.0,0.54095536
10599,0.0,0.67338616
10609,0.0,0.983413
10619,0.0,1.1189853
10629,0.0,1.0762541
10639,0.0,0.9276767
10649,0.0,0.1937831
10659,0.0,0.19959897
10669,0.0,0.33210546
10679,0.0,-0.43141818
10689,0.0,-0.4233849
10699,0.0,-0.21269166
10709,0.0,-0.0044840574
10719,0.0,-0.12656558
10729,0.0,0.092712045
10739,0.0,0.08141756
10749,0.0,0.39046603
10759,0.0,0.6740454
10769,0.0,0.67185366
10779,0.0,0.45820147
10789,0.0,0.7276218
10799,0.0,0.5397673
10809,0.0,0.6212593
10819,0.0,-0.027486563
10829,0.0,0.1881423
10839,0.0,-0.3648973
10849,0.0,-0.12503463
10859,0.0,0.12987751
10869,0.0,-0.21906048
10879,0.0,-0.09485775
10889,0.0,-0.37531877
10899,0.0,-0.40662813
10909,0.0,-0.21561784
10919,0.0,0.039809346
10929,0.0,0.12746471
10939,0.0,-0.2440511
10949,0.0,-0.39125293
10959,0.0,-0.26726514
10969,0.0,-0.35490763
10979,0.0,-0.020392656
10989,0.0,-0.19665551
10999,0.0,-0.47560507
11009,0.0,-0.6617584
11019,0.0,-0.11485398
11029,0.0,-0.3310253
11039,0.0,-0.43148738
11049,0.0,-0.5785907
11059,0.0,-0.30375594
11069,0.0,-0.2639643
11079,0.0,-0.10467589
11089,0.0,-0.2840181
11099,0.0,-0.13364798
11109,0.0,-0.029058576
11119,0.0,-0.03449303
11129,0.0,0.19190305
11139,0.0,-0.23224515
11149,0.0,-0.1730572
11159,0.0,-0.22463119
11169,0.0,0.10978377
11179,0.0,-0.0022563338
11189,0.0,-0.07907599
11199,0.0,-0.49161667
11209,0.0,-0.35199517
11219,0.0,-0.34020787
11229,0.0,-0.5743591
11239,0.0,-0.8229793
11249,0.0,-0.48228067
11259,0.0,-0.39109874
11269,0.0,-0.40545863
11279,0.0,-0.43994337
11289,0.0,-0.574382
11299,0.0,0.23972374
11309,0.0,-0.0015887618
11319,0.0,0.057049155
11329,0.0,-0.010210276
11339,0.0,-0.111046016
11349,0.0,-0.047398448
11359,0.0,-0.010695517
11369,0.0,-0.1270191
11379,0.0,0.39910072
11389,0.0,0.80372846
11399,0.0,0.47721058
11409,0.0,0.47343427
11419,0.0,0.28862208
11429,0.0,0.16825539
11439,0.0,-0.19246197
11449,0.0,0.37954688
11459,0.0,0.004348874
11469,0.0,0.36946762
11479,0.0,-0.19234991
11489,0.0,-0.3141548
11499,0.0,0.36035967
11509,0.0,0.2013349
11519,0.0,0.21651167
11529,0.0,0.15406322
11539,0.0,-0.016269445
11549,0.0,-0.29328752
11559,0.0,-0.040397525
11569,0.0,-0.032702208
11579,0.0,-0.30817515
11589,0.0,0.2002235
11599,0.0,0.14658773
11609,0.0,0.33384472
11619,0.0,0.20753318
11629,0.0,-0.107170105
11639,0.0,0.22433329
11649,0.0,0.14832795
11659,0.0,0.23706383
11669,1.0,0.4870398
11679,1.0,0.40616965
11689,1.0,0.43127805
11699,1.0,0.5336707
11709,1.0,1.1665865
11719,1.0,1.1098745
11729,1.0,1.5381699
11739,1.0,1.4916079
11749,1.0,2.0444913
11759,1.0,2.329588
11769,1.0,2.8884015
11779,1.0,3.7016063
11789,1.0,3.7636578
11799,1.0,4.109579
11809,1.0,4.507866
11819,1.0,5.341214
11829,1.0,5.7970834
11839,1.0,6.888645
11849,1.0,7.4366846
11859,1.0,9.584842
11869,1.0,8.820779
11879,1.0,8.620668
11889,1.0,8.496397
11899,1.0,9.272421
11909,1.0,9.969059
11919,1.0,7.835764
11929,1.0,6.820863
11939,1.0,5.8644705
11949,1.0,3.897606
11959,1.0,2.6059012
11969,1.0,1.7946911
11979,1.0,0.95549154
11989,1.0,0.67627287
11999,1.0,0.45951456
12009,1.0,0.61776376
12019,1.0,0.38807
12029,1.0,0.6343893
12039,1.0,1.8824439
12049,1.0,2.872919
12059,1.0,3.9814944
12069,1.0,6.0317035
12079,1.0,6.6111035
12089,1.0,8.484909
12099,1.0,8.494638
12109,1.0,8.618246
12119,1.0,8.793123
12129,1.0,8.752798
12139,1.0,9.014287
12149,1.0,9.5125675
12159,1.0,8.5983715
12169,1.0,7.074355
12179,1.0,7.2086167
12189,1.0,6.5332108
12199,1.0,5.9544034
12209,1.0,5.3282256
12219,1.0,4.2639947
12229,1.0,3.107098
12239,1.0,2.859623
12249,1.0,2.2102723
12259,1.0,2.291317
12269,1.0,1.9292862
12279,1.0,1.3060488
12289,1.0,0.9507365
12299,1.0,0.9731583
12309,1.0,0.85228205
12319,1.0,0.58833194
12329,1.0,0.2593155
12339,0.0,-0.0688107
12349,0.0,0.13015598
12359,0.0,0.21529579
12369,0.0,0.40798795
12379,0.0,0.11823398
12389,0.0,-0.07652128
12399,0.0,0.08859545
12409,0.0,-0.12364274
12419,0.0,-0.28429115
12429,0.0,-0.009493709
12439,0.0,-0.5046787
12449,0.0,0.20270365
12459,0.0,0.18308377
12469,0.0,0.46411663
12479,0.0,0.24861169
12489,0.0,0.3518632
12499,0.0,0.681644
12509,0.0,0.7312298
12519,0.0,1.0012782
12529,0.0,0.6025529
12539,0.0,0.5347646
12549,0.0,0.537948
12559,0.0,0.31663436
12569,0.0,0.62089634
12579,0.0,0.3728212
12589,0.0,0.1451301
12599,0.0,-0.2375843
12609,0.0,-0.40068662
12619,0.0,-1.0108454
12629,0.0,-0.66231406
12639,0.0,-0.69336146
12649,0.0,-0.44158864
12659,0.0,-0.19069982
12669,0.0,-0.3983236
12679,0.0,-0.44316703
12689,0.0,-0.37866867
12699,0.0,-0.31154066
12709,0.0,-0.57449085
12719,0.0,-0.39891237
12729,0.0,-0.23537338
12739,0.0,-0.18380249
12749,0.0,-0.3450212
12759,0.0,-0.18912071
12769,0.0,-0.36769515
12779,0.0,-0.4523877
12789,0.0,-0.44540483
12799,0.0,-0.4096774
12809,0.0,-0.14305794
12819,0.0,0.17554349
12829,0.0,-0.16312754
12839,0.0,0.04712248
12849,0.0,-0.11230171
12859,0.0,0.1711576
12869,0.0,0.14334816
12879,0.0,0.2679158
12889,0.0,0.37285256
12899,0.0,0.02333492
12909,0.0,0.26169837
12919,0.0,0.066613734
12929,0.0,-0.06866586
12939,0.0,-0.20927137
12949,0.0,-0.22908342
12959,0.0,0.05108881
12969,0.0,0.12522918
12979,0.0,-0.116330385
12989,0.0,-0.5383243
12999,0.0,-0.52994347
13009,0.0,0.0294559
13019,0.0,-0.03498453
13029,0.0,0.035683513
13039,0.0,0.16718149
13049,0.0,-0.020655751
13059,0.0,0.2747811
13069,0.0,0.5170208
13079,0.0,0.65150756
13089,0.0,-0.23524046
13099,0.0,-0.08800328
13109,0.0,0.0019093156
13119,0.0,0.25093204
13129,0.0,0.039948523
13139,0.0,0.090979755
13149,0.0,0.2702577
13159,0.0,0.05763805
13169,0.0,-0.07842851
13179,0.0,-0.025832057
13189,0.0,-0.3334542
13199,0.0,-0.008405447
13209,0.0,0.2830854
13219,0.0,0.2248199
13229,0.0,-0.072854996
13239,0.0,0.060569286
13249,0.0,-0.018380344
13259,0.0,0.089378715
13269,0.0,0.28302532
13279,0.0,0.23741859
13289,0.0,0.19791502
13299,0.0,-0.28027552
13309,0.0,-0.41565663
13319,0.0,-0.036151826
13329,0.0,-0.16943347
13339,0.0,0.256822
13349,0.0,-0.046746254
13359,0.0,0.03671956
13369,0.0,-0.36278206
13379,0.0,0.111542284
13389,0.0,-0.18159145
13399,0.0,-0.09831673
13409,0.0,-0.037419736
13419,0.0,-0.11982602
13429,0.0,-0.35671997
13439,0.0,-0.33150893
13449,0.0,-0.774276
13459,0.0,-0.46067226
13469,0.0,-0.5764628
13479,0.0,-0.058376312
13489,0.0,-0.46338218
13499,0.0,-0.27579403
13509,0.0,-0.7055402
13519,0.0,-0.43589222
13529,0.0,-0.040641546
13539,0.0,-0.42436463
13549,0.0,-0.52169013
13559,0.0,-0.2942173
13569,0.0,-0.16871691
13579,0.0,-0.026414633
13589,0.0,-0.11922234
13599,0.0,-0.21843135
13609,0.0,0.5909817
13619,0.0,0.026354909
13629,0.0,-0.11533785
13639,0.0,0.16094464
13649,0.0,-0.04662454
13659,0.0,-0.016854107
13669,0.0,0.1253711
13679,0.0,0.17687625
13689,0.0,0.10911679
13699,0.0,0.3425231
13709,0.0,0.2861057
13719,0.0,0.047458112
13729,0.0,-0.09196907
13739,0.0,-0.21478409
13749,0.0,-0.2082879
13759,0.0,-0.17039663
13769,0.0,0.3631301
13779,0.0,0.04219365
13789,0.0,-0.19049692
13799,0.0,-0.32253397
13809,0.0,-0.6359815
13819,0.0,-0.34971428
13829,0.0,-0.19322914
13839,0.0,-0.29937547
13849,0.0,-0.6529539
13859,0.0,-0.30984354
13869,0.0,-0.12873042
13879,0.0,-0.20480818
13889,0.0,-0.16039467
13899,0.0,-0.15016133
13909,0.0,-0.0638724
13919,0.0,0.30519366
13929,0.0,0.23314375
13939,0.0,-0.3154894
13949,0.0,-0.32931668
13959,0.0,-0.6898451
13969,0.0,-0.2960214
13979,0.0,-0.37305003
13989,0.0,-0.6387511
13999,0.0,-0.6210003
14009,0.0,-0.6499119
14019,0.0,-0.54285085
14029,0.0,-0.41840196
14039,0.0,-0.08701217
14049,0.0,-0.37249088
14059,0.0,-0.3826704
14069,0.0,-0.21452075
14079,0.0,0.24830914
14089,0.0,0.003601551
14099,0.0,-0.05960715
14109,0.0,0.07448852
14119,0.0,0.34466213
14129,0.0,0.2186886
14139,0.0,-0.31831664
14149,0.0,-0.017842948
14159,0.0,0.025101066
14169,0.0,-0.34836257
14179,0.0,-0.55622387
14189,0.0,-0.5431712
14199,0.0,-0.36842293
14209,0.0,-0.20877951
14219,0.0,-0.2833231
14229,0.0,-0.66176784
14239,0.0,-0.8178505
14249,0.0,-0.6925359
14259,0.0,-0.46610415
14269,0.0,-0.42692274
14279,0.0,-0.33792853
14289,0.0,-0.00827235
14299,0.0,0.15945214
14309,0.0,0.046591938
14319,0.0,0.117922425
14329,0.0,0.35106957
14339,0.0,0.3092935
14349,0.0,0.42405546
14359,0.0,0.34177428
14369,0.0,0.36110365
14379,0.0,0.3107896
14389,0.0,0.7510955
14399,0.0,0.3821131
14409,0.0,0.2833714
14419,0.0,0.010201991
14429,0.0,-0.1260078
14439,0.0,0.07162547
14449,0.0,0.035646677
14459,0.0,-0.24440509
14469,0.0,-0.39538765
14479,0.0,-0.4159506
14489,0.0,-0.25213832
14499,0.0,-0.040108085
14509,0.0,0.07473159
14519,0.0,-0.004773617
14529,0.0,0.42074388
14539,0.0,0.370848
14549,0.0,0.7409763
14559,0.0,0.5712492
14569,0.0,0.37805128
14579,0.0,-0.029518902
14589,0.0,-0.07967436
14599,0.0,-0.13107711
14609,0.0,-0.027414799
14619,0.0,-0.27088523
14629,0.0,-0.32674915
14639,0.0,-0.23315221
14649,0.0,-0.09615594
14659,0.0,0.25871336
14669,0.0,-0.29341984
14679,0.0,-0.083069265
14689,0.0,-0.050506175
14699,0.0,-0.36225885
14709,0.0,-0.42626053
14719,0.0,-0.012654424
14729,0.0,-0.23646659
14739,0.0,0.09624958
14749,0.0,0.098329306
14759,0.0,0.27160895
14769,0.0,-0.038626194
14779,0.0,-0.4848045
14789,0.0,-0.20670855
14799,0.0,0.08897519
14809,0.0,0.12277681
14819,0.0,-0.17369074
14829,0.0,-0.29156446
14839,0.0,-0.29752064
14849,0.0,0.31893653
14859,0.0,0.26639563
14869,0.0,-0.31058562
14879,0.0,-0.1355561
14889,0.0,-0.1258524
14899,0.0,-0.16546637
14909,0.0,-0.067802906
14919,0.0,0.43604672
14929,0.0,0.038904727
14939,0.0,-0.042888343
14949,0.0,0.46543688
14959,0.0,0.044241846
14969,0.0,-0.19907385
14979,0.0,-0.06012243
14989,0.0,-0.12737948
14999,0.0,-0.1697579
15009,0.0,-0.5058504
15019,0.0,-0.59255165
15029,0.0,0.09727985
15039,0.0,-0.13117355
15049,0.0,-0.091692805
15059,0.0,0.08428669
15069,0.0,-0.14458853
15079,0.0,0.044352055
15089,0.0,-0.16770375
15099,0.0,-0.28639716
15109,0.0,0.25075102
15119,0.0,0.1945104
15129,0.0,0.24764377
15139,0.0,-0.3271848
15149,0.0,-0.54276633
15159,0.0,-0.14304298
15169,0.0,-0.27181548
15179,0.0,-0.11454594
15189,0.0,-0.10255945
15199,0.0,-0.4417752
15209,0.0,-0.1218338
15219,0.0,0.047142982
15229,0.0,0.4051677
15239,0.0,0.023441851
15249,0.0,0.35213554
15259,0.0,-0.045080125
15269,0.0,0.01731056
15279,0.0,0.4102059
15289,0.0,0.23678601
15299,0.0,-0.05828762
15309,0.0,-0.17410368
15319,0.0,-0.07551497
15329,0.0,-0.29694086
15339,0.0,-0.11627704
15349,0.0,0.12298542
15359,0.0,-0.122293234
15369,0.0,-0.10503703
15379,0.0,0.10471642
15389,0.0,0.20168668
15399,0.0,0.122348905
15409,0.0,0.3763224
15419,0.0,-0.39571983
15429,0.0,-0.21102077
15439,0.0,-0.47332126
15449,0.0,-0.34909737
15459,0.0,-0.32619417
15469,0.0,-0.33607054
15479,0.0,0.09224868
15489,0.0,-0.5020504
15499,0.0,-0.15399444
15509,0.0,-0.37214774
15519,0.0,-0.5402496
15529,0.0,-0.42935693
15539,0.0,-0.4890226
15549,0.0,-0.43048215
15559,0.0,-0.27797252
15569,0.0,-0.21235245
15579,0.0,0.028188825
15589,0.0,-0.17411685
15599,0.0,0.44634414
15609,0.0,-0.01952213
15619,0.0,-0.008298039
15629,0.0,-0.07652694
15639,0.0,-0.25922465
15649,0.0,0.39768082
15659,0.0,0.4435886
15669,0.0,0.2854588
15679,0.0,0.060569108
15689,0.0,0.3219002
15699,0.0,0.032685757
15709,0.0,0.21359587
15719,0.0,0.05216664
15729,0.0,-0.4274385
15739,0.0,-0.24133676
15749,0.0,-0.1648106
15759,0.0,-0.20209265
15769,0.0,-0.056076586
15779,0.0,0.2803113
15789,0.0,0.31851906
15799,0.0,-0.3009146
15809,0.0,-0.24227357
15819,0.0,-0.11629379
15829,0.0,-0.30499184
15839,0.0,-0.056217313
15849,0.0,-0.20218748
15859,0.0,-0.36092907
15869,0.0,0.12892056
15879,0.0,-0.19570619
15889,0.0,0.113702
15899,0.0,-0.046411514
15909,0.0,-0.40830278
15919,0.0,-0.35938555
15929,0.0,-0.22888327
15939,0.0,-0.31782877
15949,0.0,-0.370304
15959,0.0,-0.22845888
15969,0.0,-0.20745224
15979,0.0,-0.18718314
15989,0.0,-0.12772506
15999,0.0,-0.06722373
16009,0.0,-0.6938798
16019,0.0,-0.18984812
16029,0.0,-0.08692545
16039,0.0,-0.14950114
16049,0.0,0.5074491
16059,0.0,0.07818568
16069,0.0,0.1951598
16079,0.0,0.09718835
16089,0.0,0.098219514
16099,0.0,0.012273669
16109,0.0,0.14472568
16119,0.0,-0.28272617
16129,0.0,-0.10471082
16139,0.0,-0.1268112
16149,0.0,0.25393993
16159,0.0,0.12990022
16169,0.0,0.23089117
16179,0.0,0.6817988
16189,0.0,0.32050896
16199,0.0,0.85815513
16209,0.0,-0.039580643
16219,0.0,-0.5634093
16229,0.0,-0.13339782
16239,0.0,-0.2523138
16249,0.0,-0.058404744
16259,0.0,-0.12855244
16269,0.0,-0.008762479
16279,0.0,-0.015942752
16289,0.0,-0.1729384
16299,0.0,0.18118995
16309,0.0,0.20877188
16319,0.0,-0.3341936
16329,0.0,-0.23708344
16339,0.0,-0.14861417
16349,0.0,0.060792923
16359,0.0,0.005072236
16369,0.0,-0.21365517
16379,0.0,0.028300405
16389,0.0,0.105908096
16399,0.0,0.034059405
16409,0.0,-0.16873288
16419,0.0,-0.0012422204
16429,0.0,0.07607907
16439,0.0,0.045770824
16449,0.0,0.12030077
16459,0.0,0.049007595
16469,0.0,-0.491764
16479,0.0,0.21479267
16489,0.0,-0.10913128
16499,0.0,0.13517642
16509,0.0,-0.010953426
16519,0.0,0.13644731
16529,0.0,0.34773624
16539,0.0,0.26878715
16549,0.0,0.015548885
16559,0.0,0.2194035
16569,0.0,-0.18773454
16579,0.0,-0.09023166
16589,0.0,-0.079887986
16599,0.0,0.06235242
16609,0.0,0.18053049
16619,0.0,0.8754843
16629,0.0,0.75906765
16639,0.0,0.5169436
16649,0.0,0.36180294
16659,0.0,0.2557299
16669,0.0,0.04879093
16679,0.0,0.4291278
16689,0.0,0.15876466
16699,0.0,-0.084631324
16709,0.0,-0.07511711
16719,0.0,0.097344816
16729,0.0,0.13370031
16739,0.0,0.16392714
16749,0.0,0.004843235
16759,0.0,0.00040072203
16769,0.0,-0.14048928
16779,0.0,-0.07367033
16789,0.0,0.29871172
16799,0.0,0.11667848
16809,0.0,0.08403516
16819,0.0,0.09098625
16829,0.0,-0.10178137
16839,0.0,0.08525312
16849,0.0,0.038553357
16859,0.0,-0.10805559
16869,1.0,0.45744687
16879,1.0,1.0920829
16889,1.0,0.99077
16899,1.0,2.062345
16909,1.0,1.7917986
16919,1.0,2.0547256
16929,1.0,2.3484669
16939,1.0,2.3896537
16949,1.0,2.871402
16959,1.0,3.4166512
16969,1.0,3.9548712
16979,1.0,5.2516336
16989,1.0,5.415994
16999,1.0,6.1611485
17009,1.0,6.539215
17019,1.0,7.189264
17029,1.0,6.8692336
17039,1.0,7.8794236
17049,1.0,8.766697
17059,1.0,9.503241
17069,1.0,8.839582
17079,1.0,8.703831
17089,1.0,8.174357
17099,1.0,9.255802
17109,1.0,8.768433
17119,1.0,8.163206
17129,1.0,6.389574
17139,1.0,5.4073324
17149,1.0,3.7491112
17159,1.0,2.6052678
17169,1.0,1.4703125
17179,1.0,1.021977
17189,1.0,0.8963108
17199,1.0,0.78038603
17209,1.0,0.49654984
17219,1.0,0.80704945
17229,1.0,1.1542658
17239,1.0,1.2237253
17249,1.0,2.8263729
17259,1.0,3.7502198
17269,1.0,5.3532143
17279,1.0,6.276284
17289,1.0,7.455652
17299,1.0,10.191001
17309,1.0,8.855164
17319,1.0,8.562138
17329,1.0,8.692266
17339,1.0,8.400969
17349,1.0,9.464146
17359,1.0,8.743929
17369,1.0,7.9014125
17379,1.0,6.7064533
17389,1.0,5.4071474
17399,1.0,5.380648
17409,1.0,4.801855
17419,1.0,4.0239964
17429,1.0,3.3139267
17439,1.0,2.9782524
17449,1.0,2.346405
17459,1.0,2.4304683
17469,1.0,1.5165489
17479,1.0,1.4618275
17489,1.0,0.8944889
17499,1.0,0.41489768
17509,1.0,-0.16154552
17519,1.0,-0.16755044
17529,1.0,-0.43625802
17539,0.0,-0.7292345
17549,0.0,-0.7629233
17559,0.0,-0.4529791
17569,0.0,0.16271657
17579,0.0,0.09251058
17589,0.0,0.15614915
17599,0.0,0.011676371
17609,0.0,0.51077384
17619,0.0,0.9399174
17629,0.0,0.93689096
17639,0.0,0.8149599
17649,0.0,0.89660794
17659,0.0,0.92434865
17669,0.0,0.82147205
17679,0.0,0.2943694
17689,0.0,-0.506647
17699,0.0,0.4555328
17709,0.0,0.23027486
17719,0.0,0.1364379
17729,0.0,-0.29667717
17739,0.0,-0.3577845
17749,0.0,-0.39148915
17759,0.0,-0.38883954
17769,0.0,-0.5482102
17779,0.0,-0.5274057
17789,0.0,-0.28483653
17799,0.0,0.062470317
17809,0.0,-0.11668944
17819,0.0,0.86227334
17829,0.0,0.6953311
17839,0.0,0.703083
17849,0.0,0.21370065
17859,0.0,-0.12938517
17869,0.0,-0.31775993
17879,0.0,0.2647971
17889,0.0,-0.29764962
17899,0.0,-0.40221733
17909,0.0,-0.12358141
17919,0.0,-0.1244486
17929,0.0,0.30195087
17939,0.0,-0.2234599
17949,0.0,-0.034421742
17959,0.0,0.07395768
17969,0.0,0.17703575
17979,0.0,0.3212253
17989,0.0,0.38413674
17999,0.0,0.02137971
18009,0.0,-0.24483329
18019,0.0,0.08984083
18029,0.0,0.23443401
18039,0.0,-0.010314226
18049,0.0,-0.083367765
18059,0.0,0.42231107
18069,0.0,0.0684917
18079,0.0,0.11103797
18089,0.0,0.31888574
18099,0.0,0.06756866
18109,0.0,-0.19418615
18119,0.0,-0.4159618
18129,0.0,-0.96442276
18139,0.0,-0.40542293
18149,0.0,-0.68728364
18159,0.0,-0.5102628
18169,0.0,-0.4619708
18179,0.0,-0.19995117
18189,0.0,-0.4794441
18199,0.0,-0.511454
18209,0.0,-0.27804464
18219,0.0,-0.009884596
18229,0.0,-0.45701766
18239,0.0,-0.19688773
18249,0.0,-0.812496
18259,0.0,-0.15129924
18269,0.0,-0.07612711
18279,0.0,0.31483537
18289,0.0,0.09646171
18299,0.0,0.20112789
18309,0.0,-0.6262865
18319,0.0,-0.59418094
18329,0.0,-0.58733064
18339,0.0,-0.2140041
18349,0.0,-0.21463561
18359,0.0,-0.10820472
18369,0.0,-0.09426004
18379,0.0,-0.07414615
18389,0.0,0.16330975
18399,0.0,0.16386032
18409,0.0,-0.46221644
18419,0.0,0.056239665
18429,0.0,0.031789243
18439,0.0,-0.118336916
18449,0.0,0.17411602
18459,0.0,-0.6780829
18469,0.0,-0.14596093
18479,0.0,-0.43256766
18489,0.0,-0.50168717
18499,0.0,-0.29964238
18509,0.0,-0.56533265
18519,0.0,-0.5143883
18529,0.0,-0.8570785
18539,0.0,-0.64192796
18549,0.0,-0.73863465
18559,0.0,-0.5161428
18569,0.0,-0.45646518
18579,0.0,-0.1655184
18589,0.0,-0.36832023
18599,0.0,0.34050536
18609,0.0,0.12886608
18619,0.0,-0.0908401
18629,0.0,0.30834264
18639,0.0,0.94871986
18649,0.0,0.66695017
18659,0.0,0.15065295
18669,0.0,0.20304847
18679,0.0,-0.024286628
18689,0.0,0.25736612
18699,0.0,0.13186502
18709,0.0,0.2768007
18719,0.0,-0.09386146
18729,0.0,-0.028512418
18739,0.0,0.13544309
18749,0.0,0.09602511
18759,0.0,-0.09935391
18769,0.0,-0.21216965
18779,0.0,0.11112952
18789,0.0,0.1395669
18799,0.0,0.2992655
18809,0.0,0.021984518
18819,0.0,-0.48137558
18829,0.0,-0.25047255
18839,0.0,-0.6116521
18849,0.0,0.09513748
18859,0.0,-0.40056032
18869,0.0,-0.070438504
18879,0.0,0.21738642
18889,0.0,0.27547342
18899,0.0,0.19215363
18909,0.0,0.5505547
18919,0.0,0.47819817
18929,0.0,0.56591904
18939,0.0,0.42959464
18949,0.0,0.25016868
18959,0.0,-0.29696387
18969,0.0,-0.17686886
18979,0.0,-0.37556398
18989,0.0,-0.42658824
18999,0.0,-0.4712978
19009,0.0,-0.5853398
19019,0.0,-0.27991337
19029,0.0,-0.28867984
19039,0.0,-0.2766013
19049,0.0,-0.32237387
19059,0.0,-0.05636555
19069,0.0,-0.0053807497
19079,0.0,-0.014285624
19089,0.0,0.57189685
19099,0.0,0.35955983
19109,0.0,-0.005203247
19119,0.0,-0.083663166
19129,0.0,0.21562946
19139,0.0,0.30653626
19149,0.0,0.13231248
19159,0.0,0.072639525
19169,0.0,-0.38844115
19179,0.0,-0.18362212
19189,0.0,-0.0437544
19199,0.0,-0.006324351
19209,0.0,0.36866927
19219,0.0,0.3559639
19229,0.0,0.41120714
19239,0.0,1.138339
19249,0.0,1.0756738
19259,0.0,1.2197442
19269,0.0,0.94176024
19279,0.0,0.79473305
19289,0.0,0.57742494
19299,0.0,0.46031874
19309,0.0,0.22462386
19319,0.0,-0.21328104
19329,0.0,0.13775682
19339,0.0,-0.15533596
19349,0.0,-0.3003686
19359,0.0,-0.5218361
19369,0.0,-0.50887644
19379,0.0,-0.39293832
19389,0.0,0.10664475
19399,0.0,0.09013343
19409,0.0,-0.078852415
19419,0.0,0.3450876
19429,0.0,-0.165048
19439,0.0,0.84320664
19449,0.0,0.89010245
19459,0.0,1.0821352
19469,0.0,-0.078083456
19479,0.0,0.51587665
19489,0.0,0.16544431
19499,0.0,0.16162992
19509,0.0,0.06839627
19519,0.0,-0.32491195
19529,0.0,-0.1771496
19539,0.0,-0.25151062
19549,0.0,-0.7612605
19559,0.0,0.018759489
19569,0.0,-0.719623
19579,0.0,-0.4467997
19589,0.0,-0.016234517
19599,0.0,0.011482
19609,0.0,0.03220892
19619,0.0,-0.09171033
19629,0.0,-0.26050663
19639,0.0,-0.20093292
19649,0.0,0.054726005
19659,0.0,-0.024579525
19669,0.0,-0.22794431
19679,0.0,0.23308623
19689,0.0,0.71707416
19699,0.0,0.50520766
19709,0.0,0.13617212
19719,0.0,0.116334915
19729,0.0,0.23845279
19739,0.0,-0.26035482
19749,0.0,-0.36321497
19759,0.0,-0.029779494
19769,0.0,-0.062078476
19779,0.0,0.24225181
19789,0.0,0.087543786
19799,0.0,0.09999299
19809,0.0,0.09453666
19819,0.0,0.48133183
19829,0.0,0.40017474
19839,0.0,0.43805838
19849,0.0,0.1501444
19859,0.0,0.21830827
19869,0.0,0.14661813
19879,0.0,-0.21829653
19889,0.0,-0.233998
19899,0.0,-0.45227504
19909,0.0,-0.33246058
19919,0.0,-0.38328075
19929,0.0,-0.3597697
19939,0.0,-0.0549888
19949,0.0,0.14014041
19959,0.0,0.5248148
19969,0.0,0.32142246
19979,0.0,0.30818248
19989,0.0,0.2573616
19999,0.0,-0.1740976
20009,0.0,-0.08815074
20019,0.0,-0.47680026
20029,0.0,-0.16509867
20039,0.0,0.1887247
20049,0.0,0.22947103
20059,0.0,-0.013612211
20069,0.0,-0.11707717
20079,0.0,-0.27837175
20089,0.0,-0.025609493
20099,0.0,-0.0031439662
20109,0.0,0.02324164
20119,0.0,-0.10760844
20129,0.0,0.079318404
20139,0.0,0.51626855
20149,0.0,0.86392903
20159,0.0,1.1467173
20169,0.0,0.73396355
20179,0.0,0.77515924
20189,0.0,0.35454863
20199,0.0,0.74544567
20209,0.0,0.55462444
20219,0.0,0.90461177
20229,0.0,0.58582866
20239,0.0,0.26848775
20249,0.0,0.42561328
20259,0.0,0.15831822
20269,0.0,0.33983535
20279,0.0,0.14963144
20289,0.0,0.14317942
20299,0.0,0.36809957
20309,0.0,0.14391637
20319,0.0,-0.08553076
20329,0.0,-0.0058871508
20339,0.0,0.013350904
20349,0.0,0.07149905
20359,0.0,0.027625024
20369,0.0,0.18810034
20379,0.0,0.15687007
20389,0.0,-0.24593413
20399,0.0,0.129906
20409,0.0,0.097519636
20419,0.0,0.11451858
20429,0.0,0.2211057
20439,0.0,-0.06817466
20449,0.0,0.1585567
20459,0.0,0.16887963
20469,0.0,0.048622727
20479,0.0,-0.13255203
20489,0.0,-0.05070281
20499,0.0,-0.28434283
20509,0.0,-0.27592885
20519,0.0,-0.037372947
20529,0.0,0.16647285
20539,0.0,0.33773565
20549,0.0,-0.08184683
20559,0.0,0.13843709
20569,0.0,-0.014107883
20579,0.0,-0.41707486
20589,0.0,-0.5250255
20599,0.0,-0.20373935
20609,0.0,0.06312847
20619,0.0,-0.13475502
20629,0.0,-0.1990934
20639,0.0,-0.4289698
20649,0.0,-0.37771142
20659,0.0,-0.07359779
20669,0.0,-0.25316453
20679,0.0,0.02261585
20689,0.0,-0.3080333
20699,0.0,-0.079568565
20709,0.0,-0.29440188
20719,0.0,0.17147464
20729,0.0,0.016282499
20739,0.0,0.0866099
20749,0.0,-0.53912824
20759,0.0,-0.1792152
20769,0.0,-0.37274313
20779,0.0,-0.095733285
20789,0.0,-0.08922428
20799,0.0,-0.2413243
20809,0.0,-0.1570428
20819,0.0,-0.108944
20829,0.0,-0.27776736
20839,0.0,-0.72593284
20849,0.0,-0.57110906
20859,0.0,-0.0760982
20869,0.0,-0.09262043
20879,0.0,-0.12843472
20889,0.0,-0.21065867
20899,0.0,0.006544769
20909,0.0,-0.0053958297
20919,0.0,-0.50591916
20929,0.0,-0.15723926
20939,0.0,-0.15856367
20949,0.0,-0.1623419
20959,0.0,-0.24547285
20969,0.0,-0.275527
20979,0.0,-0.47302675
20989,0.0,-0.29172158
20999,0.0,-0.24827981
21009,0.0,0.054620743
21019,0.0,0.19409955
21029,0.0,-0.3269258
21039,0.0,-0.41160065
21049,0.0,-0.47087234
21059,0.0,-0.43540084
21069,0.0,0.12026763
21079,0.0,0.13754421
21089,0.0,0.051172793
21099,0.0,-0.0692929
21109,0.0,-0.04523611
21119,0.0,-0.08152288
21129,0.0,0.20291287
21139,0.0,0.44256806
21149,0.0,0.31715083
21159,0.0,0.17558378
21169,0.0,0.2579196
21179,0.0,0.18321174
21189,0.0,0.03430319
21199,0.0,0.78438973
21209,0.0,0.27730578
21219,0.0,0.056253135
21229,0.0,-0.31962043
21239,0.0,-0.035005867
21249,0.0,-0.4778412
21259,0.0,-0.26009357
21269,0.0,-0.10060078
21279,0.0,0.2713861
21289,0.0,-0.021700263
21299,0.0,-0.020264745
21309,0.0,-0.22964472
21319,0.0,0.09555298
21329,0.0,0.8323138
21339,0.0,0.8584188
21349,0.0,0.6774511
21359,0.0,0.501495
21369,0.0,0.75136197
21379,0.0,0.64785445
21389,0.0,0.53621006
21399,0.0,1.3303238
21409,0.0,1.4399097
21419,0.0,0.5729639
21429,0.0,0.29888248
21439,0.0,0.65900904
21449,0.0,0.41760242
21459,0.0,0.2654878
21469,0.0,-0.10889155
21479,0.0,-0.25194222
21489,0.0,-0.13634461
21499,0.0,-0.087551236
21509,0.0,-0.31433958
21519,0.0,0.07461083
21529,0.0,-0.028051376
21539,0.0,0.11656654
21549,0.0,-0.03296554
21559,0.0,0.100461006
21569,0.0,0.12647563
21579,0.0,-0.38920844
21589,0.0,-0.18891418
21599,0.0,0.09292954
21609,0.0,-0.23503858
21619,0.0,-0.46815348
21629,0.0,-0.27458775
21639,0.0,0.04218477
21649,0.0,-0.11296773
21659,0.0,-0.14135408
21669,0.0,-0.4652539
21679,0.0,-0.23530471
21689,0.0,-0.088899076
21699,0.0,0.07506764
21709,0.0,0.11152202
21719,0.0,0.53162956
21729,0.0,0.10211164
21739,0.0,-0.08427405
21749,0.0,0.28148115
21759,0.0,0.7180139
21769,0.0,0.9312297
21779,0.0,1.3102677
21789,0.0,1.0140913
21799,0.0,0.6501528
21809,0.0,0.3407712
21819,0.0,0.5792044
21829,0.0,0.16038215
21839,0.0,0.3364659
21849,0.0,-0.31398255
21859,0.0,-0.09444147
21869,0.0,0.12526661
21879,0.0,0.0014790297
21889,0.0,-0.5420391
21899,0.0,-0.3137319
21909,0.0,0.043542266
21919,0.0,0.23781252
21929,0.0,0.39453685
21939,0.0,0.4936751
21949,0.0,0.68499666
21959,0.0,0.24334049
21969,0.0,0.5945871
21979,0.0,0.82985866
21989,0.0,0.7667514
21999,0.0,0.5731512
22009,0.0,0.7531653
22019,0.0,0.74618703
22029,0.0,0.36864036
22039,0.0,0.3463722
22049,0.0,-0.05081576
22059,0.0,0.5896941
22069,1.0,0.30932766
22079,1.0,0.034682512
22089,1.0,0.14168584
22099,1.0,0.3716706
22109,1.0,0.46185684
22119,1.0,0.7691343
22129,1.0,1.3569472
22139,1.0,1.5831213
22149,1.0,2.0442932
22159,1.0,2.8045893
22169,1.0,3.403644
22179,1.0,3.2027397
22189,1.0,5.030047
22199,1.0,5.6176634
22209,1.0,5.916111
22219,1.0,6.7357187
22229,1.0,7.500108
22239,1.0,8.426435
22249,1.0,8.166139
22259,1.0,9.754952
22269,1.0,8.695732
22279,1.0,8.574377
22289,1.0,10.004032
22299,1.0,9.417477
22309,1.0,8.2779455
22319,1.0,7.777718
22329,1.0,6.021754
22339,1.0,4.8422327
22349,1.0,2.9520392
22359,1.0,1.8341782
22369,1.0,1.4139874
22379,1.0,0.7469245
22389,1.0,0.6667571
22399,1.0,0.17775983
22409,1.0,0.7042167
22419,1.0,1.0803064
22429,1.0,1.8425444
22439,1.0,2.9567728
22449,1.0,3.1625514
22459,1.0,4.5395555
22469,1.0,6.172979
22479,1.0,7.999691
22489,1.0,9.795292
22499,1.0,9.467941
22509,1.0,9.084668
22519,1.0,8.722634
22529,1.0,8.39612
22539,1.0,9.271826
22549,1.0,8.147848
22559,1.0,7.7120123
22569,1.0,6.9593086
22579,1.0,6.672368
22589,1.0,5.851416
22599,1.0,5.093487
22609,1.0,4.637721
22619,1.0,3.7152202
22629,1.0,3.3272686
22639,1.0,2.7792904
22649,1.0,2.6063333
22659,1.0,2.1074543
22669,1.0,1.3960845
22679,1.0,1.561659
22689,1.0,1.0363364
22699,1.0,0.70598996
22709,1.0,0.50980747
22719,1.0,0.38208455
22729,1.0,0.1958465
22739,0.0,-0.097556114
22749,0.0,0.25444055
22759,0.0,-0.061159432
22769,0.0,0.67225325
22779,0.0,0.6263528
22789,0.0,0.10006255
22799,0.0,-0.059634864
22809,0.0,-0.31539613
22819,0.0,-0.2934878
22829,0.0,0.024478078
22839,0.0,-0.362386
22849,0.0,-0.50347996
22859,0.0,-0.62839675
22869,0.0,-0.5536402
22879,0.0,-0.3938275
22889,0.0,-0.4806242
22899,0.0,-0.36256206
22909,0.0,-0.3524562
22919,0.0,-0.3772378
22929,0.0,-0.11798394
22939,0.0,-0.34149277
22949,0.0,0.22357959
22959,0.0,-0.08872235
22969,0.0,0.53774977
22979,0.0,0.28597242
22989,0.0,0.29358643
22999,0.0,0.08990139
23009,0.0,-0.0013403893
23019,0.0,0.11191422
23029,0.0,-0.23095155
23039,0.0,-0.29819852
23049,0.0,0.2900343
23059,0.0,-0.33653653
23069,0.0,-0.48496354
23079,0.0,-0.20732158
23089,0.0,-0.03344047
23099,0.0,-0.29739565
23109,0.0,-0.26259297
23119,0.0,-0.04859996
23129,0.0,-0.05568528
23139,0.0,-0.44196975
23149,0.0,-0.040548384
23159,0.0,-0.22413749
23169,0.0,0.32738048
23179,0.0,0.5492447
23189,0.0,-0.018849194
23199,0.0,0.28448838
23209,0.0,0.77840734
23219,0.0,1.3318249
23229,0.0,0.89267987
23239,0.0,0.6187023
23249,0.0,1.6119075
23259,0.0,1.8369255
23269,0.0,1.5220461
23279,0.0,1.7195647
23289,0.0,1.5342265
23299,0.0,1.0513761
23309,0.0,1.1761215
23319,0.0,1.0706111
23329,0.0,1.4127216
23339,0.0,1.3352299
23349,0.0,1.2494466
23359,0.0,0.66269165
23369,0.0,0.27656984
23379,0.0,0.5054788
23389,0.0,-0.044011354
23399,0.0,-0.18273598
23409,0.0,-0.52020675
23419,0.0,0.0004518032
23429,0.0,-0.38751572
23439,0.0,-0.047718704
23449,0.0,-0.7505134
23459,0.0,-0.55969286
23469,0.0,-0.5909643
23479,0.0,-0.20894879
23489,0.0,-0.003256619
23499,0.0,-0.18820876
23509,0.0,-0.01921916
23519,0.0,-0.026671827
23529,0.0,0.6901015
23539,0.0,0.373618
23549,0.0,0.7082827
23559,0.0,0.7679381
23569,0.0,0.3301109
23579,0.0,0.40854043
23589,0.0,0.43336082
23599,0.0,-0.074512064
23609,0.0,0.3287776
23619,0.0,0.79204947
23629,0.0,0.6825408
23639,0.0,0.96930146
23649,0.0,0.44271648
23659,0.0,0.24969459
23669,0.0,-0.06464988
23679,0.0,0.14914024
23689,0.0,0.32539344
23699,0.0,0.8354142
23709,0.0,0.3477714
23719,0.0,-0.1657129
23729,0.0,0.24771488
23739,0.0,0.38948905
23749,0.0,0.35512227
23759,0.0,0.7320852
23769,0.0,0.6415236
23779,0.0,0.23269004
23789,0.0,0.15572447
23799,0.0,0.0955289
23809,0.0,-0.33439583
23819,0.0,-0.2588358
23829,0.0,-0.3671329
23839,0.0,-0.6769143
23849,0.0,-0.46755403
23859,0.0,-0.2585985
23869,0.0,0.019797564
23879,0.0,-0.40322125
23889,0.0,0.24999142
23899,0.0,0.09865266
23909,0.0,0.31707543
23919,0.0,0.096166074
23929,0.0,-0.11229277
23939,0.0,0.24894106
23949,0.0,0.19563174
23959,0.0,0.76377237
23969,0.0,0.5797854
23979,0.0,0.686062
23989,0.0,0.467929
23999,0.0,0.7731906
24009,0.0,0.041763186
24019,0.0,0.1437186
24029,0.0,0.76119477
24039,0.0,0.7244183
24049,0.0,0.93393826
24059,0.0,0.53322256
24069,0.0,0.4754877
24079,0.0,0.4883268
24089,0.0,0.09296763
24099,0.0,0.19327956
24109,0.0,0.1514126
24119,0.0,-0.114693105
24129,0.0,-0.10036355
24139,0.0,-0.17245913
24149,0.0,-0.1010353
24159,0.0,-0.100182414
24169,0.0,-0.42791027
24179,0.0,0.03451121
24189,0.0,0.18987936
24199,0.0,0.46091068
24209,0.0,0.21475488
24219,0.0,0.031597257
24229,0.0,0.46413827
24239,0.0,0.25114197
24249,0.0,0.58961564
24259,0.0,0.3489346
24269,0.0,0.36478734
24279,0.0,0.5801064
24289,0.0,0.24137408
24299,0.0,-0.0191226
24309,0.0,0.28767443
24319,0.0,0.31368852
24329,0.0,0.40775663
24339,0.0,0.22761333
24349,0.0,0.10611081
24359,0.0,0.36483908
24369,0.0,-0.12079561
24379,0.0,-0.30076176
24389,0.0,-0.21945846
24399,0.0,0.037412465
24409,0.0,-0.15374029
24419,0.0,0.1535433
24429,0.0,0.4134305
24439,0.0,0.12176734
24449,0.0,0.46688485
24459,0.0,0.76502407
24469,0.0,-0.004707098
24479,0.0,-0.005130887
24489,0.0,-0.06944126
24499,0.0,-0.02795726
24509,0.0,-0.25293207
24519,0.0,-0.5033254
24529,0.0,0.1004923
24539,0.0,-0.110260546
24549,0.0,0.19478792
24559,0.0,0.6782372
24569,0.0,0.24636632
24579,0.0,0.035373688
24589,0.0,0.017304659
24599,0.0,0.14911932
24609,0.0,0.10066795
24619,0.0,-0.013497174
24629,0.0,-0.31783032
24639,0.0,-0.13237703
24649,0.0,-0.51721984
24659,0.0,-0.38268715
24669,0.0,-0.047415555
24679,0.0,0.24371845
24689,0.0,0.63222885
24699,0.0,0.1567682
24709,0.0,0.089645565
24719,0.0,0.019547522
24729,0.0,-0.3010149
24739,0.0,-0.43754786
24749,0.0,-0.24487758
24759,0.0,-0.5589862
24769,0.0,-0.5514277
24779,0.0,-0.6778486
24789,0.0,-0.72840756
24799,0.0,-0.29967147
24809,0.0,-0.3246137
24819,0.0,0.1817143
24829,0.0,-0.29370552
24839,0.0,-0.04937774
24849,0.0,-0.13838822
24859,0.0,0.32034665
24869,0.0,0.38828635
24879,0.0,0.9991345
24889,0.0,1.1159816
24899,0.0,1.2237971
24909,0.0,1.0197444
24919,0.0,1.2991269
24929,0.0,1.295556
24939,0.0,0.50329477
24949,0.0,0.72497946
24959,0.0,0.39467853
24969,0.0,0.47217345
24979,0.0,0.54250807
24989,0.0,0.779942
24999,0.0,-0.07359576
25009,0.0,-0.0014691949
25019,0.0,0.30668557
25029,0.0,-0.07483339
25039,0.0,0.18857402
25049,0.0,-0.3383395
25059,0.0,-0.12488705
25069,0.0,-0.43052012
25079,0.0,-0.05754131
25089,0.0,0.0464288
25099,0.0,0.12179345
25109,0.0,0.093351126
25119,0.0,0.17715907
25129,0.0,0.059563875
25139,0.0,0.056761026
25149,0.0,-0.11499637
25159,0.0,0.09733254
25169,0.0,-0.3012569
25179,0.0,-0.01496613
25189,0.0,0.044238627
25199,0.0,0.115834355
25209,0.0,0.12549943
25219,0.0,0.22497499
25229,0.0,0.21278495
25239,0.0,-0.11690253
25249,0.0,0.042336106
25259,0.0,-0.098327994
25269,0.0,0.4704507
25279,0.0,0.70379364
25289,0.0,0.07183719
25299,0.0,0.012390554
25309,0.0,-0.054453373
25319,0.0,-0.3277123
25329,0.0,-0.3184535
25339,0.0,-0.9058028
25349,0.0,-0.6246977
25359,0.0,-0.357592
25369,0.0,-0.5853504
25379,0.0,-0.27179027
25389,0.0,0.21057779
25399,0.0,0.26669377
25409,0.0,0.32951194
25419,0.0,0.2142824
25429,0.0,0.2637663
25439,0.0,0.32083398
25449,0.0,-0.060876787
25459,0.0,0.39507884
25469,0.0,0.5992299
25479,0.0,0.6630824
25489,0.0,0.71797234
25499,0.0,0.25117397
25509,0.0,0.27809352
25519,0.0,-0.1796779
25529,0.0,-0.100280225
25539,0.0,-0.4705193
25549,0.0,-0.4289084
25559,0.0,-0.27121216
25569,0.0,-0.24480784
25579,0.0,-0.37591046
25589,0.0,0.06711835
25599,0.0,-0.18294823
25609,0.0,-0.43361378
25619,0.0,-0.32028747
25629,0.0,-0.31944168
25639,0.0,-0.14086926
25649,0.0,-0.4936533
25659,0.0,-0.22855896
25669,0.0,-0.1150012
25679,0.0,-0.09113419
25689,0.0,-0.27048433
25699,0.0,-0.56787354
25709,0.0,-0.11827779
25719,0.0,0.24016917
25729,0.0,0.40889663
25739,0.0,-0.3551709
25749,0.0,-0.14089572
25759,0.0,0.03940749
25769,0.0,0.52369773
25779,0.0,0.23347282
25789,0.0,0.6932367
25799,0.0,0.04342562
25809,0.0,-0.078712225
25819,0.0,0.016581476
25829,0.0,0.15543032
25839,0.0,-0.15770155
25849,0.0,-0.24326444
25859,0.0,-0.23003173
25869,0.0,-0.23723364
25879,0.0,-0.28047937
25889,0.0,-0.3847344
25899,0.0,-0.4870457
25909,0.0,0.020947158
25919,0.0,-0.29757303
25929,0.0,-0.45033813
25939,0.0,-0.24795961
25949,0.0,-0.4834392
25959,0.0,-0.77044773
25969,0.0,-0.20446837
25979,0.0,-0.3306104
25989,0.0,-0.07097036
25999,0.0,-0.10831666
26009,0.0,0.59117454
26019,0.0,0.4711665
26029,0.0,1.1765904
26039,0.0,0.6718937
26049,0.0,0.2560755
26059,0.0,-0.08130932
26069,0.0,0.049395323
26079,0.0,-0.031389534
26089,0.0,0.1696409
26099,0.0,0.012948632
26109,0.0,0.0777598
26119,0.0,-0.08261925
26129,0.0,0.32127243
26139,0.0,0.4998756
26149,0.0,0.57060003
26159,0.0,0.32470882
26169,0.0,0.35857552
26179,0.0,0.060055375
26189,0.0,-0.055092692
26199,0.0,0.2922364
26209,0.0,0.004217863
26219,0.0,0.3878553
26229,0.0,0.8065589
26239,0.0,0.32801276
26249,0.0,-0.11109716
26259,0.0,-0.36283678
26269,0.0,-0.46452874
26279,0.0,0.21970332
26289,0.0,0.47531635
26299,0.0,0.71494865
26309,0.0,0.3771273
26319,0.0,0.49345797
26329,0.0,0.17836696
26339,0.0,-0.062217355
26349,0.0,-0.5169969
26359,0.0,0.08639586
26369,0.0,-0.0027886033
26379,0.0,-0.058252513
26389,0.0,0.24118769
26399,0.0,0.33764327
26409,0.0,0.14795059
26419,0.0,0.20560575
26429,0.0,-0.0047632456
26439,0.0,-0.14693499
26449,0.0,-0.050805867
26459,0.0,-0.22711158
26469,0.0,-0.25918633
26479,0.0,-0.3607369
26489,0.0,0.23443896
26499,0.0,0.58687484
26509,0.0,0.14633942
26519,0.0,-0.13206637
26529,0.0,0.5146164
26539,0.0,0.19575709
26549,0.0,-0.08085585
26559,0.0,-0.34365255
26569,0.0,-0.45407355
26579,0.0,-0.35167563
26589,0.0,-0.38690442
26599,0.0,-0.22406083
26609,0.0,-0.16767979
26619,0.0,0.2633674
26629,0.0,0.42711693
26639,0.0,0.7209235
26649,0.0,0.43673724
26659,0.0,0.60789925
26669,0.0,0.33570844
26679,0.0,0.3188594
26689,0.0,0.21473807
26699,0.0,-0.27342534
26709,0.0,-0.32678717
26719,0.0,-0.35656184
26729,0.0,-0.42420125
26739,0.0,-0.06738591
26749,0.0,-0.79342806
26759,0.0,-0.6977703
26769,0.0,-0.15309292
26779,0.0,-0.23305732
26789,0.0,-0.16141027
26799,0.0,-0.118910074
26809,0.0,-0.35333246
26819,0.0,0.3540603
26829,0.0,0.9112744
26839,0.0,0.6909227
26849,0.0,0.65712816
26859,0.0,0.74854106
26869,0.0,0.7445681
26879,0.0,0.41717768
26889,0.0,0.28857
26899,0.0,0.22602797
26909,0.0,-0.37825888
26919,0.0,-0.26968586
26929,0.0,0.07264924
26939,0.0,0.09346706
26949,0.0,0.027509153
26959,0.0,0.20305377
26969,0.0,0.3074907
26979,0.0,0.31485587
26989,0.0,0.5592878
26999,0.0,0.28767073
27009,0.0,0.40488362
27019,0.0,0.09106696
27029,0.0,0.3033576
27039,0.0,0.2824862
27049,0.0,0.11771828
27059,0.0,0.5936841
27069,0.0,0.3627255
27079,0.0,0.34143186
27089,0.0,0.27379996
27099,0.0,0.21982515
27109,0.0,0.12701774
27119,0.0,-0.10220903
27129,0.0,0.34762812
27139,0.0,0.013643026
27149,0.0,0.31217963
27159,0.0,-0.12001377
27169,0.0,-0.0013031363
27179,0.0,0.16898596
27189,0.0,0.3180135
27199,0.0,0.6734267
27209,0.0,0.86813396
27219,0.0,0.45050412
27229,0.0,0.56592464
27239,0.0,1.0028571
27249,0.0,0.9563651
27259,1.0,1.6284096
27269,1.0,1.5685927
27279,1.0,1.2714298
27289,1.0,0.55354375
27299,1.0,1.0679225
27309,1.0,1.4479411
27319,1.0,1.9125547
27329,1.0,1.7407404
27339,1.0,1.9088075
27349,1.0,2.3274598
27359,1.0,3.2681322
27369,1.0,3.3408618
27379,1.0,3.5447247
27389,1.0,3.8327756
27399,1.0,4.6106176
27409,1.0,4.900757
27419,1.0,5.584157
27429,1.0,6.792171
27439,1.0,7.5815916
27449,1.0,8.493183
27459,1.0,8.928371
27469,1.0,8.7666
27479,1.0,8.7048
27489,1.0,8.035559
27499,1.0,10.127935
27509,1.0,7.8422217
27519,1.0,7.470413
27529,1.0,5.741771
27539,1.0,4.945485
27549,1.0,2.697322
27559,1.0,1.7067994
27569,1.0,1.102459
27579,1.0,0.7302005
27589,1.0,0.52787656
27599,1.0,0.43833464
27609,1.0,0.7036039
27619,1.0,1.6793045
27629,1.0,1.9024502
27639,1.0,3.1104918
27649,1.0,4.740858
27659,1.0,6.0632706
27669,1.0,7.259259
27679,1.0,8.038626
27689,1.0,10.185051
27699,1.0,9.06678
27709,1.0,8.922726
27719,1.0,8.63269
27729,1.0,8.597557
27739,1.0,9.097152
27749,1.0,7.35262
27759,1.0,6.5404015
27769,1.0,6.107871
27779,1.0,5.364332
27789,1.0,4.829437
27799,1.0,4.142491
27809,1.0,4.42272
27819,1.0,4.0080943
27829,1.0,3.2224352
27839,1.0,2.7439835
27849,1.0,2.0823178
27859,1.0,1.8719361
27869,1.0,1.2219119
27879,1.0,1.1871471
27889,1.0,0.91895556
27899,1.0,0.6352548
27909,1.0,0.3383385
27919,1.0,0.4528299
27929,1.0,0.22867864
27939,0.0,0.022616088
27949,0.0,0.1708352
27959,0.0,-0.12815607
27969,0.0,-0.12256986
27979,0.0,0.5343254
27989,0.0,0.4526593
27999,0.0,0.6688986
28009,0.0,0.28312165
28019,0.0,0.038602352
28029,0.0,-0.08868265
28039,0.0,0.42346245
28049,0.0,-0.08582759
28059,0.0,0.13750744
28069,0.0,0.86900204
28079,0.0,0.9086586
28089,0.0,0.62578523
28099,0.0,0.6390039
28109,0.0,0.7186681
28119,0.0,0.58348703
28129,0.0,0.5020639
28139,0.0,0.4177121
28149,0.0,0.2551797
28159,0.0,0.17184657
28169,0.0,-0.031177163
28179,0.0,0.102781594
28189,0.0,-0.038656652
28199,0.0,-0.12236452
28209,0.0,-0.48970526
28219,0.0,-0.515343
28229,0.0,-0.4298985
28239,0.0,-0.48351973
28249,0.0,-0.21103811
28259,0.0,-0.31764543
28269,0.0,-0.18269414
28279,0.0,-0.47660124
28289,0.0,-0.13500512
28299,0.0,-0.045538485
28309,0.0,-0.58348733
28319,0.0,-0.24005568
28329,0.0,-0.30968624
28339,0.0,-0.20575571
28349,0.0,0.07085389
28359,0.0,-0.16836852
28369,0.0,-0.0568285
28379,0.0,-0.25372344
28389,0.0,-0.03678024
28399,0.0,-0.10190463
28409,0.0,0.31757057
28419,0.0,0.3822707
28429,0.0,0.14690167
28439,0.0,0.46297657
28449,0.0,0.8272386
28459,0.0,0.6516216
28469,0.0,0.6664517
28479,0.0,0.54220605
28489,0.0,-0.10639489
28499,0.0,0.43227524
28509,0.0,0.77508754
28519,0.0,0.7225602
28529,0.0,0.22640502
28539,0.0,0.035696268
28549,0.0,-0.01679182
28559,0.0,0.039343
28569,0.0,0.4401551
28579,0.0,0.16957879
28589,0.0,0.30378878
28599,0.0,-0.23182458
28609,0.0,-0.16285658
28619,0.0,0.14381915
28629,0.0,0.28990597
28639,0.0,0.73806655
28649,0.0,1.4203984
28659,0.0,0.61238825
28669,0.0,0.85802126
28679,0.0,0.61184466
28689,0.0,0.5386779
28699,0.0,1.0657208
28709,0.0,1.0288802
28719,0.0,0.9066081
28729,0.0,0.789016
28739,0.0,-0.08157176
28749,0.0,-0.4153564
28759,0.0,-0.13221687
28769,0.0,-0.16341275
28779,0.0,-0.4285487
28789,0.0,-0.57806647
28799,0.0,-0.45186943
28809,0.0,-0.7025921
28819,0.0,-0.59045386
28829,0.0,-0.745456
28839,0.0,-0.28428078
28849,0.0,-0.33516848
28859,0.0,-0.31311136
28869,0.0,-0.19343722
28879,0.0,-0.22317004
28889,0.0,0.36959553
28899,0.0,0.43081045
28909,0.0,-0.070242524
28919,0.0,-0.12735248
28929,0.0,-0.035384536
28939,0.0,-0.17437017
28949,0.0,-0.19005865
28959,0.0,-0.24584651
28969,0.0,-0.17924964
28979,0.0,-0.46654242
28989,0.0,-0.3674693
28999,0.0,-0.4708134
29009,0.0,-0.29800087
29019,0.0,-0.48614895
29029,0.0,-0.14616072
29039,0.0,-0.052185
29049,0.0,-0.219863
29059,0.0,-0.4018432
29069,0.0,-0.40117514
29079,0.0,-0.27454472
29089,0.0,-0.2097646
29099,0.0,-0.32584262
29109,0.0,-0.19784665
29119,0.0,-0.052817345
29129,0.0,0.024140596
29139,0.0,-0.16207373
29149,0.0,-0.19930643
29159,0.0,-0.19062269
29169,0.0,-0.108150005
29179,0.0,0.010679245
29189,0.0,0.13880372
29199,0.0,0.3840449
29209,0.0,0.18042159
29219,0.0,0.06593311
29229,0.0,0.2670474
29239,0.0,0.45686525
29249,0.0,0.74120545
29259,0.0,-0.09553522
29269,0.0,-0.00451082
29279,0.0,0.102775335
29289,0.0,0.10154945
29299,0.0,0.48906612
29309,0.0,-0.18427539
29319,0.0,0.15530556
29329,0.0,0.28729808
29339,0.0,-0.13008851
29349,0.0,0.24638772
29359,0.0,0.10945201
29369,0.0,-0.16370118
29379,0.0,0.11761558
29389,0.0,-0.31645006
29399,0.0,0.026018798
29409,0.0,-0.030576408
29419,0.0,-0.15690303
29429,0.0,0.06679225
29439,0.0,0.025381684
29449,0.0,0.24457532
29459,0.0,0.47415847
29469,0.0,0.48304003
29479,0.0,0.59812784
29489,0.0,0.3151477
29499,0.0,0.5840879
29509,0.0,0.74372685
29519,0.0,0.85158306
29529,0.0,0.7623464
29539,0.0,0.3302822
29549,0.0,0.16962653
29559,0.0,-0.23624331
29569,0.0,-0.1172778
29579,0.0,0.1076774
29589,0.0,0.2553025
29599,0.0,0.055472434
29609,0.0,-0.1482709
29619,0.0,0.06652206
29629,0.0,-0.31539154
29639,0.0,-0.48503935
29649,0.0,-0.46194947
29659,0.0,-0.33333415
29669,0.0,-0.34251428
29679,0.0,-0.32108134
29689,0.0,-0.7311055
29699,0.0,-0.47765422
29709,0.0,-0.18055457
29719,0.0,-0.44944882
29729,0.0,-0.09755278
29739,0.0,-0.40503907
29749,0.0,-0.06687087
29759,0.0,-0.24229264
29769,0.0,-0.13145363
29779,0.0,0.16398722
29789,0.0,0.109773755
29799,0.0,-0.06278521
29809,0.0,-0.10138005
29819,0.0,-0.62163985
29829,0.0,-0.51073486
29839,0.0,-0.20202196
29849,0.0,-0.42317837
29859,0.0,0.13812166
29869,0.0,0.18003911
29879,0.0,0.17822939
29889,0.0,-0.23029661
29899,0.0,-0.289568
29909,0.0,-0.55981094
29919,0.0,-0.06932771
29929,0.0,-0.19815123
29939,0.0,0.28717554
29949,0.0,0.24416316
29959,0.0,0.09245926
29969,0.0,0.6932504
29979,0.0,0.5169943
29989,0.0,0.7982556
29999,0.0,0.80901766
30009,0.0,0.6807075
30019,0.0,0.5261325
30029,0.0,0.49559814
30039,0.0,0.21449697
30049,0.0,0.2584983
30059,0.0,0.56453335
30069,0.0,0.2548253
30079,0.0,0.2812298
30089,0.0,-0.11556834
30099,0.0,0.29270184
30109,0.0,-0.05999279
30119,0.0,0.19295233
30129,0.0,0.021194816
30139,0.0,-0.18817711
30149,0.0,-0.023163438
30159,0.0,0.04904914
30169,0.0,0.043821692
30179,0.0,-0.04368925
30189,0.0,-0.2626394
30199,0.0,-0.6667448
30209,0.0,-0.16406912
30219,0.0,0.2588572
30229,0.0,0.26900393
30239,0.0,0.033103824
30249,0.0,0.21675098
30259,0.0,-0.19044006
30269,0.0,-0.31151474
30279,0.0,0.17847782
30289,0.0,0.19522709
30299,0.0,0.4191724
30309,0.0,-0.1306243
30319,0.0,-0.023467302
30329,0.0,-0.071567655
30339,0.0,-0.20060903
30349,0.0,0.005292058
30359,0.0,-0.11864543
30369,0.0,-0.051667213
30379,0.0,-0.2356723
30389,0.0,-0.58290035
30399,0.0,-0.26946378
30409,0.0,-0.47297937
30419,0.0,-0.26617557
30429,0.0,-0.5290649
30439,0.0,-0.20671421
30449,0.0,-0.11284077
30459,0.0,0.1635974
30469,0.0,0.15507972
30479,0.0,0.064797044
30489,0.0,-0.2193402
30499,0.0,-0.36868256
30509,0.0,0.041757345
30519,0.0,-0.20117629
30529,0.0,0.025697887
30539,0.0,-0.29488456
30549,0.0,-0.32284784
30559,0.0,0.13500017
30569,0.0,-0.2262153
30579,0.0,0.21415305
30589,0.0,-0.012670338
30599,0.0,-0.034308553
30609,0.0,0.15820593
30619,0.0,0.34963912
30629,0.0,0.22580051
30639,0.0,-0.121739745
30649,0.0,0.063784
30659,0.0,0.42747676
30669,0.0,0.5600481
30679,0.0,0.28354996
30689,0.0,-0.30433857
30699,0.0,-0.27174932
30709,0.0,-0.065304756
30719,0.0,0.23826957
30729,0.0,-0.035251617
30739,0.0,0.014279187
30749,0.0,0.24384928
30759,0.0,0.22030962
30769,0.0,0.7549799
30779,0.0,1.1176054
30789,0.0,0.515098
30799,0.0,0.45666885
30809,0.0,-0.03526032
30819,0.0,0.11045891
30829,0.0,-0.28729665
30839,0.0,0.04185939
30849,0.0,-0.094302595
30859,0.0,-0.039212108
30869,0.0,-0.20541602
30879,0.0,-0.38565415
30889,0.0,-0.16267282
30899,0.0,0.078823805
30909,0.0,-0.07179618
30919,0.0,0.16090328
30929,0.0,-0.0012834072
30939,0.0,0.3001405
30949,0.0,0.15808207
30959,0.0,0.18019837
30969,0.0,0.45629817
30979,0.0,0.38681734
30989,0.0,0.34791034
30999,0.0,0.25349534
31009,0.0,0.023195863
31019,0.0,-0.16044617
31029,0.0,-0.18320578
31039,0.0,-0.22463977
31049,0.0,0.1417579
31059,0.0,0.8275774
31069,0.0,0.56032515
31079,0.0,0.32707632
31089,0.0,0.10547376
31099,0.0,0.24839878
31109,0.0,0.31433743
31119,0.0,0.49405593
31129,0.0,0.24646407
31139,0.0,0.3787194
31149,0.0,-0.21807027
31159,0.0,-0.07858318
31169,0.0,0.16493487
31179,0.0,0.74349403
31189,0.0,0.96480054
31199,0.0,0.8697909
31209,0.0,1.4867756
31219,0.0,1.445676
31229,0.0,1.1116161
31239,0.0,0.5257316
31249,0.0,1.777549
31259,0.0,1.8170476
31269,0.0,1.7495043
31279,0.0,1.0984495
31289,1.0,0.840102
31299,1.0,0.59010863
31309,1.0,0.52013606
31319,1.0,0.65262944
31329,1.0,0.31550044
31339,1.0,1.4244511
31349,1.0,1.878328
31359,1.0,1.7925861
31369,1.0,2.4034274
31379,1.0,3.4340377
31389,1.0,3.9788728
31399,1.0,3.198706
31409,1.0,4.2820106
31419,1.0,4.3039875
31429,1.0,5.7526264
31439,1.0,5.792148
31449,1.0,6.611416
31459,1.0,7.4136896
31469,1.0,7.6991625
31479,1.0,8.909195
31489,1.0,8.576497
31499,1.0,8.460833
31509,1.0,8.863243
31519,1.0,8.6836605
31529,1.0,9.182325
31539,1.0,9.238412
31549,1.0,6.910534
31559,1.0,6.3677244
31569,1.0,4.742917
31579,1.0,2.8113503
31589,1.0,2.0697143
31599,1.0,1.3035212
31609,1.0,0.5175631
31619,1.0,0.3967808
31629,1.0,0.5810582
31639,1.0,0.78372097
31649,1.0,1.3322284
31659,1.0,1.5117381
31669,1.0,2.0951474
31679,1.0,3.3539329
31689,1.0,5.207544
31699,1.0,6.590343
31709,1.0,8.827461
31719,1.0,9.728208
31729,1.0,9.082493
31739,1.0,8.877538
31749,1.0,8.508404
31759,1.0,8.538973
31769,1.0,9.698274
31779,1.0,8.215048
31789,1.0,7.134608
31799,1.0,6.6707373
31809,1.0,5.578887
31819,1.0,5.0432453
31829,1.0,5.2715855
31839,1.0,4.209138
31849,1.0,4.3148623
31859,1.0,3.4870238
31869,1.0,3.646171
31879,1.0,3.1127136
31889,1.0,2.2040813
31899,1.0,2.5410483
31909,1.0,1.5139804
31919,1.0,1.0617204
31929,1.0,0.6480245
31939,1.0,0.74757177
31949,1.0,0.30588847
31959,0.0,0.39311135
31969,0.0,0.22012752
31979,0.0,0.35339016
31989,0.0,0.23144418
31999,0.0,-0.022580266
32009,0.0,0.026852846
32019,0.0,-0.054242313
32029,0.0,-0.12929887
32039,0.0,-0.37506992
32049,0.0,-0.18970788
32059,0.0,-0.25564218
32069,0.0,-0.23090744
32079,0.0,-0.1732567
32089,0.0,-0.29265153
32099,0.0,-0.21211553
32109,0.0,0.05960208
32119,0.0,0.06411171
32129,0.0,-0.07699996
32139,0.0,-0.1048221
32149,0.0,0.7485115
32159,0.0,0.3420375
32169,0.0,0.19320935
32179,0.0,0.4637758
32189,0.0,0.10491431
32199,0.0,-0.044852138
32209,0.0,-0.32555848
32219,0.0,-0.23781472
32229,0.0,-0.6415805
32239,0.0,-0.45088798
32249,0.0,0.09110296
32259,0.0,0.08525628
32269,0.0,0.21788138
32279,0.0,0.29927933
32289,0.0,-0.02038312
32299,0.0,0.2860341
32309,0.0,0.21608299
32319,0.0,0.12179506
32329,0.0,0.34336442
32339,0.0,0.7803449
32349,0.0,0.7188744
32359,0.0,0.41648185
32369,0.0,0.51546925
32379,0.0,0.32441896
32389,0.0,0.5956113
32399,0.0,0.25160336
32409,0.0,0.055192232
32419,0.0,-0.2949338
32429,0.0,-0.4735343
32439,0.0,-0.313501
32449,0.0,-0.06891686
32459,0.0,0.06722289
32469,0.0,-0.18232715
32479,0.0,-0.060592353
32489,0.0,0.029568136
32499,0.0,-0.020050943
32509,0.0,-0.06543487
32519,0.0,-0.19164348
32529,0.0,0.3389495
32539,0.0,0.10593444
32549,0.0,0.05776769
32559,0.0,-0.25415814
32569,0.0,-0.12099534
32579,0.0,0.1827411
32589,0.0,0.015856504
32599,0.0,-0.003442824
32609,0.0,0.0025862455
32619,0.0,-0.32953495
32629,0.0,-0.26523852
32639,0.0,-0.4376192
32649,0.0,-0.19021904
32659,0.0,-0.40162575
32669,0.0,-0.4061123
32679,0.0,-0.5337851
32689,0.0,-0.491898
32699,0.0,-0.62836856
32709,0.0,-0.8531822
32719,0.0,-0.16496241
32729,0.0,-0.21782374
32739,0.0,0.04312694
32749,0.0,-0.23607343
32759,0.0,-0.23436838
32769,0.0,0.07315582
32779,0.0,-0.4376096
32789,0.0,-0.3726021
32799,0.0,-0.110456645
32809,0.0,0.022849739
32819,0.0,0.06001669
32829,0.0,-0.37445402
32839,0.0,-0.36122328
32849,0.0,-0.44696558
32859,0.0,-0.2099939
32869,0.0,-0.36557293
32879,0.0,-0.36998844
32889,0.0,-0.37171745
32899,0.0,-0.81229806
32909,0.0,-0.2589426
32919,0.0,-0.4425339
32929,0.0,0.0809266
32939,0.0,-0.037207425
32949,0.0,-0.07456851
32959,0.0,0.005969107
32969,0.0,0.052838802
32979,0.0,0.11397433
32989,0.0,0.2654754
32999,0.0,0.14034861
33009,0.0,0.11552566
33019,0.0,-0.3650384
33029,0.0,-0.2730884
33039,0.0,-0.5941169
33049,0.0,-0.7819469
33059,0.0,-0.49258012
33069,0.0,-0.17552418
33079,0.0,0.20374566
33089,0.0,-0.008765876
33099,0.0,-0.03838384
33109,0.0,0.0006123185
33119,0.0,0.0035566688
33129,0.0,0.4095708
33139,0.0,0.9235287
33149,0.0,0.5579159
33159,0.0,0.47330344
33169,0.0,0.5547708
33179,0.0,0.82205486
33189,0.0,0.81439465
33199,0.0,0.6086182
33209,0.0,1.1047108
33219,0.0,0.58245176
33229,0.0,0.5406687
33239,0.0,-0.101320565
33249,0.0,-0.13855958
33259,0.0,-0.31384647
33269,0.0,0.052550614
33279,0.0,-0.34512103
33289,0.0,-0.108772874
33299,0.0,-0.09597051
33309,0.0,-0.061257422
33319,0.0,-0.02754414
33329,0.0,0.24587244
33339,0.0,0.16924703
33349,0.0,0.41017056
33359,0.0,0.053729177
33369,0.0,0.034180164
33379,0.0,0.40207094
33389,0.0,0.6048764
33399,0.0,0.8937352
33409,0.0,1.2173643
33419,0.0,0.891313
33429,0.0,1.0258242
33439,0.0,0.36917502
33449,0.0,0.20034242
33459,0.0,0.15237582
33469,0.0,0.42402464
33479,0.0,0.17058897
33489,0.0,-0.13469493
33499,0.0,-0.19609344
33509,0.0,-0.07613146
33519,0.0,-0.24910116
33529,0.0,0.19541901
33539,0.0,-0.113040626
33549,0.0,0.24393147
33559,0.0,-0.19117016
33569,0.0,0.27198875
33579,0.0,0.055913508
33589,0.0,-0.2580276
33599,0.0,-0.30472887
33609,0.0,-0.17957473
33619,0.0,-0.2766993
33629,0.0,-0.113835335
33639,0.0,-0.29326332
33649,0.0,-0.2091409
33659,0.0,0.21617681
33669,0.0,0.016922176
33679,0.0,0.32510203
33689,0.0,0.23753506
33699,0.0,-0.06380314
33709,0.0,-0.31920618
33719,0.0,-0.07059145
33729,0.0,0.2604776
33739,0.0,0.08150971
33749,0.0,0.005895078
33759,0.0,-0.2527427
33769,0.0,-0.110972285
33779,0.0,0.028013587
33789,0.0,-0.36101496
33799,0.0,-0.25142604
33809,0.0,-0.41580945
33819,0.0,-0.14802015
33829,0.0,-0.35786378
33839,0.0,-0.1887222
33849,0.0,-0.2902146
33859,0.0,0.06142813
33869,0.0,-0.17806649
33879,0.0,-0.53498685
33889,0.0,-0.72291553
33899,0.0,-0.57557034
33909,0.0,-0.3281058
33919,0.0,-0.6614824
33929,0.0,-0.34511495
33939,0.0,-0.61595386
33949,0.0,-0.43140626
33959,0.0,-0.41101873
33969,0.0,-0.23134941
33979,0.0,-0.59875524
33989,0.0,-0.2240181
33999,0.0,-0.23864144
34009,0.0,-0.29014558
34019,0.0,-0.1385895
34029,0.0,-0.2863301
34039,0.0,-0.2259255
34049,0.0,-0.3351069
34059,0.0,0.12494105
34069,0.0,0.02481103
34079,0.0,-0.15622962
34089,0.0,0.30772597
34099,0.0,0.23738319
34109,0.0,-0.052666903
34119,0.0,0.12726963
34129,0.0,-0.18038243
34139,0.0,-0.5090037
34149,0.0,-0.099695385
34159,0.0,-0.11821109
34169,0.0,-0.23753333
34179,0.0,-0.17969579
34189,0.0,-0.3457793
34199,0.0,-0.5429221
34209,0.0,-0.58364516
34219,0.0,-0.49279898
34229,0.0,-0.40402067
34239,0.0,-0.3596303
34249,0.0,-0.6359462
34259,0.0,-0.5987276
34269,0.0,-0.7728843
34279,0.0,-0.38786954
34289,0.0,-0.16001546
34299,0.0,-0.231902
34309,0.0,-0.2076506
34319,0.0,-0.34590548
34329,0.0,-0.47056282
34339,0.0,-0.37810397
34349,0.0,-0.03402108
34359,0.0,0.74327195
34369,0.0,0.49742842
34379,0.0,0.40162164
34389,0.0,0.681795
34399,0.0,0.7452817
34409,0.0,0.41143924
34419,0.0,0.5802123
34429,0.0,0.591037
34439,0.0,0.63236713
34449,0.0,0.21849215
34459,0.0,0.15634519
34469,0.0,0.20310426
34479,0.0,0.01826936
34489,0.0,0.30425096
34499,0.0,-0.101178885
34509,0.0,-0.22715366
34519,0.0,-0.4480185
34529,0.0,-0.5007568
34539,0.0,-0.23879778
34549,0.0,-0.55539984
34559,0.0,-0.57524747
34569,0.0,-0.45942813
34579,0.0,0.24537283
34589,0.0,-0.086306214
34599,0.0,-0.31358725
34609,0.0,0.14529085
34619,0.0,0.05717981
34629,0.0,0.20681828
34639,0.0,0.115065575
34649,0.0,0.14560324
34659,0.0,-0.7049371
34669,0.0,-0.18866706
34679,0.0,-0.2858389
34689,0.0,0.1277529
34699,0.0,-0.26531333
34709,0.0,0.03062439
34719,0.0,-0.17892933
34729,0.0,0.036052406
34739,0.0,-0.28928918
34749,0.0,-0.29377514
34759,0.0,-0.3226604
34769,0.0,0.19746375
34779,0.0,-0.12757748
34789,0.0,-0.053118348
34799,0.0,-0.21574217
34809,0.0,0.085422516
34819,0.0,-0.16946173
34829,0.0,-0.3153119
34839,0.0,-0.44267058
34849,0.0,-0.37980956
34859,0.0,-0.21869326
34869,0.0,-0.05647278
34879,0.0,-0.6786651
34889,0.0,-0.5674337
34899,0.0,-0.70002615
34909,0.0,-0.22589737
34919,0.0,-0.2390948
34929,0.0,-0.60974044
34939,0.0,-0.77643913
34949,0.0,-0.8076696
34959,0.0,-0.5879789
34969,0.0,-0.1381759
34979,0.0,-0.29360104
34989,0.0,-0.32156956
34999,0.0,0.04019046
35009,0.0,0.021458924
35019,0.0,0.033002853
35029,0.0,0.33276653
35039,0.0,0.21292084
35049,0.0,-0.07037544
35059,0.0,-0.26976198
35069,0.0,-0.14123714
35079,0.0,-0.28315258
35089,0.0,-0.35394096
35099,0.0,-0.27838665
35109,0.0,0.12503344
35119,0.0,-0.5122027
35129,0.0,0.07840395
35139,0.0,-0.11786014
35149,0.0,0.11642212
35159,0.0,-0.19563454
35169,0.0,-0.07745248
35179,0.0,0.109423995
35189,0.0,0.20806271
35199,0.0,0.44261968
35209,0.0,0.2499547
35219,0.0,-0.04708141
35229,0.0,-0.080595136
35239,0.0,0.23107594
35249,0.0,0.29924297
35259,0.0,0.44105536
35269,0.0,-0.020510554
35279,0.0,0.22686237
35289,0.0,-0.21169865
35299,0.0,-0.014413714
35309,0.0,0.002690971
35319,0.0,0.18323195
35329,0.0,-0.45482677
35339,0.0,-0.17457402
35349,0.0,0.0011812449
35359,0.0,0.25602466
35369,0.0,0.029668987
35379,0.0,-0.1267541
35389,0.0,-0.22735173
35399,0.0,0.014897585
35409,0.0,-0.09847802
35419,0.0,0.018911302
35429,0.0,0.18747002
35439,0.0,0.13476324
35449,0.0,0.062182486
35459,0.0,0.04202646
35469,0.0,-0.056548774
35479,0.0,0.024781048
35489,0.0,-0.068584025
35499,0.0,-0.1472413
35509,0.0,-0.35442692
35519,0.0,-0.81741184
35529,0.0,-0.6087218
35539,0.0,-0.50762355
35549,0.0,-0.44465786
35559,0.0,-0.48461765
35569,0.0,-0.085300505
35579,0.0,-0.20177805
35589,0.0,-0.24777293
35599,0.0,-0.37215954
35609,0.0,-0.47271764
35619,0.0,-0.39014596
35629,0.0,-0.22836876
35639,0.0,-0.17534375
35649,0.0,-0.43286037
35659,0.0,-0.2994116
35669,0.0,-0.35292894
35679,0.0,-0.29119372
35689,0.0,-0.08565897
35699,0.0,-0.32616866
35709,0.0,-0.40833926
35719,0.0,-0.56468093
35729,0.0,-0.4441486
35739,0.0,-0.4513679
35749,0.0,-0.3323806
35759,0.0,-0.30674708
35769,0.0,-0.038663626
35779,0.0,-0.06465894
35789,0.0,-0.048357308
35799,0.0,-0.2505594
35809,0.0,-0.07473248
35819,0.0,-0.37656456
35829,0.0,-0.5843493
35839,0.0,-0.45966828
35849,0.0,-0.2394144
35859,0.0,-0.064436615
35869,0.0,0.06567162
35879,0.0,-0.42273897
35889,0.0,-0.29020244
35899,0.0,-0.07066989
35909,0.0,0.18117702
35919,0.0,0.07340294
35929,0.0,-0.095030606
35939,0.0,0.020879745
35949,0.0,-0.16371685
35959,0.0,-0.050008833
35969,0.0,-0.5323678
35979,0.0,0.048440874
35989,0.0,-0.01492697
35999,0.0,-0.35414988
36009,0.0,0.06889814
36019,0.0,-0.17432487
36029,0.0,0.15025371
36039,0.0,-0.34448606
36049,0.0,-0.1258052
36059,0.0,0.12459099
36069,0.0,0.17375582
36079,0.0,0.3792867
36089,0.0,0.43391383
36099,0.0,0.24220186
36109,0.0,0.39369988
36119,0.0,0.56048393
36129,0.0,0.10185021
36139,0.0,-0.18418074
36149,0.0,-0.15966803
36159,0.0,-0.40461344
36169,0.0,-0.34349346
36179,0.0,-0.11968881
36189,0.0,-0.08991927
36199,0.0,0.070269585
36209,0.0,-0.1268236
36219,0.0,-0.28535908
36229,0.0,-0.27477598
36239,0.0,-0.51559687
36249,0.0,-0.2888949
36259,0.0,-0.06287861
36269,0.0,0.033390045
36279,0.0,0.22749072
36289,0.0,0.60624284
36299,0.0,0.55987936
36309,0.0,0.6090125
36319,0.0,0.30402666
36329,0.0,0.6349242
36339,0.0,1.4047109
36349,0.0,1.5582352
36359,0.0,0.96702445
36369,0.0,0.4698553
36379,0.0,0.42528778
36389,0.0,0.4497288
36399,0.0,0.42713886
36409,0.0,0.34576428
36419,0.0,0.15931946
36429,0.0,-0.10692757
36439,0.0,0.04645759
36449,0.0,-0.33628613
36459,0.0,0.0025237203
36469,0.0,0.090524375
36479,0.0,-0.14997494
36489,1.0,-0.056519806
36499,1.0,0.24960297
36509,1.0,0.51260084
36519,1.0,1.1231576
36529,1.0,0.7373263
36539,1.0,1.381849
36549,1.0,1.5472575
36559,1.0,1.9139049
36569,1.0,2.3173978
36579,1.0,2.7469335
36589,1.0,3.0013332
36599,1.0,3.8264985
36609,1.0,3.8724957
36619,1.0,4.2699113
36629,1.0,4.8074007
36639,1.0,6.033217
36649,1.0,7.914769
36659,1.0,8.730122
36669,1.0,8.652939
36679,1.0,9.841608
36689,1.0,8.551056
36699,1.0,8.586529
36709,1.0,8.552465
36719,1.0,9.555153
36729,1.0,9.162813
36739,1.0,7.2276106
36749,1.0,6.2877016
36759,1.0,5.2047534
36769,1.0,3.722222
36779,1.0,2.5060697
36789,1.0,1.7055199
36799,1.0,0.49654675
36809,1.0,0.5788248
36819,1.0,0.24879539
36829,1.0,0.27021098
36839,1.0,0.5632016
36849,1.0,1.2046578
36859,1.0,1.9933339
36869,1.0,3.61813
36879,1.0,4.4500313
36889,1.0,5.77962
36899,1.0,6.8675117
36909,1.0,8.389191
36919,1.0,8.568023
36929,1.0,9.060263
36939,1.0,8.6391325
36949,1.0,8.673401
36959,1.0,8.537998
36969,1.0,8.584066
36979,1.0,8.305527
36989,1.0,7.480287
36999,1.0,7.65797
37009,1.0,6.421342
37019,1.0,6.1744604
37029,1.0,5.3867316
37039,1.0,4.5803623
37049,1.0,4.5677133
37059,1.0,3.3952184
37069,1.0,3.4243584
37079,1.0,2.2900124
37089,1.0,1.9312843
37099,1.0,1.4147931
37109,1.0,1.7440927
37119,1.0,0.81974745
37129,1.0,0.96109635
37139,1.0,0.8076514
37149,1.0,-0.026169658
37159,0.0,-0.21883321
37169,0.0,-0.20104694
37179,0.0,-0.14638895
37189,0.0,0.25047874
37199,0.0,0.20645565
37209,0.0,0.29798287
37219,0.0,0.53212434
37229,0.0,0.19914877
37239,0.0,-0.07651961
37249,0.0,0.05954349
37259,0.0,-0.18752837
37269,0.0,0.07950771
37279,0.0,-0.06325501
37289,0.0,0.1780793
37299,0.0,-0.12262064
37309,0.0,-0.0802868
37319,0.0,0.11899084
37329,0.0,0.03548515
37339,0.0,0.24460828
37349,0.0,-0.006067276
37359,0.0,0.36319017
37369,0.0,0.17706585
37379,0.0,0.04307902
37389,0.0,-0.13107532
37399,0.0,-0.051258743
37409,0.0,0.26774454
37419,0.0,-0.17278534
37429,0.0,-0.30771524
37439,0.0,-0.2932943
37449,0.0,-0.303478
37459,0.0,-0.3699764
37469,0.0,-0.5389755
37479,0.0,-0.07571584
37489,0.0,-0.082458496
37499,0.0,0.31950462
37509,0.0,0.2501307
37519,0.0,0.6915954
37529,0.0,0.19810188
37539,0.0,0.5943252
37549,0.0,0.17764688
37559,0.0,-0.022043347
37569,0.0,-0.26593518
37579,0.0,-0.18245417
37589,0.0,-0.31531227
37599,0.0,-0.3532114
37609,0.0,-0.5467274
37619,0.0,-0.7196609
37629,0.0,-0.60039866
37639,0.0,-0.6771219
37649,0.0,-0.733413
37659,0.0,-0.946878
37669,0.0,-0.82716805
37679,0.0,-0.39408296
37689,0.0,-0.5885851
37699,0.0,-0.50306726
37709,0.0,-1.1339562
37719,0.0,-0.3135175
37729,0.0,-0.030467093
37739,0.0,-0.18177879
37749,0.0,-0.42873937
37759,0.0,-0.08945155
37769,0.0,0.13926232
37779,0.0,-0.0025576353
37789,0.0,-0.028292418
37799,0.0,-0.10049498
37809,0.0,-0.13943261
37819,0.0,0.32013512
37829,0.0,0.6301196
37839,0.0,0.34745663
37849,0.0,0.18749493
37859,0.0,0.27126777
37869,0.0,0.24003011
37879,0.0,0.5375474
37889,0.0,0.3278013
37899,0.0,-0.12603194
37909,0.0,-0.00086146593
37919,0.0,0.126459
37929,0.0,0.25032532
37939,0.0,0.21234691
37949,0.0,0.22373211
37959,0.0,-0.06092769
37969,0.0,0.016179025
37979,0.0,-0.11323327
37989,0.0,0.06700218
37999,0.0,-0.04136789
38009,0.0,-0.11969221
38019,0.0,0.099805355
38029,0.0,0.23779535
38039,0.0,-0.020419061
38049,0.0,-0.18923277
38059,0.0,-0.159818
38069,0.0,-0.23006153
38079,0.0,-0.19715685
38089,0.0,-0.21405828
38099,0.0,-0.064843595
38109,0.0,-0.026527822
38119,0.0,-0.34833562
38129,0.0,-0.73354703
38139,0.0,-0.9162532
38149,0.0,-0.8040747
38159,0.0,-0.76239926
38169,0.0,-0.829166
38179,0.0,-0.8516336
38189,0.0,-0.66777486
38199,0.0,-0.40636456
38209,0.0,-0.06681889
38219,0.0,0.1669712
38229,0.0,-0.1431542
38239,0.0,-0.061065137
38249,0.0,0.019522369
38259,0.0,0.12540638
38269,0.0,0.2614271
38279,0.0,0.6335144
38289,0.0,0.5233301
38299,0.0,0.67493325
38309,0.0,0.52579546
38319,0.0,0.4929737
38329,0.0,1.0876884
38339,0.0,0.4530992
38349,0.0,0.38599414
38359,0.0,0.3680765
38369,0.0,-0.18773055
38379,0.0,-0.18734574
38389,0.0,-0.68309563
38399,0.0,-0.67408854
38409,0.0,-0.2905624
38419,0.0,-0.20016742
38429,0.0,-0.2697255
38439,0.0,-0.6551162
38449,0.0,-0.46835518
38459,0.0,-0.6796155
38469,0.0,-0.37236136
38479,0.0,-0.56838775
38489,0.0,-0.35085154
38499,0.0,0.018161833
38509,0.0,-0.19678658
38519,0.0,0.28378314
38529,0.0,0.7796281
38539,0.0,0.56869936
38549,0.0,0.47428036
38559,0.0,-0.35626405
38569,0.0,-0.15755957
38579,0.0,-0.42454445
38589,0.0,0.015592575
38599,0.0,-0.51547754
38609,0.0,0.14221019
38619,0.0,-0.13394332
38629,0.0,-0.081233144
38639,0.0,-0.4073109
38649,0.0,-0.45674217
38659,0.0,-0.41365916
38669,0.0,-0.3168277
38679,0.0,-0.36923182
38689,0.0,-0.07248235
38699,0.0,-0.38712
38709,0.0,-0.54340607
38719,0.0,-0.24929917
38729,0.0,-0.2747833
38739,0.0,-0.21922809
38749,0.0,0.10366523
38759,0.0,-0.4854663
38769,0.0,-0.20096534
38779,0.0,0.16955328
38789,0.0,-0.02437234
38799,0.0,-0.048491
38809,0.0,-0.09521788
38819,0.0,-0.6557709
38829,0.0,-0.39651614
38839,0.0,-0.22331876
38849,0.0,-0.055336
38859,0.0,0.023439884
38869,0.0,0.4524672
38879,0.0,0.47803104
38889,0.0,0.14850211
38899,0.0,-0.081048846
38909,0.0,0.039152265
38919,0.0,-0.30248004
38929,0.0,-0.81154406
38939,0.0,-0.7010408
38949,0.0,-0.40939277
38959,0.0,-0.6361298
38969,0.0,-0.025904179
38979,0.0,-0.47597104
38989,0.0,-0.5984625
38999,0.0,-0.8424024
39009,0.0,-0.27094328
39019,0.0,-0.65257645
39029,0.0,-0.24992734
39039,0.0,-0.17695045
39049,0.0,0.15979612
39059,0.0,-0.08237231
39069,0.0,0.14655691
39079,0.0,0.03750527
39089,0.0,0.01567918
39099,0.0,-0.20959109
39109,0.0,-0.4444142
39119,0.0,-0.25782967
39129,0.0,-0.22686225
39139,0.0,-0.071429074
39149,0.0,-0.121225
39159,0.0,0.12523001
39169,0.0,-0.45511377
39179,0.0,-0.5177049
39189,0.0,-0.4995634
39199,0.0,-0.33883166
39209,0.0,-0.35588086
39219,0.0,-0.035925925
39229,0.0,-0.43732643
39239,0.0,0.028579295
39249,0.0,0.007550299
39259,0.0,0.0052391887
39269,0.0,0.09936321
39279,0.0,0.21424782
39289,0.0,-0.13619393
39299,0.0,0.22120273
39309,0.0,-0.49723077
39319,0.0,-0.22295153
39329,0.0,-0.43615872
39339,0.0,-0.18134534
39349,0.0,-0.13003224
39359,0.0,-0.16533983
39369,0.0,-0.53938866
39379,0.0,-0.5167296
39389,0.0,-0.4433996
39399,0.0,-0.027329981
39409,0.0,-0.35220963
39419,0.0,-0.30874306
39429,0.0,0.15382642
39439,0.0,-0.26268572
39449,0.0,-0.2607041
39459,0.0,0.023022592
39469,0.0,-0.14918202
39479,0.0,-0.18428838
39489,0.0,-0.19684386
39499,0.0,-0.12560743
39509,0.0,-0.4316321
39519,0.0,-0.43079692
39529,0.0,-0.51283616
39539,0.0,-0.6993365
39549,0.0,-0.48934042
39559,0.0,-0.51300794
39569,0.0,-0.47756714
39579,0.0,-0.5423766
39589,0.0,-0.52823836
39599,0.0,-0.28615987
39609,0.0,-0.4164709
39619,0.0,-0.08191562
39629,0.0,-0.10609269
39639,0.0,-0.16007847
39649,0.0,-0.28919208
39659,0.0,-0.073123574
39669,0.0,-0.3272174
39679,0.0,-0.41074443
39689,0.0,-0.21410036
39699,0.0,-0.23980051
39709,0.0,-0.05273986
39719,0.0,-0.2916093
39729,0.0,0.07923955
39739,0.0,0.012096763
39749,0.0,-0.21869445
39759,0.0,0.46485174
39769,0.0,0.47006214
39779,0.0,0.7912576
39789,0.0,0.41108495
39799,0.0,-0.11857152
39809,0.0,-0.20412135
39819,0.0,0.11952561
39829,0.0,-0.31118846
39839,0.0,0.028451443
39849,0.0,0.10185295
39859,0.0,-0.037679613
39869,0.0,-0.01567036
39879,0.0,-0.11711389
39889,0.0,0.11630201
39899,0.0,-0.046072245
39909,0.0,-0.1917041
39919,0.0,0.5349468
39929,0.0,0.13988858
39939,0.0,-0.05031061
39949,0.0,0.019563437
39959,0.0,0.19361663
39969,0.0,0.45394117
39979,0.0,0.18263638
39989,0.0,-0.18326676
39999,0.0,-0.6622883
40009,0.0,-0.40743065
40019,0.0,-0.5501366
40029,0.0,-0.4629339
40039,0.0,-0.20003492
40049,0.0,-0.5472948
40059,0.0,-0.49591523
40069,0.0,-0.34059334
40079,0.0,-0.24560332
40089,0.0,-0.4718331
40099,0.0,-0.5951325
40109,0.0,-0.48471808
40119,0.0,-0.38249838
40129,0.0,-0.6995072
40139,0.0,-0.5378105
40149,0.0,-0.8306436
40159,0.0,-0.56284386
40169,0.0,-0.5099433
40179,0.0,-0.5158578
40189,0.0,-0.39012676
40199,0.0,-0.72719806
40209,0.0,-0.1198647
40219,0.0,0.028780937
40229,0.0,0.2556334
40239,0.0,0.36496496
40249,0.0,0.41021204
40259,0.0,0.266473
40269,0.0,0.21680397
40279,0.0,-0.0774104
40289,0.0,0.0788852
40299,0.0,-0.04443282
40309,0.0,0.0039117336
40319,0.0,0.34906286
40329,0.0,-0.17391431
40339,0.0,-0.20464587
40349,0.0,-0.19893622
40359,0.0,-0.18219888
40369,0.0,-0.31909662
40379,0.0,-0.19007844
40389,0.0,0.21491951
40399,0.0,0.8554854
40409,0.0,1.1472355
40419,0.0,1.0912986
40429,0.0,1.3595259
40439,0.0,1.4048188
40449,0.0,2.0895135
40459,0.0,1.9663953
40469,0.0,2.8777685
40479,0.0,3.4474206
40489,0.0,4.3222823
40499,0.0,4.621657
40509,0.0,4.685752
40519,0.0,5.3031225
40529,0.0,6.410346
40539,0.0,7.9662786
40549,0.0,8.632177
40559,0.0,8.268362
40569,0.0,7.8598647
40579,0.0,7.7305307
40589,0.0,6.241288
40599,0.0,5.7656884
40609,0.0,5.070702
40619,0.0,4.9663424
40629,0.0,4.9950256
40639,0.0,3.5864086
40649,0.0,2.7448878
40659,0.0,2.5992641
40669,0.0,1.8166125
40679,0.0,1.3549967
40689,0.0,1.0009689
40699,0.0,0.6148508
40709,0.0,0.42226565
40719,0.0,0.14421684
40729,0.0,-0.100492716
40739,0.0,0.008086264
40749,0.0,-0.43334436
40759,0.0,0.10448414
40769,0.0,-0.43876255
40779,0.0,-0.5481821
40789,0.0,-0.0821808
40799,0.0,-0.0146228075
40809,0.0,-0.30249673
40819,0.0,0.02075702
40829,0.0,-0.18638891
40839,0.0,-0.1369586
40849,0.0,-0.22046387
40859,0.0,0.017647326
40869,0.0,-0.25069165
40879,0.0,-0.5139907
40889,0.0,-0.29082483
40899,0.0,-0.26174402
40909,0.0,-0.31215644
40919,0.0,-0.027043104
40929,0.0,-0.4032529
40939,0.0,-0.3570099
40949,0.0,-0.44099444
40959,0.0,-0.27373362
40969,0.0,-0.32107157
40979,0.0,-0.43437868
40989,0.0,-0.40736645
40999,0.0,-0.42971295
41009,0.0,-0.5898582
41019,0.0,-0.5151662
41029,0.0,-0.8156736
41039,0.0,-0.5330685
41049,0.0,-0.48357403
41059,0.0,-0.58816075
41069,0.0,-0.35920393
41079,0.0,-0.59000534
41089,0.0,-0.59305745
41099,0.0,-0.2701075
41109,0.0,-0.29414344
41119,0.0,-0.52353
41129,0.0,-0.44199008
41139,0.0,-0.23749495
41149,0.0,0.056895733
41159,0.0,0.034270704
41169,0.0,0.24619472
41179,0.0,0.79399234
41189,0.0,0.7258684
41199,0.0,0.56590617
41209,0.0,-0.00408864
41219,0.0,0.23266727
41229,0.0,-0.09785533
41239,0.0,-0.45688087
41249,0.0,0.22251195
41259,0.0,0.10136092
41269,0.0,0.10761052
41279,0.0,0.3791262
41289,0.0,0.3973806
41299,0.0,0.79598784
41309,0.0,0.79648703
41319,0.0,-0.052178025
41329,0.0,-0.13754094
41339,0.0,-0.20889634
41349,0.0,-0.19926208
41359,0.0,0.15013856
41369,0.0,0.28732944
41379,0.0,0.30153674
41389,0.0,1.0674789
41399,0.0,0.93555534
41409,0.0,0.50883156
41419,0.0,0.9112581
41429,0.0,0.3525051
41439,0.0,0.10940701
41449,0.0,0.492823
41459,0.0,0.34176397
41469,0.0,-0.24874228
41479,0.0,0.06511158
41489,0.0,0.003511846
41499,0.0,0.14665031
41509,0.0,0.34498912
41519,0.0,-0.21475756
41529,0.0,-0.010287344
41539,0.0,0.10098684
41549,0.0,0.12611735
41559,0.0,-0.18191552
41569,0.0,0.34261602
41579,0.0,0.18864357
41589,0.0,0.32818693
41599,0.0,-0.060755193
41609,0.0,-0.3667888
41619,0.0,-0.41869366
41629,0.0,-0.17502928
41639,0.0,-0.18500417
41649,0.0,0.16329116
41659,0.0,-0.4996689
41669,0.0,-0.31803858
41679,1.0,-0.19462067
41689,1.0,-0.048539698
41699,1.0,-0.09613204
41709,1.0,0.6775612
41719,1.0,0.6798459
41729,1.0,1.1009191
41739,1.0,1.6696137
41749,1.0,2.516194
41759,1.0,2.5012536
41769,1.0,3.4735513
41779,1.0,3.1731246
41789,1.0,3.951733
41799,1.0,4.0093136
41809,1.0,4.117385
41819,1.0,4.91964
41829,1.0,5.517314
41839,1.0,6.1311364
41849,1.0,7.219651
41859,1.0,8.138222
41869,1.0,8.431542
41879,1.0,9.502344
41889,1.0,8.570228
41899,1.0,7.7588587
41909,1.0,9.059949
41919,1.0,10.201902
41929,1.0,9.717121
41939,1.0,8.0522785
41949,1.0,6.6675935
41959,1.0,5.779166
41969,1.0,4.0986495
41979,1.0,2.4378495
41989,1.0,1.83974
41999,1.0,1.3291142
42009,1.0,0.75545305
42019,1.0,0.48587263
42029,1.0,0.47094876
42039,1.0,0.58418614
42049,1.0,1.2013329
42059,1.0,2.1135354
42069,1.0,3.8796659
42079,1.0,4.774423
42089,1.0,5.9872503
42099,1.0,7.179597
42109,1.0,9.173965
42119,1.0,9.1587305
42129,1.0,8.48126
42139,1.0,8.735792
42149,1.0,8.801858
42159,1.0,10.248413
42169,1.0,8.97532
42179,1.0,7.9338694
42189,1.0,7.3430204
42199,1.0,7.119314
42209,1.0,5.9802065
42219,1.0,4.960933
42229,1.0,4.6527157
42239,1.0,3.8589478
42249,1.0,3.3595295
42259,1.0,3.0195427
42269,1.0,2.7769215
42279,1.0,1.942424
42289,1.0,1.9139109
42299,1.0,1.5976355
42309,1.0,1.7371712
42319,1.0,1.5803882
42329,1.0,1.2318485
42339,1.0,0.7406398
42349,1.0,0.38433498
42359,0.0,-0.14139557
42369,0.0,0.018270612
42379,0.0,0.31336993
42389,0.0,-0.018780708
42399,0.0,0.32827473
42409,0.0,0.15659589
42419,0.0,0.3061046
42429,0.0,0.5809976
42439,0.0,0.51723313
42449,0.0,0.36709017
42459,0.0,0.5353319
42469,0.0,0.62015295
42479,0.0,0.68887496
42489,0.0,0.40792626
42499,0.0,0.9825051
42509,0.0,0.45029974
42519,0.0,0.34401274
42529,0.0,0.20855522
42539,0.0,0.3573169
42549,0.0,0.6067531
42559,0.0,0.088201344
42569,0.0,0.032260835
42579,0.0,-0.2764815
42589,0.0,-0.24782711
42599,0.0,-0.53350365
42609,0.0,-0.101294816
42619,0.0,-0.4039234
42629,0.0,-0.3099246
42639,0.0,-0.029785275
42649,0.0,-0.231915
42659,0.0,-0.29631025
42669,0.0,-0.21283191
42679,0.0,0.11900133
42689,0.0,0.27095157
42699,0.0,-0.05591452
42709,0.0,0.10709506
42719,0.0,-0.051493824
42729,0.0,-0.07728553
42739,0.0,0.272008
42749,0.0,-0.23851395
42759,0.0,-0.49088264
42769,0.0,-0.14828813
42779,0.0,-0.62323976
42789,0.0,-0.0032327175
42799,0.0,-0.29157293
42809,0.0,-0.44707215
42819,0.0,-0.74585056
42829,0.0,-0.47747487
42839,0.0,-0.61563516
42849,0.0,-0.5802268
42859,0.0,-0.43381262
42869,0.0,-0.26199663
42879,0.0,-0.23570031
42889,0.0,0.002136469
42899,0.0,-0.2378298
42909,0.0,-0.038984835
42919,0.0,-0.20226449
42929,0.0,-0.23996913
42939,0.0,-0.26605207
42949,0.0,-0.09385353
42959,0.0,-0.49934655
42969,0.0,-0.49495935
42979,0.0,-0.5224615
42989,0.0,-0.23681426
42999,0.0,-0.36531204
43009,0.0,-0.031507194
43019,0.0,0.19506526
43029,0.0,0.45093125
43039,0.0,0.12467307
43049,0.0,-0.07599878
43059,0.0,0.47918934
43069,0.0,0.28703952
43079,0.0,0.23602772
43089,0.0,0.7967748
