T,S,Score
999,0,0.007627237442172308
1009,0,0.0005942699012443375
1019,0,0.0006860666932705928
1029,0,0.0006865194181479017
1039,0,0.000756192406556222
1049,0,0.0009020527759462382
1059,0,0.0009349695689548354
1069,0,0.0009215946946153908
1079,0,0.0010585148197148064
1089,0,0.0009642479759779943
1099,0,0.0009222997328868221
1109,0,0.0009933743213706991
1119,0,0.001007612088458787
1129,0,0.0009736083271362772
1139,0,0.0009735845419394651
1149,0,0.001064129870784969
1159,0,0.0012633119007460225
1169,0,0.001007811643399914
1179,0,0.0009641227450722378
1189,0,0.0006864681922774674
1199,0,0.00040840341208892017
1209,0,0.00035483734522290256
1219,0,0.00032817688793163047
1229,0,0.0006039506501003267
1239,0,0.0002109072583964533
1249,0,0.0006468052034573901
1259,0,0.0003936615856585668
1269,0,0.0006249129385595964
1279,0,0.0004363480339784065
1289,0,0.000455709937035087
1299,0,0.000500082266990165
1309,0,0.00040482209492731513
1319,0,0.0005222675324634274
1329,0,0.0004579058080380616
1339,0,0.0005182682214025514
1349,0,0.0005629536189818984
1359,0,0.00047323404430843485
1369,0,0.000529264707319399
1379,0,0.0006265200266890592
1389,0,0.0005476041717316082
1399,0,0.00040767749710524104
1409,0,0.0004024815504137802
1419,0,0.00025976172587494073
1429,0,0.00027977462114614493
1439,0,0.00032776278385865387
1449,0,0.00022696129640298324
1459,0,0.0002104512371260414
1469,0,0.00011902020959164705
1479,0,0.0001615455352234063
1489,0,0.0002414197496271031
1499,0,0.00023286949231238196
1509,0,0.0005870696339297377
1519,0,0.0005254944157062624
1529,0,0.000521185765010368
1539,0,0.0006774346854241942
1549,0,0.0008185132848489429
1559,0,0.000799876705194158
1569,0,0.0006962880198467247
1579,0,0.0008509720254271103
1589,0,0.0008145191565231413
1599,0,0.0006152815265615397
1609,0,0.0006434847127870791
1619,0,0.0007430467239127325
1629,0,0.0007980132359864944
1639,0,0.000947027628786401
1649,0,0.0008661566127585729
1659,0,0.0008656366527733383
1669,0,0.000859579505259056
1679,0,0.0007150039842320766
1689,0,0.0005887503744982925
1699,0,0.00040335638133331964
1709,0,0.00034206325001290283
1719,0,0.00024666072246437576
1729,0,0.00032919169379941327
1739,0,0.0005170483728607622
1749,0,0.0006211270668255442
1759,0,0.0006350836775711466
1769,0,0.0005802580394916323
1779,0,0.0005580172410022954
1789,0,0.0005947015849455117
1799,0,0.000639811263347223
1809,0,0.0005449321868611356
1819,0,0.0004545191029025619
1829,0,0.0003944566598542698
1839,0,0.0005258431806141606
1849,0,0.0005167958958091079
1859,0,0.00046791432473847205
1869,0,0.0005467539635894969
1879,0,0.0005836916707053774
1889,0,0.0006329863871261665
1899,0,0.00048432130096109915
1909,0,0.00034991945337159436
1919,0,0.00018671335747749707
1929,0,0.00014996107272102766
1939,0,0.00010703456960492463
1949,0,8.714402368692475e-05
1959,0,7.132251242619736e-05
1969,0,-9.973008696650965e-09
1979,0,2.5237911019937442e-05
1989,0,7.07715180151558e-05
1999,0,8.100250437104162e-05
2009,0,0.0002342606983132267
2019,0,0.000222136179040211
2029,0,0.00017892881080150413
2039,0,0.00026472676642597115
2049,0,0.0003252581163084578
2059,0,0.00034071717367972765
2069,0,0.0002467967354445322
2079,0,0.00021428668278250518
2089,0,0.0002273369543348558
2099,0,0.00022077095721267925
2109,0,0.0002444184144324568
2119,0,0.0002027166472523545
2129,0,0.00026558816389044004
2139,0,0.0004121459338642941
2149,0,0.0004436213017763313
2159,0,0.0004595938506457009
2169,0,0.00046117053688504717
2179,0,0.0004010438399775218
2189,0,0.0004443381352157161
2199,0,0.0004910217000810291
2209,0,0.0005365250867980786
2219,0,0.0007171132198958152
2229,0,0.000812061596327962
2239,0,0.000916240609833141
2249,0,0.001047184580697691
2259,0,0.0010428370027976697
2269,0,0.0010616725429355989
2279,0,0.0011517840736386398
2289,0,0.0013013182210547813
2299,0,0.001352208398907373
2309,0,0.0012624919454126138
2319,0,0.0009725449413249265
2329,0,0.0008459422427427588
2339,0,0.0008945067081321811
2349,0,0.0009713288083336713
2359,0,0.0009870668274786776
2369,0,0.0010059212711561738
2379,0,0.000996720574379939
2389,0,0.0010411405534656026
2399,0,0.0010684353093821097
2409,0,0.000960832629590902
2419,0,0.0006749641322134625
2429,0,0.0005811801719876053
2439,0,0.00048173381313343366
2449,0,0.0003196751322978031
2459,0,0.0003403588922735179
2469,0,0.00039188126986960947
2479,0,0.0004333890743913882
2489,0,0.00048563529128420324
2499,0,0.0005393502042712606
2509,0,0.0006146591845590521
2519,0,0.0006933252528318334
2529,0,0.0007787412601795718
2539,0,0.0007689152051790771
2549,0,0.000805393415047928
2559,0,0.000769562712948868
2569,0,0.0007649523296723859
2579,0,0.0008837403784310305
2589,0,0.0008645550659994727
2599,0,0.0008114783878293563
2609,0,0.0007436517046841562
2619,0,0.0008886091117248363
2629,0,0.0008203466558155403
2639,0,0.0005122403407167853
2649,0,0.0004960659546385804
2659,0,0.000502375722613746
2669,0,0.0005922881619646048
2679,0,0.0007342734896420566
2689,0,0.0007568800422003141
2699,0,0.0006937958433835267
2709,0,0.0006475194435450748
2719,0,0.00025112352435063823
2729,0,0.0001460252779772464
2739,0,0.0003914725442006328
2749,0,0.00039407416311382226
2759,0,0.0005197278033497454
2769,0,0.000549578930629957
2779,0,0.0005390681298362288
2789,0,0.0004721903695929508
2799,0,0.00042822835871819676
2809,0,0.0006311266510131697
2819,0,0.0007161750297418057
2829,0,0.0009091038149738884
2839,0,0.0008840036198118351
2849,0,0.0007811969671173702
2859,0,0.0010045938162098755
2869,0,0.0011082911618370272
2879,0,0.001292076979763801
2889,0,0.0013677387327598045
2899,0,0.0013197515562964335
2909,0,0.0014649654877699203
2919,0,0.0018691148849549477
2929,0,0.0021618081259223154
2939,0,0.002335060016044166
2949,0,0.0025555485993891125
2959,0,0.002794820574168244
2969,0,0.002852242286781548
2979,0,0.0028435553279058667
2989,0,0.002899018604720194
2999,0,0.0028092185235599754
3009,0,0.0025749189740956746
3019,0,0.002364959526365673
3029,0,0.0023640690733659486
3039,0,0.0022896210294588437
3049,0,0.0022411985367123965
3059,0,0.0022878355389166494
3069,0,0.0024872716929100203
3079,0,0.0025330500042354265
3089,0,0.002533387814014465
3099,0,0.0026028371355694135
3109,0,0.00264335639689689
3119,0,0.00267531414422445
3129,0,0.0027400868849173365
3139,0,0.0029424102756148707
3149,0,0.002957412101554535
3159,0,0.0029682953441821924
3169,0,0.002854146899518628
3179,0,0.002712990109702662
3189,0,0.0026676382984608393
3199,0,0.002679680032537546
3209,0,0.00269093669530851
3219,0,0.002956937641101165
3229,0,0.0029570704918693846
3239,0,0.0025769313373644187
3249,0,0.0023647482245161
3259,0,0.0022057707257085446
3269,0,0.0022200872860143606
3279,0,0.0020428442277137804
3289,0,0.0019468719805429413
3299,0,0.0020772315280922493
3309,0,0.0021469354619749748
3319,0,0.002267709833304099
3329,0,0.0023637194054533794
3339,0,0.0023705527141179017
3349,0,0.0023516309409458702
3359,0,0.002282269299813622
3369,0,0.0018220943448229443
3379,0,0.00168401953975017
3389,0,0.0016224443291067425
3399,0,0.0014516297116755061
3409,0,0.001317239342552179
3419,0,0.0008311180755713465
3429,0,0.0005782273786408276
3439,0,0.00044199725153321046
3449,0,-9.998000205513335e-09
3459,0,0.00037344390010096706
3469,0,0.00041613020700337344
3479,0,0.0004213131432093675
3489,0,0.0003557513130885148
3499,0,0.0001431470944937563
3509,0,0.00020606421557667343
3519,0,0.000402849601012667
3529,0,0.000501885355863374
3539,0,0.000759021389755643
3549,0,0.0008935427458301448
3559,0,0.0009676894992766694
3569,0,0.0008640836580201539
3579,0,0.0008250530616368268
3589,0,0.0006807220283903126
3599,0,0.0006685376436105783
3609,0,0.0007746799241550306
3619,0,0.0004891196319400382
3629,0,0.0002515016308002327
3639,0,0.0003421170740605106
3649,0,0.0003966905218973915
3659,0,0.0005216058593102701
3669,0,0.0005952237360420387
3679,0,0.0005837472584732661
3689,0,0.0006130469446515296
3699,0,0.0005346590044340016
3709,0,0.0006086613654689432
3719,0,0.0005206813947528088
3729,0,0.0005149447773277194
3739,0,0.0007165901807387742
3749,0,0.0008553575230880739
3759,0,0.0008241027558683611
3769,0,0.0008546736085007778
3779,0,0.0006811493804670943
3789,0,0.0006999032293920071
3799,0,0.0005764096377972594
3809,0,0.0005188906481398137
3819,0,0.00040127069838324925
3829,0,0.00041917449268547013
3839,0,0.000438571523575515
3849,0,0.0005433215851646245
3859,0,0.0007185657396746592
3869,0,0.0003049886868821128
3879,0,0.0004558273172425853
3889,0,0.00047720287151364893
3899,0,0.0003911976343591306
3909,0,0.0002989764297713915
3919,0,0.0005750602459378418
3929,0,0.0007936164366212362
3939,0,0.0008202677888187737
3949,0,0.0008621893994580909
3959,0,0.0009563565500630977
3969,0,0.0007261199596251267
3979,0,0.0009372570954934711
3989,0,0.0004657906805848322
3999,0,0.0005017161931210046
4009,0,0.0006204822429879409
4019,0,0.0007500860105151275
4029,0,0.0006752041654751739
4039,0,0.0006464705695963247
4049,0,0.000869505311156038
4059,0,0.001297349155547467
4069,0,0.001273561446317184
4079,0,0.0013952317192923447
4089,0,0.0015015017132594122
4099,0,0.001322044373089526
4109,0,0.0013955646028587787
4119,0,0.0011645635281876676
4129,0,0.0011163182117535642
4139,0,0.0011438975979298216
4149,0,0.0012570220096486673
4159,0,0.0013452643541527198
4169,0,0.0013534842692386473
4179,0,0.001161730764784319
4189,0,0.0011948297421734422
4199,0,0.0010764222569005777
4209,0,0.0013375580577302815
4219,0,0.001378878598437716
4229,0,0.0014235557299867585
4239,0,0.0013841869480634705
4249,0,0.0015341177897225666
4259,0,0.0016043093265544206
4269,0,0.0018080709454093014
4279,0,0.0016221793229759807
4289,0,0.0015739053365870226
4299,0,0.0018260482406753376
4309,0,0.0017635610800423862
4319,0,0.001597505506827468
4329,0,0.0014510030118556894
4339,0,0.0013969062303256785
4349,0,0.001424524382743042
4359,0,0.001562997611785022
4369,0,0.001575120714847944
4379,0,0.0014534654613960196
4389,0,0.0015669395719196122
4399,0,0.0016273153661178763
4409,0,0.0018031363698595704
4419,0,0.0019203829072279577
4429,0,0.0018668037494974365
4439,0,0.0018669241064679931
4449,0,0.0018217596721864515
4459,0,0.0018500485053193905
4469,0,0.001946167309465785
4479,0,0.002021353528624259
4489,0,0.0019072129331029752
4499,0,0.0017031653936843139
4509,0,0.0015617662128156184
4519,0,0.001685987416656598
4529,0,0.0020394947110001227
4539,0,0.0020779623153699966
4549,0,0.0021625411586843613
4559,0,0.0020439411001534347
4569,0,0.002106271632739687
4579,0,0.002025994896692751
4589,0,0.0018812564773683649
4599,0,0.001962504789529085
4609,0,0.0020256271616364008
4619,0,0.0021758354760674226
4629,0,0.002318101552926888
4639,0,0.002661835189951056
4649,0,0.002697059521140077
4659,0,0.0027760981171023325
4669,0,0.002712613929326757
4679,0,0.0030239457343303466
4689,0,0.003087648743972715
4699,0,0.0029758846659461158
4709,0,0.0030337982471931313
4719,0,0.0030930843714587763
4729,0,0.0030520139763514087
4739,0,0.003127069527685933
4749,0,0.0028824781352400075
4759,0,0.002929676003388504
4769,0,0.0027549736998085383
4779,0,0.0027704370909909515
4789,0,0.002844361014091523
4799,0,0.002660326727682738
4809,0,0.002469406608636482
4819,0,0.0025439767613765762
4829,0,0.0025044522181484896
4839,0,0.002527817856660064
4849,0,0.0024703238936183425
4859,0,0.0026250348485700736
4869,0,0.0025807494918850815
4879,0,0.0025536259280834472
4889,0,0.0023402090038020518
4899,0,0.002538499902883906
4909,0,0.0024025786199832755
4919,0,0.002252234806326525
4929,0,0.0021118631865298387
4939,0,0.0020995951548083425
4949,0,0.002168124464207666
4959,0,0.0023165093744502707
4969,0,0.002399864874538915
4979,0,0.002127160192167299
4989,0,0.0021007892753219792
4999,0,0.00272027119313345
5009,0,0.002749421613934211
5019,0,0.00231139792276408
5029,0,0.0023172226959066733
5039,0,0.002445212755296966
5049,0,0.0021706197755425594
5059,0,0.0022115024848803344
5069,0,0.0024173684006333906
5079,0,0.002142705970854253
5089,0,0.0024424735827333066
5099,0,0.0015911699194262052
5109,0,0.0016811654178036095
5119,0,0.002087722423329219
5129,0,0.0013732037156257149
5139,0,0.0022560375510018993
5149,0,0.0013919748583475222
5159,0,0.0015285540200090653
5169,0,0.0013506842481818548
5179,0,0.0018781828413307888
5189,0,0.0011366033295246991
5199,0,0.0017592581696037612
5209,0,0.001108615725109896
5219,0,0.0015201421695757444
5229,0,0.0010838703546649509
5239,0,0.0011247486126936268
5249,0,0.0010291316040356158
5259,0,0.0010441158708029974
5269,0,0.0009380041936946082
5279,0,0.0017876892879790107
5289,0,0.0013777500348520766
5299,0,0.0009323704459395232
5309,0,0.0009456118606310238
5319,0,0.001358582543702469
5329,0,0.0010825518888777363
5339,0,0.0006633687038954394
5349,0,0.0013359810179237597
5359,0,0.0010972830188999971
5369,0,0.0015205583097404052
5379,0,0.0011836721700005381
5389,0,0.001505854404862339
5399,0,0.0017194989067322308
5409,0,0.0017289781903655488
5419,0,0.001843308780709818
5429,0,0.0020067240664761177
5439,0,0.001980972395846714
5449,0,0.0022944471123043653
5459,0,0.0023645366243257304
5469,0,0.002244370875967794
5479,0,0.0022092186184424767
5489,0,0.0023169481178249574
5499,0,0.00262813831572023
5509,0,0.002705054833346987
5519,0,0.0027568260754808893
5529,0,0.0027510887829345076
5539,0,0.002923093892885975
5549,0,0.002858715092985853
5559,0,0.0027821168700771226
5569,0,0.002737654244937493
5579,0,0.002718553562484627
5589,0,0.0026769988293348645
5599,0,0.0026703298883897775
5609,0,0.0024313081113825352
5619,0,0.0024373552780618257
5629,0,0.002438653034720073
5639,0,0.0026287112503934895
5649,0,0.0025417474535915363
5659,0,0.0023914936888095872
5669,0,0.002404968529014062
5679,0,0.002299922374393193
5689,0,0.002209047677487974
5699,0,0.0021215685980409127
5709,0,0.0020454503164766824
5719,0,0.0021121509020258777
5729,0,0.0023192154781716545
5739,0,0.0020666571730084127
5749,0,0.0017130537894560205
5759,0,0.0022137226339122296
5769,0,0.0026428322535172466
5779,0,0.002177432425085002
5789,0,0.003268711624061671
5799,0,0.00262899683519191
5809,0,0.0020086734054228783
5819,0,0.003020070323553503
5829,0,0.0019225671850883197
5839,0,0.002036194729703733
5849,0,0.002179078944623436
5859,0,0.0034778035930983497
5869,0,0.0017557325687662662
5879,0,0.001264453722661374
5889,0,0.0027701720926901485
5899,0,0.0014220715762306435
5909,0,0.001292902166451726
5919,0,0.0009960616269049094
5929,0,0.0021176006161504057
5939,0,0.0024450648497772454
5949,0,0.002054466509886166
5959,0,0.0017833800705073788
5969,0,0.0018758837970801467
5979,0,0.001640852334010956
5989,0,0.003171362533518185
5999,0,0.0022417654772788898
6009,0,0.001989937528839414
6019,0,0.0022262458188402334
6029,0,0.002057417295522612
6039,0,0.0018372473805856049
6049,0,0.0020540573965082687
6059,0,0.0023089456524076346
6069,0,0.002312386815413292
6079,0,0.0019484783424392194
6089,0,0.002623002588114487
6099,0,0.002058288104777928
6109,0,0.0018830284661857655
6119,0,0.001904222106704101
6129,0,0.002119616978684069
6139,0,0.002192465688117873
6149,0,0.0022325959372305193
6159,0,0.0021238626687588025
6169,0,0.0019365178808581907
6179,0,0.0018014177176035595
6189,0,0.0016278116942224363
6199,0,0.0015812069893685887
6209,0,0.001650776400885956
6219,0,0.0015587216639557089
6229,0,0.0014812875618141486
6239,0,0.0014706529045690475
6249,0,0.0014603168513371845
6259,0,0.001581081569313525
6269,0,0.0015813065506836144
6279,0,0.001546724052197579
6289,0,0.0016625726895889703
6299,0,0.001712805453484012
6309,0,0.001390050884018612
6319,0,0.0017840823098689285
6329,0,0.001457813864989277
6339,0,0.0016204941529589512
6349,0,0.0014768199578142904
6359,0,0.001128923636608603
6369,0,0.0010959628165000401
6379,0,0.000947355062678179
6389,0,0.002492632749895418
6399,0,0.0018118493860014295
6409,0,0.0003986442135880952
6419,0,0.0010952548178640997
6429,0,0.002311980005056946
6439,0,0.0015041634088973632
6449,0,0.0019816794715610264
6459,0,0.0015343259070201842
6469,0,0.002809208605913105
6479,0,0.003103126976166104
6489,0,0.0030403945342796224
6499,0,0.0032942244181793923
6509,0,0.002864668976409579
6519,0,0.0023335596325217978
6529,0,0.0035530919590724963
6539,0,0.004145702124712103
6549,0,0.0033820622037430415
6559,0,0.002783582321257083
6569,0,0.0039327051676188995
6579,0,0.002610800212874853
6589,0,0.00324675923233797
6599,0,0.003107441936117339
6609,0,0.004787574468092748
6619,0,0.0050747917433050516
6629,0,0.003912018435664022
6639,0,0.003550273392768144
6649,0,0.003957635081623501
6659,0,0.0043307264559475644
6669,0,0.004299366462993448
6679,0,0.004451700774377065
6689,0,0.005236219455337476
6699,0,0.00424521408024614
6709,0,0.004178128498002476
6719,0,0.0031367132997668357
6729,0,0.0046416922817285045
6739,0,0.0038064024913229133
6749,0,0.003325045446001318
6759,0,0.004188191535867025
6769,0,0.005668321445772451
6779,0,0.0044045897771733955
6789,0,0.005088943171890681
6799,0,0.00508853489930472
6809,0,0.0033443688860665954
6819,0,0.003370611111884081
6829,0,0.0030569991989374268
6839,0,0.004850153452564676
6849,0,0.0031145974028247148
6859,0,0.004056950333829912
6869,0,0.0029473959099711733
6879,0,0.0027710383291881246
6889,0,0.0025072315154621716
6899,0,0.0036963943956280776
6909,0,0.0031588267167729223
6919,0,0.002411883383915736
6929,0,0.002845196378736259
6939,0,0.0029592279086113615
6949,0,0.002533602082908981
6959,0,0.003301932082945269
6969,0,0.002689723349991624
6979,0,0.002968498880628667
6989,0,0.002365832415577973
6999,0,0.0023374321189573166
7009,0,0.0030468865156889624
7019,0,0.0014728239099351947
7029,0,0.002185511327727485
7039,0,0.002123338198823377
7049,0,0.002445590587619839
7059,0,0.0030310986304759036
7069,0,0.002140005165795822
7079,0,0.0020573801245512557
7089,0,0.0013928190438845522
7099,0,0.002045838632593555
7109,0,0.0013994617620273209
7119,0,0.0015256584198604095
7129,0,0.0014862784676260565
7139,0,0.0018556877582608378
7149,0,0.0014805316952685166
7159,0,0.0009097604507213308
7169,0,0.0010204800293115435
7179,0,0.0013121679048849755
7189,0,0.0007668527802072722
7199,0,0.0009034908874601122
7209,0,0.001033856334000216
7219,0,0.0009698636310098152
7229,0,0.0006582058728524798
7239,0,0.0007688510079130184
7249,0,0.0007863984736167784
7259,0,0.0008401379892577499
7269,0,0.0009252916573412873
7279,1,0.0011509697291670618
7289,1,0.010528490367942456
7299,1,0.020078014998432092
7309,1,0.030142685206996978
7319,1,0.04034707835852297
7329,1,0.05108148712615701
7339,1,0.062189698453612774
7349,1,0.07392095464673559
7359,1,0.08592656554616379
7369,1,0.09819243702915309
7379,1,0.1115589950784126
7389,1,0.1253306420166096
7399,1,0.13990030332075903
7409,1,0.15480573828555622
7419,1,0.17071808661193594
7429,1,0.18748858421092546
7439,1,0.20505588394916652
7449,1,0.22320285271088097
7459,1,0.24241610260574242
7469,1,0.2629897387983335
7479,1,0.2844459890593664
7489,1,0.3064961503835832
7499,1,0.33156255528789946
7509,1,0.35751904409359336
7519,1,0.384776908355194
7529,1,0.4141332546486992
7539,1,0.438191541258115
7549,1,0.47873209292184365
7559,1,0.5137338293236166
7569,1,0.552456243367103
7579,1,0.5944176945833725
7589,1,0.639546810976571
7599,1,0.6880104756034718
7609,1,0.7409846210354145
7619,1,0.7969510838485134
7629,1,0.8626739144449146
7639,1,0.9337140665157135
7649,1,1.0119547227600452
7659,1,1.098573140327868
7669,1,1.1944186503402756
7679,1,1.3047066963909173
7689,1,1.4302091735121718
7699,1,1.574867281770033
7709,1,1.7429489650466348
7719,1,1.940731345025492
7729,1,2.1760087118954354
7739,1,2.4631110067692235
7749,1,2.817285928990107
7759,1,3.2678779749301223
7769,1,3.8574501730145285
7779,1,4.493750554773852
7789,1,4.395937088678966
7799,1,4.473108493264447
7809,1,4.372083145607331
7819,1,4.272235276171979
7829,1,4.175689535510449
7839,1,4.072225369302481
7849,1,3.9726210683571006
7859,1,3.878412295854597
7869,1,3.7814026304227464
7879,1,3.6731204989476898
7889,1,3.578354112281472
7899,1,3.4752579350013595
7909,1,3.3814632784568297
7919,1,3.2826347270330305
7929,1,3.1803140310980647
7939,1,3.0815413794385806
7949,1,2.9784670018151544
7959,1,2.8879918811332836
7969,1,2.7785606918119607
7979,1,2.6951163961815463
7989,1,2.592633335330568
7999,1,2.4816239815730357
8009,1,2.384770351119195
8019,1,2.2846255812487275
8029,1,2.181571485032549
8039,1,2.0876807497744907
8049,1,1.9896813626398113
8059,1,1.884680507992614
8069,1,1.7785765989375277
8079,1,1.6858944628412873
8089,1,1.5816999257041697
8099,1,1.4939851180846953
8109,1,1.391379840440321
8119,1,1.2937930167082583
8129,1,1.1879202498951202
8139,1,1.0908325099280887
8149,1,0.9912744013063566
8159,1,0.8857341522273543
8169,1,0.8529127113295395
8179,1,0.6882944151291268
8189,1,0.6212993265629396
8199,1,0.013311096550267076
8209,1,0.39120948328378763
8219,1,0.2912353684708962
8229,1,0.1945242934688758
8239,1,0.06078393281181482
8249,1,-0.009518409037624243
8259,1,-0.010097460948204962
8269,1,0.11378385424143167
8279,1,0.0039022586047756103
8289,1,0.09272464870061126
8299,1,0.08854457840918106
8309,1,-0.001947364252560202
8319,1,0.004976038746141831
8329,1,0.03519175468661229
8339,1,0.04794361319788115
8349,1,0.25565301304711985
8359,1,0.20452555818384932
8369,1,0.13440019440643308
8379,1,0.13014436404025975
8389,1,0.13150956824665205
8399,1,0.18641415410351048
8409,1,0.16781163855718595
8419,1,0.15906468767712523
8429,1,0.22345623606950782
8439,1,0.21418901798365442
8449,1,0.22270466314047166
8459,1,0.19835976643105668
8469,1,0.19559223271275827
8479,1,0.22123236419594844
8489,1,0.20080953326972428
8499,1,0.1828705682691028
8509,1,0.21222720173615867
8519,1,0.22264277252817777
8529,1,0.18850731783788233
8539,1,0.19762994858368044
8549,1,0.15877139496651166
8559,1,0.17641111864303788
8569,1,0.20807586496205155
8579,1,0.16976094034752315
8589,1,0.17181955526077852
8599,1,0.17196191130383764
8609,1,0.19480535828655904
8619,1,0.15213253976714253
8629,1,0.1870858605929654
8639,1,0.17067691402185547
8649,1,0.18030235574235154
8659,1,0.2984952990414889
8669,1,0.2881151982708416
8679,1,0.24248644151755844
8689,1,0.2899706342727408
8699,1,0.294504166957417
8709,1,0.336046428247562
8719,1,0.32071477549992644
8729,1,0.3712924172946474
8739,1,0.431985728867781
8749,1,0.45908818434432697
8759,1,0.8077049415766885
8769,1,0.8272134027981485
8779,1,0.6475709710158428
8789,1,1.0452302639065603
8799,1,0.8727523884052883
8809,1,0.8216151372293831
8819,1,1.4039855166060518
8829,1,1.2173824065834427
8839,1,0.7146747296685351
8849,1,0.9774403361092382
8859,1,1.172541705917962
8869,1,0.7147453626040714
8879,1,0.8644469150168094
8889,1,1.3289943975538294
8899,1,1.4773928703760133
8909,1,0.9859464970406735
8919,1,0.7156438584985297
8929,1,1.1004087303962955
8939,1,1.2749006267287628
8949,1,1.4069870770063018
8959,1,2.445366419405883
8969,1,1.9211337307031344
8979,1,2.4092126482454077
8989,1,2.3161529076848804
8999,1,2.259345635679521
9009,1,2.1413779084577373
9019,1,2.4427217517336146
9029,1,2.103547858347759
9039,1,1.9276250844705443
9049,1,1.916203721611256
9059,1,1.4075508393982665
9069,1,1.8027898416158101
9079,1,1.424367023154982
9089,1,1.9860988127924086
9099,1,2.0797946235009364
9109,1,1.8585991399331703
9119,1,1.641161011427528
9129,1,1.7531274573818927
9139,1,1.072722654004009
9149,1,1.385653716918522
9159,1,1.447048821243965
9169,1,1.4513042681137338
9179,1,1.306373351740611
9189,1,1.577067420473376
9199,1,1.3085794809124889
9209,1,1.4181522201423482
9219,1,1.2718436220904823
9229,1,0.974284574128887
9239,1,1.121340490783298
9249,1,0.9914494398473883
9259,1,1.3269311453440762
9269,1,1.1798333078834922
9279,1,1.023530540964877
9289,1,1.2866572736206927
9299,1,0.8688711231520534
9309,1,0.8831748540646409
9319,1,0.9269135227699798
9329,1,0.8263721917706985
9339,1,1.1095017650151024
9349,1,0.6765758431688232
9359,1,0.3629194454404206
9369,1,1.0231253415599055
9379,1,1.4509061450182879
9389,1,1.6622632973316909
9399,1,1.5434959556716668
9409,1,1.4907476872643133
9419,1,1.3246688906433288
9429,1,0.9952771865448617
9439,1,0.8296418187357875
9449,1,0.8081006488250135
9459,1,0.43859302010067003
9469,1,0.6837288668327673
9479,1,0.8444868754591878
9489,1,0.864489091012554
9499,1,0.5034412949505881
9509,1,0.8306859188528541
9519,1,0.4317296959522866
9529,1,0.4707418705399985
9539,1,0.29882505743007426
9549,1,0.09652044186210951
9559,1,0.06078876662354382
9569,1,0.04244982782127493
9579,1,0.1965207129247204
9589,1,0.33377527085308084
9599,1,0.05726739416816107
9609,1,0.17940593451822168
9619,1,0.05256133573619337
9629,1,0.08091519075184161
9639,1,0.050819807763897884
9649,1,0.2514066026488186
9659,1,0.06036991319161111
9669,1,0.059361606125683086
9679,1,0.07139405169284035
9689,1,0.0783161034430091
9699,1,0.0857493144386055
9709,1,0.08871553485873607
9719,1,0.11793174894701114
9729,1,0.11756605354833705
9739,1,0.11840059000822889
9749,1,0.11099946680044509
9759,1,0.09020513875893454
9769,1,0.07204416460811447
9779,1,0.021832334810155174
9789,1,0.024155891800153206
9799,1,0.02040926059245507
9809,1,0.0010307536088327574
9819,1,0.0020637389000434103
9829,1,0.013097550113245426
9839,1,0.038232079792913765
9849,1,0.05487801265432085
9859,1,0.07918054859773471
9869,1,0.11277411227955231
9879,1,0.16833874040716684
9889,1,0.20299232705805392
9899,1,0.2398777400375729
9909,1,0.29068761005701615
9919,1,0.3026466059038955
9929,1,0.3171221207115032
9939,1,0.3316753503452354
9949,1,0.2863512598003197
9959,1,0.24799827908818806
9969,1,0.21694199082275972
9979,1,0.2852193393057928
9989,1,0.20714021047637848
9999,1,0.20001064295178972
10009,1,0.1938065815816034
10019,1,0.18451077696152657
10029,1,0.19362761495062314
10039,1,0.15537333564000655
10049,1,0.14125457660161134
10059,1,0.11923526174867116
10069,1,0.12113944113747055
10079,1,0.11407486221264901
10089,1,0.13444339335845534
10099,1,0.14286762794070978
10109,1,0.1682721855635559
10119,1,0.18320227516726018
10129,1,0.18461667654085206
10139,1,0.18453970943319353
10149,1,0.18216094988290366
10159,1,0.19463899879680574
10169,1,0.21794978992941927
10179,1,0.26378145602530517
10189,1,0.2962896751017714
10199,1,0.35124668448568763
10209,1,0.3787026271967118
10219,1,0.4513007110239897
10229,1,0.5363962103250826
10239,1,0.8605727924312561
10249,1,0.8848254146920272
10259,1,0.4037912787319285
10269,1,0.6937823157815419
10279,1,0.6466750198006679
10289,1,0.4096511253284776
10299,1,0.3817788032461829
10309,1,0.3456026804586345
10319,1,0.3315910606562684
10329,1,0.3278685597564032
10339,1,0.48395832549794704
10349,1,0.6512830062075737
10359,1,0.34246257296847377
10369,1,0.6298314138008052
10379,1,0.4507680216879406
10389,1,0.5614509566934989
10399,1,0.48531446054027055
10409,1,0.7681938043389724
10419,1,0.480892807681237
10429,1,0.541633806638817
10439,1,0.3106145839019112
10449,1,0.20396464319343494
10459,1,0.8288458685937974
10469,1,0.5905264862676245
10479,1,0.4945672925605849
10489,1,0.6242986165645359
10499,1,0.27562393166843546
10509,1,0.5719490907949557
10519,1,0.1858378567039512
10529,1,0.17694057939904778
10539,1,0.19374325249172875
10549,1,0.216622125033611
10559,1,0.34216440314589797
10569,1,0.17960238722206318
10579,1,0.2843708545300943
10589,1,0.26103543303683235
10599,1,0.14077858096785711
10609,1,0.42882057777147187
10619,1,0.1254898380065148
10629,1,0.1209518420637809
10639,1,0.13565194263942454
10649,1,0.11496994831373941
10659,1,0.1068989760445278
10669,1,0.16502463485415808
10679,1,0.13267653377159605
10689,1,0.06948471677488921
10699,1,0.05373073097342285
10709,1,0.042321852932548754
10719,1,0.022388766930497184
10729,1,0.031606161794328014
10739,1,0.02710723602294457
10749,1,0.028571271573370305
10759,1,0.029987338034441202
10769,1,0.14225709070338516
10779,1,0.027870691710486395
10789,1,0.025873060559538585
10799,1,0.024786505259149716
10809,1,0.022983135283406564
10819,1,0.018580270904262286
10829,1,0.013050580592985361
10839,1,0.008804806668524179
10849,1,0.007499309859917147
10859,1,0.005011276723326963
10869,1,5.977084478209216e-05
10879,1,3.4142712093676586e-05
10889,1,-1.6154312887373123e-08
10899,1,1.3367198556824e-05
10909,1,5.121257257328926e-05
10919,1,0.004684499689613764
10929,1,5.594103077416479e-05
10939,1,8.377271544546261e-05
10949,1,2.9328567464181887e-05
10959,1,2.4354417927086036e-05
10969,1,-1.4173432316688661e-08
10979,1,2.2538798605253874e-10
10989,1,1.8156402308622255e-05
10999,1,3.974100894538202e-05
11009,1,0.0040254423569562325
11019,1,0.004475904069178249
11029,1,0.0039058650675477535
11039,1,2.7356336721517938e-05
11049,1,3.686240634959148e-08
11059,1,6.551673508825573e-05
11069,1,2.2123174172550275e-05
11079,1,-3.0996148425721515e-09
11089,1,-1.1454797443910536e-08
11099,1,4.1566975579998555e-05
11109,1,8.118915668614557e-05
11119,1,6.619349325504009e-05
11129,1,0.00386846848074196
11139,1,0.010335356594450451
11149,1,0.015819258564103766
11159,1,0.021218487166179023
11169,1,0.026954293001157537
11179,1,0.030372355080075852
11189,1,0.03510285778594863
11199,1,0.12079408364587729
11209,1,0.02686388008499463
11219,1,0.036295334609031615
11229,1,0.03408763031783296
11239,1,0.03079052098220575
11249,1,0.027858887621487527
11259,1,0.08325095425719403
11269,1,0.0714105927031054
11279,1,0.011292361786808147
11289,1,0.026989297978448845
11299,1,0.20527780847792887
11309,1,0.07943121725767116
11319,1,0.22453728399007866
11329,1,0.03854467111049503
11339,1,0.3334711808826166
11349,1,0.040653202190867044
11359,1,0.039020244721107766
11369,1,0.25323340514775705
11379,1,0.27243244518369775
11389,1,0.17140392421867062
11399,1,0.05040757160835757
11409,1,0.05321878578505351
11419,1,0.4877212565704697
11429,1,0.07695923464315663
11439,1,0.3931305774050955
11449,1,0.2916763458058375
11459,1,0.43751471640284106
11469,1,0.5933311194217259
11479,1,0.8585834723084123
11489,1,0.42846434654312826
11499,1,0.7332916301294358
11509,1,1.2688625116098917
11519,1,0.8164879210525603
11529,1,1.5740565616327171
11539,1,1.7656393250136044
11549,1,0.8454559934166584
11559,1,0.7852407833915103
11569,1,1.5145937799033957
11579,1,1.0245886048322044
11589,1,1.5100691084396696
11599,1,1.2241930174913653
11609,1,1.407407324721827
11619,1,1.699422681672265
11629,1,1.1159557471983175
11639,1,1.215980240321529
11649,1,1.2654379617589178
11659,1,1.2959252707188995
11669,1,0.666595634603525
11679,1,1.0534127867588192
11689,1,1.0005507369489617
11699,1,1.2969042523520233
11709,1,0.8963959371009853
11719,1,1.1464288859494447
11729,1,1.2273461538491457
11739,1,1.0409349802229864
11749,1,0.9192506099279824
11759,1,1.1792580904347905
11769,1,1.203318495977698
11779,1,0.8882632796555294
11789,1,1.147944284758009
11799,1,1.1432175590857807
11809,1,1.0857112461569538
11819,1,1.0848501965427184
11829,1,1.2823967846188455
11839,1,1.366017191839175
11849,1,1.0187698864293617
11859,1,1.3623594161047836
11869,1,0.9398845949915512
11879,1,1.3215825773667453
11889,1,1.345295590646836
11899,1,1.5208017120457096
11909,1,0.8322645532831946
11919,1,0.030670483495032652
11929,1,1.4277194736539303
11939,1,0.26048417599373785
11949,1,1.0074317738187657
11959,1,0.5338588926310379
11969,1,0.5000937780964874
11979,1,0.591090537469545
11989,1,0.48309326301633954
11999,1,0.9013284984358212
12009,1,0.8822585660068903
12019,1,0.46472099498229497
12029,1,0.7697892471363592
12039,1,0.4442507088045506
12049,1,0.47690920840482925
12059,1,0.41600181270661096
12069,1,0.5128600025939295
12079,1,0.34802109205773607
12089,1,0.39895759379169105
12099,1,0.3128960516492229
12109,1,0.21052785981177546
12119,1,0.21572779906823764
12129,1,0.25206908064329736
12139,1,0.186108569315028
12149,1,0.2059439783922396
12159,1,0.2681003820405382
12169,1,0.1796263350846239
12179,1,0.20567824418620528
12189,1,0.18571398578319998
12199,1,0.07505118645791614
12209,1,0.13972737917880895
12219,1,0.13396908273834468
12229,1,0.20292880409865527
12239,1,0.23824931717054443
12249,1,0.22955109180245548
12259,1,0.20042602558218453
12269,1,0.17131589649056983
12279,1,0.154658172097826
12289,1,0.18129070649490797
12299,1,0.17525390042858774
12309,1,0.313798590676599
12319,1,0.22254917634239674
12329,1,0.19632152042599338
12339,1,0.19640205206936467
12349,1,0.16973521116850515
12359,1,0.14691474043625014
12369,1,0.13341780985377255
12379,1,0.08895029169361962
12389,1,0.08330067819854653
12399,1,0.09377459667862342
12409,1,0.10469089212928417
12419,1,0.09709385534450393
12429,1,0.08820911228671208
12439,1,0.0738796757308442
12449,1,0.07782309220010536
12459,1,0.04949038371819914
12469,1,0.03787362520918364
12479,1,0.04137594292740171
12489,1,0.02187757118985101
12499,1,0.021431261506302035
12509,1,0.001450338370917681
12519,1,0.0013822849340083265
12529,1,0.001850503270738546
12539,1,0.028040778733541383
12549,1,0.031722968794853035
12559,1,0.045611625425607705
12569,1,0.049214358786983714
12579,1,0.045520150958040906
12589,1,0.03663906771375103
12599,1,0.035999142028193654
12609,1,0.035291605868950415
12619,1,0.039460855108543746
12629,1,0.05755148837639912
12639,1,0.048376974251649496
12649,1,0.043700738066711264
12659,1,0.04111009857930692
12669,1,0.046295346717314945
12679,1,0.05976579342031091
12689,1,0.05962101988521057
12699,1,0.05076269774857334
12709,1,0.05894044999404585
12719,1,0.04730669262036158
12729,1,0.0277156271640725
12739,1,0.012607194977399039
12749,1,0.026556715051554936
12759,1,0.0450575963779512
12769,1,0.06864988957300255
12779,1,0.07922955652296648
12789,1,0.06825634334850705
12799,1,0.0434970373969093
12809,1,0.032809764589333545
12819,1,0.018169836188097532
12829,1,0.013321923364903732
12839,1,0.012495865505324277
12849,1,0.008320227809264558
12859,1,0.015470628903102523
12869,1,0.03342829707792244
12879,1,0.025745404644287206
12889,1,0.0011888489272974812
12899,1,0.0007589940766300485
12909,1,0.00017525730397577322
12919,1,0.00012999333001595392
12929,1,0.00031852813852190076
12939,1,0.0006853257731763152
12949,1,0.000824729665970636
12959,1,0.004578689682584902
12969,1,0.006916460197612606
12979,1,0.0008648208714323036
12989,1,0.0007611476098119963
12999,1,0.0005306466912303187
13009,1,0.00032858950954905985
13019,1,0.00024786716542019027
13029,1,0.00014698800279105972
13039,1,0.00019174280773293084
13049,1,0.0001722653422241427
13059,1,0.00043469406397628196
13069,1,0.0004275789642531058
13079,1,0.00731632874655197
13089,1,0.0048548355729048365
13099,1,0.0017061187882834727
13109,1,0.006203066921590561
13119,1,0.013943579890689173
13129,1,0.016995517747390887
13139,1,0.031144595747689463
13149,1,0.03342202209487766
13159,1,0.033918162172813515
13169,1,0.035711831416887
13179,1,0.037322570704883595
13189,1,0.05578938565464264
13199,1,0.06451806482255512
13209,1,0.06959961188986286
13219,1,0.08132692690613402
13229,1,0.0778295372968757
13239,1,0.08156471965697332
13249,1,0.10351352422427779
13259,1,0.11891736388919566
13269,1,0.13918263912755624
13279,1,0.1448735295161474
13289,1,0.12287545109909792
13299,1,0.12612194256340564
13309,1,0.13857781670595926
13319,1,0.13274443693240412
13329,1,0.16466267095711923
13339,1,0.12553904318587467
13349,1,0.11189149164409007
13359,1,0.13644953471596655
13369,1,0.15656460752550927
13379,1,0.14876688911456237
13389,1,0.11462276265683474
13399,1,0.08254768566023263
13409,1,0.046067668156512975
13419,1,0.04008213373388081
13429,1,0.032990789297767
13439,1,0.03169369289319629
13449,1,0.044350620855345135
13459,1,0.032888830388784984
13469,1,0.034376604289921564
13479,1,0.010722493908712882
13489,1,0.019705873387103057
13499,1,0.0062720007985935244
13509,1,0.011279752696914114
13519,1,0.0008057219544464478
13529,1,0.0009822517645757256
13539,1,0.0011295868749283122
13549,1,0.0011593543476271506
13559,1,0.0009959882832172307
13569,1,0.017782862025091883
13579,1,0.001181926821704593
13589,1,0.023056205393177265
13599,1,0.025871502777746136
13609,1,0.02371051011521863
13619,1,0.009892210765628184
13629,1,0.006762460658951475
13639,1,0.011492480235550107
13649,1,0.017566583035090122
13659,1,-1.0301951236524332e-08
13669,1,0.00014918405380665023
13679,1,0.0003024562367328065
13689,1,0.00018578851554051923
13699,1,0.00038518476155413595
13709,1,0.0009937077164851593
13719,1,0.005944433516319181
13729,1,0.0212246079959581
13739,1,0.03280319217163713
13749,1,0.05169265036338411
13759,1,0.05549159980322427
13769,1,0.05707717854673866
13779,1,0.06127175099474236
13789,1,0.0610687609842252
13799,1,0.05838362624980331
13809,1,0.0698455249470673
13819,1,0.11279354536956537
13829,1,0.11361547754024531
13839,1,0.0899922159735495
13849,1,0.08398720126406073
13859,1,0.09746403752294325
13869,1,0.1441983135779159
13879,1,0.15214191455625248
13889,1,0.15808931389698977
13899,1,0.1146142219659409
13909,1,0.0940037289126529
13919,1,0.09402709216518756
13929,1,0.09024437302850341
13939,1,0.09280203151014033
13949,1,0.09846042442798342
13959,1,0.09734671039260084
13969,1,0.07601536597518738
13979,1,0.07552487927813828
13989,1,0.0683982895130642
13999,1,0.06399684368133834
14009,1,0.08632931249834358
14019,1,0.10689602340400656
14029,1,0.13642637856443113
14039,1,0.16803000072852536
14049,1,0.16932949505216727
14059,1,0.18052747555644022
14069,1,0.18222669114819512
14079,1,0.22236582808082367
14089,1,0.2614092220562152
14099,1,0.2660484542082989
14109,1,0.2873577468267758
14119,1,0.29281765443188007
14129,1,0.4493630995380297
14139,1,0.39087648894153504
14149,1,0.330188345619715
14159,1,0.23849915522585108
14169,1,0.3257460202884585
14179,1,0.5303684701892208
14189,1,0.34346425977719125
14199,1,0.5636460150010559
14209,1,0.5485756001942601
14219,1,0.31326469887909597
14229,1,0.29089696436338647
14239,1,0.2560333687584575
14249,1,0.2318026699462004
14259,1,0.20691635773288386
14269,1,0.19928885904041055
14279,1,0.2059334184101267
14289,1,0.20650234342483426
14299,1,0.20778444474928776
14309,1,0.19888579148568697
14319,1,0.18164895085763433
14329,1,0.19071985123582463
14339,1,0.17189934903704684
14349,1,0.21813280142387215
14359,1,0.20049690604300002
14369,1,0.17683613036381407
14379,1,0.1621614554473333
14389,1,0.1585499155813646
14399,1,0.272800023781847
14409,1,0.33637920272678723
14419,1,0.42392353774829694
14429,1,0.26782994603648086
14439,1,0.03451208171492681
14449,1,0.3393408679855635
14459,1,0.18734368092090203
14469,1,0.78416646224408
14479,1,0.47528468162149384
14489,1,0.6742751346065821
14499,1,0.5707568235549214
14509,1,0.5006330078439327
14519,1,0.4972028010196918
14529,1,0.7059229352747747
14539,1,0.6693818974065566
14549,1,0.40238126654870954
14559,1,0.11978552395151615
14569,1,0.22361276410305103
14579,1,0.07942777414819485
14589,1,0.07687155008958074
14599,1,0.06688610888169688
14609,1,0.4194055373353841
14619,1,0.09401701936523127
14629,1,0.14065313264361345
14639,1,0.3579815469729947
14649,1,0.15313295448335512
14659,1,0.039751548508219714
14669,1,0.020883190079608704
14679,1,0.008954801303525328
14689,1,0.04447157699227955
14699,1,0.006559695426719081
14709,1,0.013823863240728596
14719,1,0.017254917883310017
14729,1,0.026250947740751818
14739,1,0.042031148991921397
14749,1,0.17727310870187513
14759,1,0.17497292925314584
14769,1,0.353127533387848
14779,1,0.14859042214167228
14789,1,0.2353657524671
14799,1,0.15610811554000104
14809,1,0.037988350127996284
14819,1,0.014656954499339736
14829,1,0.007281545045174365
14839,1,0.18930683625908207
14849,1,0.05675842590227448
14859,1,0.039186962901678224
14869,1,0.04219817834304773
14879,1,0.04256284360484053
14889,1,0.035416072264876586
14899,1,0.028540501485021408
14909,1,0.023128569082186246
14919,1,0.02247211448682357
14929,1,0.02180316529188192
14939,1,0.021501178788304043
14949,1,0.013621171418181255
14959,1,0.00031505775739804065
14969,1,6.016099926570151e-05
14979,1,1.851201279629011e-05
14989,1,1.6622783427511223e-08
14999,1,9.919365598948238e-05
15009,1,0.0022827955666401833
15019,1,0.006924740789325146
15029,1,0.012955321880653459
15039,1,0.022094842402203274
15049,1,0.030917843996926042
15059,1,0.03825152444224322
15069,1,0.0541524741926504
15079,1,0.05971398602046263
15089,1,0.06451466914719511
15099,1,0.06390349683777363
15109,1,0.06533098869741766
15119,1,0.06077670924493139
15129,1,0.06042597840110059
15139,1,0.0622548539339991
15149,1,0.0641635586162328
15159,1,0.06702551385677002
15169,1,0.06700215060908998
15179,1,0.067055084423083
15189,1,0.06234574355583561
15199,1,0.05105843431071805
15209,1,0.04029771549841926
15219,1,0.03161212450333789
15229,1,0.018570198129533866
15239,1,0.00013288559306479097
15249,1,0.00013989473115838535
15259,1,0.014936612541223304
15269,1,0.02263978571102021
15279,1,0.016967156988875243
15289,1,0.0001052694347848937
15299,1,2.660133061255232e-05
15309,1,0.00012622038859105844
15319,1,8.520100178621703e-05
15329,1,2.6200127123399142e-08
15339,1,6.869775497225783e-05
15349,1,2.4908410567681116e-05
15359,1,3.9392927086989715e-08
15369,1,5.4932350113112705e-08
15379,1,8.73486513586208e-06
15389,1,3.542659561373007e-05
15399,1,8.661801873416364e-05
15409,1,8.34632344465791e-05
15419,1,7.738998872086622e-05
15429,1,8.457785185950195e-05
15439,1,7.68993276297758e-05
15449,1,8.443195082552535e-05
15459,1,0.003420959365361631
15469,1,0.007021022016188205
15479,1,0.013484183261282923
15489,1,0.004750418169972348
15499,1,5.259823036113387e-05
15509,1,0.00014256254319555683
15519,1,0.0041542346467733915
15529,1,0.010581238153153483
15539,1,0.015798840603509612
15549,1,0.02288923972010032
15559,1,0.028024525455573213
15569,1,0.04027520688502145
15579,1,0.047437994219755975
15589,1,0.13006552194049564
15599,1,0.05538385851546157
15609,1,0.057159557453782484
15619,1,0.05420316974115491
15629,1,0.04999996373553606
15639,1,0.049613610907411565
15649,1,0.05136707171586402
15659,1,0.052184329420852604
15669,1,0.04368526977507459
15679,1,0.05042787031988233
15689,1,0.04152236878481175
15699,1,0.03379495174611974
15709,1,0.027091137319155245
15719,1,0.016150290398914968
15729,1,0.0041136449386852125
15739,1,0.0001148599507064807
15749,1,0.0022603923450505436
15759,1,0.012963163062223004
15769,1,0.022169662893183284
15779,1,0.024688694311380988
15789,1,0.019882262040315957
15799,1,0.005068573918245223
15809,1,0.010831104853108176
15819,1,0.011053016029812956
15829,1,0.010271025143184564
15839,1,0.013221736462158906
15849,1,0.013716335932187795
15859,1,0.016103969928950967
15869,1,0.015608982188483889
15879,1,0.01178851153118926
15889,1,0.006913438486524648
15899,1,0.007381263617415312
15909,1,0.00598351041597911
15919,1,0.010171242887476728
15929,1,0.008445266982311184
15939,1,0.008257556325441562
15949,1,0.0060450516571474155
15959,1,0.0031820265477197074
15969,1,0.0022149156923348956
15979,1,0.02236002462901343
15989,1,0.006624007353112027
15999,1,0.014499480899784645
16009,1,0.02405385006141353
16019,1,0.02976432403709689
16029,1,0.032272728669986595
16039,1,0.029175997037697132
16049,1,0.02219864948974165
16059,1,0.018879799846730883
16069,1,0.02109193380271246
16079,1,0.0212304470275389
16089,1,0.02215524772290195
16099,1,0.02213536309765557
16109,1,0.021276919949484774
16119,1,0.019916064368833974
16129,1,0.01584849919110831
16139,1,0.015274354797321699
16149,1,0.015571366888556981
16159,1,0.014680629999482109
16169,1,0.014371026588228086
16179,1,0.01353912220731568
16189,1,0.011690913288403826
16199,1,0.0034261916673957726
