T,S,Score
399,1.0,7.8771205
409,1.0,8.0618925
419,1.0,6.146585
429,1.0,5.694409
439,1.0,4.368675
449,1.0,4.5123644
459,1.0,3.7497067
469,1.0,3.305919
479,1.0,2.9737217
489,1.0,2.3389556
499,1.0,1.8640229
509,1.0,1.6745524
519,1.0,1.7965761
529,1.0,0.7602825
539,1.0,1.4282489
549,1.0,1.86147
559,1.0,1.7380252
569,1.0,1.4280866
579,0.0,2.1396763
589,0.0,2.5493565
599,0.0,2.1822422
609,0.0,2.4239693
619,0.0,3.0671391
629,0.0,2.026667
639,0.0,2.2554202
649,0.0,0.89428276
659,0.0,0.47302473
669,0.0,0.9361759
679,0.0,0.1886158
689,0.0,-0.25685096
699,0.0,0.36028397
709,0.0,-0.29049814
719,0.0,-0.18400788
729,0.0,-0.21038532
739,0.0,-0.016937971
749,0.0,1.9242496
759,0.0,1.4349205
769,0.0,1.4675801
779,0.0,0.6929173
789,0.0,0.91254425
799,0.0,1.189085
809,0.0,0.16942358
819,0.0,1.1568537
829,0.0,2.0877638
839,0.0,1.8641217
849,0.0,1.3098972
859,0.0,1.5218413
869,0.0,0.83640945
879,0.0,0.3634436
889,0.0,0.29545748
899,0.0,0.22897375
909,0.0,0.46189457
919,0.0,0.2685451
929,0.0,0.42887062
939,0.0,0.076705456
949,0.0,0.112004995
959,0.0,-0.10004777
969,0.0,0.4976089
979,0.0,-0.17823362
989,0.0,-0.32939494
999,0.0,-0.39713657
1009,0.0,-0.30302942
1019,0.0,-0.1218124
1029,0.0,0.21496648
1039,0.0,-0.33319044
1049,0.0,-0.21001446
1059,0.0,-0.43021435
1069,0.0,-0.06647205
1079,0.0,-0.34704995
1089,0.0,-0.18687624
1099,0.0,-0.00856185
1109,0.0,-0.17682147
1119,0.0,1.0437808
1129,0.0,1.0611682
1139,0.0,0.9745122
1149,0.0,1.5131142
1159,0.0,1.0598271
1169,0.0,1.9833212
1179,0.0,2.7144835
1189,0.0,2.296301
1199,0.0,3.332302
1209,0.0,4.0949507
1219,0.0,6.7137084
1229,0.0,4.0715704
1239,0.0,3.6461706
1249,0.0,4.1701894
1259,0.0,1.267953
1269,0.0,1.8540115
1279,0.0,0.73968387
1289,0.0,0.60181487
1299,0.0,0.16889608
1309,0.0,0.33316278
1319,0.0,-0.03607297
1329,0.0,-0.38308716
1339,0.0,0.21989417
1349,0.0,-0.15460587
1359,0.0,-0.25363445
1369,0.0,-0.29401743
1379,0.0,-0.5754107
1389,0.0,0.34997827
1399,0.0,-0.0034663677
1409,0.0,0.909285
1419,0.0,1.3637456
1429,0.0,1.312079
1439,0.0,0.5391758
1449,0.0,0.72775614
1459,0.0,0.38049185
1469,0.0,0.4688627
1479,0.0,0.7772907
1489,0.0,0.41653407
1499,0.0,0.8628607
1509,0.0,0.37630177
1519,0.0,1.1683122
1529,0.0,0.93366843
1539,0.0,0.56337255
1549,0.0,0.62422377
1559,0.0,1.1085814
1569,0.0,0.23005378
1579,0.0,0.3030933
1589,0.0,-0.45607853
1599,0.0,-0.13400167
1609,0.0,0.25438207
1619,0.0,-0.098915935
1629,0.0,-0.6170448
1639,0.0,-0.4035349
1649,0.0,-0.042488575
1659,0.0,0.9319877
1669,0.0,0.062983274
1679,0.0,0.911969
1689,0.0,0.61947703
1699,0.0,0.36009824
1709,0.0,-0.27342463
1719,0.0,0.3338136
1729,0.0,0.36849034
1739,0.0,0.2426424
1749,0.0,0.68407726
1759,0.0,1.0380449
1769,0.0,0.9038982
1779,0.0,2.2567441
1789,0.0,3.2759233
1799,0.0,1.9909726
1809,0.0,0.90822005
1819,0.0,0.6346402
1829,0.0,-0.35430104
1839,0.0,0.39395827
1849,0.0,0.16443133
1859,0.0,-0.2557721
1869,0.0,0.034453988
1879,0.0,0.36747676
1889,0.0,-0.30867076
1899,0.0,-0.40829957
1909,0.0,0.17321718
1919,0.0,-0.11369705
1929,0.0,0.52938867
1939,0.0,1.0183082
1949,0.0,2.0806034
1959,0.0,3.323141
1969,0.0,3.743765
1979,0.0,4.907975
1989,0.0,5.9894114
1999,0.0,3.9124365
2009,0.0,5.3162136
2019,0.0,2.9913454
2029,0.0,2.1833382
2039,0.0,3.5379896
2049,0.0,2.4145677
2059,0.0,2.8008826
2069,0.0,3.2576776
2079,0.0,2.5407703
2089,0.0,0.792691
2099,0.0,1.3006843
2109,0.0,1.0929313
2119,0.0,0.6193155
2129,0.0,0.94995874
2139,0.0,0.08102262
2149,0.0,0.012120843
2159,0.0,-0.22746336
2169,0.0,0.32325137
2179,0.0,0.56659716
2189,0.0,-0.032515645
2199,0.0,0.66906136
2209,0.0,0.33868062
2219,0.0,0.08900249
2229,0.0,0.4453733
2239,0.0,0.08563149
2249,0.0,0.35277426
2259,0.0,0.6110369
2269,0.0,0.93481684
2279,0.0,0.42214042
2289,0.0,-0.06206602
2299,0.0,0.12564588
2309,0.0,1.0516944
2319,0.0,0.65316314
2329,0.0,0.81225014
2339,0.0,0.6388828
2349,0.0,1.0861723
2359,0.0,0.7879915
2369,0.0,0.5216567
2379,0.0,0.0024972558
2389,0.0,-0.0017707348
2399,0.0,0.14295542
2409,0.0,1.1563351
2419,0.0,1.1179563
2429,0.0,0.3342471
2439,0.0,0.90209997
2449,0.0,0.30233932
2459,0.0,0.9031193
2469,0.0,1.0558225
2479,0.0,1.351186
2489,0.0,0.79066604
2499,0.0,0.62002593
2509,0.0,0.5915857
2519,0.0,-0.0842545
2529,0.0,-0.24917948
2539,0.0,-0.18745136
2549,0.0,-0.12563002
2559,0.0,-0.065323114
2569,0.0,-0.45718277
2579,0.0,0.42478794
2589,0.0,0.32289773
2599,0.0,-0.23533726
2609,0.0,0.10156095
2619,0.0,0.5829676
2629,0.0,0.2217753
2639,0.0,0.6295259
2649,0.0,1.0978029
2659,0.0,0.34947848
2669,0.0,1.2269287
2679,0.0,1.2576201
2689,0.0,1.1176687
2699,0.0,1.4191849
2709,0.0,1.571423
2719,0.0,1.8338127
2729,0.0,1.9937325
2739,0.0,1.5913546
2749,0.0,2.0666006
2759,0.0,3.3592925
2769,0.0,2.3922107
2779,0.0,2.8596334
2789,0.0,3.1385727
2799,0.0,2.8352432
2809,0.0,2.661336
2819,0.0,2.779814
2829,0.0,3.1798398
2839,0.0,2.7120361
2849,0.0,2.40013
2859,0.0,2.6161819
2869,0.0,1.1530386
2879,0.0,1.7164246
2889,0.0,0.9664383
2899,0.0,0.42212927
2909,0.0,0.28299087
2919,0.0,-0.03494382
2929,0.0,0.41581726
2939,0.0,0.34064436
2949,0.0,-0.5998595
2959,0.0,-0.5898215
2969,0.0,-0.43140775
2979,0.0,-0.7718681
2989,0.0,0.08914244
2999,0.0,0.58832073
3009,0.0,-0.22073299
3019,0.0,0.5028405
3029,0.0,1.1840088
3039,0.0,0.9354392
3049,0.0,1.1611955
3059,0.0,1.3702261
3069,0.0,0.99309194
3079,0.0,1.1240726
3089,0.0,1.0290453
3099,0.0,1.1292262
3109,0.0,0.55347526
3119,0.0,0.53153646
3129,0.0,0.41096634
3139,0.0,0.18446183
3149,0.0,-0.5758604
3159,0.0,-0.388798
3169,1.0,-0.25297797
3179,1.0,-0.09433365
3189,1.0,0.09963286
3199,1.0,0.4292252
3209,1.0,0.49306422
3219,1.0,0.99283206
3229,1.0,0.8999502
3239,1.0,1.7191267
3249,1.0,1.9500452
3259,1.0,2.6324337
3269,1.0,2.5253778
3279,1.0,2.2847672
3289,1.0,3.4624653
3299,1.0,4.1703176
3309,1.0,4.3325686
3319,1.0,4.9842205
3329,1.0,5.6297984
3339,1.0,7.1912074
3349,1.0,6.7092743
3359,1.0,8.4348755
3369,1.0,11.514477
3379,1.0,13.400665
3389,1.0,13.546576
3399,1.0,11.012114
3409,1.0,11.021886
3419,1.0,7.371974
3429,1.0,4.2945127
3439,1.0,3.5137239
3449,1.0,1.8178833
3459,1.0,2.0581894
3469,1.0,1.2629591
3479,1.0,1.2057855
3489,1.0,1.3904998
3499,1.0,0.78553677
3509,1.0,0.6984133
3519,1.0,1.4846605
3529,1.0,2.7390878
3539,1.0,2.0116725
3549,1.0,5.535981
3559,1.0,4.2026978
3569,1.0,6.567276
3579,1.0,11.754499
3589,1.0,13.372
3599,1.0,13.642626
3609,1.0,13.245331
3619,1.0,9.812366
3629,1.0,7.6237726
3639,1.0,7.019483
3649,1.0,6.0776653
3659,1.0,4.778769
3669,1.0,4.9619503
3679,1.0,4.3908615
3689,1.0,3.632239
3699,1.0,3.006079
3709,1.0,2.8136053
3719,1.0,2.789511
3729,1.0,1.8034875
3739,1.0,1.5291915
3749,1.0,1.2603767
3759,1.0,0.99499726
3769,1.0,0.6769728
3779,1.0,0.47919494
3789,1.0,0.14693373
3799,1.0,-0.073247075
3809,0.0,-0.4335667
3819,0.0,0.007840037
3829,0.0,0.032461286
3839,0.0,0.041606545
3849,0.0,0.12769926
3859,0.0,0.008612514
3869,0.0,0.27091277
3879,0.0,0.78333795
3889,0.0,0.5357437
3899,0.0,0.45132935
3909,0.0,2.0037549
3919,0.0,1.0920917
3929,0.0,0.5422889
3939,0.0,1.1969867
3949,0.0,2.615833
3959,0.0,1.2024319
3969,0.0,1.0412295
3979,0.0,1.6176322
3989,0.0,1.160192
3999,0.0,1.5574236
4009,0.0,1.0524234
4019,0.0,0.2797625
4029,0.0,0.9764755
4039,0.0,0.7771316
4049,0.0,0.80443
4059,0.0,1.3801589
4069,0.0,2.7049513
4079,0.0,1.7051679
4089,0.0,0.59326994
4099,0.0,0.0069071054
4109,0.0,0.3025928
4119,0.0,0.5149124
4129,0.0,0.5298542
4139,0.0,0.4188928
4149,0.0,-0.03656614
4159,0.0,-0.21603024
4169,0.0,-0.07681513
4179,0.0,-0.10077
4189,0.0,-0.08924472
4199,0.0,-0.1344012
4209,0.0,0.2769904
4219,0.0,-0.11492658
4229,0.0,-0.5329642
4239,0.0,-0.11153418
4249,0.0,-0.31411982
4259,0.0,-0.39935863
4269,0.0,-0.0456236
4279,0.0,0.27926648
4289,0.0,0.80947196
4299,0.0,0.4027009
4309,0.0,0.03653848
4319,0.0,0.10622895
4329,0.0,0.13138849
4339,0.0,-0.14430916
4349,0.0,0.045852065
4359,0.0,-0.07917166
4369,0.0,-0.24411583
4379,0.0,-0.22771573
4389,0.0,-0.14492404
4399,0.0,0.24013972
4409,0.0,-0.20891619
4419,0.0,0.17244685
4429,0.0,-0.042461634
4439,0.0,0.46367085
4449,0.0,0.63390106
4459,0.0,0.6513959
4469,0.0,0.41357756
4479,0.0,-0.07612586
4489,0.0,0.17512286
4499,0.0,-0.048579633
4509,0.0,-0.30350232
4519,0.0,0.18588293
4529,0.0,-0.24465251
4539,0.0,-0.1088717
4549,0.0,-0.0116865635
4559,0.0,0.02650237
4569,0.0,-0.21485656
4579,0.0,-0.46744734
4589,0.0,0.10918707
4599,0.0,-0.121013165
4609,0.0,-0.42431426
4619,0.0,-0.012814164
4629,0.0,-0.15375817
4639,0.0,-0.013951182
4649,0.0,0.37948215
4659,0.0,0.45692587
4669,0.0,0.76100355
4679,0.0,0.32060993
4689,0.0,0.3306185
4699,0.0,0.22958386
4709,0.0,-0.21953565
4719,0.0,0.7550691
4729,0.0,0.102514625
4739,0.0,0.55122054
4749,0.0,0.1848098
4759,0.0,0.27241135
4769,0.0,0.09974444
4779,0.0,0.13430703
4789,0.0,0.25502193
4799,0.0,0.12819386
4809,0.0,-0.17450511
4819,0.0,-0.343647
4829,0.0,0.07641572
4839,0.0,-0.36163586
4849,0.0,-0.70524603
4859,0.0,-0.6334512
4869,0.0,-0.29502678
4879,0.0,0.17633724
4889,0.0,0.15932536
4899,0.0,0.5219568
4909,0.0,0.20982748
4919,0.0,0.16718197
4929,0.0,0.53158045
4939,0.0,0.1784488
4949,0.0,0.21121508
4959,0.0,-0.20732713
4969,0.0,-0.017927766
4979,0.0,0.49541992
4989,0.0,0.8200345
4999,0.0,0.62907857
5009,0.0,0.3837806
5019,0.0,0.010807395
5029,0.0,0.007065177
5039,0.0,0.66294765
5049,0.0,0.008140326
5059,0.0,-0.3169496
5069,0.0,0.08180189
5079,0.0,-0.12788475
5089,0.0,0.15325177
5099,0.0,-0.38719714
5109,0.0,0.21623766
5119,0.0,0.021615624
5129,0.0,-0.1706196
5139,0.0,0.48313898
5149,0.0,0.42760152
5159,0.0,-0.009307265
5169,0.0,0.5103874
5179,0.0,1.5023273
5189,0.0,1.8602289
5199,0.0,2.0825408
5209,0.0,2.0352244
5219,0.0,1.3712099
5229,0.0,1.0506184
5239,0.0,-0.12161732
5249,0.0,-0.11440587
5259,0.0,0.28255737
5269,0.0,0.037891388
5279,0.0,-0.27897495
5289,0.0,-0.7844317
5299,0.0,-0.11714786
5309,0.0,-0.08965874
5319,0.0,-0.20163429
5329,0.0,-0.17132616
5339,0.0,0.27679175
5349,0.0,-0.07679963
5359,0.0,-0.24641657
5369,0.0,0.51491404
5379,0.0,1.0376859
5389,0.0,1.100054
5399,0.0,0.46600163
5409,0.0,0.6120371
5419,0.0,0.109552145
5429,0.0,0.07191479
5439,0.0,-0.24547696
5449,0.0,0.1510914
5459,0.0,0.21550691
5469,0.0,-0.18193805
5479,0.0,0.056322336
5489,0.0,0.2414357
5499,0.0,0.27074146
5509,0.0,0.7833184
5519,0.0,0.32482815
5529,0.0,0.14715147
5539,0.0,0.41461027
5549,0.0,0.28525764
5559,0.0,0.12995684
5569,0.0,0.8235022
5579,0.0,0.95533454
5589,0.0,0.33097577
5599,0.0,0.43184102
5609,0.0,0.2797609
5619,0.0,0.6258613
5629,0.0,0.3870566
5639,0.0,0.25304145
5649,0.0,1.1746972
5659,0.0,0.36257958
5669,0.0,-0.14957833
5679,0.0,0.23424083
5689,0.0,0.8633977
5699,0.0,0.93612003
5709,0.0,0.9671881
5719,0.0,0.14270884
5729,0.0,0.32399708
5739,0.0,-0.011374593
5749,0.0,0.58784914
5759,0.0,-0.22670162
5769,0.0,0.74699616
5779,0.0,0.7847095
5789,0.0,0.14366162
5799,0.0,-0.4253595
5809,0.0,-0.28510463
5819,0.0,0.32307613
5829,0.0,0.8121978
5839,0.0,0.8335838
5849,0.0,0.35576785
5859,0.0,0.24549723
5869,0.0,0.62689126
5879,0.0,0.864128
5889,0.0,1.134898
5899,0.0,1.4477911
5909,0.0,1.6211686
5919,0.0,0.7748461
5929,0.0,1.8568754
5939,0.0,1.814832
5949,0.0,1.6193614
5959,0.0,2.5667174
5969,0.0,1.6383507
5979,0.0,1.9279038
5989,0.0,2.2685828
5999,0.0,2.2524881
6009,0.0,2.528345
6019,0.0,1.0061307
6029,0.0,0.40112013
6039,0.0,0.40042198
6049,0.0,0.41495603
6059,0.0,0.62758374
6069,0.0,0.31901646
6079,0.0,-0.13509744
6089,0.0,0.07974017
6099,0.0,-0.6689815
6109,0.0,-0.38413906
6119,0.0,-0.24963474
6129,0.0,0.24513245
6139,0.0,0.14327812
6149,0.0,0.010473549
6159,0.0,0.61734533
6169,0.0,0.38841683
6179,0.0,0.71968156
6189,0.0,1.4359705
6199,0.0,1.3357813
6209,0.0,1.3658264
6219,0.0,1.4965255
6229,0.0,1.3620856
6239,0.0,1.3911952
6249,0.0,2.22614
6259,0.0,2.6229649
6269,0.0,2.9261065
6279,0.0,1.0966425
6289,0.0,1.3341651
6299,0.0,1.2765902
6309,0.0,0.2852956
6319,0.0,0.29991382
6329,0.0,0.13599885
6339,0.0,-0.25267333
6349,0.0,-0.36111724
6359,0.0,-0.015621066
6369,0.0,-0.16000998
6379,0.0,0.06173706
6389,1.0,0.21524692
6399,1.0,0.13745284
6409,1.0,0.22384071
6419,1.0,0.66885877
6429,1.0,0.6554851
6439,1.0,1.033927
6449,1.0,1.6419364
6459,1.0,1.7245846
6469,1.0,2.470395
6479,1.0,2.4068546
6489,1.0,2.4545355
6499,1.0,3.49088
6509,1.0,3.2555208
6519,1.0,5.0587335
6529,1.0,4.568183
6539,1.0,4.384725
6549,1.0,5.1722403
6559,1.0,6.0896053
6569,1.0,6.879364
6579,1.0,8.574806
6589,1.0,11.214013
6599,1.0,13.294814
6609,1.0,13.387675
6619,1.0,11.253608
6629,1.0,8.611263
6639,1.0,8.591633
6649,1.0,5.3865137
6659,1.0,3.4951859
6669,1.0,2.625096
6679,1.0,1.9547484
6689,1.0,1.60267
6699,1.0,1.3105466
6709,1.0,0.7650112
6719,1.0,1.1101294
6729,1.0,1.8092763
6739,1.0,2.1977882
6749,1.0,1.8123248
6759,1.0,1.8411326
6769,1.0,2.7828193
6779,1.0,5.8611565
6789,1.0,7.793362
6799,1.0,11.999588
6809,1.0,13.342809
6819,1.0,13.725666
6829,1.0,13.028893
6839,1.0,11.20171
6849,1.0,6.5188065
6859,1.0,6.2656975
6869,1.0,6.408857
6879,1.0,4.1223483
6889,1.0,4.245941
6899,1.0,4.062667
6909,1.0,3.262306
6919,1.0,3.4291358
6929,1.0,2.5988517
6939,1.0,2.5912132
6949,1.0,2.0690088
6959,1.0,1.6497157
6969,1.0,1.4188964
6979,1.0,1.0405445
6989,1.0,2.0084798
6999,1.0,0.58231366
7009,1.0,2.1799293
7019,1.0,2.7436152
7029,1.0,1.3981609
7039,0.0,1.9452952
7049,0.0,1.3798797
7059,0.0,1.24543
7069,0.0,1.1813192
7079,0.0,0.7634301
7089,0.0,1.0244335
7099,0.0,-0.011854172
7109,0.0,0.3041408
7119,0.0,-0.10833824
7129,0.0,-0.6046371
7139,0.0,-0.5773072
7149,0.0,-0.13836801
7159,0.0,-0.44748408
7169,0.0,-0.74092394
7179,0.0,-0.28192496
7189,0.0,-0.33629882
7199,0.0,-0.35858297
7209,0.0,-0.67378646
7219,0.0,0.17233479
7229,0.0,-0.12075102
7239,0.0,-0.29380757
7249,0.0,-0.18175638
7259,0.0,0.045634627
7269,0.0,0.3523153
7279,0.0,0.38685215
7289,0.0,0.29127717
7299,0.0,1.0706197
7309,0.0,0.35017097
7319,0.0,0.14305317
7329,0.0,0.15255117
7339,0.0,0.7266058
7349,0.0,0.37057233
7359,0.0,0.71936667
7369,0.0,0.21762896
7379,0.0,0.114278555
7389,0.0,0.6227132
7399,0.0,0.40839618
7409,0.0,0.69238544
7419,0.0,0.49830478
7429,0.0,0.38230455
7439,0.0,1.3677181
7449,0.0,1.2344807
7459,0.0,1.0134981
7469,0.0,0.46642578
7479,0.0,-0.54704356
7489,0.0,0.8557247
7499,0.0,0.32932705
7509,0.0,0.40983886
7519,0.0,0.09855461
7529,0.0,0.4876011
7539,0.0,-0.15094066
7549,0.0,-0.21885264
7559,0.0,-0.17330831
7569,0.0,-0.4428177
7579,0.0,-0.46001148
7589,0.0,-0.25570077
7599,0.0,0.34103847
7609,0.0,-0.016614676
7619,0.0,0.35372686
7629,0.0,0.2598892
7639,0.0,1.1821882
7649,0.0,0.9710343
7659,0.0,1.1994703
7669,0.0,-0.0030385256
7679,0.0,0.5943584
7689,0.0,0.13556373
7699,0.0,0.8676191
7709,0.0,0.88926333
7719,0.0,-0.08197659
7729,0.0,-0.17607003
7739,0.0,-0.46102798
7749,0.0,-0.13913965
7759,0.0,-0.241889
7769,0.0,-0.008036494
7779,0.0,0.12876713
7789,0.0,0.016137838
7799,0.0,0.12527257
7809,0.0,1.2339975
7819,0.0,1.0736594
7829,0.0,-0.0071456432
7839,0.0,1.1033665
7849,0.0,2.442194
7859,0.0,2.067357
7869,0.0,0.97198045
7879,0.0,0.7086699
7889,0.0,1.864891
7899,0.0,1.5362256
7909,0.0,0.848976
7919,0.0,0.64974296
7929,0.0,0.9432969
7939,0.0,0.94292414
7949,0.0,0.4413079
7959,0.0,0.7910815
7969,0.0,1.0137967
7979,0.0,0.5440846
7989,0.0,0.4307332
7999,0.0,0.32431042
8009,0.0,0.39568007
8019,0.0,0.6301303
8029,0.0,-0.094587445
8039,0.0,0.26737642
8049,0.0,-0.42386597
8059,0.0,0.12188113
8069,0.0,-0.04819727
8079,0.0,0.04453826
8089,0.0,-0.014097929
8099,0.0,-0.3649068
8109,0.0,-0.32985985
8119,0.0,0.038341165
8129,0.0,-0.08156645
8139,0.0,-0.10226154
8149,0.0,0.21093476
8159,0.0,0.3462255
8169,0.0,1.3246062
8179,0.0,0.846977
8189,0.0,1.893922
8199,0.0,2.9063897
8209,0.0,3.6510282
8219,0.0,3.4897203
8229,0.0,2.5405169
8239,0.0,3.7658944
8249,0.0,4.532694
8259,0.0,3.8795595
8269,0.0,4.764804
8279,0.0,4.2416115
8289,0.0,3.6978526
8299,0.0,1.9652889
8309,0.0,3.1727319
8319,0.0,2.9591177
8329,0.0,1.6025903
8339,0.0,1.6360533
8349,0.0,0.62746215
8359,0.0,0.029989123
8369,0.0,-0.1452055
8379,0.0,0.11979157
8389,0.0,0.08195853
8399,0.0,0.16161346
8409,0.0,0.5881547
8419,0.0,1.0211797
8429,0.0,1.9366949
8439,0.0,1.8718046
8449,0.0,2.3109593
8459,0.0,2.2800283
8469,0.0,2.5546927
8479,0.0,2.191121
8489,0.0,3.1583405
8499,0.0,2.3153253
8509,0.0,2.376913
8519,0.0,3.2748742
8529,0.0,2.4006457
8539,0.0,3.2367334
8549,0.0,1.4261854
8559,0.0,0.8262596
8569,0.0,0.5451637
8579,0.0,-0.16329741
8589,0.0,-0.27557468
8599,0.0,-0.27395952
8609,0.0,-0.057034314
8619,0.0,-0.13927591
8629,0.0,-0.26976675
8639,0.0,-0.04437405
8649,0.0,-0.12767369
8659,0.0,0.33041316
8669,0.0,0.53547806
8679,0.0,0.66728073
8689,0.0,1.1904298
8699,0.0,1.2361324
8709,0.0,1.8545172
8719,0.0,2.1677878
8729,0.0,1.7745162
8739,0.0,1.6386193
8749,0.0,0.9812428
8759,0.0,0.71606493
8769,0.0,0.680259
8779,0.0,0.022490025
8789,0.0,-0.17151529
8799,0.0,-0.085838795
8809,0.0,0.10288662
8819,0.0,0.44503367
8829,0.0,0.050537705
8839,0.0,0.15851712
8849,0.0,0.038265765
8859,0.0,-0.06273818
8869,0.0,-0.2513559
8879,0.0,0.10214609
8889,0.0,0.5286683
8899,0.0,0.046448827
8909,0.0,0.6812867
8919,0.0,0.8464596
8929,0.0,0.55799246
8939,0.0,0.103411436
8949,0.0,0.8437892
8959,0.0,0.79552525
8969,0.0,-0.08033383
8979,0.0,0.10925257
8989,0.0,-0.5465033
8999,0.0,-0.38964218
9009,0.0,0.43921137
9019,0.0,0.31533253
9029,0.0,0.6735243
9039,0.0,1.8141513
9049,0.0,1.4160552
9059,0.0,0.03254646
9069,0.0,0.14871734
9079,0.0,-0.09663677
9089,0.0,-0.02270025
9099,0.0,-0.7282371
9109,0.0,-0.25795722
9119,0.0,0.12098193
9129,0.0,-0.3986752
9139,0.0,0.63066643
9149,0.0,-0.06672019
9159,0.0,0.23449558
9169,0.0,0.3586557
9179,0.0,-0.33119524
9189,0.0,-0.29875147
9199,0.0,0.23109055
9209,0.0,0.6038415
9219,0.0,0.10470128
9229,0.0,0.2972399
9239,0.0,1.0832479
9249,0.0,1.4866192
9259,0.0,0.9574302
9269,0.0,0.12702334
9279,0.0,0.72002417
9289,0.0,-0.22257924
9299,0.0,-0.44141704
9309,0.0,0.06038773
9319,0.0,-0.2908957
9329,0.0,-0.020410419
9339,0.0,0.0406518
9349,0.0,-0.045440912
9359,0.0,0.105089724
9369,0.0,-0.110271275
9379,0.0,-0.69536924
9389,0.0,-0.49492282
9399,0.0,-0.29635
9409,0.0,0.03549713
9419,0.0,-0.08015424
9429,0.0,0.12006956
9439,0.0,0.22781146
9449,0.0,-0.4303661
9459,0.0,0.04186082
9469,0.0,0.066789806
9479,0.0,-0.11213142
9489,0.0,0.04164231
9499,0.0,0.022575498
9509,0.0,-0.2663417
9519,0.0,0.13711447
9529,0.0,-0.2514019
9539,0.0,0.3366047
9549,0.0,-0.20865363
9559,0.0,-0.07844788
9569,0.0,-0.2406199
9579,0.0,0.11672199
9589,0.0,0.7046402
9599,0.0,1.0681539
9609,0.0,0.934914
9619,0.0,0.71406025
9629,1.0,1.4752977
9639,1.0,0.859379
9649,1.0,1.2404325
9659,1.0,1.0195553
9669,1.0,0.605449
9679,1.0,1.159364
9689,1.0,0.8833038
9699,1.0,1.6514883
9709,1.0,1.7417774
9719,1.0,2.3310986
9729,1.0,4.000299
9739,1.0,2.89229
9749,1.0,3.8913765
9759,1.0,4.24696
9769,1.0,5.2473936
9779,1.0,5.131542
9789,1.0,5.7844505
9799,1.0,6.3696933
9809,1.0,8.175224
9819,1.0,8.050554
9829,1.0,12.395592
9839,1.0,13.446688
9849,1.0,13.479595
9859,1.0,10.546664
9869,1.0,7.6906013
9879,1.0,5.578366
9889,1.0,3.4519596
9899,1.0,1.4142838
9909,1.0,0.8775646
9919,1.0,2.0487719
9929,1.0,1.1712227
9939,1.0,0.8039996
9949,1.0,0.6084093
9959,1.0,0.94224256
9969,1.0,0.927458
9979,1.0,1.8576816
9989,1.0,1.7351671
9999,1.0,2.134856
10009,1.0,3.3532126
10019,1.0,4.5167313
10029,1.0,10.182727
10039,1.0,9.5283985
10049,1.0,13.366528
10059,1.0,13.536729
10069,1.0,12.736868
10079,1.0,8.05776
10089,1.0,8.169281
10099,1.0,6.420951
10109,1.0,5.857819
10119,1.0,5.0058985
10129,1.0,4.4936633
10139,1.0,3.5201447
10149,1.0,3.1716537
10159,1.0,3.2386322
10169,1.0,3.6250107
10179,1.0,3.0454597
10189,1.0,2.1121955
10199,1.0,2.5103645
10209,1.0,1.6424705
10219,1.0,1.5851107
10229,1.0,1.2208046
10239,1.0,0.5453999
10249,1.0,0.34501195
10259,1.0,0.5852888
10269,0.0,0.22102916
10279,0.0,0.37197506
10289,0.0,0.2551738
10299,0.0,1.2167232
10309,0.0,-0.5903629
10319,0.0,0.26838326
10329,0.0,-0.09127259
10339,0.0,-0.2360791
10349,0.0,0.11259484
10359,0.0,0.17981696
10369,0.0,0.7313575
10379,0.0,0.30400777
10389,0.0,-0.19968426
10399,0.0,1.0758066
10409,0.0,0.35788417
10419,0.0,0.23172128
10429,0.0,0.5132036
10439,0.0,0.5141293
10449,0.0,0.38467872
10459,0.0,0.49759984
10469,0.0,0.60972005
10479,0.0,1.2529874
10489,0.0,0.90347207
10499,0.0,1.0246999
10509,0.0,0.35358953
10519,0.0,0.3097136
10529,0.0,0.67736506
10539,0.0,0.49759418
10549,0.0,0.28954792
10559,0.0,0.22630608
10569,0.0,0.8126216
10579,0.0,0.9031408
10589,0.0,0.98555815
10599,0.0,1.3791182
10609,0.0,1.3060195
10619,0.0,0.7607794
10629,0.0,1.5455503
10639,0.0,1.6810608
10649,0.0,1.1942228
10659,0.0,1.1603979
10669,0.0,0.9237939
10679,0.0,0.9137105
10689,0.0,0.842176
10699,0.0,0.7304838
10709,0.0,1.4980924
10719,0.0,1.054861
10729,0.0,1.1576757
10739,0.0,1.4587886
10749,0.0,1.6559969
10759,0.0,0.6838979
10769,0.0,-0.32679135
10779,0.0,0.15935993
10789,0.0,-0.008386254
10799,0.0,-0.4694382
10809,0.0,-0.11226988
10819,0.0,-0.26318258
10829,0.0,-0.2209723
10839,0.0,-0.053038597
10849,0.0,0.13487804
10859,0.0,-0.2510118
10869,0.0,-0.13686961
10879,0.0,0.25636947
10889,0.0,-0.10796726
10899,0.0,0.28182507
10909,0.0,-0.4761032
10919,0.0,-0.2790562
10929,0.0,0.026658654
10939,0.0,-0.2966001
10949,0.0,0.52636504
10959,0.0,0.3702141
10969,0.0,0.36400712
10979,0.0,0.5489471
10989,0.0,0.5379676
10999,0.0,-0.20761049
11009,0.0,0.2298348
11019,0.0,0.6804602
11029,0.0,0.098986626
11039,0.0,-0.5131551
11049,0.0,-0.14663112
11059,0.0,-0.12981486
11069,0.0,0.38625097
11079,0.0,0.32468474
11089,0.0,0.05476439
11099,0.0,0.43903452
11109,0.0,-0.09017563
11119,0.0,0.04176426
11129,0.0,0.8003343
11139,0.0,1.5656897
11149,0.0,2.5192683
11159,0.0,2.8721678
11169,0.0,3.2063265
11179,0.0,4.2606373
11189,0.0,4.599431
11199,0.0,3.96608
11209,0.0,2.5831738
11219,0.0,2.9616096
11229,0.0,2.7128475
11239,0.0,1.8082465
11249,0.0,2.7827067
11259,0.0,2.0147731
11269,0.0,2.287132
11279,0.0,1.973392
11289,0.0,2.338438
11299,0.0,2.0141408
11309,0.0,4.014611
11319,0.0,1.1541684
11329,0.0,0.712529
11339,0.0,0.33215868
11349,0.0,0.26880002
11359,0.0,-0.048556685
11369,0.0,-0.03633535
11379,0.0,-0.49736702
11389,0.0,-0.017590165
11399,0.0,-0.06498039
11409,0.0,-0.42952454
11419,0.0,-0.49503648
11429,0.0,-0.54552233
11439,0.0,0.49294835
11449,0.0,-0.013849974
11459,0.0,0.8318476
11469,0.0,0.95558167
11479,0.0,1.3875117
11489,0.0,1.122153
11499,0.0,1.9025925
11509,0.0,3.537104
11519,0.0,1.5108079
11529,0.0,1.4139254
11539,0.0,1.6836152
11549,0.0,1.957895
11559,0.0,2.7049623
11569,0.0,2.6295886
11579,0.0,2.4141822
11589,0.0,1.700892
11599,0.0,2.0554152
11609,0.0,1.6082
11619,0.0,3.3848863
11629,0.0,2.9313793
11639,0.0,2.628408
11649,0.0,2.1496506
11659,0.0,1.1883471
11669,0.0,1.3323163
11679,0.0,1.4997182
11689,0.0,0.5387473
11699,0.0,-0.1854738
11709,0.0,-0.18830949
11719,0.0,0.21767491
11729,0.0,0.13405818
11739,0.0,-0.36786568
11749,0.0,-0.16997576
11759,0.0,0.34493697
11769,0.0,-0.3442464
11779,0.0,-0.031605244
11789,0.0,-0.26980114
11799,0.0,-0.40859103
11809,0.0,0.2763846
11819,0.0,0.1664846
11829,0.0,-0.10531795
11839,0.0,0.37786275
11849,0.0,0.009852767
11859,0.0,-0.83528
11869,0.0,0.0030329227
11879,0.0,0.13812578
11889,0.0,-0.23079717
11899,0.0,-0.319664
11909,0.0,-0.41146827
11919,0.0,0.04127407
11929,0.0,-0.074697316
11939,0.0,-0.16695261
11949,0.0,0.124762535
11959,0.0,-0.022053659
11969,0.0,0.6163036
11979,0.0,0.16100144
11989,0.0,0.16625237
11999,0.0,0.21301705
12009,0.0,0.8902935
12019,0.0,0.28641343
12029,0.0,-0.03104496
12039,0.0,-0.11314738
12049,0.0,-0.15295744
12059,0.0,-0.3273462
12069,0.0,-0.33043838
12079,0.0,0.08751583
12089,0.0,-0.2700448
12099,0.0,0.22684109
12109,0.0,-0.17269087
12119,0.0,-0.15758228
12129,0.0,0.22438037
12139,0.0,-0.4833842
12149,0.0,-0.105865
12159,0.0,-0.14047849
12169,0.0,-0.56519526
12179,0.0,-0.6975491
12189,0.0,-0.1020726
12199,0.0,-0.38578486
12209,0.0,0.16557097
12219,0.0,-0.15968561
12229,0.0,0.11247289
12239,0.0,-0.03594613
12249,0.0,-0.33689892
12259,0.0,-0.566659
12269,0.0,0.06399119
12279,0.0,-0.41697282
12289,0.0,0.031146646
12299,0.0,0.052518725
12309,0.0,0.291528
12319,0.0,-0.5670843
12329,0.0,-0.119133174
12339,0.0,-0.10447514
12349,0.0,-0.057160854
12359,0.0,-0.1114285
12369,0.0,0.24031413
12379,0.0,-0.23440003
12389,0.0,-0.08068764
12399,0.0,0.8642386
12409,0.0,1.1446061
12419,0.0,1.1734692
12429,0.0,1.0359542
12439,0.0,1.4438459
12449,0.0,1.0042276
12459,0.0,0.48663247
12469,0.0,1.3511066
12479,0.0,0.7146721
12489,0.0,-0.018481493
12499,0.0,0.3998748
12509,0.0,-0.44280374
12519,0.0,-0.20391005
12529,0.0,-0.058011055
12539,0.0,-0.022235274
12549,0.0,-0.1850841
12559,0.0,-0.41501617
12569,0.0,0.26942134
12579,0.0,0.30668294
12589,0.0,-0.4327736
12599,0.0,0.1380465
12609,0.0,0.23620224
12619,0.0,0.17371976
12629,0.0,0.98339695
12639,0.0,0.97238845
12649,0.0,0.5166155
12659,0.0,0.42925584
12669,0.0,1.6377101
12679,0.0,0.10658157
12689,0.0,-0.3699212
12699,1.0,-0.087507844
12709,1.0,0.52800006
12719,1.0,0.45380646
12729,1.0,0.99131155
12739,1.0,0.90547615
12749,1.0,1.5173476
12759,1.0,1.5319786
12769,1.0,1.804857
12779,1.0,1.9882871
12789,1.0,2.5750666
12799,1.0,2.9198637
12809,1.0,3.4877458
12819,1.0,4.279181
12829,1.0,4.5332165
12839,1.0,4.710287
12849,1.0,5.971799
12859,1.0,5.8040075
12869,1.0,6.06034
12879,1.0,7.751281
12889,1.0,9.649087
12899,1.0,13.259485
12909,1.0,13.663424
12919,1.0,13.060355
12929,1.0,10.447091
12939,1.0,4.4215326
12949,1.0,2.7432802
12959,1.0,2.119669
12969,1.0,2.1607947
12979,1.0,1.054669
12989,1.0,1.4652519
12999,1.0,0.47596067
13009,1.0,0.5152428
13019,1.0,0.87429
13029,1.0,1.6787285
13039,1.0,1.087451
13049,1.0,2.6374512
13059,1.0,2.8821247
13069,1.0,2.910953
13079,1.0,3.673348
13089,1.0,3.558125
13099,1.0,11.4933
13109,1.0,12.469957
13119,1.0,13.618126
13129,1.0,12.934285
13139,1.0,12.317751
13149,1.0,8.347178
13159,1.0,6.758011
13169,1.0,6.316559
13179,1.0,5.117911
13189,1.0,4.2153535
13199,1.0,3.8360195
13209,1.0,4.1130414
13219,1.0,3.106357
13229,1.0,3.8850431
13239,1.0,3.439015
13249,1.0,1.6383116
13259,1.0,2.8154416
13269,1.0,3.8065383
13279,1.0,2.82966
13289,1.0,2.4442768
13299,1.0,1.5458163
13309,1.0,1.2968181
13319,1.0,1.2869346
13329,1.0,1.7284759
13339,0.0,3.2905354
13349,0.0,3.7160134
13359,0.0,2.6514597
13369,0.0,2.3888712
13379,0.0,2.2745733
13389,0.0,3.7191842
13399,0.0,3.8923705
13409,0.0,2.824512
13419,0.0,4.235175
13429,0.0,3.5498576
13439,0.0,4.347692
13449,0.0,4.134432
13459,0.0,5.6327767
13469,0.0,5.67294
13479,0.0,4.9724455
13489,0.0,5.5497694
13499,0.0,4.4686356
13509,0.0,3.3993871
13519,0.0,2.498804
13529,0.0,2.8649366
13539,0.0,2.4830046
13549,0.0,2.8366902
13559,0.0,3.172791
13569,0.0,0.9296608
13579,0.0,0.74965614
13589,0.0,0.68847346
13599,0.0,0.34699333
13609,0.0,0.18353522
13619,0.0,0.4227233
13629,0.0,0.19742346
13639,0.0,-0.29970467
13649,0.0,-0.7432865
13659,0.0,-0.2885329
13669,0.0,0.43192726
13679,0.0,-0.7784507
13689,0.0,-0.024999678
13699,0.0,0.24249053
13709,0.0,-0.44188786
13719,0.0,-0.28581125
13729,0.0,0.1576463
13739,0.0,0.3463738
13749,0.0,0.027337074
13759,0.0,0.16983038
13769,0.0,0.056307435
13779,0.0,-0.36023355
13789,0.0,-0.45714557
13799,0.0,0.021144748
13809,0.0,-0.23091292
13819,0.0,-0.28492558
13829,0.0,-0.16839385
13839,0.0,0.07354796
13849,0.0,1.7549063
13859,0.0,0.97874475
13869,0.0,0.69710463
13879,0.0,1.5532217
13889,0.0,1.3435148
13899,0.0,0.960059
13909,0.0,0.8314998
13919,0.0,1.0995681
13929,0.0,0.9319569
13939,0.0,1.533813
13949,0.0,0.63356495
13959,0.0,0.18311572
13969,0.0,0.07253623
13979,0.0,0.31480038
13989,0.0,0.11556065
13999,0.0,0.14675844
14009,0.0,0.8089351
14019,0.0,0.70406747
14029,0.0,-0.044071913
14039,0.0,0.66960883
14049,0.0,0.7600814
14059,0.0,0.7206969
14069,0.0,1.1117005
14079,0.0,1.1448883
14089,0.0,0.7686632
14099,0.0,1.0067959
14109,0.0,0.49020308
14119,0.0,0.6227943
14129,0.0,0.78936386
14139,0.0,0.5505328
14149,0.0,-0.36779177
14159,0.0,0.73474133
14169,0.0,0.25674915
14179,0.0,0.09188533
14189,0.0,0.38414997
14199,0.0,0.8709723
14209,0.0,1.2525194
14219,0.0,0.9054412
14229,0.0,1.0659444
14239,0.0,0.86595356
14249,0.0,0.13513005
14259,0.0,0.55117476
14269,0.0,0.40310347
14279,0.0,0.42471486
14289,0.0,0.6138032
14299,0.0,0.71635985
14309,0.0,0.50023556
14319,0.0,0.6046812
14329,0.0,0.77755785
14339,0.0,0.44302964
14349,0.0,1.9151282
14359,0.0,1.3808571
14369,0.0,1.593348
14379,0.0,1.6417539
14389,0.0,1.2729099
14399,0.0,2.277802
14409,0.0,1.0661645
14419,0.0,0.57756907
14429,0.0,0.91871566
14439,0.0,0.93836164
14449,0.0,1.4939374
14459,0.0,1.6783422
14469,0.0,3.3597753
14479,0.0,2.0637105
14489,0.0,2.3022597
14499,0.0,2.0033247
14509,0.0,1.5153133
14519,0.0,1.5691862
14529,0.0,1.0419052
14539,0.0,0.8140044
14549,0.0,0.87888515
14559,0.0,0.89069176
14569,0.0,0.50952077
14579,0.0,0.30712175
14589,0.0,-0.048896074
14599,0.0,0.11123186
14609,0.0,-0.5829907
14619,0.0,0.081999004
14629,0.0,-0.31397498
14639,0.0,-0.20365798
14649,0.0,0.22422075
14659,0.0,0.56886923
14669,0.0,1.2533033
14679,0.0,1.2507967
14689,0.0,0.9145338
14699,0.0,1.4304231
14709,0.0,1.4033506
14719,0.0,1.8606533
14729,0.0,3.2665534
14739,0.0,4.606452
14749,0.0,4.2547455
14759,0.0,3.8341982
14769,0.0,3.2845345
14779,0.0,4.3948903
14789,0.0,3.7553613
14799,0.0,6.1080422
14809,0.0,5.388294
14819,0.0,5.142585
14829,0.0,5.1301956
14839,0.0,4.7707067
14849,0.0,4.012164
14859,0.0,3.914688
14869,0.0,2.7329688
14879,0.0,2.5674553
14889,0.0,1.7670549
14899,0.0,1.6655676
14909,0.0,1.0870168
14919,0.0,1.4120661
14929,0.0,1.0495661
14939,0.0,1.2094219
14949,0.0,1.5105584
14959,0.0,0.6438381
14969,0.0,0.52494514
14979,0.0,-0.4557016
14989,0.0,0.2553681
14999,0.0,0.20936865
15009,0.0,0.7567931
15019,0.0,1.0997651
15029,0.0,1.4863892
15039,0.0,1.2645856
15049,0.0,1.5576274
15059,0.0,1.6890659
15069,0.0,1.0227542
15079,0.0,0.90505415
15089,0.0,1.1516671
15099,0.0,1.1776628
15109,0.0,0.88749295
15119,0.0,1.6129211
15129,0.0,1.6945456
15139,0.0,2.1248553
15149,0.0,2.1773791
15159,0.0,1.252896
15169,0.0,1.4325519
15179,0.0,1.6527295
15189,0.0,1.0235085
15199,0.0,0.5269446
15209,0.0,1.2344859
15219,0.0,0.26834822
15229,0.0,0.4823103
15239,0.0,0.4799372
15249,0.0,0.18151683
15259,0.0,0.12605834
15269,0.0,0.3940593
15279,0.0,0.028798938
15289,0.0,0.2803353
15299,0.0,-0.45529568
15309,0.0,-0.15421724
15319,0.0,-0.9704312
15329,0.0,-0.46620953
15339,0.0,-0.46397138
15349,0.0,-0.106734276
15359,0.0,-0.1449343
15369,0.0,0.46691155
15379,0.0,-0.0046043396
15389,0.0,0.17848241
15399,0.0,0.58615804
15409,0.0,0.195037
15419,0.0,0.7228894
15429,0.0,0.5620041
15439,0.0,0.08799267
15449,0.0,0.66366357
15459,0.0,0.19033533
15469,0.0,0.6155184
15479,0.0,0.7328083
15489,0.0,0.93914586
15499,0.0,1.4219198
15509,0.0,2.9009597
15519,0.0,2.4157374
15529,0.0,4.016636
15539,0.0,3.658922
15549,0.0,2.0018706
15559,0.0,4.5864897
15569,0.0,5.136301
15579,0.0,5.0664396
15589,0.0,6.1668043
15599,0.0,8.018412
15609,0.0,8.083192
15619,0.0,10.068184
15629,0.0,12.202355
15639,0.0,8.721523
15649,0.0,6.948056
15659,0.0,6.1398945
15669,0.0,5.6579857
15679,0.0,5.4301844
15689,0.0,3.955324
15699,0.0,3.7562227
15709,0.0,3.3331356
15719,0.0,1.9549202
15729,0.0,2.3075094
15739,0.0,1.7460114
15749,0.0,2.2221797
15759,0.0,1.1597146
15769,0.0,2.0594823
15779,0.0,1.392706
15789,0.0,0.8068379
15799,0.0,0.9209832
15809,0.0,1.1755797
15819,0.0,0.726105
15829,0.0,1.3007135
15839,0.0,0.9503386
15849,0.0,2.3326502
15859,0.0,1.4809475
15869,0.0,1.573035
15879,0.0,0.19032466
15889,0.0,1.4689813
15899,0.0,0.10440254
15909,0.0,-0.08905798
15919,1.0,-0.17240942
15929,1.0,0.18326455
15939,1.0,0.75128305
15949,1.0,1.1284653
15959,1.0,1.1394162
15969,1.0,0.9331975
15979,1.0,1.32147
15989,1.0,1.4157393
15999,1.0,1.618489
16009,1.0,2.0684469
16019,1.0,2.7374585
16029,1.0,3.4738286
16039,1.0,3.1303267
16049,1.0,4.072058
16059,1.0,5.3429337
16069,1.0,5.345008
16079,1.0,5.6255503
16089,1.0,5.7617397
16099,1.0,7.728569
16109,1.0,9.063944
16119,1.0,13.029959
16129,1.0,13.550245
16139,1.0,13.295954
16149,1.0,12.582567
16159,1.0,8.71003
16169,1.0,3.7803438
16179,1.0,3.5268764
16189,1.0,2.3702402
16199,1.0,1.6148593
16209,1.0,1.0257449
16219,1.0,1.299928
16229,1.0,0.8250026
16239,1.0,0.68322796
16249,1.0,0.63756114
16259,1.0,1.2216915
16269,1.0,0.9347783
16279,1.0,1.8337806
16289,1.0,2.5515792
16299,1.0,4.4859123
16309,1.0,5.0435762
16319,1.0,9.899002
16329,1.0,12.75165
16339,1.0,13.508193
16349,1.0,13.536259
16359,1.0,13.014633
16369,1.0,10.262644
16379,1.0,7.746212
16389,1.0,7.258667
16399,1.0,4.985059
16409,1.0,5.09549
16419,1.0,4.685182
16429,1.0,3.7415805
16439,1.0,3.6837697
16449,1.0,2.3518486
16459,1.0,2.5233026
16469,1.0,2.606863
16479,1.0,1.7772052
16489,1.0,1.1128173
16499,1.0,1.3692833
16509,1.0,1.1044933
16519,1.0,0.3725099
16529,1.0,0.3763265
16539,1.0,0.15872741
16549,1.0,0.00088465214
16559,0.0,-0.03905213
16569,0.0,-0.4114977
16579,0.0,0.1466074
16589,0.0,0.22737658
16599,0.0,0.06807232
16609,0.0,0.23376441
16619,0.0,0.9793656
16629,0.0,-0.36532873
16639,0.0,-0.020267367
16649,0.0,0.15860182
16659,0.0,0.5384687
16669,0.0,-0.20351231
16679,0.0,0.020450354
16689,0.0,1.724796
16699,0.0,1.1182692
16709,0.0,1.2705057
16719,0.0,1.3993568
16729,0.0,1.0423194
16739,0.0,0.27385604
16749,0.0,0.447953
16759,0.0,-0.24492049
16769,0.0,-0.08599502
16779,0.0,-0.06250858
16789,0.0,0.13057637
16799,0.0,-0.12717044
16809,0.0,-0.040567935
16819,0.0,-0.35786653
16829,0.0,-0.76568335
16839,0.0,-0.17180043
16849,0.0,0.30868006
16859,0.0,-0.12123573
16869,0.0,0.18160689
16879,0.0,0.12957
16889,0.0,-0.185516
16899,0.0,-0.12329018
16909,0.0,-0.060757995
16919,0.0,-0.15701103
16929,0.0,-0.43914032
16939,0.0,-0.45895398
16949,0.0,0.14869452
16959,0.0,-0.28597742
16969,0.0,-0.058912218
16979,0.0,-0.2513144
16989,0.0,-0.25024945
16999,0.0,-0.24307913
17009,0.0,-0.07519007
17019,0.0,-0.15467006
17029,0.0,-0.12074375
17039,0.0,-0.018526673
17049,0.0,-0.38229775
17059,0.0,-0.13516307
17069,0.0,-0.6223146
17079,0.0,-0.2536806
17089,0.0,-0.2470718
17099,0.0,0.17548019
17109,0.0,-0.045156002
17119,0.0,-0.24054646
17129,0.0,-0.38611352
17139,0.0,0.3037908
17149,0.0,0.37615693
17159,0.0,0.48698145
17169,0.0,0.32171398
17179,0.0,0.34302843
17189,0.0,-0.07478738
17199,0.0,0.15469378
17209,0.0,0.12135661
17219,0.0,0.22422773
17229,0.0,0.10547489
17239,0.0,-0.023081064
17249,0.0,-0.26837522
17259,0.0,-0.4003029
17269,0.0,-0.33612716
17279,0.0,-0.5176727
17289,0.0,-0.16518128
17299,0.0,0.07460129
17309,0.0,-0.21199596
17319,0.0,-0.32987416
17329,0.0,0.29902005
17339,0.0,0.18802327
17349,0.0,0.33895516
17359,0.0,0.024711788
17369,0.0,0.32385105
17379,0.0,-0.44525814
17389,0.0,-0.1592418
17399,0.0,0.06002736
17409,0.0,-0.11388534
17419,0.0,-0.16539252
17429,0.0,0.1903683
17439,0.0,-0.12574255
17449,0.0,0.1381036
17459,0.0,0.015730739
17469,0.0,-0.040765524
17479,0.0,-0.41979384
17489,0.0,-0.045556426
17499,0.0,0.33721912
17509,0.0,-0.29627538
17519,0.0,0.1900304
17529,0.0,-0.3812914
17539,0.0,0.16293085
17549,0.0,0.07605159
17559,0.0,-0.4621644
17569,0.0,0.13821054
17579,0.0,0.39139032
17589,0.0,0.37823284
17599,0.0,0.4787774
17609,0.0,0.46825743
17619,0.0,0.62905663
17629,0.0,1.1790061
17639,0.0,0.33332646
17649,0.0,1.3280973
17659,0.0,0.90051436
17669,0.0,1.7177196
17679,0.0,3.0555005
17689,0.0,3.181314
17699,0.0,3.2919998
17709,0.0,2.8054605
17719,0.0,3.3448126
17729,0.0,1.7806609
17739,0.0,1.4535323
17749,0.0,1.0495483
17759,0.0,1.2021232
17769,0.0,1.7239894
17779,0.0,1.6271954
17789,0.0,0.90649974
17799,0.0,0.7582514
17809,0.0,0.27672076
17819,0.0,-0.29336298
17829,0.0,0.32092214
17839,0.0,0.5250054
17849,0.0,0.7156783
17859,0.0,0.38019586
17869,0.0,1.3973584
17879,0.0,1.5274711
17889,0.0,2.1617324
17899,0.0,2.7927768
17909,0.0,2.2854474
17919,0.0,3.400579
17929,0.0,2.5525796
17939,0.0,1.7923236
17949,0.0,1.4225998
17959,0.0,2.7603483
17969,0.0,2.5213404
17979,0.0,2.7680273
17989,0.0,2.3778608
17999,0.0,0.6496893
18009,0.0,0.54996747
18019,0.0,0.25826693
18029,0.0,0.5742539
18039,0.0,0.39475375
18049,0.0,0.39943898
18059,0.0,0.3728286
18069,0.0,0.079720736
18079,0.0,-0.08057356
18089,0.0,-0.4111247
18099,0.0,-0.21670389
18109,0.0,-0.042771578
18119,0.0,0.17136031
18129,0.0,-0.1099664
18139,0.0,-0.5383351
18149,0.0,-0.022395134
18159,0.0,-0.02309823
18169,0.0,-0.503224
18179,0.0,-0.4312008
18189,0.0,-0.5238101
18199,0.0,-0.09688854
18209,0.0,0.42847526
18219,0.0,0.4841661
18229,0.0,0.50184876
18239,0.0,0.45633894
18249,0.0,0.60406315
18259,0.0,0.60055095
18269,0.0,0.40275455
18279,0.0,0.86652017
18289,0.0,0.5892624
18299,0.0,0.29540873
18309,0.0,0.3169893
18319,0.0,0.45288348
18329,0.0,-0.16532075
18339,0.0,-0.13241172
18349,0.0,0.20825374
18359,0.0,-0.048128724
18369,0.0,-0.145908
18379,0.0,-0.15259182
18389,0.0,-0.41679752
18399,0.0,-0.039500594
18409,0.0,-0.46433103
18419,0.0,0.09808588
18429,0.0,0.13457304
18439,0.0,-0.06413102
18449,0.0,0.49430525
18459,0.0,0.38744307
18469,0.0,0.8244276
18479,0.0,0.46983314
18489,0.0,0.032251358
18499,0.0,0.2601652
18509,0.0,-0.60064816
18519,0.0,-0.053503513
18529,0.0,-0.22326148
18539,0.0,0.023394465
18549,0.0,0.49126887
18559,0.0,0.6521537
18569,0.0,1.3276801
18579,0.0,1.4535416
18589,0.0,0.8559299
18599,0.0,1.097479
18609,0.0,0.23656285
18619,0.0,0.4404689
18629,0.0,0.20581388
18639,0.0,0.6932274
18649,0.0,0.79923177
18659,0.0,0.4733417
18669,0.0,0.8551258
18679,0.0,1.1437166
18689,0.0,1.6173561
18699,0.0,1.2907463
18709,0.0,2.3005528
18719,0.0,2.6627443
18729,0.0,2.47198
18739,0.0,2.1566417
18749,0.0,1.1262262
18759,0.0,0.78046775
18769,0.0,1.1473675
18779,0.0,1.0842757
18789,0.0,1.2794085
18799,0.0,1.7834766
18809,0.0,1.4329784
18819,0.0,1.3091841
18829,0.0,1.7794973
18839,0.0,0.9135324
18849,0.0,0.5552413
18859,0.0,0.48047638
18869,0.0,0.48634994
18879,0.0,0.048285484
18889,0.0,0.08520293
18899,0.0,-0.06706786
18909,0.0,-0.37423062
18919,0.0,-0.3770306
18929,0.0,0.15241802
18939,0.0,0.38664913
18949,0.0,-0.49599516
18959,0.0,0.1680839
18969,0.0,0.13490164
18979,0.0,0.38485503
18989,0.0,0.7823058
18999,0.0,0.754822
19009,0.0,0.54600924
19019,0.0,0.9779608
19029,0.0,0.9945382
19039,0.0,1.4772193
19049,0.0,1.6905866
19059,0.0,1.3943808
19069,0.0,0.5680927
19079,0.0,0.32616472
19089,0.0,0.030604243
19099,0.0,-0.11326814
19109,0.0,0.30168945
19119,0.0,-0.31520152
19129,0.0,0.30644655
19139,1.0,-0.44619238
19149,1.0,-0.49716413
19159,1.0,0.28546238
19169,1.0,0.5520264
19179,1.0,0.94564503
19189,1.0,1.2365155
19199,1.0,1.4434812
19209,1.0,1.2631156
19219,1.0,2.655385
19229,1.0,1.3775569
19239,1.0,3.063448
19249,1.0,3.544111
19259,1.0,4.051613
19269,1.0,4.097623
19279,1.0,4.1371503
19289,1.0,4.9691973
19299,1.0,4.9327927
19309,1.0,6.574165
19319,1.0,7.853426
19329,1.0,8.22817
19339,1.0,11.048278
19349,1.0,13.3817005
19359,1.0,13.729757
19369,1.0,13.001501
19379,1.0,12.487787
19389,1.0,6.884643
19399,1.0,3.244827
19409,1.0,4.551266
19419,1.0,2.661825
19429,1.0,2.16166
19439,1.0,1.4079895
19449,1.0,0.9760246
19459,1.0,0.40923262
19469,1.0,1.0191042
19479,1.0,0.932418
19489,1.0,1.3520753
19499,1.0,1.5539474
19509,1.0,1.0810128
19519,1.0,2.1348279
19529,1.0,4.985582
19539,1.0,5.116464
19549,1.0,10.81349
19559,1.0,11.324268
19569,1.0,13.553557
19579,1.0,13.465347
19589,1.0,9.606644
19599,1.0,8.379276
19609,1.0,7.6489615
19619,1.0,6.7052426
19629,1.0,6.0369716
19639,1.0,6.1124134
19649,1.0,4.250299
19659,1.0,4.5577335
19669,1.0,3.6623042
19679,1.0,2.8613346
19689,1.0,2.735054
19699,1.0,2.3279064
19709,1.0,2.195272
19719,1.0,1.4880044
19729,1.0,1.2236674
19739,1.0,0.89195234
19749,1.0,0.72632265
19759,1.0,0.79191035
19769,1.0,0.83835214
19779,1.0,0.2831307
19789,0.0,0.80345714
19799,0.0,0.681468
19809,0.0,0.26872206
19819,0.0,0.8229959
19829,0.0,0.895202
19839,0.0,1.4340823
19849,0.0,1.6276925
19859,0.0,2.542041
19869,0.0,1.8825536
19879,0.0,1.7085135
19889,0.0,1.5140002
19899,0.0,0.7406912
19909,0.0,0.20769107
19919,0.0,0.010959506
19929,0.0,0.14795619
19939,0.0,0.23796022
19949,0.0,0.36097175
19959,0.0,0.9740872
19969,0.0,0.6573941
19979,0.0,1.0726316
19989,0.0,0.20224553
19999,0.0,0.68070704
20009,0.0,0.22842616
20019,0.0,0.04986155
20029,0.0,0.3631299
20039,0.0,0.043001354
20049,0.0,-0.2020477
20059,0.0,0.37706333
20069,0.0,0.5018044
20079,0.0,0.8378737
20089,0.0,1.4432847
20099,0.0,1.9616883
20109,0.0,0.9340185
20119,0.0,0.89742166
20129,0.0,0.56110954
20139,0.0,0.6006599
20149,0.0,0.5677738
20159,0.0,0.7788971
20169,0.0,0.6283527
20179,0.0,0.2992289
20189,0.0,0.21357107
20199,0.0,0.90563923
20209,0.0,1.28448
20219,0.0,1.6943762
20229,0.0,1.3121734
20239,0.0,0.71580046
20249,0.0,0.5445447
20259,0.0,0.36223328
20269,0.0,-0.65407467
20279,0.0,0.24725103
20289,0.0,-0.07662219
20299,0.0,-0.07812464
20309,0.0,-0.23378062
20319,0.0,0.003615737
20329,0.0,0.27049732
20339,0.0,0.06715202
20349,0.0,-0.302783
20359,0.0,0.14762163
20369,0.0,-0.05665195
20379,0.0,0.074178636
20389,0.0,-0.057568073
20399,0.0,0.0685941
20409,0.0,0.5455775
20419,0.0,0.90459585
20429,0.0,0.46487308
20439,0.0,0.15189052
20449,0.0,-0.50330114
20459,0.0,-0.27003717
20469,0.0,0.119341135
20479,0.0,0.23121506
20489,0.0,-0.3012786
20499,0.0,-0.0788213
20509,0.0,0.28927225
20519,0.0,-0.015184343
20529,0.0,0.10279405
20539,0.0,0.19152063
20549,0.0,0.44882667
20559,0.0,0.03903401
20569,0.0,0.4219848
20579,0.0,0.5455268
20589,0.0,0.59380734
20599,0.0,0.7605616
20609,0.0,1.262172
20619,0.0,1.3753157
20629,0.0,2.305632
20639,0.0,1.6296322
20649,0.0,0.14566195
20659,0.0,0.66092193
20669,0.0,0.017922401
20679,0.0,0.48585725
20689,0.0,-0.18153846
20699,0.0,-0.21723181
20709,0.0,0.27696663
20719,0.0,-0.5583528
20729,0.0,-0.064130545
20739,0.0,-0.3582945
20749,0.0,0.6841577
20759,0.0,0.006207168
20769,0.0,-0.20284265
20779,0.0,0.09597349
20789,0.0,0.0031499267
20799,0.0,-0.1739012
20809,0.0,-0.050307274
20819,0.0,-0.0731715
20829,0.0,-0.014496267
20839,0.0,-0.030096054
20849,0.0,-0.56164205
20859,0.0,0.41938996
20869,0.0,0.2114048
20879,0.0,0.30007863
20889,0.0,-0.5656885
20899,0.0,-0.44284225
20909,0.0,1.0358468
20919,0.0,-0.21068954
20929,0.0,0.08251822
20939,0.0,-0.20974028
20949,0.0,0.123167515
20959,0.0,0.25539804
20969,0.0,-0.09593725
20979,0.0,0.16528112
20989,0.0,-0.2080301
20999,0.0,0.25325525
21009,0.0,-0.17273325
21019,0.0,-0.9095769
21029,0.0,-0.24982119
21039,0.0,0.010161161
21049,0.0,-0.43910766
21059,0.0,-0.36496258
21069,0.0,-0.41460085
21079,0.0,-0.22956347
21089,0.0,-0.11848402
21099,0.0,-0.031653702
21109,0.0,0.37575203
21119,0.0,-0.16458821
21129,0.0,0.6467783
21139,0.0,0.148732
21149,0.0,0.35117483
21159,0.0,0.32582545
21169,0.0,0.4308532
21179,0.0,-0.4166476
21189,0.0,-0.5978116
21199,0.0,-0.10199237
21209,0.0,-0.45717967
21219,0.0,-0.9398601
21229,0.0,-0.019395232
21239,0.0,0.21786875
21249,0.0,0.11518681
21259,0.0,0.33358222
21269,0.0,-0.39253378
21279,0.0,-0.3009038
21289,0.0,-0.22404361
21299,0.0,-0.51266146
21309,0.0,0.05269122
21319,0.0,0.30779302
21329,0.0,0.35126376
21339,0.0,0.31674856
21349,0.0,0.3664803
21359,0.0,-0.22323895
21369,0.0,0.12902558
21379,0.0,0.06832898
21389,0.0,-0.19045126
21399,0.0,-0.11760807
21409,0.0,-0.37565148
21419,0.0,-0.16102076
21429,0.0,-0.26380628
21439,0.0,-0.21980357
21449,0.0,-0.05267042
21459,0.0,0.18952298
21469,0.0,0.30637693
21479,0.0,0.56315964
21489,0.0,0.16521823
21499,0.0,0.8200175
21509,0.0,0.17235875
21519,0.0,0.5336313
21529,0.0,0.2068305
21539,0.0,0.23119116
21549,0.0,-0.03344685
21559,0.0,0.21643889
21569,0.0,0.23076248
21579,0.0,0.26776314
21589,0.0,0.19159484
21599,0.0,1.1065185
21609,0.0,0.5359213
21619,0.0,0.35151422
21629,0.0,-0.359717
21639,0.0,-0.03727615
21649,0.0,-0.4669569
21659,0.0,0.058226585
21669,0.0,-0.05029726
21679,0.0,0.3336708
21689,0.0,0.41506976
21699,0.0,-0.05852592
21709,0.0,0.24065322
21719,0.0,0.06652939
21729,0.0,0.85755384
21739,0.0,0.13798022
21749,0.0,-0.32927054
21759,0.0,0.4898544
21769,0.0,0.2808956
21779,0.0,-0.12132478
21789,0.0,-0.030427098
21799,0.0,-0.3461597
21809,0.0,-0.560218
21819,0.0,-0.13195121
21829,0.0,0.30673516
21839,0.0,0.23521125
21849,0.0,-0.14409924
21859,0.0,0.28020996
21869,0.0,0.95320374
21879,0.0,0.9871805
21889,0.0,-0.010556936
21899,0.0,-0.03893757
21909,0.0,-0.040597558
21919,0.0,0.25067818
21929,0.0,-0.52421796
21939,0.0,-0.08339149
21949,0.0,0.16835976
21959,0.0,0.11875868
21969,0.0,0.43941385
21979,0.0,1.2049663
21989,0.0,0.7759287
21999,0.0,0.55918145
22009,0.0,0.89063525
22019,0.0,1.2469485
22029,0.0,1.5552684
22039,0.0,1.8068342
22049,0.0,0.9675899
22059,0.0,1.8066745
22069,0.0,2.522355
22079,0.0,2.277369
22089,0.0,2.705951
22099,0.0,2.5080247
22109,0.0,1.1136508
22119,0.0,1.4089458
22129,0.0,0.7713852
22139,0.0,0.53497595
22149,0.0,0.14793885
22159,0.0,0.51097566
22169,0.0,-0.098771214
22179,0.0,0.5104149
22189,0.0,0.19646543
22199,0.0,-0.0072971582
22209,0.0,-0.07569826
22219,0.0,-0.55239254
22229,0.0,0.56953907
22239,0.0,-0.16766918
22249,0.0,-0.056791186
22259,0.0,0.28851473
22269,0.0,-0.09853679
22279,0.0,0.3797946
22289,0.0,0.41825306
22299,0.0,0.040657043
22309,0.0,0.20524055
22319,0.0,0.25225347
22329,0.0,-0.046487927
22339,0.0,-0.15159613
22349,0.0,0.50183845
22359,0.0,0.044040203
22369,0.0,0.2513432
22379,1.0,-0.39528596
22389,1.0,-0.32342303
22399,1.0,0.21547991
22409,1.0,0.4573714
22419,1.0,0.6995974
22429,1.0,1.0986985
22439,1.0,1.2617435
22449,1.0,1.26769
22459,1.0,1.7992599
22469,1.0,1.886931
22479,1.0,2.8148708
22489,1.0,2.390495
22499,1.0,3.1123297
22509,1.0,3.941267
22519,1.0,4.3851976
22529,1.0,4.9352674
22539,1.0,5.036122
22549,1.0,6.425701
22559,1.0,7.1043673
22569,1.0,7.927169
22579,1.0,9.494956
22589,1.0,13.534187
22599,1.0,13.52838
22609,1.0,11.732534
22619,1.0,10.195869
22629,1.0,5.988435
22639,1.0,3.718164
22649,1.0,3.7686024
22659,1.0,1.7316117
22669,1.0,2.2848713
22679,1.0,1.362921
22689,1.0,1.6393147
22699,1.0,0.5889642
22709,1.0,0.91827786
22719,1.0,0.8857902
22729,1.0,1.4483709
22739,1.0,2.566063
22749,1.0,3.8846455
22759,1.0,2.1266723
22769,1.0,4.4741063
22779,1.0,11.272685
22789,1.0,11.473173
22799,1.0,13.28701
22809,1.0,13.606034
22819,1.0,12.199383
22829,1.0,7.3963785
22839,1.0,7.7089806
22849,1.0,7.311129
22859,1.0,6.5131474
22869,1.0,5.5013237
22879,1.0,4.415473
22889,1.0,2.9032674
22899,1.0,3.4498758
22909,1.0,3.319573
22919,1.0,2.5454297
22929,1.0,2.7900004
22939,1.0,2.1890025
22949,1.0,1.9173195
22959,1.0,1.5082245
22969,1.0,1.2064059
22979,1.0,0.7492241
22989,1.0,0.5624956
22999,1.0,0.34541875
23009,1.0,-0.3825922
23019,0.0,-0.1494993
23029,0.0,-0.35301805
23039,0.0,0.106672764
23049,0.0,-0.20231259
23059,0.0,-0.13857484
23069,0.0,0.06321585
23079,0.0,-0.25138986
23089,0.0,-0.092386484
23099,0.0,-0.038657904
23109,0.0,0.0008023977
23119,0.0,0.27912056
23129,0.0,-0.06625289
23139,0.0,0.12125075
23149,0.0,0.018237174
23159,0.0,0.018072903
23169,0.0,-0.029939294
23179,0.0,0.12514383
23189,0.0,0.27647322
23199,0.0,1.0481305
23209,0.0,1.4687808
23219,0.0,1.0027843
23229,0.0,0.49433827
23239,0.0,0.3557154
23249,0.0,0.6083313
23259,0.0,-0.05689788
23269,0.0,0.046161532
23279,0.0,0.2872194
23289,0.0,-0.35953426
23299,0.0,-0.10914719
23309,0.0,0.34065336
23319,0.0,0.08666068
23329,0.0,0.2501933
23339,0.0,-0.071415186
23349,0.0,0.059067965
23359,0.0,0.01860559
23369,0.0,-0.25101244
23379,0.0,-0.45502818
23389,0.0,0.7591635
23399,0.0,0.75888425
23409,0.0,0.8352521
23419,0.0,0.53226197
23429,0.0,0.24103373
23439,0.0,0.23285836
23449,0.0,-0.04770726
23459,0.0,0.33204782
23469,0.0,0.26226377
23479,0.0,0.6379401
23489,0.0,0.22927803
23499,0.0,0.9262558
23509,0.0,0.003914237
23519,0.0,0.9066686
23529,0.0,0.5057324
23539,0.0,0.6790761
23549,0.0,0.36569273
23559,0.0,0.14885026
23569,0.0,0.24897182
23579,0.0,0.55353236
23589,0.0,-0.0871855
23599,0.0,-0.31600344
23609,0.0,0.19342601
23619,0.0,0.2733
23629,0.0,0.2716791
23639,0.0,0.4979365
23649,0.0,0.6594782
23659,0.0,1.6010121
23669,0.0,1.3772011
23679,0.0,1.7740796
23689,0.0,0.6154528
23699,0.0,1.4052713
23709,0.0,1.0550566
23719,0.0,1.7691658
23729,0.0,1.7846816
23739,0.0,1.7336447
23749,0.0,2.0250337
23759,0.0,1.9160001
23769,0.0,1.631353
23779,0.0,0.6484765
23789,0.0,0.6299975
23799,0.0,-0.47035646
23809,0.0,0.42938876
23819,0.0,0.25121856
23829,0.0,0.37179482
23839,0.0,0.4394505
23849,0.0,1.0235575
23859,0.0,0.19848919
23869,0.0,-0.8224558
23879,0.0,-0.25887764
23889,0.0,-0.26557302
23899,0.0,-0.07817042
23909,0.0,-0.053862095
23919,0.0,-0.24567533
23929,0.0,-0.26179373
23939,0.0,-0.61402404
23949,0.0,0.24712396
23959,0.0,-0.06941348
23969,0.0,0.20210516
23979,0.0,-0.41129124
23989,0.0,-0.15248668
23999,0.0,0.2645948
24009,0.0,0.3039046
24019,0.0,0.15375936
24029,0.0,-0.51009184
24039,0.0,-0.4376136
24049,0.0,-0.07685828
24059,0.0,0.18621719
24069,0.0,-0.08788848
24079,0.0,-0.754544
24089,0.0,-0.273315
24099,0.0,-0.25578243
24109,0.0,0.038888097
24119,0.0,0.7780941
24129,0.0,0.18443072
24139,0.0,0.42658877
24149,0.0,0.90599626
24159,0.0,0.73618644
24169,0.0,1.5202954
24179,0.0,1.7038071
24189,0.0,3.554777
24199,0.0,5.62477
24209,0.0,6.956114
24219,0.0,6.278493
24229,0.0,5.7110333
24239,0.0,5.3198423
24249,0.0,2.1000967
24259,0.0,1.8634698
24269,0.0,1.2073798
24279,0.0,0.555658
24289,0.0,0.5853425
24299,0.0,-0.19027197
24309,0.0,-0.32436943
24319,0.0,-0.072128534
24329,0.0,-0.18210477
24339,0.0,-0.086298585
24349,0.0,-0.24088466
24359,0.0,0.109261274
24369,0.0,0.115970254
24379,0.0,0.47362196
24389,0.0,1.5538454
24399,0.0,3.1319137
24409,0.0,3.3880272
24419,0.0,5.5679245
24429,0.0,6.3053026
24439,0.0,6.345535
24449,0.0,5.894347
24459,0.0,4.1385794
24469,0.0,4.2437487
24479,0.0,4.0223017
24489,0.0,2.586605
24499,0.0,1.1526718
24509,0.0,1.5687121
24519,0.0,1.3396688
24529,0.0,0.87378556
24539,0.0,1.4237443
24549,0.0,1.8121542
24559,0.0,0.90585226
24569,0.0,0.7738949
24579,0.0,-0.007153511
24589,0.0,0.50120217
24599,0.0,-0.18523544
24609,0.0,0.30653334
24619,0.0,0.83719116
24629,0.0,0.5276104
24639,0.0,0.72283876
24649,0.0,0.5128225
24659,0.0,-0.021561861
24669,0.0,0.22125709
24679,0.0,0.074911475
24689,0.0,0.15950769
24699,0.0,0.4693601
24709,0.0,0.11158669
24719,0.0,0.6883906
24729,0.0,0.26044786
24739,0.0,0.5280713
24749,0.0,0.3818978
24759,0.0,0.06669223
24769,0.0,0.103735805
24779,0.0,0.13695312
24789,0.0,0.1577093
24799,0.0,-0.009837389
24809,0.0,-0.04554999
24819,0.0,1.2555407
24829,0.0,0.9286497
24839,0.0,0.66391945
24849,0.0,1.9141872
24859,0.0,0.49274063
24869,0.0,1.8157661
24879,0.0,2.588098
24889,0.0,1.3875818
24899,0.0,1.9869967
24909,0.0,1.2808877
24919,0.0,1.6600393
24929,0.0,0.97022617
24939,0.0,1.5497506
24949,0.0,1.1587977
24959,0.0,0.59560806
24969,0.0,1.4552072
24979,0.0,0.3640105
24989,0.0,0.71337366
24999,0.0,0.19635773
25009,0.0,0.7396711
25019,0.0,1.3161902
25029,0.0,1.8469889
25039,0.0,0.7151416
25049,0.0,0.18180215
25059,0.0,0.41923445
25069,0.0,0.005899191
25079,0.0,-0.2918465
25089,0.0,-0.08748853
25099,0.0,-0.14261341
25109,0.0,0.48592675
25119,0.0,0.11982417
25129,0.0,0.6332302
25139,0.0,0.9733808
25149,0.0,0.5157825
25159,0.0,0.605283
25169,0.0,0.48069888
25179,0.0,0.80048233
25189,0.0,0.15597105
25199,0.0,0.5969814
25209,0.0,1.133408
25219,0.0,1.5418236
25229,0.0,2.0431726
25239,0.0,1.9712179
25249,0.0,1.2594554
25259,0.0,1.0981922
25269,0.0,1.0038316
25279,0.0,1.1614665
25289,0.0,0.91802514
25299,0.0,0.27399713
25309,0.0,-0.20303899
25319,0.0,0.38494003
25329,0.0,-0.35332382
25339,0.0,-0.2664026
25349,0.0,-0.010710835
25359,0.0,-0.058274627
25369,0.0,-0.33592272
25379,0.0,-0.13241208
25389,0.0,0.28824204
25399,0.0,0.5656725
25409,0.0,1.107943
25419,0.0,0.40151596
25429,0.0,0.59929264
25439,0.0,0.09999144
25449,0.0,0.4951474
25459,0.0,0.10165149
25469,0.0,-0.15210664
25479,0.0,-0.6768254
25489,0.0,0.6193168
25499,0.0,0.018368363
25509,0.0,-0.27600932
25519,0.0,-0.79285127
25529,0.0,0.4373014
25539,0.0,-0.49319667
25549,0.0,-0.17675471
25559,0.0,-0.09741616
25569,0.0,0.15892029
25579,0.0,0.39643568
25589,0.0,-0.06736773
25599,0.0,-0.35341692
25609,1.0,-0.24104416
25619,1.0,0.12742198
25629,1.0,0.37623185
25639,1.0,0.36857235
25649,1.0,0.9141057
25659,1.0,1.3067198
25669,1.0,1.9915062
25679,1.0,1.7370294
25689,1.0,2.2114491
25699,1.0,2.3958588
25709,1.0,2.766794
25719,1.0,3.1936274
25729,1.0,4.0838227
25739,1.0,4.006202
25749,1.0,4.7097692
25759,1.0,5.7337976
25769,1.0,5.2177114
25779,1.0,7.2701488
25789,1.0,6.8583612
25799,1.0,11.316725
25809,1.0,13.315832
25819,1.0,13.737042
25829,1.0,13.190848
25839,1.0,11.489452
25849,1.0,10.449337
25859,1.0,6.4494905
25869,1.0,4.9531345
25879,1.0,2.568897
25889,1.0,2.7372875
25899,1.0,1.625344
25909,1.0,1.1810703
25919,1.0,1.2637373
25929,1.0,0.68688065
25939,1.0,1.2616322
25949,1.0,1.3514868
25959,1.0,1.4165983
25969,1.0,1.6593627
25979,1.0,3.2164867
25989,1.0,5.7164435
25999,1.0,5.921369
26009,1.0,10.818667
26019,1.0,12.803446
26029,1.0,13.667494
26039,1.0,13.35358
26049,1.0,9.434944
26059,1.0,8.661126
26069,1.0,7.2288594
26079,1.0,6.4402385
26089,1.0,5.404957
26099,1.0,5.527149
26109,1.0,4.324238
26119,1.0,3.733355
26129,1.0,3.7796397
26139,1.0,2.0365086
26149,1.0,2.7452974
26159,1.0,2.1359015
26169,1.0,2.0547493
26179,1.0,1.7079262
26189,1.0,1.2355764
26199,1.0,1.0767626
26209,1.0,0.38163757
26219,1.0,0.27660298
26229,1.0,-0.08346045
26239,1.0,-0.5020154
26249,0.0,-0.12803471
26259,0.0,-0.050819576
26269,0.0,-0.74753785
26279,0.0,0.047879577
26289,0.0,0.1434378
26299,0.0,0.12508106
26309,0.0,0.8161196
26319,0.0,0.16796708
26329,0.0,0.19063628
26339,0.0,0.1033597
26349,0.0,-0.0024991035
26359,0.0,0.17238164
26369,0.0,0.042544246
26379,0.0,0.5921031
26389,0.0,1.1244907
26399,0.0,1.6443703
26409,0.0,0.83639705
26419,0.0,1.4968108
26429,0.0,2.3194325
26439,0.0,1.9443703
26449,0.0,2.9762878
26459,0.0,3.0397706
26469,0.0,2.652946
26479,0.0,3.2631676
26489,0.0,1.6226023
26499,0.0,2.284615
26509,0.0,1.7987406
26519,0.0,1.3773279
26529,0.0,1.2256266
26539,0.0,0.65095127
26549,0.0,1.6663604
26559,0.0,1.3800981
26569,0.0,2.1471062
26579,0.0,0.88239
26589,0.0,0.5637841
26599,0.0,0.8491532
26609,0.0,0.67201716
26619,0.0,0.9603501
26629,0.0,0.564203
26639,0.0,0.7621988
26649,0.0,1.0985575
26659,0.0,0.62807167
26669,0.0,0.7312238
26679,0.0,0.80950236
26689,0.0,0.057844758
26699,0.0,-0.43247235
26709,0.0,0.5657599
26719,0.0,0.59176403
26729,0.0,0.26964468
26739,0.0,-0.043762088
26749,0.0,-0.47031897
26759,0.0,-0.5381314
26769,0.0,-0.16940916
26779,0.0,-0.23383766
26789,0.0,-0.39386702
26799,0.0,-0.6383814
26809,0.0,-0.05898869
26819,0.0,0.30852813
26829,0.0,0.19298291
26839,0.0,-0.29617083
26849,0.0,-0.35009348
26859,0.0,-0.19988847
26869,0.0,-0.22424364
26879,0.0,-0.52554333
26889,0.0,-0.13977599
26899,0.0,0.3272918
26909,0.0,-0.042215466
26919,0.0,-0.74672747
26929,0.0,-0.12721944
26939,0.0,0.054721236
26949,0.0,0.12195754
26959,0.0,-0.113976
26969,0.0,0.087622285
26979,0.0,0.0016402006
26989,0.0,-0.15283799
26999,0.0,-0.109612584
27009,0.0,-0.41309685
27019,0.0,-0.1771034
27029,0.0,-0.13166207
27039,0.0,0.43193626
27049,0.0,0.10272598
27059,0.0,0.16981035
27069,0.0,0.33508962
27079,0.0,-0.17064106
27089,0.0,-0.29959458
27099,0.0,-0.24105668
27109,0.0,-0.13741362
27119,0.0,-0.1760692
27129,0.0,-0.5084853
27139,0.0,-0.2024917
27149,0.0,-0.25141537
27159,0.0,0.39111805
27169,0.0,0.54321414
27179,0.0,-0.06622505
27189,0.0,0.6836715
27199,0.0,1.1331805
27209,0.0,1.0266445
27219,0.0,0.95520765
27229,0.0,-0.3496914
27239,0.0,0.1894542
27249,0.0,0.5668287
27259,0.0,0.46957135
27269,0.0,1.1515846
27279,0.0,0.40663683
27289,0.0,1.216568
27299,0.0,0.9417014
27309,0.0,1.3776281
27319,0.0,0.665374
27329,0.0,0.1935091
27339,0.0,0.2806279
27349,0.0,-0.48286915
27359,0.0,-0.036970854
27369,0.0,0.13341188
27379,0.0,-0.19097936
27389,0.0,0.21279573
27399,0.0,0.18805099
27409,0.0,-0.04361236
27419,0.0,0.38779026
27429,0.0,1.1107136
27439,0.0,1.4953687
27449,0.0,0.96786225
27459,0.0,0.9652506
27469,0.0,0.3531797
27479,0.0,0.7138679
27489,0.0,0.5179038
27499,0.0,0.64969635
27509,0.0,0.52278936
27519,0.0,0.015076876
27529,0.0,0.602159
27539,0.0,0.27085733
27549,0.0,0.48391616
27559,0.0,0.42014956
27569,0.0,0.27899462
27579,0.0,0.68203336
27589,0.0,0.27349305
27599,0.0,-0.16072786
27609,0.0,0.079919815
27619,0.0,-0.03967452
27629,0.0,-0.115107656
27639,0.0,0.061522484
27649,0.0,0.036394656
27659,0.0,-0.06709391
27669,0.0,0.111855626
27679,0.0,-0.111974776
27689,0.0,0.8175929
27699,0.0,0.13991344
27709,0.0,0.5994596
27719,0.0,0.90066427
27729,0.0,1.1664217
27739,0.0,1.0588474
27749,0.0,0.812222
27759,0.0,0.9779178
27769,0.0,0.15015924
27779,0.0,0.27866304
27789,0.0,1.6912951
27799,0.0,1.2335131
27809,0.0,1.7343062
27819,0.0,1.9419259
27829,0.0,1.3968098
27839,0.0,0.27176654
27849,0.0,0.1753329
27859,0.0,-0.16029179
27869,0.0,0.15315115
27879,0.0,0.76715535
27889,0.0,0.5352022
27899,0.0,0.5494858
27909,0.0,0.2953248
27919,0.0,0.5826285
27929,0.0,0.2851624
27939,0.0,-0.0747689
27949,0.0,0.11144292
27959,0.0,0.2783897
27969,0.0,0.6601542
27979,0.0,0.11662948
27989,0.0,0.4376248
27999,0.0,0.42450923
28009,0.0,-0.0048527718
28019,0.0,-0.029068947
28029,0.0,-0.09599388
28039,0.0,0.0331555
28049,0.0,0.34277636
28059,0.0,0.10271728
28069,0.0,0.50542384
28079,0.0,0.677732
28089,0.0,0.72227514
28099,0.0,1.0958409
28109,0.0,0.855622
28119,0.0,2.308372
28129,0.0,3.1617014
28139,0.0,3.480785
28149,0.0,2.0445204
28159,0.0,3.9156368
28169,0.0,3.5004668
28179,0.0,3.1911113
28189,0.0,1.2419891
28199,0.0,1.2283409
28209,0.0,1.412788
28219,0.0,1.5379765
28229,0.0,0.7355753
28239,0.0,0.52989614
28249,0.0,0.73746085
28259,0.0,1.0055498
28269,0.0,0.17279494
28279,0.0,-0.25546896
28289,0.0,-0.122339964
28299,0.0,0.0634774
28309,0.0,-0.2483297
28319,0.0,0.15816253
28329,0.0,0.5052443
28339,0.0,0.5184064
28349,0.0,-0.1373946
28359,0.0,0.17441797
28369,0.0,-0.0019419193
28379,0.0,-0.1325239
28389,0.0,-0.11435592
28399,0.0,-0.4476297
28409,0.0,-0.6316568
28419,0.0,0.04638183
28429,0.0,-0.43120706
28439,0.0,-0.22079337
28449,0.0,0.263309
28459,0.0,-0.16147792
28469,0.0,-0.32315242
28479,0.0,0.2122109
28489,0.0,-0.1828624
28499,0.0,-0.47933757
28509,0.0,-0.6320754
28519,0.0,-0.16728169
28529,0.0,-0.1732943
28539,0.0,-0.17364156
28549,0.0,0.11457837
28559,0.0,-0.34234464
28569,0.0,-0.22274888
28579,0.0,0.30945432
28589,0.0,1.4123582
28599,0.0,1.9454789
28609,0.0,1.4118279
28619,0.0,2.1554127
28629,0.0,2.2011642
28639,0.0,1.8196988
28649,0.0,2.3979967
28659,0.0,1.5379319
28669,0.0,1.8922695
28679,0.0,1.0595863
28689,0.0,1.0449739
28699,0.0,1.390202
28709,0.0,1.7356557
28719,0.0,2.4579349
28729,0.0,2.9018545
28739,0.0,2.5620625
28749,0.0,2.2406828
28759,0.0,1.3548491
28769,0.0,1.5525684
28779,0.0,1.4469922
28789,0.0,1.1913233
28799,0.0,1.4607503
28809,0.0,0.75700915
28819,0.0,0.23765743
28829,1.0,0.60783875
28839,1.0,0.4092418
28849,1.0,0.14193553
28859,1.0,0.12068194
28869,1.0,0.5234274
28879,1.0,0.96212864
28889,1.0,0.91037214
28899,1.0,1.5115137
28909,1.0,1.9617991
28919,1.0,2.3600307
28929,1.0,2.4499326
28939,1.0,2.8614213
28949,1.0,3.9710937
28959,1.0,4.3390017
28969,1.0,4.8912134
28979,1.0,4.2611113
28989,1.0,5.427517
28999,1.0,6.192218
29009,1.0,7.4148846
29019,1.0,8.512602
29029,1.0,9.026991
29039,1.0,13.382938
29049,1.0,13.383656
29059,1.0,12.530436
29069,1.0,10.221418
29079,1.0,7.1512237
29089,1.0,4.8431764
29099,1.0,2.2091973
29109,1.0,1.5921879
29119,1.0,1.8780712
29129,1.0,1.0732235
29139,1.0,0.5113735
29149,1.0,0.7026218
29159,1.0,1.10971
29169,1.0,0.4518625
29179,1.0,1.6571736
29189,1.0,1.7210847
29199,1.0,3.0091748
29209,1.0,3.3402596
29219,1.0,4.400154
29229,1.0,6.1350193
29239,1.0,12.12346
29249,1.0,13.481819
29259,1.0,13.647398
29269,1.0,13.048975
29279,1.0,6.668631
29289,1.0,7.783169
29299,1.0,5.997408
29309,1.0,5.7768526
29319,1.0,4.964217
29329,1.0,4.247036
29339,1.0,4.064552
29349,1.0,3.9866228
29359,1.0,3.132418
29369,1.0,2.8232102
29379,1.0,2.3319843
29389,1.0,1.7538629
29399,1.0,1.4567908
29409,1.0,1.0524752
29419,1.0,1.2163258
29429,1.0,0.711121
29439,1.0,0.44279343
29449,1.0,0.293108
29459,1.0,0.6487022
29469,0.0,-0.2243638
29479,0.0,0.07737422
29489,0.0,0.055901527
29499,0.0,-0.49951756
29509,0.0,-0.34697628
29519,0.0,0.17338479
29529,0.0,0.28219795
29539,0.0,-0.24456942
29549,0.0,-0.35268688
29559,0.0,-0.0531255
29569,0.0,-0.11353576
29579,0.0,-0.120483875
29589,0.0,-0.39770484
29599,0.0,0.0923484
29609,0.0,-0.07967627
29619,0.0,-0.14639783
29629,0.0,0.07113731
29639,0.0,-0.21712804
29649,0.0,0.06653941
29659,0.0,0.21958208
29669,0.0,0.5050094
29679,0.0,0.021998405
29689,0.0,0.05835247
29699,0.0,0.13054073
29709,0.0,-0.1055907
29719,0.0,1.9504346
29729,0.0,2.727954
29739,0.0,2.7479298
29749,0.0,1.5182347
29759,0.0,1.6696699
29769,0.0,2.1001806
29779,0.0,1.7123376
29789,0.0,2.0994906
29799,0.0,1.107532
29809,0.0,1.3091612
29819,0.0,0.5904059
29829,0.0,0.116811156
29839,0.0,0.21169412
29849,0.0,0.21345174
29859,0.0,0.322805
29869,0.0,-0.4776271
29879,0.0,-0.40381014
29889,0.0,0.12923944
29899,0.0,0.35691065
29909,0.0,-0.87642896
29919,0.0,-0.28664315
29929,0.0,-0.030403733
29939,0.0,-0.58432406
29949,0.0,-0.39446962
29959,0.0,-0.6343688
29969,0.0,-0.12129927
29979,0.0,-0.27833033
29989,0.0,0.10411012
29999,0.0,-0.21654618
30009,0.0,0.13838184
30019,0.0,0.22362626
30029,0.0,-0.12424314
30039,0.0,0.032234013
30049,0.0,-0.41521454
30059,0.0,-0.24216837
30069,0.0,0.1951282
30079,0.0,-0.4210261
30089,0.0,-0.78791475
30099,0.0,-0.3968597
30109,0.0,-0.60381526
30119,0.0,-0.14535034
30129,0.0,-0.57560617
30139,0.0,-0.16364694
30149,0.0,-0.37160718
30159,0.0,-0.23359036
30169,0.0,-0.37586176
30179,0.0,0.022241533
30189,0.0,0.41391265
30199,0.0,0.35136628
30209,0.0,0.36047512
30219,0.0,0.352026
30229,0.0,0.22858512
30239,0.0,0.08781499
30249,0.0,0.9584609
30259,0.0,0.8394915
30269,0.0,0.5406397
30279,0.0,-0.14268613
30289,0.0,0.118962586
30299,0.0,0.10192096
30309,0.0,-0.33481395
30319,0.0,-0.54265803
30329,0.0,-0.1593889
30339,0.0,-0.20775568
30349,0.0,-0.14734781
30359,0.0,0.22368473
30369,0.0,-0.08778614
30379,0.0,0.33884656
30389,0.0,0.013252616
30399,0.0,-0.21259582
30409,0.0,-0.24434173
30419,0.0,-0.3036692
30429,0.0,-0.3250578
30439,0.0,-0.25595975
30449,0.0,-0.010228157
30459,0.0,1.1919403
30469,0.0,0.99608606
30479,0.0,0.2270267
30489,0.0,1.1786834
30499,0.0,0.27484167
30509,0.0,0.23274809
30519,0.0,0.73751515
30529,0.0,1.4104869
30539,0.0,1.6570024
30549,0.0,2.6548471
30559,0.0,5.2661448
30569,0.0,5.3559237
30579,0.0,4.512594
30589,0.0,5.388383
30599,0.0,3.1758518
30609,0.0,2.4623723
30619,0.0,2.475127
30629,0.0,2.1125166
30639,0.0,1.5084484
30649,0.0,1.5037639
30659,0.0,0.8537609
30669,0.0,0.16482627
30679,0.0,0.17939037
30689,0.0,-0.17701197
30699,0.0,1.0284035
30709,0.0,1.081914
30719,0.0,0.44544792
30729,0.0,-0.015342236
30739,0.0,-0.032375216
30749,0.0,0.25320715
30759,0.0,0.90195715
30769,0.0,1.0455213
30779,0.0,1.649467
30789,0.0,1.5986894
30799,0.0,1.5556545
30809,0.0,2.396232
30819,0.0,1.8495071
30829,0.0,1.3280077
30839,0.0,1.60422
30849,0.0,1.135237
30859,0.0,0.223822
30869,0.0,0.28892815
30879,0.0,0.12559861
30889,0.0,-0.1603173
30899,0.0,-0.54045653
30909,1.0,-0.005191922
30919,1.0,-0.049299777
30929,1.0,0.53073186
30939,1.0,0.8724312
30949,1.0,1.125062
30959,1.0,1.5318402
30969,1.0,1.7868894
30979,1.0,2.6314201
30989,1.0,2.8640277
30999,1.0,2.6123884
31009,1.0,2.9794927
31019,1.0,4.7456446
31029,1.0,4.7197104
31039,1.0,5.533856
31049,1.0,5.2853203
31059,1.0,6.6652308
31069,1.0,6.219817
31079,1.0,6.807903
31089,1.0,6.852826
31099,1.0,9.176823
31109,1.0,13.214226
31119,1.0,13.591866
31129,1.0,12.65575
31139,1.0,11.149263
31149,1.0,4.6878757
31159,1.0,2.5047321
31169,1.0,2.6205478
31179,1.0,1.8106282
31189,1.0,1.7667054
31199,1.0,1.4674547
31209,1.0,1.141736
31219,1.0,1.014396
31229,1.0,1.3399017
31239,1.0,0.9432097
31249,1.0,1.7152455
31259,1.0,1.0071521
31269,1.0,3.1507149
31279,1.0,3.8498013
31289,1.0,4.293413
31299,1.0,7.2026486
31309,1.0,12.258003
31319,1.0,13.459587
31329,1.0,13.513716
31339,1.0,9.235306
31349,1.0,8.791666
31359,1.0,7.292973
31369,1.0,5.9073577
31379,1.0,5.279402
31389,1.0,4.3159523
31399,1.0,4.3981056
31409,1.0,3.8986442
31419,1.0,2.8027215
31429,1.0,2.2791412
31439,1.0,3.0965254
31449,1.0,2.260837
31459,1.0,1.487705
31469,1.0,1.4651132
31479,1.0,1.1959705
31489,1.0,0.47015202
31499,1.0,0.96014315
31509,1.0,0.55302477
31519,1.0,-0.059672892
31529,1.0,-0.5299505
31539,0.0,0.07813692
31549,0.0,0.25831103
31559,0.0,0.20450532
31569,0.0,0.0043872595
31579,0.0,0.433447
31589,0.0,-0.14540291
31599,0.0,0.51470655
31609,0.0,-0.5652203
31619,0.0,-0.08449471
31629,0.0,0.14494681
31639,0.0,-0.11172032
31649,0.0,0.68736255
31659,0.0,1.4321578
31669,0.0,2.162608
31679,0.0,2.272977
31689,0.0,3.634039
31699,0.0,3.1520524
31709,0.0,2.6154647
31719,0.0,2.8587074
31729,0.0,2.6371462
31739,0.0,2.6619685
31749,0.0,4.587798
31759,0.0,3.4681451
31769,0.0,3.2437444
31779,0.0,1.7044352
31789,0.0,1.6736783
31799,0.0,2.5764842
31809,0.0,2.354031
31819,0.0,1.6237423
31829,0.0,0.9031046
31839,0.0,0.5350933
31849,0.0,0.024801373
31859,0.0,0.14755362
31869,0.0,0.2499808
31879,0.0,0.952527
31889,0.0,0.9850874
31899,0.0,0.823482
31909,0.0,0.39753026
31919,0.0,1.089467
31929,0.0,0.37019348
31939,0.0,0.6125025
31949,0.0,0.83845717
31959,0.0,0.773134
31969,0.0,0.76771116
31979,0.0,0.42023134
31989,0.0,0.62041515
31999,0.0,1.1171829
32009,0.0,1.4385846
32019,0.0,1.3862689
32029,0.0,1.6465085
32039,0.0,0.2687819
32049,0.0,1.1110278
32059,0.0,0.97507125
32069,0.0,-0.6112834
32079,0.0,-0.17936897
32089,0.0,-0.19009161
32099,0.0,-0.22037941
32109,0.0,0.110044956
32119,0.0,-0.052209258
32129,0.0,-0.45463836
32139,0.0,0.0468688
32149,0.0,-0.35540187
32159,0.0,-0.4970358
32169,0.0,-0.53765047
32179,0.0,-0.33088475
32189,0.0,-0.2364251
32199,0.0,-0.12156463
32209,0.0,0.31465685
32219,0.0,-0.2630555
32229,0.0,-0.17315483
32239,0.0,-0.2749853
32249,0.0,-0.12363005
32259,0.0,0.14647937
32269,0.0,0.35177368
32279,0.0,0.038226783
32289,0.0,0.0033296347
32299,0.0,-0.20173693
32309,0.0,0.37104857
32319,0.0,-0.07405293
32329,0.0,-0.13092804
32339,0.0,0.2991106
32349,0.0,0.14330077
32359,0.0,-0.27652937
32369,0.0,-0.07844001
32379,0.0,-0.09153277
32389,0.0,-0.0049157143
32399,0.0,0.13563275
32409,0.0,0.3414842
32419,0.0,-0.22990572
32429,0.0,-0.088453054
32439,0.0,0.101507545
32449,0.0,0.04478824
32459,0.0,0.18406379
32469,0.0,-0.11098814
32479,0.0,-0.046859205
32489,0.0,0.030972123
32499,0.0,-0.17741632
32509,0.0,-0.077741265
32519,0.0,-0.119615674
32529,0.0,0.15277398
32539,0.0,0.8367052
32549,0.0,0.7755599
32559,0.0,1.1608679
32569,0.0,2.9636502
32579,0.0,2.9554443
32589,0.0,1.562669
32599,0.0,0.8033487
32609,0.0,2.315761
32619,0.0,0.9334761
32629,0.0,1.81588
32639,0.0,2.4872208
32649,0.0,1.9311416
32659,0.0,1.456273
32669,0.0,1.5816505
32679,0.0,1.3617601
32689,0.0,1.2147572
32699,0.0,1.8503213
32709,0.0,1.6559967
32719,0.0,0.49952316
32729,0.0,-0.06552076
32739,0.0,0.5510932
32749,0.0,0.15842998
32759,0.0,0.29504222
32769,0.0,0.5805893
32779,0.0,0.77603936
32789,0.0,-0.43317932
32799,0.0,-0.00020766258
32809,0.0,-0.057018638
32819,0.0,0.16132057
32829,0.0,-0.308537
32839,0.0,-0.5393959
32849,0.0,0.15531039
32859,0.0,0.37555623
32869,0.0,0.08559787
32879,0.0,0.043944478
32889,0.0,0.41545427
32899,0.0,0.35487688
32909,0.0,0.49241108
32919,0.0,-0.41621017
32929,0.0,0.23949063
32939,0.0,0.6823113
32949,0.0,0.4624951
32959,0.0,0.974474
32969,0.0,0.51607466
32979,0.0,-0.004075527
32989,0.0,-0.15048254
32999,0.0,0.5672333
33009,0.0,0.2649054
33019,0.0,0.071582556
33029,0.0,0.38664955
33039,0.0,-0.37890333
33049,0.0,-0.23769367
33059,0.0,-0.077056944
33069,0.0,-0.58053994
33079,0.0,-0.20404613
33089,0.0,0.23269993
33099,0.0,0.2315656
33109,0.0,-0.023420572
33119,0.0,0.5132323
33129,0.0,0.3655138
33139,0.0,0.25200927
33149,0.0,1.1359837
33159,0.0,0.12417233
33169,0.0,0.32265675
33179,0.0,-0.056229293
33189,0.0,0.04059267
33199,0.0,-0.1358043
33209,0.0,0.39947444
33219,0.0,-0.14113271
33229,0.0,0.19677484
33239,0.0,-0.1622802
33249,0.0,-0.1599791
33259,0.0,0.34618568
33269,0.0,0.5839329
33279,0.0,0.7961688
33289,0.0,0.45643568
33299,0.0,0.71521574
33309,0.0,1.6404823
33319,0.0,2.1948304
33329,0.0,2.5044591
33339,0.0,2.4251776
33349,0.0,1.4709529
33359,0.0,1.2155803
33369,0.0,0.77845323
33379,0.0,0.24117076
33389,0.0,0.011397243
33399,0.0,-0.23083472
33409,0.0,0.2767176
33419,0.0,0.18235612
33429,0.0,0.003430128
33439,0.0,-0.15341693
33449,0.0,0.03290379
33459,0.0,0.2741742
33469,0.0,0.06651378
33479,0.0,-0.05288893
33489,0.0,-0.15830624
33499,0.0,-0.27406865
33509,0.0,0.68054366
33519,0.0,0.60597557
33529,0.0,0.78341424
33539,0.0,0.60452294
33549,0.0,0.38498414
33559,0.0,0.51269454
33569,0.0,0.33259475
33579,0.0,0.83954304
33589,0.0,-0.6379936
33599,0.0,-0.02876842
33609,0.0,-0.2181471
33619,0.0,0.56985605
33629,0.0,0.28514266
33639,0.0,-0.11656332
33649,0.0,-0.12982655
33659,0.0,0.2967049
33669,0.0,0.57152605
33679,0.0,-0.17815971
33689,0.0,0.41754305
33699,0.0,-0.05199355
33709,0.0,0.3011899
33719,0.0,0.14450371
33729,0.0,0.10432643
33739,0.0,0.52465975
33749,0.0,0.72508913
33759,0.0,0.8825438
33769,0.0,-0.28214812
33779,0.0,0.13983285
33789,0.0,0.48944664
33799,0.0,0.55218565
33809,0.0,0.25289202
33819,0.0,0.24879396
33829,0.0,-0.3404398
33839,0.0,-0.1587764
33849,0.0,0.3890636
33859,0.0,-0.059256077
33869,0.0,0.3972093
33879,0.0,0.12033188
33889,0.0,-0.09941304
33899,0.0,-0.61311626
33909,0.0,0.48251384
33919,0.0,0.18496358
33929,0.0,-0.22778487
33939,0.0,0.45796174
33949,0.0,-0.19811118
33959,0.0,0.07326865
33969,0.0,0.14271235
33979,0.0,0.08978152
33989,0.0,-0.10478413
33999,0.0,0.25963205
34009,0.0,0.72006154
34019,0.0,0.001096487
34029,0.0,0.16425323
34039,0.0,-0.26659083
34049,0.0,-0.1228745
34059,0.0,-0.112590194
34069,0.0,-0.32168698
34079,0.0,-0.083337545
34089,0.0,0.036872685
34099,0.0,-0.18509948
34109,0.0,-0.33270615
34119,0.0,0.21809483
34129,1.0,-0.18072027
34139,1.0,-0.061864853
34149,1.0,0.36770344
34159,1.0,0.4039361
34169,1.0,0.6293591
34179,1.0,0.9061995
34189,1.0,1.4437231
34199,1.0,1.6162753
34209,1.0,1.8206376
34219,1.0,2.5144286
34229,1.0,2.9079404
34239,1.0,2.886033
34249,1.0,3.274356
34259,1.0,3.8695455
34269,1.0,5.018953
34279,1.0,5.2155514
34289,1.0,5.751793
34299,1.0,6.4566784
34309,1.0,6.301345
34319,1.0,8.896069
34329,1.0,10.704491
34339,1.0,13.456351
34349,1.0,13.589466
34359,1.0,11.46962
34369,1.0,10.219161
34379,1.0,6.5928955
34389,1.0,3.6134794
34399,1.0,3.3754466
34409,1.0,2.9770112
34419,1.0,0.75478274
34429,1.0,0.86555576
34439,1.0,1.423285
34449,1.0,0.95166844
34459,1.0,1.4312874
34469,1.0,1.3235459
34479,1.0,1.6386778
34489,1.0,3.0446374
34499,1.0,2.8428862
34509,1.0,2.9875057
34519,1.0,3.7190573
34529,1.0,7.357544
34539,1.0,9.472841
34549,1.0,12.792881
34559,1.0,13.584848
34569,1.0,13.329995
34579,1.0,9.052719
34589,1.0,8.678489
34599,1.0,7.049373
34609,1.0,6.2977543
34619,1.0,5.449957
34629,1.0,5.074883
34639,1.0,4.352742
34649,1.0,4.112684
34659,1.0,2.9922175
34669,1.0,3.1485238
34679,1.0,2.2051651
34689,1.0,2.0242257
34699,1.0,2.076238
34709,1.0,1.3855368
34719,1.0,1.2992775
34729,1.0,0.5961837
34739,1.0,0.43003923
34749,1.0,0.3254255
34759,1.0,-0.03343296
34769,0.0,0.02674681
34779,0.0,0.2665699
34789,0.0,-0.10477269
34799,0.0,0.120310664
34809,0.0,0.09355867
34819,0.0,-0.4763235
34829,0.0,-0.1890297
34839,0.0,0.11943066
34849,0.0,-0.35849917
34859,0.0,0.2704618
34869,0.0,0.24837935
34879,0.0,-0.23587155
34889,0.0,-0.22471869
34899,0.0,-0.73775315
34909,0.0,0.06106907
34919,0.0,0.05736506
34929,0.0,-0.36924124
34939,0.0,-0.47806764
34949,0.0,-0.180762
34959,0.0,-1.0322258
34969,0.0,0.029320002
34979,0.0,-0.441683
34989,0.0,-0.57205456
34999,0.0,0.051629126
35009,0.0,-0.3328992
35019,0.0,-0.31477398
35029,0.0,-0.25617766
35039,0.0,-0.031329036
35049,0.0,-0.1568309
35059,0.0,-0.20053911
35069,0.0,-0.48525113
35079,0.0,-0.018716156
35089,0.0,0.18670446
35099,0.0,0.0021228194
35109,0.0,0.35167265
35119,0.0,0.9559622
35129,0.0,0.29273522
35139,0.0,-0.28659618
35149,0.0,0.5299276
35159,0.0,1.0048292
35169,0.0,1.5326568
35179,0.0,1.1761324
35189,0.0,0.42062938
35199,0.0,1.1264791
35209,0.0,0.85024244
35219,0.0,1.1852937
35229,0.0,0.53432286
35239,0.0,0.5537257
35249,0.0,0.14826155
35259,0.0,0.45832652
35269,0.0,-0.040016294
35279,0.0,0.45147765
35289,0.0,-0.06769848
35299,0.0,-0.29047656
35309,0.0,0.50307286
35319,0.0,0.3382544
35329,0.0,0.42891574
35339,0.0,-0.18345487
35349,0.0,0.09034419
35359,0.0,0.86060524
35369,0.0,1.4039865
35379,0.0,2.121482
35389,0.0,1.8375554
35399,0.0,2.4524417
35409,0.0,2.9081652
35419,0.0,2.4441786
35429,0.0,3.00907
35439,0.0,1.7166798
35449,0.0,2.144674
35459,0.0,1.0352831
35469,0.0,0.7960942
35479,0.0,0.8981466
35489,0.0,0.5375724
35499,0.0,0.51480573
35509,0.0,0.5342801
35519,0.0,0.60296375
35529,0.0,0.04033017
35539,0.0,0.28561032
35549,0.0,1.3656547
35559,0.0,1.9367411
35569,0.0,1.837158
35579,0.0,2.566314
35589,0.0,4.1579046
35599,0.0,4.5650206
35609,0.0,4.6949906
35619,0.0,3.982627
35629,0.0,4.7488546
35639,0.0,2.8745933
35649,0.0,2.4710429
35659,0.0,2.5394459
35669,0.0,2.479718
35679,0.0,3.036965
35689,0.0,3.0334344
35699,0.0,2.514698
35709,0.0,1.3090246
35719,0.0,1.0983634
35729,0.0,0.710786
35739,0.0,0.40423846
35749,0.0,0.0039469004
35759,0.0,8.881092e-05
35769,0.0,-0.05878389
35779,0.0,-0.061583757
35789,0.0,0.84570134
35799,0.0,0.25289
35809,0.0,-0.13393432
35819,0.0,-0.051195502
35829,0.0,0.4862535
35839,0.0,1.3414501
35849,0.0,1.1429796
35859,0.0,1.2604035
35869,0.0,1.9797947
35879,0.0,2.7581375
35889,0.0,4.7372785
35899,0.0,3.611436
35909,0.0,4.7346764
35919,0.0,5.868273
35929,0.0,4.025849
35939,0.0,4.509244
35949,0.0,2.2054944
35959,0.0,2.415546
35969,0.0,1.906901
35979,0.0,1.7781272
35989,0.0,0.9422455
35999,0.0,0.9479798
36009,0.0,0.83953166
36019,0.0,1.6860589
36029,0.0,2.0023472
36039,0.0,1.2360073
36049,0.0,1.0051942
36059,0.0,2.4968698
36069,0.0,2.1147451
36079,0.0,2.0798445
36089,0.0,0.31237602
36099,0.0,0.9759916
36109,0.0,0.2936808
36119,0.0,-0.756811
36129,0.0,0.050685406
36139,0.0,-0.083842635
36149,0.0,0.054837704
36159,0.0,0.105505705
36169,0.0,0.123586774
36179,0.0,-0.074622154
36189,0.0,0.5953728
36199,0.0,0.051607132
36209,0.0,-0.036764264
36219,0.0,0.5259492
36229,0.0,0.5934606
36239,0.0,0.67325443
36249,0.0,0.4028331
36259,0.0,1.7081285
36269,0.0,1.2997112
36279,0.0,1.4460177
36289,0.0,1.2987866
36299,0.0,0.8678495
36309,0.0,1.4709747
36319,0.0,1.3656158
36329,0.0,-0.06784487
36339,0.0,-0.00016844273
36349,0.0,-0.28877866
36359,0.0,0.049384832
36369,0.0,-0.1776371
36379,0.0,0.43112123
36389,0.0,0.7030566
36399,0.0,0.40093458
36409,0.0,0.76831055
36419,0.0,1.3052108
36429,0.0,1.3914814
36439,0.0,1.1889449
36449,0.0,0.25314164
36459,0.0,0.27908248
36469,0.0,0.11063087
36479,0.0,0.09458768
36489,0.0,-0.31983173
36499,0.0,0.23871732
36509,0.0,0.3000198
36519,0.0,-0.19247341
36529,0.0,-0.43982863
36539,0.0,-0.36906374
36549,0.0,-0.44658923
36559,0.0,-0.33794594
36569,0.0,-0.43914235
36579,0.0,-0.5851417
36589,0.0,0.3001126
36599,0.0,-0.110925674
36609,0.0,-0.031861365
36619,0.0,-0.071260214
36629,0.0,0.19012117
36639,0.0,0.037869573
36649,0.0,-0.096307874
36659,0.0,-0.38360453
36669,0.0,-0.3715644
36679,0.0,0.052126527
36689,0.0,-0.38541532
36699,0.0,-0.214517
36709,0.0,-0.4928609
36719,0.0,-0.17381465
36729,0.0,-0.12003279
36739,0.0,0.031846404
36749,0.0,-0.5352885
36759,0.0,-0.1502108
36769,0.0,-0.48332536
36779,0.0,0.35093313
36789,0.0,-0.15424609
36799,0.0,-0.6408952
36809,0.0,-0.104910076
36819,0.0,-0.008867025
36829,0.0,-0.23430401
36839,0.0,-0.14313412
36849,0.0,-0.5571401
36859,0.0,0.33363903
36869,0.0,-0.34621286
36879,0.0,0.011082411
36889,0.0,0.39023846
36899,0.0,0.18418807
36909,0.0,-0.47269535
36919,0.0,-0.15141559
36929,0.0,-0.47357547
36939,0.0,0.14673227
36949,0.0,-0.30430317
36959,0.0,0.33373326
36969,0.0,-0.16601336
36979,0.0,-0.22571409
36989,0.0,0.092390895
36999,0.0,0.2428245
37009,0.0,-0.027471244
37019,0.0,-0.40749937
37029,0.0,0.15833855
37039,0.0,0.33494264
37049,0.0,-0.09412515
37059,0.0,0.17395318
37069,0.0,0.33544034
37079,0.0,-0.34728962
37089,0.0,-0.1202482
37099,0.0,-0.1948294
37109,0.0,-0.6200702
37119,0.0,-0.09185666
37129,0.0,0.08758879
37139,0.0,0.08581293
37149,0.0,0.28005964
37159,0.0,0.19748771
37169,0.0,-0.21415436
37179,0.0,0.22217965
37189,0.0,0.3250237
37199,0.0,-0.18032146
37209,0.0,-0.43898714
37219,0.0,-0.2612638
37229,0.0,-0.63164085
37239,0.0,-0.13614988
37249,0.0,-0.08533287
37259,0.0,0.20884871
37269,0.0,0.13577175
37279,0.0,0.0650512
37289,0.0,0.07958031
37299,0.0,0.02037549
37309,0.0,-0.5056802
37319,0.0,0.32670093
37329,0.0,0.11815274
37339,0.0,-0.0019264817
37349,0.0,0.14925587
37359,1.0,-0.06588161
37369,1.0,0.2912621
37379,1.0,0.15700525
37389,1.0,0.12763757
37399,1.0,0.7652807
37409,1.0,0.9745381
37419,1.0,1.1936315
37429,1.0,1.3559148
37439,1.0,1.7765434
37449,1.0,2.116079
37459,1.0,2.82547
37469,1.0,3.4136262
37479,1.0,3.5124862
37489,1.0,4.831366
37499,1.0,4.662365
37509,1.0,4.662589
37519,1.0,5.804941
37529,1.0,6.9539566
37539,1.0,6.843074
37549,1.0,9.944114
37559,1.0,13.066086
37569,1.0,13.629999
37579,1.0,13.5221405
37589,1.0,11.37912
37599,1.0,8.328634
37609,1.0,4.7958746
37619,1.0,5.4924526
37629,1.0,3.0385137
37639,1.0,3.0522623
37649,1.0,1.2851421
37659,1.0,1.2644713
37669,1.0,1.5772575
37679,1.0,1.2195146
37689,1.0,1.1350806
37699,1.0,1.89062
37709,1.0,2.1825168
37719,1.0,2.5663853
37729,1.0,2.071551
37739,1.0,3.5351195
37749,1.0,6.271187
37759,1.0,8.611302
37769,1.0,12.950653
37779,1.0,13.546703
37789,1.0,13.438032
37799,1.0,10.651129
37809,1.0,8.466518
37819,1.0,7.2064877
37829,1.0,6.145384
37839,1.0,5.251314
37849,1.0,4.803643
37859,1.0,4.328126
37869,1.0,3.4691656
37879,1.0,3.8146813
37889,1.0,2.9027326
37899,1.0,3.0983365
37909,1.0,2.0348725
37919,1.0,1.933099
37929,1.0,1.3576708
37939,1.0,1.1750772
37949,1.0,0.8213244
37959,1.0,0.8116195
37969,1.0,0.72467405
37979,1.0,0.7507764
37989,1.0,0.49382937
37999,0.0,0.041723847
38009,0.0,0.48025143
38019,0.0,-0.1135031
38029,0.0,-0.51219976
38039,0.0,0.032200694
38049,0.0,0.058430076
38059,0.0,0.92527544
38069,0.0,1.2841182
38079,0.0,0.8467
38089,0.0,1.1738713
38099,0.0,1.1588693
38109,0.0,0.9914897
38119,0.0,1.5531031
38129,0.0,0.9695538
38139,0.0,0.5757813
38149,0.0,2.3545384
38159,0.0,3.0632877
38169,0.0,3.3988965
38179,0.0,4.2055655
38189,0.0,3.5335565
38199,0.0,3.6018202
38209,0.0,2.073303
38219,0.0,1.5619522
38229,0.0,1.2730092
38239,0.0,1.5123209
38249,0.0,1.0933784
38259,0.0,1.1926926
38269,0.0,0.5017123
38279,0.0,-0.21040666
38289,0.0,0.06370902
38299,0.0,0.35580695
38309,0.0,0.36825925
38319,0.0,-0.6051694
38329,0.0,0.15563864
38339,0.0,-0.024061024
38349,0.0,-0.09093392
38359,0.0,0.17681998
38369,0.0,-0.07741189
38379,0.0,0.12864852
38389,0.0,0.14312327
38399,0.0,-0.035404623
38409,0.0,-0.28600848
38419,0.0,-1.031146
38429,0.0,-0.20105445
38439,0.0,-0.082404196
38449,0.0,0.016372561
38459,0.0,-0.5140976
38469,0.0,0.27646995
38479,0.0,-0.63251996
38489,0.0,0.19843757
38499,0.0,-0.052526116
38509,0.0,-0.19015312
38519,0.0,0.2262789
38529,0.0,0.9254104
38539,0.0,0.48379612
38549,0.0,0.12757945
38559,0.0,0.62016356
38569,0.0,0.21376663
38579,0.0,0.09548807
38589,0.0,0.41282523
38599,0.0,0.43792522
38609,0.0,0.26653433
38619,0.0,0.65233845
38629,0.0,-0.20287752
38639,0.0,0.5699123
38649,0.0,0.07889104
38659,0.0,-0.3010552
38669,0.0,0.15914083
38679,0.0,0.39990264
38689,0.0,-0.035912633
38699,0.0,-0.14819992
38709,0.0,-0.55359834
38719,0.0,0.09292078
38729,0.0,0.35446244
38739,0.0,-0.083628416
38749,0.0,0.3439721
38759,0.0,0.34708905
38769,0.0,0.500964
38779,0.0,0.20524776
38789,0.0,0.37031305
38799,0.0,0.51036257
38809,0.0,0.77185225
38819,0.0,1.0230436
38829,0.0,1.3233666
38839,0.0,0.96225744
38849,0.0,0.9191538
38859,0.0,0.8645435
38869,0.0,0.37065518
38879,0.0,0.3277809
38889,0.0,0.3403089
38899,0.0,0.31417823
38909,0.0,-0.16616535
38919,0.0,0.11260325
38929,0.0,-0.2874614
38939,0.0,0.24843633
38949,0.0,-0.06379795
38959,0.0,-0.25045198
38969,0.0,-0.17781115
38979,0.0,-0.31150603
38989,0.0,0.20793027
38999,0.0,0.09110224
39009,0.0,0.2634511
39019,0.0,0.1121093
39029,0.0,-0.25744116
39039,0.0,0.04749453
39049,0.0,0.6003483
39059,0.0,-0.24727762
39069,0.0,0.1414305
39079,0.0,0.019931078
39089,0.0,0.480074
39099,0.0,1.3306296
39109,0.0,1.300703
39119,0.0,1.1139681
39129,0.0,2.7635589
39139,0.0,2.915181
39149,0.0,2.4699397
39159,0.0,3.251763
39169,0.0,5.318214
39179,0.0,5.728986
39189,0.0,6.4914713
39199,0.0,7.8847923
39209,0.0,4.9523168
39219,0.0,5.0986066
39229,0.0,4.2189436
39239,0.0,3.908827
39249,0.0,4.145648
39259,0.0,2.3459659
39269,0.0,1.7381333
39279,0.0,1.3080757
39289,0.0,1.2004876
39299,0.0,1.1876712
39309,0.0,0.6473073
39319,0.0,0.75679785
39329,0.0,0.90829873
39339,0.0,0.053489327
39349,0.0,0.43712175
39359,0.0,0.5125777
39369,0.0,-0.027519464
39379,0.0,0.5592738
39389,0.0,1.214586
39399,0.0,0.71772337
39409,0.0,0.07243705
39419,0.0,0.4463339
39429,0.0,-0.18771005
39439,0.0,-0.3986516
39449,0.0,-0.05730796
39459,0.0,0.11958015
39469,0.0,0.09032261
39479,0.0,-0.290972
39489,0.0,-0.5256029
39499,0.0,-0.067505956
39509,0.0,0.003532052
39519,0.0,0.042583942
39529,0.0,0.9869114
39539,0.0,0.31470215
39549,0.0,0.13160312
39559,0.0,0.089665234
39569,0.0,-0.027357697
39579,0.0,0.114029646
39589,0.0,-0.010663152
39599,0.0,0.25555438
39609,0.0,0.24553454
39619,0.0,-0.44912553
39629,0.0,0.12282646
39639,0.0,0.16374469
39649,0.0,0.088303566
39659,0.0,1.0359633
39669,0.0,0.4857043
39679,0.0,0.8390988
39689,0.0,1.5371795
39699,0.0,1.1975715
39709,0.0,0.34407508
39719,0.0,-0.056073785
39729,0.0,0.51614666
39739,0.0,-0.01975584
39749,0.0,-0.053159237
39759,0.0,0.17465955
39769,0.0,0.35725653
39779,0.0,0.2595564
39789,0.0,0.2266081
39799,0.0,0.75084233
39809,0.0,1.0186849
39819,0.0,2.0037096
39829,0.0,1.457365
39839,0.0,0.18574429
39849,0.0,0.026080012
39859,0.0,0.122262955
39869,0.0,0.08997166
39879,0.0,0.07074463
39889,0.0,0.15227246
39899,0.0,-0.33069575
39909,0.0,-0.89814293
39919,0.0,0.108724
39929,0.0,0.009718895
39939,0.0,0.2779073
39949,0.0,-0.04221785
39959,0.0,-0.1944766
39969,0.0,-0.4358951
39979,0.0,-0.165138
39989,0.0,-0.16609848
39999,0.0,0.38688225
40009,0.0,0.46812022
40019,0.0,0.36960608
40029,0.0,-0.15667951
40039,0.0,0.069521666
40049,0.0,0.2797699
40059,0.0,-0.12898016
40069,0.0,0.15456784
40079,0.0,-0.15535295
40089,0.0,-0.31612325
40099,0.0,-0.41602385
40109,0.0,-0.08160955
40119,0.0,-0.42810416
40129,0.0,-0.2141468
40139,0.0,-0.3660432
40149,0.0,-0.6547628
40159,0.0,-0.34149843
40169,0.0,0.048889756
40179,0.0,-0.2904548
40189,0.0,-0.12921655
40199,0.0,-0.6129732
40209,0.0,0.18735611
40219,0.0,-0.030378342
40229,0.0,0.43613708
40239,0.0,0.32541478
40249,0.0,0.48958862
40259,0.0,-0.074376225
40269,0.0,0.2372837
40279,0.0,-0.3495071
40289,0.0,-0.21526861
40299,0.0,-0.574945
40309,0.0,-0.2878157
40319,0.0,-0.3293109
40329,0.0,0.011806726
40339,0.0,-0.03931755
40349,0.0,0.36205804
40359,0.0,0.4079877
40369,0.0,0.1360302
40379,0.0,0.5414753
40389,0.0,-0.3553809
40399,0.0,0.057386994
40409,0.0,-0.028645873
40419,0.0,0.047971845
40429,0.0,-0.00455451
40439,0.0,-0.48454487
40449,0.0,0.19993067
40459,0.0,-0.92981416
40469,0.0,0.709035
40479,0.0,0.25301158
40489,0.0,-0.9883932
40499,0.0,0.04312265
40509,0.0,-0.62828314
40519,0.0,-0.02354765
40529,0.0,-0.37427318
40539,0.0,-0.37681246
40549,0.0,-0.058265448
40559,0.0,-0.20320463
40569,0.0,0.116632104
40579,1.0,0.2879945
40589,1.0,0.38318247
40599,1.0,0.21662343
40609,1.0,0.6759313
40619,1.0,1.0670947
40629,1.0,1.0935116
40639,1.0,1.1036658
40649,1.0,1.6665753
40659,1.0,2.3782196
40669,1.0,3.9599695
40679,1.0,2.9930573
40689,1.0,5.262727
40699,1.0,3.5879707
40709,1.0,4.597476
40719,1.0,4.8771973
40729,1.0,4.687524
40739,1.0,6.4776497
40749,1.0,6.621046
40759,1.0,6.982051
40769,1.0,7.3666654
40779,1.0,11.293606
40789,1.0,13.492416
40799,1.0,13.781782
40809,1.0,13.284419
40819,1.0,9.664469
40829,1.0,5.5593495
40839,1.0,3.6866512
40849,1.0,3.4412773
40859,1.0,2.4014764
40869,1.0,2.3532825
40879,1.0,1.1484127
40889,1.0,1.3507248
40899,1.0,0.8959588
40909,1.0,0.43682313
40919,1.0,1.1178306
40929,1.0,1.1908712
40939,1.0,1.8245459
40949,1.0,3.1805353
40959,1.0,3.2608953
40969,1.0,6.4838305
40979,1.0,7.0430264
40989,1.0,11.519157
40999,1.0,12.783829
41009,1.0,13.7542
41019,1.0,13.387463
41029,1.0,9.581419
41039,1.0,8.918292
41049,1.0,5.73443
41059,1.0,5.2365127
41069,1.0,5.2500234
41079,1.0,4.6515827
41089,1.0,4.354945
41099,1.0,3.42209
41109,1.0,2.695739
41119,1.0,2.785586
41129,1.0,2.6994002
41139,1.0,2.0151846
41149,1.0,2.2548895
41159,1.0,1.5698127
41169,1.0,1.1256512
41179,1.0,1.4273782
41189,1.0,0.6985008
41199,1.0,0.21864152
41209,1.0,0.58693993
41219,0.0,0.5964526
41229,0.0,0.47823822
41239,0.0,0.5982344
41249,0.0,1.1538061
41259,0.0,-0.1427899
41269,0.0,0.122702
41279,0.0,-0.6062282
41289,0.0,0.08147806
41299,0.0,0.14811194
41309,0.0,0.20201224
41319,0.0,-0.14256549
41329,0.0,-0.32559097
41339,0.0,0.5632416
41349,0.0,-0.53417885
41359,0.0,-0.4343139
41369,0.0,-0.1924156
41379,0.0,-0.01816225
41389,0.0,-0.9475601
41399,0.0,-0.31304562
41409,0.0,0.19576383
41419,0.0,-0.18721586
41429,0.0,-0.26671612
41439,0.0,-0.33320904
41449,0.0,-0.45068944
41459,0.0,-0.14959168
41469,0.0,-0.0063046217
41479,0.0,0.59996706
41489,0.0,1.038887
41499,0.0,1.8416216
41509,0.0,0.9869057
41519,0.0,0.5638958
41529,0.0,0.50476503
41539,0.0,0.5613834
41549,0.0,0.74853754
41559,0.0,1.0397267
41569,0.0,1.3428042
41579,0.0,0.38145018
41589,0.0,0.32690424
41599,0.0,-0.07502985
41609,0.0,-0.10569966
41619,0.0,-0.19968092
41629,0.0,0.09613037
41639,0.0,-0.15415758
41649,0.0,-0.59530544
41659,0.0,-0.7259385
41669,0.0,0.0745306
41679,0.0,0.1014694
41689,0.0,-0.26342082
41699,0.0,-0.028522074
41709,0.0,-0.20091224
41719,0.0,0.35392153
41729,0.0,0.20883435
41739,0.0,0.34273088
41749,0.0,0.19404173
41759,0.0,0.42665166
41769,0.0,1.3732903
41779,0.0,0.011237383
41789,0.0,0.30885708
41799,0.0,0.3351931
41809,0.0,0.63067245
41819,0.0,-0.0760231
41829,0.0,0.4515971
41839,0.0,1.474868
41849,0.0,1.0530674
41859,0.0,0.7859112
41869,0.0,0.97681737
41879,0.0,1.0141902
41889,0.0,0.31614703
41899,0.0,0.16090608
41909,0.0,0.27842355
41919,0.0,-0.19801116
41929,0.0,0.4107548
41939,0.0,0.1325109
41949,0.0,-0.19819802
41959,0.0,-0.020819902
41969,0.0,-0.23543811
41979,0.0,-0.5393106
41989,0.0,-0.16415566
41999,0.0,-0.43101776
42009,0.0,0.0052065253
42019,0.0,-0.055236578
42029,0.0,0.17334408
42039,0.0,0.90576506
42049,0.0,1.3313949
42059,0.0,1.3075081
42069,0.0,1.5052855
42079,0.0,1.2589946
42089,0.0,1.9705135
42099,0.0,1.2591221
42109,0.0,0.99294275
42119,0.0,1.7543678
42129,0.0,1.8983164
42139,0.0,1.2766006
42149,0.0,0.9836015
42159,0.0,1.5702062
42169,0.0,1.3065732
42179,0.0,0.8691747
42189,0.0,0.41571975
42199,0.0,0.18065321
42209,0.0,0.08864355
42219,0.0,0.35188967
42229,0.0,-0.065383315
42239,0.0,-0.20152009
42249,0.0,-0.7481134
42259,0.0,-0.09201908
42269,0.0,-0.16350317
42279,0.0,-0.26434612
42289,0.0,0.45340097
42299,0.0,0.6161949
42309,0.0,-0.16544348
42319,0.0,0.57465553
42329,0.0,-0.41922498
42339,0.0,0.5061774
42349,0.0,-0.3635121
42359,0.0,-0.38413942
42369,0.0,0.1256721
42379,0.0,0.60013753
42389,0.0,0.016759634
42399,0.0,0.27123594
42409,0.0,0.51557827
42419,0.0,0.6289724
42429,0.0,0.39611048
42439,0.0,0.29788768
42449,0.0,1.252179
42459,0.0,0.031894088
42469,0.0,-0.09926289
42479,0.0,-0.29001534
42489,0.0,-0.21974659
42499,0.0,0.53718257
42509,0.0,0.37426317
42519,0.0,-0.1586467
42529,0.0,-0.06498146
42539,0.0,-0.16268086
42549,0.0,0.489955
42559,0.0,-0.11096901
42569,0.0,0.11433399
42579,0.0,0.48611474
42589,0.0,-0.22834563
42599,0.0,-0.29978502
42609,0.0,-0.84675467
42619,0.0,-0.6253975
42629,0.0,-0.50479925
42639,0.0,-0.40863597
42649,0.0,0.14003265
42659,0.0,0.19805664
42669,0.0,0.38167596
42679,0.0,0.5778773
42689,0.0,0.38141197
42699,0.0,-0.14822435
42709,0.0,-0.10761821
42719,0.0,0.25278443
42729,0.0,0.3665396
42739,0.0,0.49877644
42749,0.0,-0.045992255
42759,0.0,-0.2114942
42769,0.0,0.21360278
42779,0.0,-0.29391932
42789,0.0,-0.07744259
42799,0.0,-0.2044838
42809,0.0,-0.22000825
42819,0.0,-0.024246216
42829,0.0,-0.60189843
42839,0.0,0.03348708
42849,0.0,-0.012652874
42859,0.0,-0.015515864
42869,0.0,0.3356762
42879,0.0,0.20528889
42889,0.0,0.5040002
42899,0.0,0.13712728
42909,0.0,0.80245805
42919,0.0,0.46596432
42929,0.0,0.19417465
42939,0.0,0.24047244
42949,0.0,0.5494105
42959,0.0,1.4465258
42969,0.0,3.2528994
42979,0.0,3.177548
42989,0.0,2.7294717
42999,0.0,2.8238475
43009,0.0,2.1207469
43019,0.0,2.3972254
43029,0.0,1.4888421
43039,0.0,0.56662834
43049,0.0,0.89999306
43059,0.0,0.96131885
43069,0.0,0.5352595
43079,0.0,0.82159305
43089,0.0,1.1314157
