T,S,Score
999,0,12.32353537143354
1009,0,12.704455217900762
1019,0,12.723623890950318
1029,0,12.828778804012213
1039,0,13.03401260191858
1049,0,13.009200201286616
1059,0,12.96578501212572
1069,0,12.842972646608597
1079,0,12.890805842392874
1089,0,13.08587374053598
1099,0,12.333019784318523
1109,0,12.195496791401869
1119,0,11.700402310329594
1129,0,11.309785837995431
1139,0,11.028623332081999
1149,0,10.741464577857561
1159,0,10.582329504550682
1169,0,10.001337292303502
1179,0,9.741600326451803
1189,0,9.302652939520351
1199,0,8.842606367156415
1209,0,8.46723754331517
1219,0,8.114146566291508
1229,0,7.769361338068613
1239,0,7.693480074557138
1249,0,7.189281425215236
1259,0,7.245453832303767
1269,0,6.846255161322473
1279,0,6.117667581836349
1289,0,6.259480659384519
1299,0,6.308052922811083
1309,0,5.798210591950096
1319,0,5.780773649437266
1329,0,5.660985112854485
1339,0,5.288906407291363
1349,0,5.028842214674196
1359,0,4.683906719383689
1369,0,4.575681628233147
1379,0,4.47765821435026
1389,0,3.88078413235435
1399,0,3.8809630651602376
1409,0,3.5345756678424864
1419,0,3.097759749221516
1429,0,3.065449460350685
1439,0,2.921100228484097
1449,0,2.856171777994848
1459,0,2.229365923873661
1469,0,2.181568652294754
1479,0,2.0844075824246024
1489,0,1.9103397759704497
1499,0,1.6955181993615929
1509,0,1.4797169857524506
1519,0,1.4668414309648772
1529,0,1.1526484679786617
1539,0,0.7995604874458289
1549,0,0.7968699603295468
1559,0,0.8366935288394738
1569,0,0.6497294164551934
1579,0,0.6336237353264472
1589,0,0.43624410213273224
1599,0,0.6873245151485737
1609,0,0.8113973487136114
1619,0,1.1012167485096773
1629,0,1.2263139640638372
1639,0,1.5534414927994105
1649,0,1.969014531977023
1659,0,2.101014271939378
1669,0,2.796716130503505
1679,0,2.6493141510958793
1689,0,2.6395669936452877
1699,0,2.5172491622968174
1709,0,2.761671079897883
1719,0,2.7004664179474434
1729,0,2.887410394595305
1739,0,3.001446731760779
1749,0,3.2258308865580902
1759,0,2.9396656443235645
1769,0,3.4779795799469175
1779,0,3.207528177106827
1789,0,3.144352996347964
1799,0,3.2985322112592073
1809,0,2.941510321228779
1819,0,3.269651039840256
1829,0,3.2293669958644244
1839,0,3.069983536411689
1849,0,3.538330015644301
1859,0,2.7432467804382252
1869,0,3.0876723737660736
1879,0,2.705615862377563
1889,0,2.743594251393591
1899,0,2.6118775084097807
1909,0,2.511742561456067
1919,0,2.6462702132537466
1929,0,2.94889455673281
1939,0,2.628400560900109
1949,0,3.3891837597948484
1959,0,2.9235364454522825
1969,0,3.2898798194746455
1979,0,3.3273629563843983
1989,0,3.7403138859182863
1999,0,3.64886932326762
2009,0,4.212377546851047
2019,0,4.027451021095291
2029,0,3.9217219273998882
2039,0,4.284194731530421
2049,0,4.474714882252712
2059,0,4.734263666612588
2069,0,4.762529276773092
2079,0,4.5173477048876896
2089,0,4.9509705421751855
2099,0,5.6345333484842826
2109,0,5.610997847089404
2119,0,6.1077364627279715
2129,0,5.83792572855221
2139,0,6.293669736231753
2149,0,6.612174246018702
2159,0,6.894773596831017
2169,0,6.969105332092996
2179,0,7.465735787905732
2189,0,7.495461244940113
2199,0,7.932648959627828
2209,0,8.006855969676025
2219,0,8.05273387083186
2229,0,8.346651487289968
2239,0,8.033100820360856
2249,0,8.394773769197013
2259,0,8.570090779907277
2269,0,8.932705837723377
2279,0,9.083419882432885
2289,0,9.251606448497828
2299,0,9.521033406465413
2309,0,10.001101569565748
2319,0,9.904525340775002
2329,0,10.02010962458044
2339,0,10.154471617635696
2349,0,10.408919313772895
2359,0,10.37704097154647
2369,0,10.579079373510528
2379,0,10.333806808689495
2389,0,10.389514047192689
2399,0,10.660602761609397
2409,0,10.856734950384212
2419,0,11.050809342730698
2429,0,11.285977448555375
2439,0,11.391412984628662
2449,0,11.680964497829667
2459,0,11.948323735842159
2469,0,12.115941514473626
2479,0,12.342670114403592
2489,0,12.542478256088872
2499,0,12.68726877482576
2509,0,12.80520878284241
2519,0,12.825626876818188
2529,0,12.873120328119295
2539,0,12.858461741139488
2549,0,12.924453844688617
2559,0,12.77006900038523
2569,0,12.607375131557548
2579,0,11.584252561490697
2589,0,11.55231033728285
2599,0,10.710279174823718
2609,0,10.120799855150338
2619,0,9.478902896248723
2629,0,8.916125018144768
2639,0,8.31350566143503
2649,0,7.800626000965355
2659,0,7.333964197434314
2669,0,6.840585125922449
2679,0,6.210936249745757
2689,0,6.048483564727546
2699,0,5.598513889090765
2709,0,5.415034618615643
2719,0,4.701371439078523
2729,0,4.338474901711354
2739,0,4.246243656917558
2749,0,3.980928373765244
2759,0,3.171437571546705
2769,0,2.807736234291146
2779,0,2.5609157453182023
2789,0,2.2450568470516257
2799,0,1.917408349732524
2809,0,1.4106143480270066
2819,0,1.1966830963259691
2829,0,1.1168506571218004
2839,0,1.0689025741308429
2849,0,0.830126623024933
2859,0,0.6603806385727401
2869,0,0.6312119395512851
2879,0,0.5593357558177635
2889,0,0.5597677352873619
2899,0,0.5427399014364266
2909,0,0.5192296032219659
2919,0,0.5172592886981351
2929,0,0.6347311138895868
2939,0,0.850370943649975
2949,0,1.1180279498106551
2959,0,1.3751426961428037
2969,0,1.6870342825006808
2979,0,2.2128546814844947
2989,0,2.964948996193664
2999,0,3.8515406634072757
3009,0,4.875029749122474
3019,0,4.967039146954192
3029,0,6.4010041320808515
3039,0,7.795100728643147
3049,0,8.835259891881908
3059,0,9.736146086347976
3069,0,10.16646903632805
3079,0,10.751954999318267
3089,0,11.131994585465318
3099,0,11.686994863162026
3109,0,11.819686330480994
3119,0,12.000933381221078
3129,0,11.682103096072467
3139,0,11.497100575904124
3149,0,11.044063231954505
3159,0,10.317036807058194
3169,0,9.828424006928712
3179,0,8.811064787756528
3189,0,7.829823987202645
3199,0,7.344570672779279
3209,0,5.832079307236295
3219,0,4.73372423318038
3229,0,3.729823648337584
3239,0,3.4658109965399966
3249,0,2.780164442570622
3259,0,2.106693904604776
3269,0,1.7555386483090878
3279,0,1.3655143075091472
3289,0,1.1590887088651665
3299,0,0.9302071629181603
3309,0,0.7960664613616226
3319,0,0.6369832121573604
3329,0,0.46788738090046256
3339,0,0.4474090044203245
3349,0,0.33585374509355426
3359,0,0.321550511358772
3369,0,0.4049488169639326
3379,0,0.4451648968815686
3389,0,0.5629896746859717
3399,0,0.79337452788636
3409,0,0.7352974686637783
3419,0,1.3255677679253033
3429,0,1.4233582087617909
3439,0,1.9839225956904065
3449,0,2.2753736394097226
3459,0,2.56041157113852
3469,0,2.4595707345980995
3479,0,3.003796890427804
3489,0,3.665333422091165
3499,0,3.8601319549598427
3509,0,4.117504363091854
3519,0,4.522890729949857
3529,0,5.309632357811364
3539,0,5.401024172965265
3549,0,5.843723300094787
3559,0,6.138378823741549
3569,0,6.681656841567174
3579,0,6.870122997519825
3589,0,7.472327241085772
3599,0,7.794152655846515
3609,0,8.333827644114706
3619,0,8.792359275907504
3629,0,9.057796101869208
3639,0,9.247491693581242
3649,0,9.366748445414203
3659,0,9.544523111916822
3669,0,9.452261879976007
3679,0,9.720832605277478
3689,0,9.762850919818762
3699,0,9.63696395231704
3709,0,9.685884311590495
3719,0,9.579463600503903
3729,0,9.495008467820458
3739,0,9.757503384467718
3749,0,9.933490492302784
3759,0,10.221394220065113
3769,0,10.496787246541395
3779,0,10.59974385497053
3789,0,10.955804486220298
3799,0,11.337415016968286
3809,0,11.39866403654213
3819,0,11.794948524436306
3829,0,11.94712445378286
3839,0,12.330634385538776
3849,0,12.451541685300707
3859,0,12.740544465781156
3869,0,12.88199969534314
3879,0,12.953656869023657
3889,0,13.01492140840044
3899,0,12.976262603193668
3909,0,12.790883385871005
3919,0,12.287810278607418
3929,0,12.027693793728123
3939,0,11.330138499365876
3949,0,10.856831809789892
3959,0,10.033300715109965
3969,0,9.20847743926733
3979,0,8.727898559609736
3989,0,7.978778829213361
3999,0,7.2465091915888875
4009,0,6.704647983445341
4019,0,5.892060043105518
4029,0,5.352063704035762
4039,0,4.34204638479329
4049,0,3.5404429733111358
4059,0,3.2636663180747565
4069,0,2.3605393707032323
4079,0,1.9077589755284263
4089,0,1.3901075963942022
4099,0,1.030970456875879
4109,0,1.0506611454488195
4119,0,0.604093049682118
4129,0,0.41560877370462657
4139,0,0.3157373205123647
4149,0,0.3994294143002577
4159,0,0.2676349908034815
4169,0,0.11071112298428465
4179,0,0.19250533611379927
4189,0,0.20878029744274695
4199,0,0.2572371539543594
4209,0,0.25058017954995826
4219,0,0.5651783088687192
4229,0,0.7093286020189759
4239,0,0.8021763950572535
4249,0,1.0918428091001597
4259,0,1.203027536260226
4269,0,1.2941204112272067
4279,0,1.7413645365824717
4289,0,1.9991760058085049
4299,0,2.2457607950310976
4309,0,2.628556287892379
4319,0,3.354112226180084
4329,0,3.9245544887027775
4339,0,5.115810492249985
4349,0,5.308842429920284
4359,0,6.54581455250838
4369,0,7.3896266514220255
4379,0,8.06952485366972
4389,0,8.83235459077429
4399,0,9.3545655799203
4409,0,10.216883493429487
4419,0,11.4373883499099
4429,0,11.869685838350946
4439,0,12.412316943403095
4449,0,12.755090166659066
4459,0,13.130159801951532
4469,0,13.089518151086946
4479,0,12.870286230041017
4489,0,12.81785129772707
4499,0,12.3472020069315
4509,0,11.652051623561169
4519,0,10.922817696355114
4529,0,10.466451866001316
4539,0,9.576384635012433
4549,0,8.426018631583819
4559,0,7.586361236711135
4569,0,7.145028250801884
4579,0,6.477728728770635
4589,0,5.92330666919703
4599,0,5.428180189512287
4609,0,5.236796172293153
4619,0,4.9754416930449645
4629,0,4.928195634041375
4639,0,4.877369516621687
4649,0,4.615706749823494
4659,0,4.332474514272217
4669,0,4.345723893971405
4679,0,4.204512563092479
4689,0,4.051497678564078
4699,0,3.9265558259574647
4709,0,3.9622021933296234
4719,0,3.524646553290083
4729,0,3.1163169016256997
4739,0,2.9362630375352117
4749,0,2.4039537515367893
4759,0,1.6544361293348127
4769,0,1.8977773860772769
4779,0,1.249138364762438
4789,0,1.071750090679095
4799,0,0.8236477213725546
4809,0,0.7059057977978372
4819,0,0.619531519245077
4829,0,0.355174525954832
4839,0,0.2072011792453533
4849,0,0.2568274781503298
4859,0,0.12744403177947827
4869,0,0.14136976926695888
4879,0,0.13439303359872823
4889,0,0.0663437793937115
4899,0,0.23688526665686527
4909,0,0.21264995996706948
4919,0,0.40364601962333135
4929,0,0.36630481042752516
4939,0,0.8181113553094328
4949,0,0.9738987486105934
4959,0,1.2439813077734576
4969,0,1.7081668354678263
4979,0,1.8887476071356566
4989,0,2.306505210826466
4999,0,2.3692952363237643
5009,0,2.34123084207957
5019,0,2.5065427339289905
5029,0,2.7365440405493437
5039,0,2.868599528746101
5049,0,2.830549288626582
5059,0,3.2987333153184415
5069,0,3.522989059779226
5079,0,3.7689690892960135
5089,0,4.510844558814902
5099,0,5.009383477184118
5109,0,5.313215158394803
5119,0,5.9004795168134745
5129,0,6.9831507415865675
5139,0,7.803292395322085
5149,0,8.555708874814052
5159,0,8.934893451480894
5169,0,9.343997562260363
5179,0,9.457872211919858
5189,0,9.96326779604179
5199,0,10.128267894780684
5209,0,10.346895602723793
5219,0,10.318537149151101
5229,0,10.14562016841996
5239,0,9.906805678560882
5249,0,9.174034792854169
5259,0,8.755790131670873
5269,0,8.289052109314595
5279,0,7.865183686745052
5289,0,7.512361900329738
5299,0,6.896687406999875
5309,0,6.49162779441211
5319,0,6.241974580365343
5329,0,5.936217576707977
5339,0,5.430073295910042
5349,0,5.0136131180249635
5359,0,4.860772482394691
5369,0,4.471090221054798
5379,0,4.257868223754931
5389,0,3.9710094350101075
5399,0,3.888312472619037
5409,0,3.6886448913606906
5419,0,3.2257970597622707
5429,0,3.5374662195556175
5439,0,3.044056151298437
5449,0,3.232816807114816
5459,0,3.3932594736535813
5469,0,3.336291563244893
5479,0,3.2603755539893635
5489,0,4.08414159354485
5499,0,4.106364177764191
5509,0,4.369483991932813
5519,0,4.901530202777025
5529,0,5.168519027325544
5539,0,5.272626271030546
5549,0,5.883171560644002
5559,0,5.83244872297056
5569,0,5.976856208444328
5579,0,5.649223108549636
5589,0,5.208266477624509
5599,0,5.208811479337206
5609,0,5.044846700950233
5619,0,4.72898604923357
5629,0,4.442939943070977
5639,0,3.9325920793938476
5649,0,4.15797911147713
5659,0,3.9364442003414863
5669,0,3.8652770197792368
5679,0,3.727197655718658
5689,0,3.718277930694822
5699,0,3.5415628806623154
5709,0,3.682977611344622
5719,0,4.109933232198009
5729,0,3.993630468931792
5739,0,4.514186958524107
5749,0,4.9548034754149235
5759,0,4.776712077779255
5769,0,4.980124388388224
5779,0,4.760943545371925
5789,0,4.69285917333856
5799,0,4.56838489749075
5809,0,4.546775827097116
5819,0,4.858376391665278
5829,0,4.825567660953988
5839,0,4.977149537741113
5849,0,4.888852851350649
5859,0,4.937048441486428
5869,0,4.852420040084309
5879,0,4.771871722725852
5889,0,4.949388901599311
5899,0,5.239408304114795
5909,0,5.192039956259135
5919,0,5.216721877423971
5929,0,5.35849540610011
5939,0,5.5319335687938604
5949,0,5.5852446889684195
5959,0,5.958965499997991
5969,0,6.286705293995585
5979,0,6.20913223861928
5989,0,6.525806654814391
5999,0,6.975538825002506
6009,0,7.531503220692207
6019,0,7.844049413862884
6029,0,7.955680328890139
6039,0,8.059719670130576
6049,0,8.559273939420958
6059,0,8.626735849355496
6069,0,8.699392374330401
6079,0,8.64431790578064
6089,0,8.550916352720115
6099,0,8.48697229697864
6109,0,8.068090241650093
6119,0,7.202719617874437
6129,0,6.711653100471118
6139,0,6.2944024472406666
6149,0,6.0007925856904265
6159,0,5.691486775534135
6169,0,5.067475196513562
6179,0,4.294215627107786
6189,0,3.639179346768133
6199,0,2.6821251478668926
6209,0,2.5209003103073018
6219,0,1.9398359552733073
6229,0,1.764797424649906
6239,0,1.3335480221206564
6249,0,1.0357092767776304
6259,0,0.7609004587199683
6269,0,0.7682124796340271
6279,0,0.6211218496731098
6289,0,0.4524109232592508
6299,0,0.6108532177063608
6309,0,0.7620228399673652
6319,0,0.8250476980700222
6329,0,0.9314537685408125
6339,0,0.9475068384695763
6349,0,1.1978416122796323
6359,0,1.0872677787653053
6369,0,1.4687270993390835
6379,0,1.7123022995776926
6389,0,2.1871823673140995
6399,0,2.3047073037644203
6409,0,2.81797885770072
6419,0,3.022601481136242
6429,0,3.3344717326960547
6439,0,3.591965604703942
6449,0,4.127551934116287
6459,0,4.4840537584946185
6469,0,5.0193872037536735
6479,0,5.289949809264713
6489,0,5.6394324693819495
6499,0,6.0180503924462805
6509,0,6.539256561948366
6519,0,6.96762201333161
6529,0,7.331810030042942
6539,0,7.887953581890798
6549,0,8.284309718578928
6559,0,8.970241956595654
6569,0,9.444215477111204
6579,0,9.90473763003712
6589,0,10.418715610616767
6599,0,10.903536244914212
6609,0,11.284475067983657
6619,0,11.806223676057918
6629,0,11.934781607433358
6639,0,12.229221122793135
6649,0,12.440533061564095
6659,0,12.427455297785022
6669,0,12.318207968907341
6679,0,12.210178242977635
6689,0,12.159215270799308
6699,0,11.692105017169384
6709,0,11.055666375070336
6719,0,10.296206481317704
6729,0,9.484964532941282
6739,0,8.923660559436279
6749,0,8.15626452817264
6759,0,7.587964549863742
6769,0,7.036577072121288
6779,0,6.156724245774372
6789,0,5.678262681322121
6799,0,5.350103651316393
6809,0,4.849610924822475
6819,0,4.136106723446183
6829,0,3.7739962202381
6839,0,3.4384437413160285
6849,0,2.8722642440257418
6859,0,2.605812662870946
6869,0,2.063938690207558
6879,0,1.9378061896377416
6889,0,1.547447934163933
6899,0,1.3594128423413674
6909,0,1.214273722396682
6919,0,1.1032341272665451
6929,0,0.8543503165796956
6939,0,0.6202246258096322
6949,0,0.6574396856213011
6959,0,0.4751048774402141
6969,0,0.5010810322581956
6979,0,0.4474926671233763
6989,0,0.4996243569391904
6999,0,0.5307677747834559
7009,0,0.6096330433680454
7019,0,0.8551182466136878
7029,0,1.1364587401607968
7039,0,1.3173279553137176
7049,0,1.4429307252926051
7059,0,1.6567455888631293
7069,0,2.1610724055840587
7079,0,2.110667168679519
7089,1,0.8996098365336938
7099,1,0.6644560187024569
7109,1,1.1777210745511315
7119,1,1.105400764713127
7129,1,1.7133711852702067
7139,1,1.602831108897476
7149,1,1.8239112623135165
7159,1,1.9344513382746609
7169,1,2.7082318734998783
7179,1,2.929312026429653
7189,1,3.5372824475419113
7199,1,3.4267423705404925
7209,1,4.089982829357016
7219,1,3.868902676416522
7229,1,4.311062982292697
7239,1,4.532143135230816
7249,1,4.6979532499344465
7259,1,5.63754389992122
7269,1,5.9138940910938285
7279,1,5.416463746983144
7289,1,5.858624052859328
7299,1,5.748083976390264
7309,1,6.024434167562887
7319,1,6.356054396970002
7329,1,7.185104970487833
7339,1,7.240375008722352
7349,1,7.2956450469568725
7359,1,7.903615467536667
7369,1,8.179965658709255
7379,1,8.40104581164732
7389,1,8.732666041063062
7399,1,9.009016232227047
7409,1,8.8984761557614
7419,1,9.893336843979396
7429,1,9.561716614572351
7439,1,9.948606882213918
7449,1,9.72752672927583
7459,1,10.832927493966453
7469,1,10.446037226324618
7479,1,10.83292749396635
7489,1,11.275087799842439
7499,1,11.71724810571883
7509,1,12.104138373360268
7519,1,12.214678449831126
7529,1,12.380488564533021
7539,1,12.877918908643572
7549,1,13.264809176285222
7559,1,13.320079214519764
7569,1,13.706969482165249
7579,1,13.596429405692167
7589,1,13.209539138050701
7599,1,13.209539138044592
7609,1,12.998628594453557
7619,1,13.056544665747467
7629,1,12.149777841621614
7639,1,10.949440924737274
7649,1,9.405594225219268
7659,1,7.154278235411178
7669,1,5.223812541802458
7679,1,6.050365055566964
7689,1,2.7288692005239037
7699,1,1.7475730472099333
7709,1,1.7568770848240924
7719,1,1.038992280535727
7729,1,0.8371128462289631
7739,1,0.8857628814731711
7749,1,0.9989662541794704
7759,1,1.739032865022155
7769,1,1.9404529391929437
7779,1,1.9583303291502627
7789,1,2.716066545550645
7799,1,2.9601073299578666
7809,1,2.174652232541791
7819,1,2.890180557929871
7829,1,3.3106525060370617
7839,1,3.408810654036086
7849,1,4.126508513561983
7859,1,4.201392969641717
7869,1,4.096933528667991
7879,1,4.235998103025363
7889,1,5.037914394917264
7899,1,4.799639377661034
7909,1,5.4083736260408255
7919,1,6.744078832767861
7929,1,6.612248824656589
7939,1,6.845140768622505
7949,1,7.211658461107377
7959,1,7.224209588415375
7969,1,8.511288969523118
7979,1,8.344505025944095
7989,1,9.178067220390577
7999,1,9.160116744267011
8009,1,9.398076080793885
8019,1,9.674515107802616
8029,1,9.912665570464902
8039,1,10.964903036896008
8049,1,11.08209142369969
8059,1,11.363095104421934
8069,1,11.671332070193541
8079,1,11.878172886046299
8089,1,11.961476881777514
8099,1,12.42201829936208
8109,1,12.013767980737946
8119,1,12.137742905562929
8129,1,11.79844163098769
8139,1,12.066115892473839
8149,1,11.87053333826889
8159,1,11.700931023438509
8169,1,11.61456958696392
8179,1,11.347130990755641
8189,1,11.528278534844663
8199,1,11.090920790206972
8209,1,11.638211428180194
8219,1,11.423777688120419
8229,1,11.515118490690986
8239,1,11.51862825722375
8249,1,11.33507583247919
8259,1,11.086687007567459
8269,1,11.279694004055155
8279,1,10.528140745684961
8289,1,10.988125842707511
8299,1,11.093554560318296
8309,1,10.366205930585396
8319,1,10.19731221243717
8329,1,10.660182296552506
8339,1,10.469686204928006
8349,1,10.585351832878704
8359,1,10.333906751070009
8369,1,10.890457272001814
8379,1,10.404299759405832
8389,1,10.253808571343146
8399,1,9.984318806782852
8409,1,9.505931692189586
8419,1,9.841639660335558
8429,1,9.915929901177918
8439,1,10.234283049915227
8449,1,10.41627859534465
8459,1,10.259790050788334
8469,1,10.10339909663011
8479,1,10.796244182498645
8489,1,10.374503558737267
8499,1,10.1009300258475
8509,1,9.421413280392468
8519,1,9.548457699631047
8529,1,8.940751267654392
8539,1,8.80012092604871
8549,1,8.942955416131692
8559,1,8.809090059627
8569,1,9.057970499079866
8579,1,8.684348714486443
8589,1,8.694673791106478
8599,1,8.859573615512879
8609,1,8.975242580227418
8619,1,8.878196043919438
8629,1,8.728208132682685
8639,1,9.109848856528217
8649,1,9.711308039949506
8659,1,9.654850047994515
8669,1,9.662682871117223
8679,1,9.451252316121215
8689,1,9.29097956511475
8699,1,9.010404693416305
8709,1,9.088668772533486
8719,1,9.233634675518235
8729,1,9.351504746190034
8739,1,9.957136848902254
8749,1,9.83730990462473
8759,1,9.470521932272632
8769,1,9.84715980299831
8779,1,9.580450535185332
8789,1,9.502502830224199
8799,1,9.761860188251237
8809,1,10.08913093930037
8819,1,9.801682180715133
8829,1,9.714870187374332
8839,1,9.870370021424147
8849,1,10.0682108069486
8859,1,10.31992171264929
8869,1,9.879891777840065
8879,1,10.397098457254048
8889,1,10.413134685972246
8899,1,10.023675132771942
8909,1,10.00605774800091
8919,1,10.09173203308301
8929,1,9.889529057602637
8939,1,9.767788326564851
8949,1,9.572727266780486
8959,1,9.129115609568238
8969,1,8.684013233929958
8979,1,8.462597664285168
8989,1,8.452484661550896
8999,1,8.449390869516685
9009,1,8.20766715874182
9019,1,8.657316030458771
9029,1,8.778976372270026
9039,1,8.467733556997397
9049,1,8.39156377112678
9059,1,8.492637249232144
9069,1,8.343934220818273
9079,1,7.98829668039114
9089,1,8.16613446672691
9099,1,8.167153593869836
9109,1,7.832290366997507
9119,1,7.978529851088064
9129,1,8.397099816096752
9139,1,8.203436161113581
9149,1,8.460010437434079
9159,1,8.40535685408119
9169,1,8.164297994095165
9179,1,7.908966304919957
9189,1,7.955730554403615
9199,1,8.095664593855473
9209,1,8.019532090558712
9219,1,7.947700264156003
9229,1,7.781999120279792
9239,1,7.313824270190841
9249,1,7.103786168988317
9259,1,6.99091215588475
9269,1,7.380993139855457
9279,1,7.516184340119176
9289,1,7.337695353575565
9299,1,7.38068699207914
9309,1,7.421929225545362
9319,1,7.288650573882972
9329,1,6.831413737199423
9339,1,6.9470906116767726
9349,1,7.127846427482558
9359,1,7.116037752309358
9369,1,7.185476407639017
9379,1,7.122613266239538
9389,1,7.015473895027832
9399,1,7.287686017620814
9409,1,7.2660336932389304
9419,1,7.2937347945872
9429,1,7.227206801446279
9439,1,7.173077390055312
9449,1,7.005959095391931
9459,1,6.825616551626885
9469,1,6.924950969337399
9479,1,6.875317261005259
9489,1,6.454287406236734
9499,1,6.66142500726883
9509,1,6.78352608053412
9519,1,6.8208106812058436
9529,1,6.659946074528666
9539,1,6.073603867002006
9549,1,5.9708302568425395
9559,1,5.603170247959874
9569,1,5.5619586854636145
9579,1,5.3851689647757395
9589,1,5.218312179975346
9599,1,5.461860609833677
9609,1,5.277636910480027
9619,1,5.192573818094701
9629,1,5.1665306506947015
9639,1,5.141756109505438
9649,1,4.837515952455142
9659,1,4.427259377236032
9669,1,4.976633597629746
9679,1,4.841881802892596
9689,1,5.330686158648589
9699,1,4.969501666518636
9709,1,5.376469581719104
9719,1,5.101037746567238
9729,1,4.6571770388764735
9739,1,4.73120487652446
9749,1,4.231079732366403
9759,1,4.146426206377545
9769,1,3.8812169270825865
9779,1,3.796091826710539
9789,1,3.8254701014117463
9799,1,4.322814865610152
9809,1,3.8274639746129546
9819,1,4.1297246331407935
9829,1,4.218389925839399
9839,1,4.16411287720698
9849,1,4.549436295097319
9859,1,4.357636325368145
9869,1,4.303731766687882
9879,1,3.621272382357449
9889,1,3.739205150117554
9899,1,4.440936963998835
9909,1,4.049509606848918
9919,1,4.572654560409792
9929,1,4.562852637352251
9939,1,4.322458320474901
9949,1,4.788830191536292
9959,1,4.7996411602510065
9969,1,4.602911683209824
9979,1,4.972113659349059
9989,1,5.271541888167887
9999,1,4.75244779533968
10009,1,4.759948022954406
10019,1,4.991122642829904
10029,1,5.0430412155451085
10039,1,4.708969337667285
10049,1,5.013632010335248
10059,1,5.132077342590831
10069,1,4.964165230345024
10079,1,5.289708509232609
10089,1,5.10328540576475
10099,1,5.1914847219172975
10109,1,5.310168506238147
10119,1,5.444208531225804
10129,1,5.436230604515606
10139,1,5.474832650694528
10149,1,5.241824507263475
10159,1,5.5786802488069345
10169,1,5.53437687539337
10179,1,5.958269618182005
10189,1,6.2387328605674846
10199,1,5.542287539739761
10209,1,5.862544180216972
10219,1,5.23188798796292
10229,1,4.843477587444168
10239,1,4.677541244164267
10249,1,4.297796699185728
10259,1,3.6204624966675842
10269,1,3.3027432459563824
10279,1,3.075130937814475
10289,1,2.8824987261414012
10299,1,2.8888478865062193
10309,1,2.975413790616725
10319,1,2.193455749077298
10329,1,1.7948440646878148
10339,1,1.2479120530421484
10349,1,1.4373748521366092
10359,1,1.4504472840168852
10369,1,1.4145305525222542
10379,1,1.7392571678906408
10389,1,2.1090649942050974
10399,1,2.126745780685179
10409,1,2.3584469519786904
10419,1,2.340053862801626
10429,1,2.6088279097297895
10439,1,2.601693348858855
10449,1,2.951107643889597
10459,1,2.469178888209404
10469,1,2.1133385274439824
10479,1,2.03868791801489
10489,1,1.823599960422929
10499,1,2.03183758600431
10509,1,1.9304099616320463
10519,1,2.096574032980538
10529,1,2.2193682478299257
10539,1,2.108348067730487
10549,1,2.1414009724483467
10559,1,2.0339333209113164
10569,1,2.15158767916182
10579,1,2.188959544312173
10589,1,2.3273848953436773
10599,1,2.228238264069143
10609,1,2.25457808590025
10619,1,2.5596620268761208
10629,1,2.520426707003065
10639,1,2.2036544193407557
10649,1,2.222879859317805
10659,1,1.9027072475694002
10669,1,1.803312810630403
10679,1,1.5657859390952176
10689,1,1.7441972624223745
10699,1,1.4597242019329073
10709,1,1.647707986913136
10719,1,1.5641591098820178
10729,1,1.5282971721132381
10739,1,1.3982040820321169
10749,1,1.5408694213783356
10759,1,1.5245286936277274
10769,1,1.615602054437175
10779,1,1.4826000915465531
10789,1,1.4012350145988264
10799,1,1.7909059188889715
10809,1,2.2386995871570647
10819,1,1.602527274806182
10829,1,2.0314388753999757
10839,1,1.8409529966303593
10849,1,1.8085329642613568
10859,1,1.489075590308412
10869,1,1.6691338351430172
10879,1,1.6420686339912938
10889,1,1.9948305622469065
10899,1,1.7306063051082372
10909,1,1.803530403878107
10919,1,1.6908398363988093
10929,1,1.6402348954975665
10939,1,1.2422632824448259
10949,1,1.2125149478904613
10959,1,1.500509110514201
10969,1,1.9346728241818243
10979,1,2.164120021056116
10989,1,2.4895054786893795
10999,1,2.3501327039650666
11009,1,2.7221272415661466
11019,1,2.6294523326409838
11029,1,2.681961625155265
11039,1,2.837392222354901
11049,1,2.768495616646547
11059,1,3.2367467030146857
11069,1,3.3444309189574746
11079,1,3.777173374697214
11089,1,3.601264479355656
11099,1,3.3890982341230993
11109,1,3.3868444330233642
11119,1,3.415342475643035
11129,1,3.31618065466355
11139,1,3.080991450580416
11149,1,3.9779739050210208
11159,1,4.26090807538125
11169,1,4.745413944603939
11179,1,5.006950080307316
11189,1,4.766175677506871
11199,1,5.242647180057784
11209,1,5.05017550012885
11219,1,5.2311983235237705
11229,1,4.805019894489794
11239,1,4.662665851666873
11249,1,4.880976896400077
11259,1,4.754748989895313
11269,1,4.353774210057896
11279,1,4.335324896907695
11289,1,3.971512765477488
11299,1,4.03671579075335
11309,1,3.5211087498617757
11319,1,3.1950257864310956
11329,1,3.0090745471204503
11339,1,3.0226149104879907
11349,1,2.8026247084276577
11359,1,2.4290027101795473
11369,1,2.19332769296721
11379,1,2.22573471954857
11389,1,2.8247354898802373
11399,1,2.6766471452502634
11409,1,2.4178104251950985
11419,1,2.5248030311908805
11429,1,2.516647273875389
11439,1,2.4490155401387126
11449,1,2.151826387109874
11459,1,2.006856616727474
11469,1,1.9987239021015402
11479,1,2.005523291972631
11489,1,1.9878304077787887
11499,1,2.218002798647906
11509,1,2.559154455435812
11519,1,2.8405263098679283
11529,1,2.7955354163887183
11539,1,3.114772350445202
11549,1,3.068714844267747
11559,1,3.176474864575013
11569,1,3.3802114790257907
11579,1,3.0300055283634384
11589,1,3.258807809615983
11599,1,2.8615911012111024
11609,1,2.720195041568596
11619,1,2.372343386867009
11629,1,2.781763752958648
11639,1,2.8128773132288645
11649,1,2.8621611042406956
11659,1,3.0968212724365727
11669,1,3.1905485176913713
11679,1,3.18962697990721
11689,1,2.938832664707191
11699,1,3.0879650910916663
11709,1,2.4862158653186794
11719,1,2.1339361584442122
11729,1,1.5378929512989399
11739,1,1.670988045252423
11749,1,1.6975101339352219
11759,1,1.753079155587217
11769,1,1.7900648593915465
11779,1,1.7815929223601836
11789,1,1.9024285796205627
11799,1,1.6280926394464657
11809,1,1.6067665847639376
11819,1,1.281218151469849
11829,1,1.3463990529574246
11839,1,1.227931846974803
11849,1,1.1484030991919174
11859,1,0.946426844084866
11869,1,0.8937033012094836
11879,1,0.8266206549486745
11889,1,0.9993974562200786
11899,1,1.0343366257374913
11909,1,0.9040953055219484
11919,1,1.154712377413238
11929,1,1.128571674527035
11939,1,1.4645139508789473
11949,1,1.545506021162449
11959,1,1.6819421043763478
11969,1,1.975474215536154
11979,1,1.9047505437384493
11989,1,1.6198025139435224
11999,1,1.5506542565059525
12009,1,1.5335374169636606
12019,1,1.7434668875461332
12029,1,2.117862939906672
12039,1,1.923660133904002
12049,1,1.806816321683303
12059,1,2.0515859827468477
12069,1,2.193136719251005
12079,1,2.5083196659319693
12089,1,2.748622150105334
12099,1,2.720090177404442
12109,1,2.6754456230257175
12119,1,2.6659856447925945
12129,1,2.6963544103319386
12139,1,2.838875316982762
12149,1,2.795803763398983
12159,1,3.010038759111276
12169,1,3.0679912780595218
12179,1,3.1032746586879285
12189,1,3.178242164200541
12199,1,3.3178036894434046
12209,1,3.269382450907957
12219,1,3.2651295559519173
12229,1,3.236838430931777
12239,1,3.3165076177880337
12249,1,3.133890736770767
12259,1,3.37866537242224
12269,1,2.925106596188025
12279,1,2.8339894015417
12289,1,2.7338041485874838
12299,1,2.59849736789268
12309,1,2.2346973548248457
12319,1,2.5867212325985895
12329,1,2.366508196973179
12339,1,2.19746124560782
12349,1,2.07671277654966
12359,1,1.7841801817205631
12369,1,1.7290969236716123
12379,1,1.7527342879326162
12389,1,1.423899387645089
12399,1,1.7693704603059681
12409,1,1.7660828635544723
12419,1,1.6898221827453814
12429,1,1.6059096215080115
12439,1,1.790776978544263
12449,1,1.4424386693448321
12459,1,1.1987982601276492
12469,1,1.0031087371484522
12479,1,1.024469848892111
12489,1,1.185567891319458
12499,1,1.3355890686652971
12509,1,1.3708206006164763
12519,1,2.0309671953718667
12529,1,1.978574906945692
12539,1,1.8472047642529583
12549,1,1.9077073811966314
12559,1,1.9539822533824616
12569,1,1.8441461686563347
12579,1,2.0373299377894964
12589,1,1.9967314884637362
12599,1,2.0389678452200624
12609,1,2.6073281316438557
12619,1,2.639634442357444
12629,1,2.5735228546719253
12639,1,2.4042195936730524
12649,1,2.25274561667508
12659,1,2.115399078363697
12669,1,2.2570243553747034
12679,1,1.7251700855828638
12689,1,1.904302083510201
12699,1,1.8133566230781657
12709,1,1.55135419004105
12719,1,1.563806311576477
12729,1,1.2904829257165122
12739,1,1.3467608697647009
12749,1,1.3554385061447998
12759,1,1.3618894543686622
12769,1,1.3325539338558756
12779,1,1.3346677315030733
12789,1,1.3109083197103653
12799,1,1.5104532963910255
12809,1,1.6487648912330557
12819,1,1.7489160583088503
12829,1,1.604631156624605
12839,1,1.3046041007895524
12849,1,0.951042669095067
12859,1,0.8923827931144935
12869,1,0.7551737209086695
12879,1,0.8931672681839812
12889,1,0.7358781696631969
12899,1,0.6209886669782403
12909,1,0.5631699959068327
12919,1,0.5203833367840283
12929,1,0.3376547612059938
12939,1,0.28971605898297337
12949,1,0.3228677744851195
12959,1,0.0619998031970046
12969,1,0.20364036315867717
12979,1,0.17728629043937427
12989,1,0.2830399685951327
12999,1,0.2369825513568934
13009,1,0.06790868826885876
13019,1,0.09149431479961889
13029,1,-0.0025615768766559244
13039,1,0.1899670734190293
13049,1,0.5829625431014673
13059,1,0.6068158529474614
13069,1,0.6433430083524225
13079,1,0.7215138943282586
13089,1,1.0275825143210386
13099,1,1.1062202578530225
13109,1,1.1555582282480734
13119,1,1.4872740495234442
13129,1,1.4131152589732197
13139,1,1.793752087350522
13149,1,1.6506851396716402
13159,1,2.224198800379645
13169,1,2.186982316678489
13179,1,2.404220947836121
13189,1,2.1818084120221513
13199,1,2.3201357071178004
13209,1,2.464973101113032
13219,1,2.876479704346823
13229,1,2.553191048999771
13239,1,2.6303113274309946
13249,1,3.261219788429311
13259,1,3.378571254768468
13269,1,3.900286192434661
13279,1,3.3915170352909234
13289,1,3.938280080154284
13299,1,4.022595305215754
13309,1,3.5157863226692156
13319,1,3.3547019787489725
13329,1,3.3496965834982873
13339,1,3.0664836435179676
13349,1,3.5007875863043085
13359,1,3.246659924488057
13369,1,3.0292771539409866
13379,1,2.9603314282936144
13389,1,2.9348739352657622
13399,1,3.314651738559644
13409,1,2.6155368240546557
13419,1,2.7447223100017357
13429,1,3.0513979710129897
13439,1,2.8260379323387603
13449,1,2.6555108730083066
13459,1,2.6358839583502496
13469,1,2.590708943741557
13479,1,2.287669792490404
13489,1,2.3752236248246117
13499,1,2.0202579498200386
13509,1,2.361137226110463
13519,1,2.4586122800485684
13529,1,2.244992084968423
13539,1,1.57976108175223
13549,1,0.8240855505561482
13559,1,0.8907217524708588
13569,1,1.2624812699409398
13579,1,1.4119424193831998
13589,1,1.3666458696948292
13599,1,1.7340102472311467
13609,1,2.128996920103835
13619,1,2.2322540564536575
13629,1,2.3398181843872896
13639,1,2.1497949202308115
13649,1,2.2171329113213316
13659,1,2.573646336769325
13669,1,2.804031111377708
13679,1,2.9876985180305216
13689,1,3.2211639317119296
13699,1,2.9709228678037176
13709,1,3.523903573322869
13719,1,3.798147412376631
13729,1,4.239772330100591
13739,1,4.289891411233961
13749,1,4.101994987692839
13759,1,4.160361329325326
13769,1,4.157597355324251
13779,1,4.478532459478746
13789,1,4.2211616566080465
13799,1,4.562514495376851
13809,1,4.339324195803025
13819,1,4.180335982606282
13829,1,4.407503186276804
13839,1,4.548422606521041
13849,1,5.024369970360621
13859,1,4.6115794452291485
13869,1,4.783913932430984
13879,1,4.789829373047435
13889,1,4.6714858757106885
13899,1,4.563849211565765
13909,1,4.3230681839405145
13919,1,4.1839488968934795
13929,1,4.338115358435376
13939,1,4.321550816936385
13949,1,4.607219971062738
13959,1,4.573398849060453
13969,1,4.348328075933259
13979,1,4.641855710754626
13989,1,4.005687463338205
13999,1,4.3840116723963085
14009,1,4.257488918088099
14019,1,4.528672744384933
14029,1,4.533394690423854
14039,1,4.245416210112325
14049,1,3.853813894236362
14059,1,3.208351221097666
14069,1,2.5244544548978274
14079,1,2.4354659941783963
14089,1,2.2219815556027536
14099,1,2.2410846018991406
14109,1,1.909803766838913
14119,1,1.5469160807500013
14129,1,1.688270987030821
14139,1,1.892475796451669
14149,1,1.7023383771935863
14159,1,1.4099544223664648
14169,1,1.3277873262494104
14179,1,1.2541483281425116
14189,1,1.2924388394557833
14199,1,1.0946446606317677
14209,1,1.0386392378342508
14219,1,0.8523604289698504
14229,1,0.6766033666309919
14239,1,0.7983506921872989
14249,1,0.6678543487915879
14259,1,0.5535849849924649
14269,1,0.33705211049793316
14279,1,0.36269696096753856
14289,1,0.16896558881977986
14299,1,0.3004955572508362
14309,1,0.2124802519494674
14319,1,0.07287114324691202
14329,1,0.20307416549017732
14339,1,0.2043166304434959
14349,1,0.20650877663384815
14359,1,0.03631421498427434
14369,1,0.15596118825556615
14379,1,0.18160392065645847
14389,1,0.12173785375732737
14399,1,0.2615212041766031
14409,1,0.18755528470690985
14419,1,0.3530792067000298
14429,1,0.37043104521610803
14439,1,0.4300690355783904
14449,1,0.6953694723532752
14459,1,0.7170571418440393
14469,1,0.7753313735340716
14479,1,0.773778102479157
14489,1,0.7823691334298195
14499,1,0.7616399640419057
14509,1,0.7187768257434357
14519,1,0.9302328968058978
14529,1,1.0504890448252249
14539,1,1.0814694777634999
14549,1,1.0996575110925046
14559,1,1.1530335524029778
14569,1,1.056625968735712
14579,1,1.0211635118114026
14589,1,0.9974052692513398
14599,1,1.202964015822204
14609,1,0.9419886538094295
14619,1,1.0274476784490831
14629,1,1.1457410411281066
14639,1,1.114781806861832
14649,1,1.1742366802697544
14659,1,1.0272040912470142
14669,1,0.814429543622361
14679,1,0.7541496714653376
14689,1,0.7228968232999637
14699,1,0.6659455163479564
14709,1,0.5636475102290129
14719,1,0.5025216907218524
14729,1,0.4131889359805391
14739,1,0.5064355185446583
14749,1,0.577806459648923
14759,1,0.6843196315432798
14769,1,0.7778744913373722
14779,1,0.8127353507509733
14789,1,1.1841324191288742
14799,1,1.4396593642980098
14809,1,1.313237715294982
14819,1,1.366346676828083
14829,1,1.1576017518905197
14839,1,1.1821066653363115
14849,1,1.0922348776209314
14859,1,0.8492606506017366
14869,1,0.7592320060345185
14879,1,0.7027367448777019
14889,1,0.5972998460240068
14899,1,0.5236691259621471
14909,1,0.5439830513814754
14919,1,0.631412618871383
14929,1,0.4657100036177758
14939,1,0.4868216745777465
14949,1,0.41826095515100536
14959,1,0.4259725678717442
14969,1,0.3196318005525641
14979,1,0.351039707609073
14989,1,0.24511684042469783
14999,1,0.3296691108844031
15009,1,0.5443395946296677
15019,1,0.6556625392100198
15029,1,0.6852658628919456
15039,1,0.7302296210534208
15049,1,0.6806858373665827
15059,1,0.6964320347075988
15069,1,0.7188624128876098
15079,1,0.7539088766860466
15089,1,0.9371883561857517
15099,1,0.8948569030930713
15109,1,0.9599641328621834
15119,1,1.1775505882723447
15129,1,1.283254630068778
15139,1,1.2588842066500667
15149,1,1.1967428884443052
15159,1,1.280277633712835
15169,1,1.111877769722701
15179,1,1.0462393279552433
15189,1,1.1002133289319476
15199,1,0.9430530274712806
15209,1,1.1126210428502428
15219,1,0.9758157124364673
15229,1,1.2151099555426499
15239,1,1.1432742700982743
15249,1,1.10413575525719
15259,1,0.927360158527875
15269,1,0.5711791089380842
15279,1,0.4868428282269116
15289,1,0.5210735091985101
15299,1,0.5895830738017949
15309,1,0.5078127313160397
15319,1,0.6550248724588427
15329,1,0.7267644925514901
15339,1,0.6846477717268105
15349,1,0.805666428923393
15359,1,0.9040165590796087
15369,1,0.8127213761923472
15379,1,0.9259768814889068
15389,1,0.9233484425652582
15399,1,1.1657510605344272
15409,1,1.044211730497632
15419,1,0.7634388265298536
15429,1,0.6723814424023756
15439,1,0.6815217418685992
15449,1,0.8185641087135558
15459,1,0.8612369971930608
15469,1,0.9748534922577347
15479,1,1.0207366913069778
15489,1,1.0790482297323902
15499,1,1.0172547280489732
15509,1,0.953709601587024
15519,1,0.7821344908983697
15529,1,0.7703433373295883
15539,1,0.6506397603683343
15549,1,0.5985945438254182
15559,1,0.7627496102226587
15569,1,1.1157938006880466
15579,1,1.0619636636346343
15589,1,1.1154553989505076
15599,1,1.1062660341070503
15609,1,1.017655224705825
15619,1,0.7844207145766005
15629,1,1.0795490779079766
15639,1,0.8969966463002763
15649,1,0.9665456204173956
15659,1,0.9897179708567668
15669,1,1.1024979513110518
15679,1,0.9105285225771136
15689,1,1.1408860718843359
15699,1,1.1587382895299148
15709,1,1.0279056758729346
15719,1,0.9167626804928161
15729,1,0.9603575338261189
15739,1,0.9570087218522796
15749,1,1.0400484744927172
15759,1,1.0537717773129225
15769,1,0.9594705789940736
15779,1,1.0832531547771544
15789,1,0.935804764259416
15799,1,1.0571380483838673
15809,1,0.8129675112192432
15819,1,0.7814607348034258
15829,1,0.879253434749284
15839,1,0.8574104161178486
15849,1,0.9542069033521385
15859,1,1.0735821951990663
15869,1,1.261138845295208
15879,1,1.1607685010743178
15889,1,1.204862602979481
15899,1,1.4900383208583896
15909,1,1.4022453035577733
15919,1,1.2879223865862828
15929,1,1.0070805890785
15939,1,1.0481634395766763
15949,1,0.8691117066346908
15959,1,0.9156466379309804
15969,1,0.7898626772874229
15979,1,0.6850115507605355
15989,1,0.41191511371699596
15999,1,0.2815231380243798
16009,1,0.08926812075133128
16019,1,0.12338272271097761
16029,1,0.050209603826660176
16039,1,0.21738240096004757
16049,1,0.24929582703181952
16059,1,0.2866640421301676
16069,1,0.06363521656489712
16079,1,0.16479293266500616
16089,1,0.23054299804282796
16099,1,0.19531814933308211
16109,1,0.400299387609898
16119,1,0.518177326033233
16129,1,0.6506040871128826
16139,1,0.7807328237617007
16149,1,0.8385843643419701
16159,1,0.8373533045051555
16169,1,0.9344730530755541
16179,1,1.1850191001392916
16189,1,0.9788602217925988
16199,1,0.892537786193822
