T,S,Score
999,0,-0.044606745
1009,0,-0.07660735
1019,0,-0.12689298
1029,0,-0.16664463
1039,0,0.09352076
1049,0,0.04747206
1059,0,-0.22662884
1069,0,-0.13662368
1079,0,-0.052573144
1089,0,-0.029351354
1099,0,-0.09304172
1109,0,-0.06771803
1119,0,0.017906249
1129,0,0.10101038
1139,0,-0.012131929
1149,0,-0.12740386
1159,0,-0.09318638
1169,0,-0.09106535
1179,0,-0.07416749
1189,0,0.021648943
1199,0,0.15897799
1209,0,0.05086279
1219,0,0.056751072
1229,0,0.17893875
1239,0,0.048064113
1249,0,0.21315241
1259,0,0.2114591
1269,0,0.15746444
1279,0,0.106182516
1289,0,0.09646422
1299,0,0.35563928
1309,0,0.22271079
1319,0,0.461519
1329,0,0.4616624
1339,0,0.5604985
1349,0,0.2744658
1359,0,0.2732213
1369,0,0.33603734
1379,0,0.32894325
1389,0,0.015837729
1399,0,0.11676341
1409,0,0.08544779
1419,0,-0.078140795
1429,0,-0.1060245
1439,0,-0.019998133
1449,0,-0.08584803
1459,0,-0.0033020973
1469,0,-0.25436556
1479,0,-0.052791536
1489,0,-0.0572384
1499,0,-0.24507886
1509,0,0.0034038424
1519,0,-0.09234917
1529,0,0.08537632
1539,0,0.06728375
1549,0,-0.046031237
1559,0,-0.05282861
1569,0,0.06726372
1579,0,-0.005253732
1589,0,-0.09791058
1599,0,0.029542148
1609,0,-0.019252956
1619,0,0.16634333
1629,0,0.08660793
1639,0,0.016853988
1649,0,-0.17601973
1659,0,0.017567635
1669,0,-0.10019058
1679,0,-0.15500301
1689,0,-0.09064919
1699,0,-0.056839883
1709,0,-0.23098677
1719,0,-0.11277801
1729,0,-0.10977697
1739,0,-0.09383446
1749,0,-0.03381449
1759,0,-0.116149545
1769,0,-0.12661052
1779,0,-0.089025676
1789,0,-0.13723433
1799,0,-0.09992975
1809,0,-0.19655693
1819,0,-0.2407704
1829,0,-0.18772167
1839,0,-0.0334906
1849,0,0.042922497
1859,0,-0.0153102875
1869,0,-0.008142948
1879,0,0.076655686
1889,0,-0.074673116
1899,0,0.052396834
1909,0,0.019805908
1919,0,0.013848126
1929,0,-0.0012575388
1939,0,-0.059929967
1949,0,0.008038998
1959,0,0.027047873
1969,0,-0.070260465
1979,0,-0.0669716
1989,0,-0.085380316
1999,0,-0.13337743
2009,0,-0.13775325
2019,0,0.03808117
2029,0,0.053348005
2039,0,0.06443429
2049,0,0.062476456
2059,0,0.0359056
2069,0,0.12611526
2079,0,-0.090705454
2089,0,-0.017563164
2099,0,-0.008577466
2109,0,-0.21570277
2119,0,-0.008558154
2129,0,-0.03486848
2139,0,0.015665054
2149,0,-0.15762687
2159,0,-0.08684492
2169,0,0.023460805
2179,0,0.017416835
2189,0,-0.02214688
2199,0,0.16422284
2209,0,0.010397971
2219,0,-0.09987897
2229,0,-0.07753241
2239,0,-0.06764817
2249,0,-0.003311634
2259,0,-0.17386746
2269,0,0.09876317
2279,0,-0.12418795
2289,0,-0.054176986
2299,0,-0.05913645
2309,0,-0.02740407
2319,0,-0.12900919
2329,0,-0.08001816
2339,0,0.013290286
2349,0,-0.08669013
2359,0,0.038187742
2369,0,0.07782686
2379,0,0.070234716
2389,0,0.0321303
2399,0,0.20480067
2409,0,0.18236876
2419,0,0.076740086
2429,0,0.19022042
2439,0,0.2377153
2449,0,-0.058592737
2459,0,0.17503333
2469,0,-0.03290534
2479,0,0.08254105
2489,0,-0.09120184
2499,0,-0.085160434
2509,0,-0.24810839
2519,0,-0.28294706
2529,0,-0.06919724
2539,0,-0.2027387
2549,0,-0.3019789
2559,0,-0.15818036
2569,0,-0.15490234
2579,0,-0.12239659
2589,0,0.011675537
2599,0,-0.10568857
2609,0,-0.048061132
2619,0,-0.086806774
2629,0,-0.14522529
2639,0,-0.12701905
2649,0,-0.07034922
2659,0,-0.1547814
2669,0,-0.10499656
2679,0,-0.098046064
2689,0,-0.060020864
2699,0,-0.031288207
2709,0,-0.20457536
2719,0,-0.05304575
2729,0,-0.0757274
2739,0,-0.036544323
2749,0,-0.11517292
2759,0,-0.08693963
2769,0,-0.016833484
2779,0,-0.18626267
2789,0,-0.1014756
2799,0,-0.037833214
2809,0,-0.018034697
2819,0,0.032644868
2829,0,0.06766009
2839,0,-0.10111052
2849,0,-0.103916645
2859,0,0.09439075
2869,0,0.0020461679
2879,0,-0.05332285
2889,0,-0.026445866
2899,0,0.15024
2909,0,0.05632299
2919,0,0.23050082
2929,0,0.03342986
2939,0,0.02755493
2949,0,0.03171128
2959,0,0.11430687
2969,0,-0.08627498
2979,0,-0.026015162
2989,0,0.31775486
2999,0,0.027899086
3009,0,0.06838268
3019,0,-0.0758
3029,0,0.10559851
3039,0,-0.08303779
3049,0,-0.024147272
3059,0,-0.10756171
3069,0,-0.17696035
3079,0,-0.16469938
3089,0,-0.15525365
3099,0,-0.08276588
3109,0,-0.122118354
3119,0,-0.010499656
3129,0,-0.0037392378
3139,0,-0.028840125
3149,0,0.013773084
3159,0,-0.043616116
3169,0,-0.094616175
3179,0,0.040699482
3189,0,-0.098439395
3199,0,0.021295846
3209,0,-0.101370156
3219,0,0.0311144
3229,0,0.12868792
3239,0,-0.16803521
3249,0,0.016716063
3259,0,-0.043376148
3269,0,-0.15680283
3279,0,-0.09828526
3289,0,-0.06929207
3299,0,0.0039468408
3309,0,-0.042347968
3319,0,0.2459988
3329,0,0.12728125
3339,0,0.23321867
3349,0,0.12500936
3359,0,0.08526218
3369,0,0.17574304
3379,0,0.117220044
3389,0,0.18200392
3399,0,0.15542656
3409,0,0.17065388
3419,0,0.2074334
3429,0,0.15138161
3439,0,0.25475645
3449,0,0.14797759
3459,0,0.104694605
3469,0,0.11406022
3479,0,0.08504593
3489,0,-0.013871491
3499,0,-0.14608443
3509,0,-0.02554828
3519,0,-0.010246575
3529,0,-0.06918651
3539,0,-0.15341324
3549,0,-0.06529635
3559,0,-0.01780498
3569,0,-0.017718077
3579,0,-0.07947594
3589,0,-0.10384047
3599,0,0.07521784
3609,0,-0.066048265
3619,0,0.00902909
3629,0,-0.04373008
3639,0,-0.06508976
3649,0,-0.099169314
3659,0,-0.08635676
3669,0,0.07833916
3679,0,-0.09121567
3689,0,-0.15041304
3699,0,-0.036025584
3709,0,-0.111551225
3719,0,-0.11441827
3729,0,-0.01029551
3739,0,0.023764908
3749,0,-0.052022934
3759,0,-0.1357913
3769,0,-0.091469586
3779,0,0.030560017
3789,0,0.11665881
3799,0,-0.16721952
3809,0,0.06630975
3819,0,-0.008992374
3829,0,-0.054000318
3839,0,-0.028844118
3849,0,-0.062079072
3859,0,-0.0716027
3869,0,0.12046766
3879,0,0.11732298
3889,0,-0.0021086335
3899,0,0.2409625
3909,0,0.12651646
3919,0,0.08438814
3929,0,0.27382624
3939,0,-0.12086028
3949,0,0.08775562
3959,0,0.022630632
3969,0,-0.028137445
3979,0,-0.02087456
3989,0,-0.12811124
3999,0,-0.012439787
4009,0,-0.12262958
4019,0,-0.24020088
4029,0,-0.02097845
4039,0,-0.20850074
4049,0,-0.11161685
4059,0,-0.08295232
4069,0,-0.023306549
4079,0,0.011192322
4089,0,-0.056013703
4099,0,0.07498878
4109,0,-0.19251186
4119,0,0.13707864
4129,0,0.01796478
4139,0,0.040695608
4149,0,0.18170446
4159,0,0.09204936
4169,0,0.19601274
4179,0,0.07281613
4189,0,0.11356479
4199,0,0.096250296
4209,0,0.047535777
4219,0,0.038728237
4229,0,0.105873644
4239,0,0.11023611
4249,0,-0.0530985
4259,0,0.21680486
4269,0,0.06781614
4279,0,0.20402992
4289,0,-0.044431448
4299,0,0.04455465
4309,0,-0.040587068
4319,0,-0.17096144
4329,0,-0.15926796
4339,0,0.04952234
4349,0,-0.13575906
4359,0,-0.096167505
4369,0,-0.04106939
4379,0,0.055436015
4389,0,0.054347932
4399,0,0.021362185
4409,0,-0.091061294
4419,0,-0.07956493
4429,0,-0.0300169
4439,0,-0.06891632
4449,0,-0.10068679
4459,0,-0.14978445
4469,0,-0.048211694
4479,0,-0.024041831
4489,0,-0.13726717
4499,0,-0.10541105
4509,0,-0.18180954
4519,0,-0.147264
4529,0,-0.1207698
4539,0,-0.028737545
4549,0,-0.013960183
4559,0,0.033089638
4569,0,-0.008670032
4579,0,0.023828685
4589,0,0.14619201
4599,0,-0.060909152
4609,0,0.06446093
4619,0,-0.15266222
4629,0,0.09223342
4639,0,-0.014588058
4649,0,-0.016888916
4659,0,0.10103005
4669,0,0.09360212
4679,0,0.028550327
4689,0,0.036676407
4699,0,0.120228946
4709,0,0.014936447
4719,0,0.080094874
4729,0,0.0052754283
4739,0,0.08963424
4749,0,0.04510051
4759,0,0.18878305
4769,0,0.2962681
4779,0,-0.02816403
4789,0,0.26013726
4799,0,0.25099748
4809,0,0.27270204
4819,0,0.14568675
4829,0,-0.01327008
4839,0,0.32014674
4849,0,0.17354423
4859,0,0.15211767
4869,0,0.017938495
4879,0,0.28421903
4889,0,0.19279373
4899,0,0.048407078
4909,0,0.11396456
4919,0,0.29835933
4929,0,0.1222496
4939,0,0.13974386
4949,0,0.06323415
4959,0,0.08237934
4969,0,-0.028138518
4979,0,0.1167593
4989,0,0.076027036
4999,0,-0.094876826
5009,0,0.055010915
5019,0,0.03704101
5029,0,-0.02159965
5039,0,0.1875825
5049,0,0.22702008
5059,0,0.15667671
5069,0,0.09546846
5079,0,0.15343261
5089,0,0.07062119
5099,0,-0.054180562
5109,0,-0.05798614
5119,0,0.029612184
5129,0,0.038275123
5139,0,-0.21086323
5149,0,-0.10900146
5159,0,-0.032872736
5169,0,-0.14470708
5179,0,-0.15590209
5189,0,-0.1906898
5199,0,-0.06894553
5209,0,-0.15896845
5219,0,-0.14054173
5229,0,-0.12378687
5239,0,-0.16201389
5249,0,-0.11797243
5259,0,-0.07285929
5269,0,-0.13277751
5279,0,-0.1050815
5289,0,-0.0027534962
5299,0,-0.12332314
5309,0,-0.12153727
5319,0,-0.11064649
5329,0,-0.08385098
5339,0,-0.05974406
5349,0,0.0035479069
5359,0,-0.11675173
5369,0,0.1659342
5379,0,-0.010154307
5389,0,-0.016898394
5399,0,-0.10523546
5409,0,0.022423148
5419,0,-0.019246936
5429,0,-0.17072517
5439,0,-0.2811576
5449,0,-0.079887986
5459,0,0.06565386
5469,0,-0.060457706
5479,0,-0.084854424
5489,0,-0.03481722
5499,0,0.05860275
5509,0,0.16666949
5519,0,0.027924478
5529,0,0.051683903
5539,0,0.07963383
5549,0,0.06653327
5559,0,0.04702121
5569,0,0.023855805
5579,0,-0.08416271
5589,0,0.0052663684
5599,0,-0.10745174
5609,0,0.07584673
5619,0,-0.026879787
5629,0,0.08092898
5639,0,-0.13296288
5649,0,-0.17781669
5659,0,-0.027862787
5669,0,-0.013475299
5679,0,0.027599156
5689,0,-0.0070135593
5699,0,0.09367293
5709,0,-0.13333613
5719,0,0.08952099
5729,0,0.032475173
5739,0,-0.0833925
5749,0,0.015857875
5759,0,-0.04983455
5769,0,0.048156142
5779,0,0.10222888
5789,0,0.028703451
5799,0,-0.11813003
5809,0,0.08633107
5819,0,0.063693106
5829,0,0.05311227
5839,0,-0.080014944
5849,0,0.08117324
5859,0,-0.09906721
5869,0,0.030326486
5879,0,0.040638447
5889,0,-0.09013969
5899,0,-0.05105263
5909,0,-0.021540523
5919,0,-0.10378456
5929,0,-0.18740332
5939,0,0.05414158
5949,0,0.14552146
5959,0,0.14982778
5969,0,0.08305681
5979,0,0.048235595
5989,0,-0.028132915
5999,0,-0.019492209
6009,0,0.1012944
6019,0,0.08263558
6029,0,0.0875234
6039,0,0.13414836
6049,0,0.11930609
6059,0,0.0856446
6069,0,0.2212025
6079,0,-0.061083615
6089,0,0.0241822
6099,0,-0.01703298
6109,0,0.11627406
6119,0,0.0787704
6129,0,0.09268111
6139,0,-0.25917727
6149,0,-0.032975674
6159,0,0.023845673
6169,0,-0.04192984
6179,0,0.20188963
6189,0,0.011891007
6199,0,0.16875309
6209,0,0.019672036
6219,0,0.16412431
6229,0,0.09883362
6239,0,0.06074339
6249,0,0.07782209
6259,0,0.15334195
6269,0,0.09428406
6279,0,-0.008891761
6289,0,-0.045615137
6299,0,0.17561573
6309,0,0.05908221
6319,0,0.09573388
6329,0,0.2873574
6339,0,0.17789966
6349,0,0.0037046075
6359,0,0.14912134
6369,0,0.22926593
6379,0,0.11052656
6389,0,0.15092129
6399,0,0.18353981
6409,0,0.090619564
6419,0,-0.08909321
6429,0,-0.0051306486
6439,0,-0.03833294
6449,0,-0.08027166
6459,0,0.0016789436
6469,0,-0.10469568
6479,0,-0.17952043
6489,0,-0.13624018
6499,0,-0.10915476
6509,0,-0.025396824
6519,0,-0.06150645
6529,0,-0.13573432
6539,0,-0.018291473
6549,0,-0.05075091
6559,0,-0.07804769
6569,0,-0.14663196
6579,0,-0.121905744
6589,0,-0.023595214
6599,0,-0.055582047
6609,0,-0.0424127
6619,0,-0.014700651
6629,0,-0.09916246
6639,0,-0.034855843
6649,0,0.08113861
6659,0,0.0068930984
6669,0,-0.09411627
6679,0,0.09028268
6689,0,-0.19915348
6699,0,-0.026492715
6709,0,0.03997302
6719,0,-0.12189168
6729,0,-0.13705897
6739,0,0.001600802
6749,0,0.06464422
6759,0,-0.09441984
6769,0,-0.06589496
6779,0,0.23724353
6789,0,0.13575882
6799,0,0.1319108
6809,0,-0.016325414
6819,0,0.12552112
6829,0,-0.13125843
6839,0,0.10696721
6849,0,0.16333717
6859,0,0.21040368
6869,0,0.08785057
6879,0,-0.23955
6889,0,0.1048848
6899,0,0.07129109
6909,0,0.031776547
6919,0,-0.061330914
6929,0,0.012540102
6939,0,0.26044607
6949,0,0.2158454
6959,0,-0.13188124
6969,0,0.058935285
6979,0,0.060089767
6989,0,-0.045564413
6999,0,0.012920141
7009,0,-0.15145886
7019,0,0.02133125
7029,0,0.07902163
7039,0,-0.004672885
7049,0,-0.013230085
7059,0,0.055545747
7069,0,0.028695464
7079,0,0.14090031
7089,0,0.062009215
7099,0,0.23570591
7109,0,0.24293923
7119,0,0.22254282
7129,0,0.23695803
7139,0,0.1082834
7149,0,0.1763959
7159,0,0.23251843
7169,0,0.25270778
7179,0,0.27923423
7189,0,0.047918975
7199,0,0.41872418
7209,0,0.570115
7219,0,0.11168504
7229,0,0.45132238
7239,0,0.2829309
7249,0,0.41576588
7259,0,0.25849473
7269,0,0.3080247
7279,0,0.501036
7289,0,0.50907284
7299,0,0.5563642
7309,0,0.7128912
7319,0,0.7371144
7329,0,0.56834424
7339,0,0.73102915
7349,0,0.5782246
7359,0,0.61973333
7369,0,0.528101
7379,0,0.39926052
7389,0,0.36785173
7399,0,0.24730027
7409,0,0.31673652
7419,0,0.51719093
7429,0,0.18990004
7439,0,0.12378985
7449,0,-0.009274423
7459,0,0.10473591
7469,0,0.36299402
7479,0,0.23315376
7489,0,0.37726772
7499,0,0.28801727
7509,0,0.014673054
7519,0,0.08832675
7529,0,0.15926194
7539,0,0.3090917
7549,0,0.18908697
7559,0,0.1378836
7569,0,0.100144565
7579,0,0.06699389
7589,0,0.16231227
7599,0,0.06979984
7609,0,0.09568894
7619,0,0.01281029
7629,0,0.13571191
7639,0,0.207308
7649,0,0.11924493
7659,0,0.052400112
7669,0,0.07096511
7679,0,-0.15903425
7689,0,0.006916046
7699,0,-0.116687775
7709,0,-0.04560882
7719,0,-0.059625685
7729,0,0.1002574
7739,0,0.010937989
7749,0,-0.022314489
7759,0,-0.029593527
7769,0,0.041852713
7779,0,-0.012914121
7789,0,0.0005531311
7799,0,0.03073895
7809,0,-0.15997308
7819,0,0.17592627
7829,0,0.06690103
7839,0,0.1842938
7849,0,0.16789055
7859,0,0.31828254
7869,0,0.06673294
7879,0,-0.00025832653
7889,0,0.035399854
7899,0,0.011208475
7909,0,0.03014493
7919,0,-0.009485781
7929,0,0.0417791
7939,0,-0.08589369
7949,0,-0.12573427
7959,0,-0.1577186
7969,0,-0.023521066
7979,0,-0.06467742
7989,0,-0.08705062
7999,0,-0.060477912
8009,0,-0.20473742
8019,0,-0.14894211
8029,0,-0.08132082
8039,0,-0.072630286
8049,0,-0.09671402
8059,0,-0.05127138
8069,0,-0.07473993
8079,0,-0.2301808
8089,0,-0.09659666
8099,0,-0.18761718
8109,0,0.03389716
8119,0,0.15931714
8129,0,-0.050082326
8139,0,-0.063642025
8149,0,-0.09292263
8159,0,0.014830649
8169,0,-0.034086466
8179,0,-0.0412066
8189,0,0.029083073
8199,0,-0.011146545
8209,0,-0.06889534
8219,0,-0.012778163
8229,1,0.18165362
8239,1,0.44716585
8249,1,0.026374042
8259,1,0.18902266
8269,1,-0.07543051
8279,1,0.35568553
8289,1,0.21713656
8299,1,0.39930344
8309,1,-0.09320611
8319,1,0.5656574
8329,1,0.8437083
8339,1,0.6924593
8349,1,1.263618
8359,1,1.1175617
8369,1,1.0102496
8379,1,0.8867922
8389,1,0.85965306
8399,1,1.1147816
8409,1,1.1006546
8419,1,1.2894406
8429,1,1.1430337
8439,1,1.1756221
8449,1,1.464236
8459,1,1.5416944
8469,1,1.7187859
8479,1,1.6593709
8489,1,1.7474079
8499,1,1.9192785
8509,1,1.9781208
8519,1,1.9559741
8529,1,1.9599311
8539,1,2.037455
8549,1,2.4669988
8559,1,2.5905573
8569,1,2.9051433
8579,1,3.0124187
8589,1,2.8702712
8599,1,3.3538857
8609,1,4.0103655
8619,1,4.4175034
8629,1,4.523041
8639,1,4.781586
8649,1,4.561818
8659,1,4.9039826
8669,1,6.464508
8679,1,6.3311453
8689,1,6.684163
8699,1,6.7746444
8709,1,6.3765793
8719,1,6.8127418
8729,1,7.089424
8739,1,6.2214956
8749,1,4.612572
8759,1,3.8616667
8769,1,4.038595
8779,1,3.9809637
8789,1,3.543322
8799,1,3.215105
8809,1,2.7630227
8819,1,3.2171412
8829,1,2.8833108
8839,1,2.518259
8849,1,2.5320523
8859,1,3.1034966
8869,1,1.894845
8879,1,2.232483
8889,1,2.48421
8899,1,2.6534255
8909,1,2.6726441
8919,1,2.4988446
8929,1,2.1674066
8939,1,2.697029
8949,1,2.6653585
8959,1,2.8096695
8969,1,2.7489038
8979,1,2.8497598
8989,1,2.9687524
8999,1,3.3258505
9009,1,2.7208285
9019,1,3.1528
9029,1,3.8576813
9039,1,3.639916
9049,1,4.058964
9059,1,4.7044826
9069,1,5.4546437
9079,1,5.155423
9089,1,5.6842985
9099,1,6.56417
9109,1,6.955943
9119,1,5.421118
9129,1,5.678151
9139,1,5.6606913
9149,1,5.9398365
9159,1,5.9428368
9169,1,7.007164
9179,1,6.5547724
9189,1,5.692201
9199,1,6.0263557
9209,1,5.5951133
9219,1,5.9040346
9229,1,6.493838
9239,1,6.6302853
9249,1,6.818756
9259,1,5.4804735
9269,1,5.30933
9279,1,4.4376984
9289,1,4.0655575
9299,1,3.788931
9309,1,3.2222972
9319,1,2.9360137
9329,1,2.662851
9339,1,2.6457067
9349,1,1.9583635
9359,1,2.3546324
9369,1,1.6464776
9379,1,1.5932758
9389,1,1.2536855
9399,1,1.2991166
9409,1,1.1448611
9419,1,0.6580317
9429,1,0.7524908
9439,1,0.48706365
9449,1,0.5357898
9459,1,0.52038723
9469,1,0.82227165
9479,1,0.2964368
9489,1,0.36987144
9499,1,0.29965925
9509,1,0.5193848
9519,1,0.34866673
9529,1,0.58582866
9539,1,0.19855863
9549,1,0.5147916
9559,1,0.4080552
9569,1,0.31781197
9579,1,0.46145177
9589,1,0.76759326
9599,1,0.57470006
9609,1,0.66738933
9619,1,0.51652175
9629,1,0.42366707
9639,1,0.5600684
9649,1,1.0683594
9659,1,0.63050884
9669,1,0.8918547
9679,1,0.79479474
9689,1,0.9738917
9699,1,1.3798342
9709,1,1.3359798
9719,1,1.5617821
9729,1,1.6546267
9739,1,2.2626963
9749,1,2.5001235
9759,1,2.3038883
9769,1,2.5589046
9779,1,2.9453282
9789,1,2.183237
9799,1,2.5954766
9809,1,2.6826854
9819,1,2.3529673
9829,1,2.7011428
9839,1,1.9922683
9849,1,1.7458637
9859,1,2.3587937
9869,1,2.1468284
9879,1,1.8308377
9889,1,2.120326
9899,1,1.7906057
9909,1,1.5806267
9919,1,0.9195695
9929,1,0.7479431
9939,1,0.9776738
9949,1,0.91136754
9959,1,0.28550202
9969,1,0.70884585
9979,1,0.712867
9989,1,0.65000814
9999,1,0.57535386
10009,1,0.9914143
10019,1,0.9419011
10029,1,1.2010924
10039,1,1.0341234
10049,1,1.1895192
10059,1,0.96603763
10069,1,1.4836046
10079,1,0.9730205
10089,1,1.2366145
10099,1,1.2101116
10109,1,1.1904602
10119,1,1.2995012
10129,1,1.2956631
10139,1,1.353334
10149,1,1.648379
10159,1,1.3701208
10169,1,1.3478862
10179,1,1.7781117
10189,1,1.7710218
10199,1,1.7071408
10209,1,2.2874267
10219,1,2.2293065
10229,1,2.2913857
10239,1,2.124919
10249,1,2.189704
10259,1,2.2766376
10269,1,2.594611
10279,1,2.2815475
10289,1,2.8595133
10299,1,2.6917186
10309,1,3.2120245
10319,1,3.2371178
10329,1,3.7475138
10339,1,3.5063295
10349,1,4.4010906
10359,1,3.7515018
10369,1,4.1263604
10379,1,4.0271025
10389,1,3.9741411
10399,1,3.2963874
10409,1,2.6429675
10419,1,2.8582048
10429,1,2.8963964
10439,1,2.4032595
10449,1,1.8815442
10459,1,1.8675315
10469,1,1.5242875
10479,1,1.3650777
10489,1,1.5489026
10499,1,1.6809428
10509,1,1.9747651
10519,1,1.4529765
10529,1,1.1737657
10539,1,0.92915946
10549,1,1.1246186
10559,1,0.97942114
10569,1,0.95395625
10579,1,1.0634711
10589,1,1.347709
10599,1,1.0925556
10609,1,0.8627014
10619,1,0.8364601
10629,1,0.7029058
10639,1,0.570384
10649,1,0.7654977
10659,1,0.4717723
10669,1,0.4346404
10679,1,0.36845213
10689,1,0.36471033
10699,1,0.4168417
10709,1,0.4211039
10719,1,0.32009143
10729,1,0.22141004
10739,1,0.15132749
10749,1,0.056066215
10759,1,0.19320333
10769,1,0.07314837
10779,1,0.18838245
10789,1,0.16918206
10799,1,0.104186594
10809,1,0.075731814
10819,1,0.073156595
10829,1,0.24715799
10839,1,0.15783799
10849,1,0.11396283
10859,1,0.30787665
10869,1,0.112778306
10879,1,0.21584046
10889,1,0.12810749
10899,1,0.083452344
10909,1,0.19407272
10919,1,0.07377851
10929,1,0.304152
10939,1,0.13880724
10949,1,0.25639844
10959,1,0.17823607
10969,1,0.011494935
10979,1,0.20463753
10989,1,0.27095586
10999,1,0.17582083
11009,1,0.09727579
11019,1,0.45149952
11029,1,0.38771254
11039,1,0.26676965
11049,1,0.72474825
11059,1,0.6354904
11069,1,0.66309464
11079,1,0.6359589
11089,1,0.59099555
11099,1,0.3086977
11109,1,0.36223596
11119,1,0.2305516
11129,1,0.63278556
11139,1,0.6170079
11149,1,0.40945977
11159,1,0.61919034
11169,1,0.5970107
11179,1,0.5274574
11189,1,0.68592316
11199,1,0.7340491
11209,1,0.86855716
11219,1,0.9373831
11229,1,1.1239119
11239,1,1.2053764
11249,1,1.326261
11259,1,1.7435062
11269,1,1.541969
11279,1,1.261317
11289,1,1.1275756
11299,1,0.9716415
11309,1,0.99744344
11319,1,0.69103754
11329,1,0.6489992
11339,1,0.71612185
11349,1,0.36754918
11359,1,0.5209587
11369,1,0.72636265
11379,1,0.7498939
11389,1,0.6606268
11399,1,0.44047636
11409,1,0.18013442
11419,1,0.8051453
11429,1,0.4981342
11439,1,0.92091876
11449,1,0.38366854
11459,1,0.8056938
11469,1,0.76776695
11479,1,0.5893167
11489,1,0.4632197
11499,1,0.348467
11509,1,0.32731247
11519,1,0.28244162
11529,1,0.29977137
11539,1,0.33225518
11549,1,0.25736886
11559,1,0.34511966
11569,1,0.19030643
11579,1,0.08030295
11589,1,0.047477186
11599,1,0.20536369
11609,1,0.04559976
11619,1,0.003040254
11629,1,0.09700829
11639,1,0.2477361
11649,1,0.21418256
11659,1,0.17315632
11669,1,0.16554165
11679,1,0.11532819
11689,1,0.26627564
11699,1,0.31655687
11709,1,0.23567367
11719,1,0.2098437
11729,1,0.5012009
11739,1,0.9525702
11749,1,0.9929612
11759,1,1.1016991
11769,1,0.9617922
11779,1,0.7921292
11789,1,0.5036613
11799,1,0.60543925
11809,1,0.4877689
11819,1,0.5607572
11829,1,0.4298886
11839,1,0.5639425
11849,1,0.47374135
11859,1,0.18706328
11869,1,0.25286323
11879,1,0.29488897
11889,1,0.31079674
11899,1,-0.04328221
11909,1,0.1193316
11919,1,0.2559442
11929,1,0.25686628
11939,1,0.680167
11949,1,0.56238115
11959,1,0.6291001
11969,1,0.37859225
11979,1,0.40660483
11989,1,0.19503999
11999,1,0.33513325
12009,1,0.34693366
12019,1,0.44349998
12029,1,0.21484011
12039,1,0.21478462
12049,1,0.096542895
12059,1,0.09273952
12069,1,0.107497394
12079,1,0.060145378
12089,1,0.21341676
12099,1,0.20402032
12109,1,0.027626753
12119,1,0.014183283
12129,1,-0.20105982
12139,1,0.055094063
12149,1,-0.012989581
12159,1,0.10326153
12169,1,0.088762105
12179,1,0.13604462
12189,1,0.04432702
12199,1,0.011982083
12209,1,0.007921338
12219,1,0.041344702
12229,1,0.21748483
12239,1,0.2703386
12249,1,0.264026
12259,1,0.49256837
12269,1,0.6276488
12279,1,0.7963
12289,1,0.92682904
12299,1,0.94776034
12309,1,0.797186
12319,1,0.72712207
12329,1,0.79706436
12339,1,0.8790116
12349,1,0.95360124
12359,1,1.108551
12369,1,1.2277536
12379,1,1.0695143
12389,1,0.8539855
12399,1,1.0783749
12409,1,0.8291706
12419,1,0.8235991
12429,1,1.063623
12439,1,0.9906049
12449,1,0.84634244
12459,1,1.1557376
12469,1,0.8556165
12479,1,0.7705149
12489,1,0.65292716
12499,1,0.47659802
12509,1,0.12833768
12519,1,0.5448305
12529,1,0.24712086
12539,1,0.22736269
12549,1,0.06052351
12559,1,0.20184964
12569,1,0.09518242
12579,1,0.3394869
12589,1,0.18334788
12599,1,0.18890816
12609,1,0.3692839
12619,1,0.35957223
12629,1,0.2047593
12639,1,0.1353851
12649,1,0.26451433
12659,1,0.02331233
12669,1,0.23658437
12679,1,0.15282458
12689,1,0.28790098
12699,1,0.7395023
12709,1,0.90928954
12719,1,1.0379479
12729,1,1.0387982
12739,1,0.9033897
12749,1,0.6022633
12759,1,0.8938057
12769,1,1.123965
12779,1,1.1395485
12789,1,1.0053988
12799,1,0.99877584
12809,1,0.7044683
12819,1,0.8755761
12829,1,0.90137273
12839,1,0.84115064
12849,1,1.2108691
12859,1,0.7765844
12869,1,1.0116837
12879,1,0.8122743
12889,1,1.1244121
12899,1,0.7134879
12909,1,1.0582329
12919,1,1.044033
12929,1,1.431154
12939,1,1.3560233
12949,1,1.6089821
12959,1,0.90381145
12969,1,1.4431047
12979,1,2.1650941
12989,1,1.6892979
12999,1,1.609844
13009,1,1.5125072
13019,1,1.5704058
13029,1,1.5178814
13039,1,1.9102236
13049,1,2.3683732
13059,1,2.2139978
13069,1,2.3669097
13079,1,2.1753953
13089,1,2.230139
13099,1,2.8322105
13109,1,2.9639432
13119,1,3.229809
13129,1,2.5794728
13139,1,2.7901673
13149,1,2.3404665
13159,1,2.488123
13169,1,1.9672287
13179,1,2.0316777
13189,1,1.9543111
13199,1,1.8668636
13209,1,1.2128102
13219,1,1.0721774
13229,1,0.80827796
13239,1,0.7096475
13249,1,0.5400261
13259,1,0.6726899
13269,1,0.5430872
13279,1,0.5446887
13289,1,0.34255075
13299,1,0.48435318
13309,1,0.39039946
13319,1,0.715125
13329,1,0.7491703
13339,1,0.8087382
13349,1,0.96531326
13359,1,1.0433471
13369,1,1.0185521
13379,1,1.0351423
13389,1,1.2748725
13399,1,1.3524638
13409,1,1.144453
13419,1,1.3821454
13429,1,1.3479797
13439,1,1.079535
13449,1,1.2182245
13459,1,0.92072517
13469,1,0.78014624
13479,1,0.60493606
13489,1,0.54755014
13499,1,0.2547155
13509,1,0.16242057
13519,1,0.20977026
13529,1,0.17826796
13539,1,0.06647819
13549,1,0.08848357
13559,1,0.103654146
13569,1,0.09542215
13579,1,0.08193028
13589,1,0.110997796
13599,1,0.19937646
13609,1,0.38889974
13619,1,0.25927782
13629,1,0.4097914
13639,1,0.25695175
13649,1,0.16321135
13659,1,0.29066324
13669,1,0.2010411
13679,1,0.3210588
13689,1,0.5487157
13699,1,0.40910542
13709,1,0.4707473
13719,1,0.47121185
13729,1,0.16097784
13739,1,0.09108347
13749,1,0.030504763
13759,1,-0.012401938
13769,1,-0.003001511
13779,1,0.061579227
13789,1,0.047628284
13799,1,0.02795142
13809,1,0.1477086
13819,1,0.18800658
13829,1,0.12564594
13839,1,0.21569806
13849,1,0.59313107
13859,1,0.69932634
13869,1,1.0081931
13879,1,0.7071707
13889,1,0.9701734
13899,1,0.85145676
13909,1,0.65669656
13919,1,0.95828354
13929,1,1.4543921
13939,1,1.3650157
13949,1,1.2251925
13959,1,1.1288579
13969,1,1.2292302
13979,1,0.9508518
13989,1,0.7140523
13999,1,0.8713766
14009,1,0.525172
14019,1,0.44443333
14029,1,0.4451002
14039,1,0.39163655
14049,1,0.42706686
14059,1,0.42739397
14069,1,0.43549502
14079,1,0.6809815
14089,1,0.71121734
14099,1,0.53067356
14109,1,0.700062
14119,1,0.9137306
14129,1,0.619025
14139,1,1.1410971
14149,1,1.271989
14159,1,1.2346395
14169,1,1.342006
14179,1,1.2129159
14189,1,1.170082
14199,1,1.1181405
14209,1,1.0769747
14219,1,1.0930831
14229,1,1.1123488
14239,1,1.1538465
14249,1,1.0626948
14259,1,0.7027225
14269,1,1.0460145
14279,1,0.8986056
14289,1,0.98729247
14299,1,1.2958155
14309,1,1.0191553
14319,1,0.9118641
14329,1,1.0209455
14339,1,1.0573967
14349,1,1.1645547
14359,1,1.1776063
14369,1,0.89473647
14379,1,0.9044069
14389,1,0.9124874
14399,1,1.075314
14409,1,0.98983556
14419,1,0.94246656
14429,1,0.87890774
14439,1,0.6726226
14449,1,0.8847916
14459,1,1.0182273
14469,1,1.2298567
14479,1,1.0837139
14489,1,1.3735359
14499,1,1.6695645
14509,1,1.6915269
14519,1,1.6445707
14529,1,1.7877505
14539,1,2.0336335
14549,1,2.1070867
14559,1,2.4812584
14569,1,2.7992272
14579,1,2.9900053
14589,1,2.7482462
14599,1,2.5929532
14609,1,2.5192795
14619,1,2.3629222
14629,1,2.1707115
14639,1,2.0126045
14649,1,1.680877
14659,1,1.6660995
14669,1,1.3313425
14679,1,1.1477247
14689,1,0.83484805
14699,1,0.7318476
14709,1,0.6590061
14719,1,0.4642524
14729,1,0.52432436
14739,1,0.66634476
14749,1,0.59888005
14759,1,0.81153816
14769,1,0.80132306
14779,1,0.902266
14789,1,0.80868363
14799,1,0.8125759
14809,1,0.7175025
14819,1,0.63564026
14829,1,0.31461644
14839,1,0.45090395
14849,1,0.42034733
14859,1,0.17085469
14869,1,0.23132193
14879,1,0.19041163
14889,1,0.084528506
14899,1,0.20298195
14909,1,0.15602338
14919,1,0.11519778
14929,1,0.036661386
14939,1,0.08034229
14949,1,0.13733685
14959,1,0.18461221
14969,1,0.20999461
14979,1,0.2605428
14989,1,0.30855417
14999,1,0.45893234
15009,1,0.32184857
15019,1,0.4929142
15029,1,0.53312415
15039,1,0.6344916
15049,1,1.0966613
15059,1,1.1580178
15069,1,1.3158387
15079,1,1.3144307
15089,1,1.8283924
15099,1,1.5708549
15109,1,1.642679
15119,1,1.1970644
15129,1,1.4323306
15139,1,1.1046042
15149,1,1.3051326
15159,1,1.1397443
15169,1,0.8515324
15179,1,0.93974394
15189,1,0.8824384
15199,1,0.9896504
15209,1,0.605335
15219,1,0.9127847
15229,1,1.2523727
15239,1,1.5580482
15249,1,1.6123185
15259,1,1.7209033
15269,1,2.1134205
15279,1,2.318055
15289,1,2.7412066
15299,1,3.1397653
15309,1,2.4723003
15319,1,2.6930604
15329,1,2.8222604
15339,1,2.1471686
15349,1,1.816634
15359,1,2.1060505
15369,1,2.064309
15379,1,1.5176953
15389,1,2.0837302
15399,1,1.7586838
15409,1,1.5767233
15419,1,1.101872
15429,1,1.0720603
15439,1,0.7198727
15449,1,0.44456083
15459,1,0.48134196
15469,1,0.18745333
15479,1,0.13347167
15489,1,0.08865076
15499,1,0.12883252
15509,1,0.092608154
15519,1,0.20284986
15529,1,0.18016118
15539,1,0.07504797
15549,1,0.16043538
15559,1,0.1325379
15569,1,0.08957088
15579,1,0.1976732
15589,1,0.042312324
15599,1,0.13590735
15609,1,-0.034186423
15619,1,-0.015700579
15629,1,-0.026464403
15639,1,-0.06449109
15649,1,-0.06830472
15659,1,0.002919495
15669,1,-0.060838997
15679,1,-0.022208333
15689,1,0.017698944
15699,1,-0.037965715
15709,1,-0.007016182
15719,1,-0.030188024
15729,1,0.05134374
15739,1,0.1287319
15749,1,0.2018547
15759,1,0.17980832
15769,1,0.0343253
15779,1,0.004715085
15789,1,0.05557698
15799,1,0.25034195
15809,1,0.2629469
15819,1,0.20977765
15829,1,0.29805505
15839,1,0.1985547
15849,1,0.3252247
15859,1,0.32204396
15869,1,0.4132344
15879,1,0.3836015
15889,1,0.29250437
15899,1,0.43547708
15909,1,0.38238066
15919,1,0.45546597
15929,1,0.43385893
15939,1,0.42686784
15949,1,0.36743587
15959,1,0.26141196
15969,1,0.1711027
15979,1,0.18164396
15989,1,0.23916024
15999,1,0.2674231
16009,1,0.47609627
16019,1,0.28553438
16029,1,0.33871704
16039,1,0.13519484
16049,1,0.31177127
16059,1,0.22577304
16069,1,0.36270744
16079,1,0.39185715
16089,1,0.21291828
16099,1,0.49659687
16109,1,0.39604664
16119,1,0.5534637
16129,1,0.5012841
16139,1,0.37418348
16149,1,0.39358377
16159,1,0.45699275
16169,1,0.33692056
16179,1,0.27296793
16189,1,-0.13081801
16199,1,0.09382349
