T,S,Score
999,0,1.2495592764011136
1009,0,1.066007890174376
1019,0,1.2186076198243598
1029,0,1.3413678510751317
1039,0,1.2902258842601437
1049,0,1.2292853787917577
1059,0,1.1866374854450434
1069,0,1.197241291808227
1079,0,1.278019745182524
1089,0,1.306768025370466
1099,0,1.5256985389177593
1109,0,1.5261037404826665
1119,0,1.3661508853146898
1129,0,1.3468453796460682
1139,0,1.3482651518914734
1149,0,1.2583393244248646
1159,0,1.2179688281286563
1169,0,1.1870772886020482
1179,0,1.2124736762506123
1189,0,1.175092557314464
1199,0,1.2779627146242591
1209,0,1.1358091937623052
1219,0,1.091344023702762
1229,0,1.2065629563044125
1239,0,1.1368809874362171
1249,0,1.0149065155174357
1259,0,1.1093483761182448
1269,0,1.1459462066056827
1279,0,1.1824755784550658
1289,0,1.2340468720296496
1299,0,1.1581371918972727
1309,0,1.11457286665494
1319,0,1.225437222169963
1329,0,1.0062972006605841
1339,0,1.1384899124933276
1349,0,0.9530030956035485
1359,0,1.0316700626712358
1369,0,0.9932296303841845
1379,0,1.093683071172867
1389,0,1.0387348736888686
1399,0,0.985366442399273
1409,0,0.9262831452524906
1419,0,0.9496722080141283
1429,0,0.9949527015809982
1439,0,1.1131429059475717
1449,0,1.069428937691627
1459,0,1.1408042072179752
1469,0,1.134620115520614
1479,0,1.1952985361925836
1489,0,1.1981251585018253
1499,0,1.2030105949598888
1509,0,1.1190126670631446
1519,0,1.028054472355668
1529,0,1.0836463528424796
1539,0,1.2004631630969373
1549,0,1.1428076245246086
1559,0,1.2503190246906062
1569,0,1.1486601325170307
1579,0,1.1183113840227445
1589,0,1.3240237839586195
1599,0,1.280987225728903
1609,0,1.5578097474191674
1619,0,1.5069615969034629
1629,0,1.6523967412952947
1639,0,1.5487448773882586
1649,0,1.4542263270983753
1659,0,1.3538229489649758
1669,0,1.3654402524621472
1679,0,1.5240460142100616
1689,0,1.6265120037090166
1699,0,1.5056531504456638
1709,0,1.4121704457258073
1719,0,1.3635774418863784
1729,0,1.2475331157761442
1739,0,1.3735722969842452
1749,0,1.2566579317043254
1759,0,1.246861217268831
1769,0,1.316556638019738
1779,0,1.3294677761247098
1789,0,1.156621158199142
1799,0,1.244492422336855
1809,0,1.2876400353533726
1819,0,1.2077572128207734
1829,0,1.211118965120907
1839,0,1.2013812702379145
1849,0,1.1799837231319519
1859,0,1.2981221280844346
1869,0,1.2002404919531438
1879,0,1.223935448607911
1889,0,1.2802163803499742
1899,0,1.1498420535160743
1909,0,1.2667862756369535
1919,0,1.3107086169733626
1929,0,1.073191378692514
1939,0,1.2002667814937518
1949,0,1.2429357844388524
1959,0,1.307882568608149
1969,0,1.3155938275541725
1979,0,1.288652471043645
1989,0,1.261326002201832
1999,0,1.1172765406361804
2009,0,1.1860279591443676
2019,0,1.2408655446987578
2029,0,1.204609210665612
2039,0,1.0684008525140263
2049,0,1.2682930560911487
2059,0,1.0637740828422029
2069,0,1.0756652591133047
2079,0,1.127916059982463
2089,0,1.1240185647526657
2099,0,1.0079861663649212
2109,0,1.0495346717824263
2119,0,1.0753684315699452
2129,0,1.0758266006765842
2139,0,1.0886266157262452
2149,0,1.0421465253952236
2159,0,1.0759966329613126
2169,0,1.2633240664098973
2179,0,1.0718518111769784
2189,0,1.0198557860638735
2199,0,0.8894211735791944
2209,0,1.001256943048905
2219,0,0.8601683119565844
2229,0,0.8852706660581439
2239,0,0.8722895938257132
2249,0,0.8697426841299186
2259,0,0.9293828846350517
2269,0,0.9812251949102847
2279,0,0.9557427031753842
2289,0,0.8511763403572563
2299,0,0.8755220019430029
2309,0,0.9452279516443755
2319,0,1.0076572352323026
2329,0,0.9341031801665289
2339,0,0.9286464772787059
2349,0,0.8513088404693666
2359,0,0.9350209943156883
2369,0,0.9130301135627976
2379,0,0.882162665126708
2389,0,0.9061045106748108
2399,0,0.900344476813915
2409,0,0.921273825863934
2419,0,0.9192114320949794
2429,0,0.9680625114955118
2439,0,1.0391099775503205
2449,0,0.9062787263936262
2459,0,1.0782674301909108
2469,0,0.9887455542054142
2479,0,1.099891770270078
2489,0,1.0998565239802591
2499,0,1.1696042578045742
2509,0,1.1895524442573153
2519,0,1.302273776305329
2529,0,1.3402701409037165
2539,0,1.2430569162801939
2549,0,1.145726349086962
2559,0,1.232929240370576
2569,0,1.13326474315693
2579,0,1.0626817353007592
2589,0,1.1237717362869128
2599,0,1.0625335325483556
2609,0,1.0520539663254116
2619,0,1.0753341155380638
2629,0,1.170907239318519
2639,0,1.177049778018177
2649,0,0.9734366263918885
2659,0,0.966581910112839
2669,0,0.8326813836314602
2679,0,0.9195448072924762
2689,0,1.050720222844424
2699,0,1.1000687404051976
2709,0,0.8732471535769913
2719,0,0.971766700821427
2729,0,1.0281108946390343
2739,0,1.0168267471207617
2749,0,0.8823993930317775
2759,0,0.9989459894858126
2769,0,1.070185655365619
2779,0,1.0130196753619938
2789,0,1.0129214131333197
2799,0,0.9332055452823674
2809,0,0.8735438343582649
2819,0,0.9085856570653903
2829,0,0.8954168484420997
2839,0,0.8706161240220035
2849,0,0.9114597123828597
2859,0,0.8645524936552704
2869,0,0.8528980041571572
2879,0,0.9675738858530216
2889,0,0.9383202998468163
2899,0,0.9603114407280076
2909,0,0.9029178438474351
2919,0,0.9132855113764575
2929,0,0.9422851137418922
2939,0,0.8057616522666224
2949,0,0.9541163756294573
2959,0,0.9403272060459192
2969,0,0.7769638025948792
2979,0,0.8127844470038367
2989,0,0.9207569359884947
2999,0,0.8200367343740901
3009,0,0.918375661730327
3019,0,0.8307620646982736
3029,0,0.8775628828107809
3039,0,0.9046385869530753
3049,0,0.92029657484939
3059,0,0.9399517165380166
3069,0,1.0499121231823274
3079,0,0.9646262931589816
3089,0,0.9821826533954804
3099,0,0.9719286544918956
3109,0,0.9018607627301255
3119,0,0.9440588548739033
3129,0,0.9638598230141893
3139,0,1.0194636647598971
3149,0,1.0305661136511155
3159,0,0.8478555064290177
3169,0,0.8545709477142094
3179,0,0.8859031927070166
3189,0,1.0322633921655229
3199,0,1.1139473337817556
3209,0,0.9527580467931868
3219,0,1.0247947696142747
3229,0,0.8922825138022669
3239,0,0.8942231003382999
3249,0,0.9783607657697841
3259,0,0.9557089239289567
3269,0,0.9716508461078124
3279,0,0.9570565980931107
3289,0,0.9257423942371434
3299,0,0.8184442088483523
3309,0,0.8932421195853326
3319,0,1.0400323231883024
3329,0,1.0710732990972973
3339,0,1.068127903561596
3349,0,1.035398045962768
3359,0,1.0841136448786812
3369,0,0.9046261636691681
3379,0,1.0689526313814024
3389,0,1.071771458277166
3399,0,1.1705719055830572
3409,0,1.1568873838135803
3419,0,1.196140852162352
3429,0,1.1159738348049737
3439,0,1.004514567712435
3449,0,0.9633349469329613
3459,0,0.9554336127420531
3469,0,0.8386097521967811
3479,0,0.971732097558153
3489,0,0.9036958142549311
3499,0,1.0526560483468086
3509,0,1.0158423725480827
3519,0,1.0280824108731186
3529,0,0.9660949187512864
3539,0,0.9936616666549701
3549,0,0.9852414016454382
3559,0,1.1660120500817603
3569,0,1.1421162317402496
3579,0,1.1669151474395754
3589,0,1.1955266248704144
3599,0,1.0554531446189812
3609,0,1.1748821839726336
3619,0,1.1382715503386305
3629,0,1.2929190650831583
3639,0,1.4008279072981478
3649,0,1.4100268493441497
3659,0,1.418757705517922
3669,0,1.3538548325156718
3679,0,1.317162515060836
3689,0,1.4511339902041307
3699,0,1.4159113320637013
3709,0,1.3357461124459373
3719,0,1.3512097616361822
3729,0,1.3320125431446808
3739,0,1.1184065503167593
3749,0,1.0373974730937334
3759,0,0.9649255186208444
3769,0,1.320787299047619
3779,0,1.2747470231027453
3789,0,1.1742151588003653
3799,0,1.2150418173450974
3809,0,1.1970991413878163
3819,0,1.1766690309660095
3829,0,1.416702557486098
3839,0,1.3346112002175705
3849,0,1.2544808452302343
3859,0,1.3337301763590539
3869,0,1.229768603313128
3879,0,1.2781938594089204
3889,0,1.2534504923580998
3899,0,1.2763728065036057
3909,0,1.3240027567026336
3919,0,1.0898010196495018
3929,0,1.0236003256479564
3939,0,1.0290893607971197
3949,0,1.0033004052114132
3959,0,1.0790077243771667
3969,0,0.9567609661680582
3979,0,0.9976889613694135
3989,0,0.9604238648128774
3999,0,0.9954274746091084
4009,0,1.0090808307494556
4019,0,0.9034414942418323
4029,0,1.0215608985484406
4039,0,0.9956045228725577
4049,0,1.086345153094494
4059,0,1.088398578695181
4069,0,0.9850855577700008
4079,0,0.9228730179400576
4089,0,1.001479269703578
4099,0,1.0176781673326158
4109,0,1.005595005473315
4119,0,1.0406278687771888
4129,0,1.0942966347137457
4139,0,1.0935085490426175
4149,0,1.0501603933698487
4159,0,0.9849524440399497
4169,0,1.0016175051731904
4179,0,0.9836418751292139
4189,0,1.111625873588733
4199,0,1.188415739368379
4209,0,1.0505110738293428
4219,0,1.0186084150902213
4229,0,1.0272505437434438
4239,0,1.1030969508330437
4249,0,1.0835529123336876
4259,0,1.1401392694300059
4269,0,1.3625804303986633
4279,0,1.2311317806597895
4289,0,1.1687463102865623
4299,0,1.1680520960762022
4309,0,1.1207203574511957
4319,0,1.2148527966070877
4329,0,1.1975823139834165
4339,0,1.2792804898319599
4349,0,1.2130342447252855
4359,0,1.1432734530306115
4369,0,1.3082806688230832
4379,0,1.2032684354195786
4389,0,1.131134593871515
4399,0,1.1615103332215988
4409,0,1.1711035599912074
4419,0,1.1429254502172375
4429,0,0.879655871826128
4439,0,0.8616138910729133
4449,0,0.9271641461730363
4459,0,0.9727291080356505
4469,0,0.9477868522007988
4479,0,0.9529523860024293
4489,0,0.9381333252830041
4499,0,0.901854273926284
4509,0,0.8574085278916551
4519,0,0.8439648463913046
4529,0,0.8801396132302676
4539,0,0.7699291959437364
4549,0,0.9202523979825378
4559,0,0.8947964745805673
4569,0,0.8805178949555726
4579,0,0.976604565151902
4589,0,0.8342728205623251
4599,0,0.8818921672821846
4609,0,0.9516697703148786
4619,0,0.9645546547939837
4629,0,1.0361686314337022
4639,0,1.0067308004605784
4649,0,0.8635424465103507
4659,0,0.8209492376274229
4669,0,0.849557576155712
4679,0,0.8131102692230591
4689,0,0.8618256598505225
4699,0,0.8129516518558001
4709,0,0.8605806794565891
4719,0,0.901753795531715
4729,0,0.8789198005195642
4739,0,0.872615560742041
4749,0,0.8944209911974912
4759,0,0.8931892700070815
4769,0,0.91727535899569
4779,0,0.9223946554386303
4789,0,1.0231958180524074
4799,0,0.9842108562554073
4809,0,1.0483584206777348
4819,0,0.9429319250502551
4829,0,1.0008311706319715
4839,0,1.022986663973052
4849,0,1.2116563671141438
4859,0,1.0897394876826698
4869,0,1.136151430013559
4879,0,1.0810364217563808
4889,0,1.1816960331721327
4899,0,1.0415289380978714
4909,0,1.2268831927364048
4919,0,1.1670287867049407
4929,0,1.2123424319489389
4939,0,1.341995450824267
4949,0,1.3057180584800419
4959,0,1.4017225559925854
4969,0,1.4610132025462044
4979,0,1.4732534696202542
4989,0,1.409121105109217
4999,0,1.4264812389069543
5009,0,1.3859977956005878
5019,0,1.321891680758296
5029,0,1.3278583637854589
5039,0,1.4637679923502214
5049,0,1.3651068437563723
5059,0,1.365877586135467
5069,0,1.509356755520224
5079,0,1.3456527731050656
5089,0,1.3320469586017543
5099,0,1.327261158670747
5109,0,1.3552139804958139
5119,0,1.235399569706915
5129,0,1.430218111134372
5139,0,1.3699055164924037
5149,0,1.1083960019422354
5159,0,1.190769332086368
5169,0,1.0061038793823953
5179,0,1.0636925008946747
5189,0,1.237256963437136
5199,0,1.1083624320643
5209,0,1.1882216860506558
5219,0,1.0126457013656052
5229,0,1.20272367246779
5239,0,1.2103127815317412
5249,0,1.12512606280217
5259,0,0.9532857775833112
5269,0,1.0994242068622082
5279,0,1.0021653133240662
5289,0,0.9664365489503096
5299,0,1.019778353223602
5309,0,0.9854439763763462
5319,0,0.9784757721806745
5329,0,1.0269668647339256
5339,0,0.9811737511907204
5349,0,0.9947910088119867
5359,0,1.0407731383565997
5369,0,1.119572050364527
5379,0,1.0697086480760865
5389,0,1.079794127631681
5399,0,1.1364576329672549
5409,0,1.165995359261668
5419,0,1.070941309763684
5429,0,1.1480734857441652
5439,0,1.2138013788315993
5449,0,1.1300556539533178
5459,0,1.1631427328837134
5469,0,1.2595760670709388
5479,0,1.1857026902270262
5489,0,1.162603496366287
5499,0,1.1804977638488323
5509,0,1.2058033128891532
5519,0,1.0415129987191676
5529,0,1.0991205204984305
5539,0,1.0511363798605335
5549,0,1.1193084043876003
5559,0,1.2100315886833883
5569,0,1.243190368211373
5579,0,1.268078508229943
5589,0,1.2525811704584475
5599,0,1.0474428444439308
5609,0,1.279958076572798
5619,0,1.1526988246447802
5629,0,1.1785777329153533
5639,0,1.100510469296429
5649,0,1.04590032472939
5659,0,0.9289136064861034
5669,0,1.0571079182904128
5679,0,1.1048771450049586
5689,0,1.0395377964778425
5699,0,1.1416375669989351
5709,0,1.0742356793310261
5719,0,1.184146734124719
5729,0,1.0373144261917089
5739,0,1.1414956717922728
5749,0,1.0508617435497418
5759,0,0.9635739869636105
5769,0,1.117893187332204
5779,0,1.10116628126536
5789,0,0.9376853277721613
5799,0,1.0015836607089432
5809,0,1.065701370812092
5819,0,1.1933578579459811
5829,0,1.059382056613476
5839,0,1.0414660451664663
5849,0,1.0593009754632534
5859,0,1.07277289560493
5869,0,1.1789625500305247
5879,0,1.0370784397864377
5889,0,1.1525884027038753
5899,0,1.0933399780029878
5909,0,1.1925721203928306
5919,0,1.1533685057610976
5929,0,1.1160486016985114
5939,0,1.1393393937801055
5949,0,1.0478379815010155
5959,0,0.9540998763410328
5969,0,1.0947846162645178
5979,0,1.0064283351358556
5989,0,1.0154904377332978
5999,0,1.2151278712672897
6009,0,1.0128682193132015
6019,0,1.068277635969695
6029,0,1.1162063152591697
6039,0,1.1646226276260367
6049,0,1.0801007151608155
6059,0,0.9977503553315634
6069,0,0.9728145820742984
6079,0,1.1422882597440585
6089,0,1.0423715212907654
6099,0,1.0057014861471927
6109,0,1.086853148005306
6119,0,1.065374686499134
6129,0,1.08394393457833
6139,0,0.978389354457414
6149,0,0.93554627290442
6159,0,0.9392502900145455
6169,0,0.9124315819297942
6179,0,0.8854029614388802
6189,0,1.0213199094423047
6199,0,0.9893389224310375
6209,0,0.9662257425746344
6219,0,0.9423539701650021
6229,0,1.0566962406064229
6239,0,1.1841274358709613
6249,0,1.1037881031496932
6259,0,1.0558167047700826
6269,0,1.1359381202723706
6279,0,1.1305062467476001
6289,0,1.1185517142841754
6299,0,1.211837357923936
6309,0,1.2377140821283934
6319,0,1.238843975363774
6329,0,1.2381900740559317
6339,0,1.2035661575687961
6349,0,1.0644302518660291
6359,0,1.105037121356592
6369,0,1.0874178560490284
6379,0,1.032356377616917
6389,0,1.0476253658142227
6399,0,0.9233180326002522
6409,0,0.9327793473008598
6419,0,1.0112056308001338
6429,0,0.976255696800756
6439,0,1.1392101838212554
6449,0,0.9543835986896902
6459,0,1.1372858126819447
6469,0,0.9806403633370061
6479,0,0.9763032368588113
6489,0,0.8952688922639184
6499,0,1.0047417767697033
6509,0,0.9500681439550981
6519,0,1.0513030404879455
6529,0,1.0670916965327726
6539,0,1.0509786883568304
6549,0,1.2104416942319762
6559,0,0.9893149862389005
6569,0,1.003569302553002
6579,0,1.025051821704857
6589,0,1.009083370112344
6599,0,1.0322112954855334
6609,0,1.009521036202915
6619,0,0.9411762699411094
6629,0,0.9359483208070793
6639,0,1.0044957712293403
6649,0,1.0595199745359596
6659,0,0.9333040142628027
6669,0,0.9665107722153022
6679,0,0.9642090449095824
6689,0,0.9508780377982877
6699,0,0.9933516856512867
6709,0,0.9737163054831592
6719,0,0.9831799103402685
6729,0,1.0012899270465376
6739,0,1.0568146599942092
6749,0,0.9598463879410208
6759,0,1.1071158399470418
6769,0,1.1315590753128595
6779,0,1.1244707622369976
6789,0,1.1858106665080572
6799,0,1.06912880353564
6809,0,1.082299838457514
6819,0,1.0748973287969266
6829,0,1.12722312998197
6839,0,1.1793797906491474
6849,0,1.1579886730635462
6859,0,1.166833772773579
6869,0,1.0900196159840545
6879,0,1.0867979712261557
6889,0,1.0407260703576042
6899,0,1.0162720802277003
6909,0,0.919367893878307
6919,0,1.0479707299877816
6929,0,1.1312269995160764
6939,0,1.0873106977732228
6949,0,1.0767369476759976
6959,0,1.1691884736211775
6969,0,1.01955636930919
6979,0,1.066426889513501
6989,0,1.0277208753330773
6999,0,1.0695891187596072
7009,0,0.956299483293427
7019,0,1.172175055601867
7029,0,1.1856267054208562
7039,0,1.1107154345537298
7049,0,1.2079991909661918
7059,0,1.200777335690517
7069,0,1.13989850190921
7079,0,1.0343755880832928
7089,0,1.0859594738061673
7099,0,1.2549087931571774
7109,0,1.1418355798458915
7119,0,1.1232962147192525
7129,0,1.0609583857820903
7139,0,1.0366968285483058
7149,0,1.039379748695482
7159,0,0.968456528579833
7169,0,0.9192302860100098
7179,0,0.9024871284610476
7189,0,0.9247865330564529
7199,0,1.0751423149442152
7209,0,1.018419497211462
7219,0,0.9332030117344279
7229,0,1.099808490567892
7239,0,1.092604470231219
7249,0,0.9811969474640883
7259,0,1.0459034658351047
7269,0,1.178368827027904
7279,0,1.2267701681562375
7289,0,1.2692823616363325
7299,0,1.1655890847486006
7309,0,1.1212279925228024
7319,0,1.2581066389315396
7329,0,1.1594668729495634
7339,0,1.2026595186420501
7349,0,1.229172123727814
7359,0,1.0445993360872363
7369,0,1.139355480916783
7379,0,1.2047433885495797
7389,0,1.1651677162874923
7399,0,1.0983511215206896
7409,0,1.1138328729647773
7419,0,0.9910324202472713
7429,0,1.0910249395728338
7439,0,0.9742603781347862
7449,0,1.0341787844770414
7459,0,1.0668798746867316
7469,0,1.0505488182260054
7479,1,0.9409716253057858
7489,1,1.0241541157234466
7499,1,1.134566369819012
7509,1,1.253575894437007
7519,1,1.2489413100876463
7529,1,1.395247404932094
7539,1,1.459750091153008
7549,1,1.623988612863581
7559,1,1.601413380715674
7569,1,1.74086562188311
7579,1,1.7728412652000956
7589,1,1.8746214291316952
7599,1,2.0228321197215005
7609,1,2.2427719708031244
7619,1,2.1213114664266683
7629,1,2.1941266630945897
7639,1,2.250220986896187
7649,1,2.4394302827546563
7659,1,2.3902361278560207
7669,1,2.4319955729137517
7679,1,2.7902706169085754
7689,1,2.7169022685845823
7699,1,2.9361275619538585
7709,1,2.8110907236705702
7719,1,3.1594221650558985
7729,1,3.0811682966794756
7739,1,3.256293212457943
7749,1,3.465963397824635
7759,1,3.5501400231470637
7769,1,3.786202021638953
7779,1,3.88345069169487
7789,1,4.065239010342834
7799,1,4.054247495072789
7809,1,4.259061021499678
7819,1,4.525798052165193
7829,1,4.690968103274152
7839,1,4.874717444958841
7849,1,4.981959911568824
7859,1,5.160530624511566
7869,1,5.417013509508777
7879,1,5.5297446030594735
7889,1,5.625892553198304
7899,1,5.942589286173816
7909,1,6.286079891005709
7919,1,6.69727663844739
7929,1,6.850673364915069
7939,1,7.005332460530713
7949,1,7.233750200662532
7959,1,7.463408756056262
7969,1,7.673775371230138
7979,1,7.657823176538018
7989,1,7.6039847007399235
7999,1,7.360876865095473
8009,1,7.3996368945693245
8019,1,7.189304205448236
8029,1,7.091104179784039
8039,1,6.8674097361812745
8049,1,6.700079526440416
8059,1,6.597808139385016
8069,1,6.3279746238657335
8079,1,6.105036107614556
8089,1,6.214055671108383
8099,1,5.944431773710915
8109,1,5.641103027026089
8119,1,5.327316973999441
8129,1,5.135130991869349
8139,1,4.823163932269555
8149,1,4.699662116225989
8159,1,4.94723022322774
8169,1,4.566703296668782
8179,1,4.499699713362684
8189,1,4.290360927307672
8199,1,4.315138255200557
8209,1,4.22630155963504
8219,1,4.066628341506576
8229,1,3.95411318530447
8239,1,4.01037898444182
8249,1,3.8342197558111852
8259,1,3.971674804157262
8269,1,3.906244375048983
8279,1,4.031857252365857
8289,1,4.119611450172363
8299,1,3.829450218468564
8309,1,3.5879709647323255
8319,1,3.585779551401887
8329,1,3.627074743114984
8339,1,3.496318841190721
8349,1,3.322911159833943
8359,1,2.9109458626727442
8369,1,2.806539135469428
8379,1,2.8682831551439456
8389,1,2.563446714142916
8399,1,2.5298614216695694
8409,1,2.5215873650101472
8419,1,2.4395929777838856
8429,1,2.260479472318537
8439,1,2.3441279194666143
8449,1,2.3729231844915564
8459,1,2.176888894618057
8469,1,2.1329413701790916
8479,1,2.0891020086181857
8489,1,2.3718170857630043
8499,1,2.4777552537867518
8509,1,2.467058104761474
8519,1,2.6696520554432426
8529,1,2.655972066271022
8539,1,2.5811568100447904
8549,1,2.49515918420557
8559,1,2.5099888263258467
8569,1,2.365274075929462
8579,1,2.2050884730121245
8589,1,2.24548495870805
8599,1,2.1868768745649536
8609,1,2.1344181141446272
8619,1,2.1402711102420726
8629,1,1.992522177953554
8639,1,2.177977741646035
8649,1,2.002050058047984
8659,1,1.9626364223216668
8669,1,2.1431674257930133
8679,1,2.1828301761397197
8689,1,2.1691477229042286
8699,1,2.3140846971794273
8709,1,2.076469599213132
8719,1,2.320599335571779
8729,1,2.094631379996292
8739,1,2.239201992412447
8749,1,2.5317282647753743
8759,1,2.6810236199145248
8769,1,3.0001800068887894
8779,1,3.199116262075311
8789,1,3.324343422839183
8799,1,3.5823300941501284
8809,1,3.5008874543166177
8819,1,3.276652540309275
8829,1,3.3970547635128856
8839,1,3.344564315148847
8849,1,3.024995573252123
8859,1,2.9779861941315837
8869,1,2.8916032319379346
8879,1,2.555575402426645
8889,1,2.5495527319416595
8899,1,2.3365497162449396
8909,1,2.33140255666138
8919,1,2.263302156985479
8929,1,2.2105432071443514
8939,1,2.218871015775417
8949,1,2.4277055144829323
8959,1,2.1282922574393943
8969,1,2.185774762971711
8979,1,2.4764072104836723
8989,1,2.459970807359091
8999,1,2.4670414804805025
9009,1,2.134008669367137
9019,1,2.3038340774291064
9029,1,2.2022939190966455
9039,1,2.1120240426512176
9049,1,2.324072371825939
9059,1,2.0790092698902045
9069,1,2.0888768259664
9079,1,1.897461919533037
9089,1,1.9001621203868446
9099,1,1.931626249818449
9109,1,1.9491976224066256
9119,1,1.990661649813015
9129,1,2.029026543864845
9139,1,1.8907940711620588
9149,1,1.9523187508518343
9159,1,2.1480533843728358
9169,1,2.2613663220233002
9179,1,2.7255837608311406
9189,1,2.709846055377242
9199,1,2.732109254111114
9209,1,2.8214630387108306
9219,1,2.7944563392593986
9229,1,2.8335128544441064
9239,1,3.058405630116641
9249,1,2.9569235512778853
9259,1,3.089042796278206
9269,1,2.895509434058705
9279,1,2.857474103522243
9289,1,2.870291869726488
9299,1,2.5065737012647253
9309,1,2.4433396660314344
9319,1,2.7335674090646513
9329,1,2.4345503834394364
9339,1,2.3855811704405023
9349,1,2.6851524199203753
9359,1,2.634971502704187
9369,1,2.7691965302490207
9379,1,2.6542876769110846
9389,1,2.7297433648213056
9399,1,2.6407588316696327
9409,1,2.7969637877985587
9419,1,2.749919610823307
9429,1,2.9020913011867933
9439,1,2.3954163350685653
9449,1,2.464791351319378
9459,1,2.5470037700372847
9469,1,2.587900839536197
9479,1,2.4029887317306615
9489,1,2.284527946579783
9499,1,2.2973636639677997
9509,1,2.316671874870342
9519,1,2.1731828422640405
9529,1,2.1671007079314824
9539,1,2.2130886346038086
9549,1,2.1194454638044924
9559,1,2.212942050756089
9569,1,2.333476948008425
9579,1,2.392262370656556
9589,1,2.3849686601572775
9599,1,2.487320264355776
9609,1,2.4951734030945625
9619,1,2.617984467201895
9629,1,2.8114252487559495
9639,1,2.8565627366641464
9649,1,3.1073149660828454
9659,1,3.058721917255176
9669,1,2.8868431218944313
9679,1,2.654318144111036
9689,1,2.720124001052069
9699,1,2.5545518370228972
9709,1,2.1625966223341084
9719,1,2.094375281305178
9729,1,1.848694531529367
9739,1,2.0783008714626323
9749,1,1.9641349084896003
9759,1,2.049742062309773
9769,1,1.803536468031277
9779,1,1.6049489334345601
9789,1,1.5142076725444666
9799,1,1.495258201505609
9809,1,1.478350272796106
9819,1,1.3936474156554683
9829,1,1.466998055707296
9839,1,1.5233046641649115
9849,1,1.5335393656374496
9859,1,1.7998267853082524
9869,1,1.87966833675666
9879,1,1.7752749530381353
9889,1,1.779671308638159
9899,1,1.9019399636498913
9909,1,1.8633550296821708
9919,1,1.8223166251013654
9929,1,1.9548410531901164
9939,1,1.8446812227705496
9949,1,1.7701524152380328
9959,1,2.0393409393715896
9969,1,2.2664020089701395
9979,1,2.3263723129103413
9989,1,2.6661418871528024
9999,1,2.779584317459349
10009,1,2.760965338763154
10019,1,2.9096153034061603
10029,1,3.1025509468411125
10039,1,3.107396008332432
10049,1,3.46853894789595
10059,1,3.4394897432203444
10069,1,3.3841451595824057
10079,1,3.381186970535009
10089,1,3.2648999397199048
10099,1,3.2746210981069477
10109,1,2.92448020160121
10119,1,2.6983702591568406
10129,1,2.8383804751726633
10139,1,2.721203043461716
10149,1,2.566402607608935
10159,1,2.8442849815820925
10169,1,2.853534139372748
10179,1,3.0472714264020153
10189,1,2.9940672563799184
10199,1,3.238826973546189
10209,1,3.4100712336032917
10219,1,3.672040101576088
10229,1,3.4708814765338087
10239,1,3.7865199525594426
10249,1,3.756540612788273
10259,1,3.5458320377998014
10269,1,3.2709527381953545
10279,1,3.2223672648044737
10289,1,3.0662559631902093
10299,1,3.46936804457013
10309,1,3.729237743104964
10319,1,4.116683505284877
10329,1,4.237751965920618
10339,1,4.54514255819411
10349,1,4.89882993738794
10359,1,4.911161090560348
10369,1,4.967878104582153
10379,1,4.739469519462844
10389,1,4.14586370368502
10399,1,3.7399824449918797
10409,1,3.622403520261393
10419,1,3.146365517233358
10429,1,2.5988768739959274
10439,1,2.6563141327179567
10449,1,2.311794442810347
10459,1,2.0071604399843395
10469,1,1.7680599528609706
10479,1,1.6610378681425182
10489,1,1.6932567201599065
10499,1,1.4869027595442843
10509,1,1.6022674773178156
10519,1,1.6389762666965968
10529,1,1.6014464912719741
10539,1,1.6372333884736454
10549,1,1.8058113062378731
10559,1,1.5612440510191405
10569,1,1.6694026011735428
10579,1,1.7103508202627908
10589,1,1.812549454136028
10599,1,1.7131226113549338
10609,1,1.897415275054743
10619,1,1.8282221954635902
10629,1,1.9465383838000172
10639,1,2.020957127349332
10649,1,2.0960248032929263
10659,1,2.0534793500640154
10669,1,1.9200904674608457
10679,1,2.067093380288284
10689,1,1.9880105637623822
10699,1,2.191491093090333
10709,1,2.3210779830724
10719,1,2.4459791254476877
10729,1,2.4498568821410522
10739,1,2.46736515439291
10749,1,2.5255011802990155
10759,1,2.403973209727594
10769,1,2.407446518425501
10779,1,2.5197831954820926
10789,1,2.669978627508529
10799,1,2.82175329499392
10809,1,2.8932974381359795
10819,1,3.483261181892844
10829,1,3.506571920121068
10839,1,4.05072131310117
10849,1,3.818983775498181
10859,1,4.16093006309713
10869,1,3.7786358437084338
10879,1,3.669018366332395
10889,1,3.2261683750093777
10899,1,2.9999165978273465
10909,1,2.8578380078381764
10919,1,2.3884758064198754
10929,1,2.46984535456515
10939,1,2.2812518954886487
10949,1,2.1845019914182995
10959,1,2.1667513187879344
10969,1,1.923419786391319
10979,1,1.9721768262433332
10989,1,1.932309706339266
10999,1,1.8656565798941123
11009,1,1.7570362792028562
11019,1,1.8266247153623683
11029,1,1.8107403639844877
11039,1,2.1023652745078385
11049,1,2.128985149194426
11059,1,2.398075947742605
11069,1,2.3462027740557843
11079,1,2.630036787459984
11089,1,2.8723255664471994
11099,1,3.13301448294193
11109,1,3.3411053028491753
11119,1,3.4287531440056953
11129,1,3.4166030791310016
11139,1,3.6300773998263955
11149,1,3.7486071854737686
11159,1,3.486485964888243
11169,1,3.290198780719451
11179,1,3.0268859142403723
11189,1,2.9414182567804987
11199,1,2.7256151483963666
11209,1,2.3265399131904188
11219,1,2.5470740451518274
11229,1,2.4861557863917767
11239,1,2.763614862274852
11249,1,2.8154965360607482
11259,1,3.0426207314038662
11269,1,3.020260112392035
11279,1,2.8524930049106234
11289,1,2.8877964542637757
11299,1,2.691490013366386
11309,1,2.5430097484042222
11319,1,2.4209657146384442
11329,1,2.400834333770036
11339,1,2.6072091511728233
11349,1,2.2921949467197065
11359,1,2.1160224769063447
11369,1,2.307349443280808
11379,1,2.324977237062802
11389,1,2.5601438582803944
11399,1,3.0716887600289944
11409,1,3.3236549341372292
11419,1,3.4800365131856656
11429,1,3.745424565272267
11439,1,3.280675329801025
11449,1,3.0805975470812985
11459,1,3.0230184247538414
11469,1,3.2364640159249776
11479,1,3.037292085069695
11489,1,3.0536299042681696
11499,1,3.1332658325479006
11509,1,3.01059358385252
11519,1,3.0472371788035475
11529,1,3.062377840381514
11539,1,2.652961081002597
11549,1,2.6270651061603347
11559,1,2.505698646586033
11569,1,2.277941763919399
11579,1,2.31727145581217
11589,1,2.1187106610879
11599,1,1.9599111112255563
11609,1,1.874343104394175
11619,1,1.5089098858112862
11629,1,1.4611739135168793
11639,1,1.318739316402064
11649,1,1.2857007505740234
11659,1,1.1975132869220142
11669,1,1.2472172982138345
11679,1,1.0640559010906654
11689,1,1.1901087060871236
11699,1,1.160359420643423
11709,1,1.2136350043265107
11719,1,1.1164126126342517
11729,1,1.0035753087797425
11739,1,0.9524407120966429
11749,1,0.9538688937822344
11759,1,0.8291731657808996
11769,1,0.8465898726095418
11779,1,0.8939170954908245
11789,1,0.9685898224492865
11799,1,1.0322297925613135
11809,1,1.173668421201581
11819,1,1.3316070382322949
11829,1,1.4591191991584371
11839,1,1.4606717775302431
11849,1,1.4838157693939615
11859,1,1.6866065971142088
11869,1,1.6652419948332888
11879,1,1.6881395843059317
11889,1,1.5659361431813177
11899,1,1.5884088832022132
11909,1,1.5370607055309384
11919,1,1.6097315041126252
11929,1,1.789634410432051
11939,1,1.7201541687210409
11949,1,1.9677673183631108
11959,1,1.881180564470993
11969,1,1.9913105607149515
11979,1,2.1184223096520443
11989,1,2.164478871165489
11999,1,2.192895377732494
12009,1,2.082566958637652
12019,1,2.107171224019895
12029,1,2.2603773035614507
12039,1,2.7860415912448246
12049,1,2.7243088439879717
12059,1,2.324810303541062
12069,1,2.2997895310161582
12079,1,2.157507239840669
12089,1,1.993647950732276
12099,1,2.27852851786992
12109,1,2.493337589519339
12119,1,2.562764851431007
12129,1,3.0121291631364464
12139,1,3.216244872141923
12149,1,3.3898564001462845
12159,1,3.2593123044333345
12169,1,3.4406772889469215
12179,1,3.247366140786901
12189,1,3.3889102264236906
12199,1,3.420965680503357
12209,1,3.377571678463427
12219,1,3.496485993078377
12229,1,3.7046448874206432
12239,1,3.9191555591043294
12249,1,4.0523333079364665
12259,1,4.0388743501443685
12269,1,3.774598016858448
12279,1,3.6525522087040225
12289,1,3.1284758962615076
12299,1,3.1080421379548864
12309,1,3.1486982739132614
12319,1,2.8181418485552907
12329,1,2.7330945493779
12339,1,2.790332910639876
12349,1,2.8212119930689843
12359,1,2.6816251344769473
12369,1,2.4190366226763103
12379,1,2.331552097274929
12389,1,2.4812608125071716
12399,1,2.453816462732229
12409,1,2.4397138328340953
12419,1,2.4779505682170866
12429,1,2.684986102770398
12439,1,2.5237339297984662
12449,1,2.390530565045545
12459,1,2.326337044627465
12469,1,2.261534382556259
12479,1,2.2480320626778223
12489,1,1.985938561161845
12499,1,1.6898466941597066
12509,1,1.6375044320259176
12519,1,1.606940001274929
12529,1,1.480683656001104
12539,1,1.5242983566238317
12549,1,1.4123003672294812
12559,1,1.6679467525323672
12569,1,1.6880309630442032
12579,1,1.907713489520817
12589,1,2.015606711090119
12599,1,2.3165093854924237
12609,1,2.1679892958426192
12619,1,1.8676439417061501
12629,1,1.9300009845080643
12639,1,1.9632897825475197
12649,1,1.639857792862124
12659,1,1.7061604488401891
12669,1,1.5002647627833403
12679,1,1.4465037777555945
12689,1,1.2953224209057295
12699,1,1.3762875385621594
12709,1,1.0812072842215843
12719,1,1.2568966854298163
12729,1,1.062730986762724
12739,1,1.1590111336240612
12749,1,1.0322802213702265
12759,1,0.9856909412235465
12769,1,1.0051311083408394
12779,1,1.0204148721762656
12789,1,1.0869752231855372
12799,1,1.17677955419403
12809,1,0.9945319253145901
12819,1,0.9945904749759631
12829,1,1.3926488724060009
12839,1,1.2110330031365646
12849,1,1.2238009242795487
12859,1,1.1147829164066214
12869,1,1.021116859727735
12879,1,1.0909503554994653
12889,1,1.2072137886054182
12899,1,1.1754499854978033
12909,1,1.3183975417468252
12919,1,1.295858386960563
12929,1,1.2200098128366397
12939,1,1.0869867191843825
12949,1,1.0675747233000414
12959,1,0.9836126717122079
12969,1,1.1032500059108994
12979,1,1.3514085072432425
12989,1,1.1854884892638666
12999,1,1.278302291652706
13009,1,1.2971132138167514
13019,1,1.6441719311221037
13029,1,1.5281859952075354
13039,1,1.8140437445862008
13049,1,1.9476797687466665
13059,1,1.7952013780451057
13069,1,1.669751430231129
13079,1,1.6877852355078904
13089,1,1.5580179918484456
13099,1,1.5883318639298267
13109,1,1.655122521926373
13119,1,1.6511734134403664
13129,1,1.5377038842494517
13139,1,1.4308551376607428
13149,1,1.3775346683104097
13159,1,1.594704890478765
13169,1,1.4832373591222001
13179,1,1.376099867045279
13189,1,1.4467503991848991
13199,1,1.5194957620112504
13209,1,1.3251678614489437
13219,1,1.4777196066754679
13229,1,1.4461522163138711
13239,1,1.4914023529618725
13249,1,1.6085852542027645
13259,1,1.5059254430845734
13269,1,1.4720639820543744
13279,1,1.5964087697025138
13289,1,1.4673837319373473
13299,1,1.2692447083661038
13309,1,1.345884814455668
13319,1,1.3522393207137522
13329,1,1.2844077068848567
13339,1,1.4701636895186343
13349,1,1.4716851577488415
13359,1,1.338648339558668
13369,1,1.5855089868514713
13379,1,1.6518728462439787
13389,1,1.5025415568050104
13399,1,1.2952979369694673
13409,1,1.4790761351491386
13419,1,1.3783533116688316
13429,1,1.3451855480927806
13439,1,1.4214524195577096
13449,1,1.3884713300661218
13459,1,1.4277402155508103
13469,1,1.3035826046549013
13479,1,1.198981477238535
13489,1,1.060696599121639
13499,1,1.0081194891426324
13509,1,0.8835632611061547
13519,1,1.0030493652292538
13529,1,0.9419674282564081
13539,1,0.9483364674303896
13549,1,1.2360484527162943
13559,1,1.2196761579160285
13569,1,1.0605783774972373
13579,1,1.0480873062694491
13589,1,1.011650126585845
13599,1,1.205517344045482
13609,1,1.140541876995062
13619,1,1.059506048839157
13629,1,0.9847588000283506
13639,1,1.0827367300236272
13649,1,1.055938678439128
13659,1,1.0308285177356993
13669,1,1.0434672639323392
13679,1,1.0943573148300827
13689,1,1.3514394436960564
13699,1,1.2546765398010256
13709,1,1.353936585970981
13719,1,1.2955665137330228
13729,1,1.4159266597760714
13739,1,1.268906298962061
13749,1,1.3363759649235116
13759,1,1.2213251802638216
13769,1,1.1226844659557416
13779,1,0.922564584478977
13789,1,1.1212191959838242
13799,1,0.9797077020323346
13809,1,1.0981535066494503
13819,1,1.1289814451184401
13829,1,1.1913547413526289
13839,1,1.1624544007440607
13849,1,0.9174754343832014
13859,1,0.9782508938050889
13869,1,1.0287756573411604
13879,1,1.0116700662657894
13889,1,1.0304369252251702
13899,1,1.034981790436398
13909,1,1.0300836611062143
13919,1,1.2065727873274619
13929,1,1.1637257494876567
13939,1,1.033872815341955
13949,1,1.1104725648981284
13959,1,1.1635738039258559
13969,1,1.1611454630813867
13979,1,1.2806962320462116
13989,1,1.1597683077832568
13999,1,1.2154979065442704
14009,1,1.2651081041499768
14019,1,1.4420488586081288
14029,1,1.4412264963113577
14039,1,1.4539767910278976
14049,1,1.5038033142533702
14059,1,1.5599553709746952
14069,1,1.3724980738627226
14079,1,1.2628602346180833
14089,1,1.389360817879899
14099,1,1.2459194921627892
14109,1,1.5117316127516138
14119,1,1.489343420640187
14129,1,1.2549970502861512
14139,1,1.3199271396103955
14149,1,1.2944394128145784
14159,1,1.2581315578560244
14169,1,1.0861455406752898
14179,1,0.9711576913240256
14189,1,1.1106697931760807
14199,1,1.0879370308452498
14209,1,1.15951818041716
14219,1,1.2200975361831221
14229,1,1.2213021778364455
14239,1,1.2433732223214475
14249,1,1.0807518177246531
14259,1,1.1885695381509624
14269,1,1.2535066998319984
14279,1,1.351507514480638
14289,1,1.4289562881222824
14299,1,1.4689201502485292
14309,1,1.346265145079241
14319,1,1.472715884482069
14329,1,1.6614012794607267
14339,1,1.6091327879500759
14349,1,1.5616091558459844
14359,1,1.7219134272163408
14369,1,1.6377741942249509
14379,1,1.610186838754039
14389,1,1.3764977290019016
14399,1,1.3147079475914911
14409,1,1.1934454055943857
14419,1,1.2919616873071704
14429,1,1.2213927852944133
14439,1,1.19791618811472
14449,1,1.3354505354305541
14459,1,1.204796351689915
14469,1,1.1852488634911589
14479,1,1.1010395958045667
14489,1,1.1769117123403785
14499,1,1.1423289970325947
14509,1,1.258930591439239
14519,1,1.2904891042673257
14529,1,1.2092179621342205
14539,1,1.2152768957873503
14549,1,1.2677886412551682
14559,1,1.1707651244064246
14569,1,1.2383896321540715
14579,1,1.209392875162485
14589,1,1.1815476552629112
14599,1,1.2079927903939858
14609,1,1.1509363448620413
14619,1,0.9211119438331463
14629,1,0.9295804509728388
14639,1,1.0588875094570582
14649,1,0.9019000520053372
14659,1,0.9696353767097943
14669,1,0.9978143133249956
14679,1,0.9915715454016721
14689,1,1.002745380974728
14699,1,0.964620588053989
14709,1,0.9479551214023159
14719,1,0.9782540066385799
14729,1,1.0098953008435159
14739,1,0.8881799837306793
14749,1,0.8635500778869186
14759,1,0.9186612647774816
14769,1,0.8546903122421974
14779,1,0.9189001439968802
14789,1,1.0398172410960762
14799,1,0.9710926792774347
14809,1,1.0707544534740852
14819,1,1.0897129936059258
14829,1,1.177711675373751
14839,1,1.4814206713030538
14849,1,1.4771896036952592
14859,1,1.6372515699167607
14869,1,1.8255872719253714
14879,1,1.71000819606888
14889,1,1.5205108708681754
14899,1,1.4381633545190025
14909,1,1.3500591784718827
14919,1,1.4756021988651435
14929,1,1.5885402223237484
14939,1,1.7327574299201778
14949,1,1.7101305093666435
14959,1,1.6847581684880872
14969,1,1.452032142359058
14979,1,1.529848829393186
14989,1,1.666462191419809
14999,1,1.7541370812317605
15009,1,1.8279920989585985
15019,1,1.9368806693233842
15029,1,1.6957687456055082
15039,1,1.5439456938594964
15049,1,1.5629811945299794
15059,1,1.6543405661320048
15069,1,1.8704011370579645
15079,1,1.7068296494310526
15089,1,1.6981887273712455
15099,1,1.7105475380696349
15109,1,1.653159559422587
15119,1,1.7144624466259464
15129,1,1.4401692266116384
15139,1,1.6505426689862726
15149,1,1.561576735777283
15159,1,1.6204976720013282
15169,1,1.5564204831742898
15179,1,1.6718399527656698
15189,1,1.7183398009968398
15199,1,1.7266516632833318
15209,1,1.8047116068471603
15219,1,1.7515635185164615
15229,1,1.846600310466759
15239,1,2.0285643486910785
15249,1,1.9313515036788254
15259,1,1.698671291711131
15269,1,1.6195249615969718
15279,1,1.5269809767780638
15289,1,1.5000441713264794
15299,1,1.411483132141065
15309,1,1.5806763431814048
15319,1,1.3950117741127228
15329,1,1.463966031550193
15339,1,1.6735110169044167
15349,1,1.6622500522118089
15359,1,1.5929504759980917
15369,1,1.8466482233808963
15379,1,1.8013196099359807
15389,1,1.7665558854759993
15399,1,1.6632770470107237
15409,1,1.45275799124529
15419,1,1.5013880250180776
15429,1,1.5114635110395127
15439,1,1.495724395344864
15449,1,1.4370670693340828
15459,1,1.2942575067729913
15469,1,1.163163277154121
15479,1,1.047496459282288
15489,1,0.9439480876092725
15499,1,0.9455698530367213
15509,1,0.8133303492673241
15519,1,0.9576458263340712
15529,1,0.9726092088778483
15539,1,1.0868600820203402
15549,1,1.129528848015647
15559,1,1.122918769449944
15569,1,1.1914247884258948
15579,1,1.2291390373019424
15589,1,1.143423906593128
15599,1,1.0694330014869444
15609,1,1.1138653349018695
15619,1,1.2590627946052173
15629,1,1.2371648151790353
15639,1,1.5057088230829543
15649,1,1.3835581368601217
15659,1,1.5000610188286123
15669,1,1.4994327661259537
15679,1,1.5414340035736405
15689,1,1.614062990422913
15699,1,1.7703012534070968
15709,1,1.6294824463919968
15719,1,1.5455667062504177
15729,1,1.6841350365236667
15739,1,1.4180214931176756
15749,1,1.4018695758517439
15759,1,1.2706095716068715
15769,1,1.3135058341465518
15779,1,1.2430496761100844
15789,1,1.2393693777841235
15799,1,1.2136507637391494
15809,1,1.2834148742857174
15819,1,1.46862152787318
15829,1,1.6709258482819644
15839,1,1.5877320116146743
15849,1,1.6320671355160263
15859,1,1.6219029595962395
15869,1,1.7965423120987003
15879,1,1.8588509885079332
15889,1,1.7163716796664221
15899,1,1.5571895902390607
15909,1,1.4950881398268068
15919,1,1.6066389757100175
15929,1,1.7296646162688245
15939,1,1.7034423934818537
15949,1,1.6219567519558051
15959,1,1.5522892885545592
15969,1,1.6927328857749608
15979,1,1.7631607707982706
15989,1,1.7401885362144147
15999,1,1.7202161399595848
16009,1,1.569841652343504
16019,1,1.6548653988428976
16029,1,1.5826247144847763
16039,1,1.312395242105649
16049,1,1.189086082542543
16059,1,1.354113176879014
16069,1,1.2787030760345706
16079,1,1.207059630850939
16089,1,1.3925339887056476
16099,1,1.381574332499763
16109,1,1.2080770939234575
16119,1,1.2210643285422111
16129,1,1.1460065205019667
16139,1,1.1653556349337153
16149,1,1.1592586168760488
16159,1,1.2587464377901718
16169,1,1.301186367509944
16179,1,1.4075164814778864
16189,1,1.383287882793805
16199,1,1.3115306414324162
