T,S,Score
399,0.0,0.040802598
409,0.0,-0.77252096
419,0.0,-0.3185469
429,0.0,0.028290033
439,0.0,-0.17709768
449,0.0,-0.49017715
459,0.0,0.1623354
469,0.0,0.15814328
479,0.0,0.34333217
489,0.0,-0.50089633
499,0.0,-0.50360733
509,0.0,0.53974915
519,0.0,0.15734243
529,0.0,0.025439978
539,0.0,0.34824455
549,0.0,0.2770133
559,0.0,0.45231593
569,0.0,0.52239716
579,0.0,-0.2327376
589,0.0,-0.37767875
599,0.0,0.1343621
609,0.0,-0.31712437
619,0.0,0.06045401
629,0.0,-0.47406894
639,0.0,-0.29819608
649,0.0,-0.020879269
659,0.0,0.20389992
669,0.0,0.5997598
679,0.0,0.3433051
689,0.0,-0.49589562
699,0.0,0.22008276
709,0.0,0.4825669
719,0.0,0.0112835765
729,0.0,-0.4076345
739,0.0,0.2207123
749,0.0,-0.47787553
759,0.0,-0.13542366
769,0.0,-0.43525875
779,0.0,-0.1005528
789,0.0,0.39512146
799,0.0,0.61552095
809,0.0,0.6415731
819,0.0,-0.10982025
829,0.0,0.57208353
839,0.0,-0.17391789
849,0.0,-0.016889453
859,0.0,0.21521294
869,0.0,0.3991654
879,0.0,0.78328943
889,0.0,0.055721045
899,0.0,0.793861
909,0.0,-0.06089115
919,0.0,0.45642722
929,0.0,-0.38973188
939,0.0,0.16813135
949,0.0,-0.2668544
959,0.0,0.1607368
969,0.0,-0.1434747
979,0.0,-0.12844127
989,0.0,0.25462174
999,0.0,0.47600996
1009,0.0,0.5733138
1019,0.0,0.8708934
1029,0.0,1.0748308
1039,0.0,0.44810867
1049,0.0,0.078760386
1059,0.0,-0.0010356903
1069,0.0,0.12728012
1079,0.0,-0.20109701
1089,0.0,-0.10335016
1099,0.0,0.21194196
1109,0.0,-0.47012895
1119,0.0,-0.14433903
1129,0.0,-0.19332969
1139,0.0,0.32084304
1149,0.0,0.2265855
1159,0.0,-0.32176036
1169,0.0,-0.34810477
1179,0.0,0.2438544
1189,0.0,-0.28854692
1199,0.0,0.022907972
1209,0.0,0.54534614
1219,0.0,0.37090868
1229,0.0,0.19426161
1239,0.0,0.3822546
1249,0.0,0.26982582
1259,0.0,-0.17835736
1269,0.0,0.589755
1279,0.0,0.33015317
1289,0.0,0.86789614
1299,0.0,0.052217484
1309,0.0,0.9600899
1319,0.0,0.37868822
1329,0.0,-0.14078236
1339,0.0,0.61997163
1349,0.0,0.66964966
1359,0.0,0.94533825
1369,0.0,0.82883775
1379,0.0,0.50635517
1389,0.0,-0.54278004
1399,0.0,0.04449314
1409,0.0,0.66354847
1419,0.0,0.16949892
1429,0.0,-0.38062084
1439,0.0,0.6108246
1449,0.0,-0.4345935
1459,0.0,-0.3494866
1469,0.0,0.25914967
1479,0.0,-0.15507472
1489,0.0,0.11813855
1499,0.0,0.93854547
1509,0.0,0.093600035
1519,0.0,0.2626922
1529,0.0,-0.009723067
1539,0.0,0.28283644
1549,0.0,0.34351635
1559,0.0,0.6728034
1569,0.0,0.5885494
1579,0.0,0.30048633
1589,0.0,0.058505535
1599,0.0,0.037558794
1609,0.0,-0.247733
1619,0.0,0.0812732
1629,0.0,-0.31181788
1639,0.0,-0.20941424
1649,0.0,0.09193301
1659,0.0,-0.13218999
1669,0.0,-0.034142613
1679,0.0,-0.93487394
1689,0.0,0.20941567
1699,0.0,0.5082659
1709,0.0,0.09825504
1719,0.0,-0.059430778
1729,0.0,0.20703518
1739,0.0,0.8289523
1749,0.0,0.8871593
1759,0.0,0.5576015
1769,0.0,-0.77930915
1779,0.0,0.20140195
1789,0.0,0.5296566
1799,0.0,-0.64214617
1809,0.0,-0.3195799
1819,0.0,-0.28284013
1829,0.0,0.016729116
1839,0.0,-0.17670846
1849,0.0,0.45946354
1859,0.0,0.82835025
1869,0.0,0.5374925
1879,0.0,-0.47710776
1889,0.0,0.57151747
1899,0.0,0.48154122
1909,0.0,1.0351901
1919,0.0,1.1701467
1929,0.0,0.70437205
1939,0.0,1.6660057
1949,0.0,1.884512
1959,0.0,1.1283544
1969,0.0,0.91856384
1979,0.0,0.9133927
1989,0.0,0.9185097
1999,0.0,0.60150814
2009,0.0,0.61738324
2019,0.0,0.27428943
2029,0.0,-0.22660327
2039,0.0,0.2863422
2049,0.0,-0.0052843094
2059,0.0,-0.38729715
2069,0.0,0.3886391
2079,0.0,0.6629087
2089,0.0,0.31570935
2099,0.0,1.1733909
2109,0.0,0.69665605
2119,0.0,0.55499566
2129,0.0,0.57374537
2139,0.0,0.053044915
2149,0.0,0.49987888
2159,0.0,-0.033946753
2169,0.0,0.7273206
2179,0.0,0.6765668
2189,0.0,0.30053848
2199,0.0,0.3411178
2209,0.0,-0.16019636
2219,0.0,0.17486513
2229,0.0,0.93752867
2239,0.0,0.72379994
2249,0.0,0.067917705
2259,0.0,-0.148552
2269,0.0,0.30856937
2279,0.0,0.113955736
2289,0.0,-0.7539426
2299,0.0,-0.29118574
2309,0.0,-0.50668967
2319,0.0,0.31339884
2329,0.0,-0.5693772
2339,0.0,-0.480177
2349,0.0,-0.21406889
2359,0.0,-0.53174967
2369,0.0,-0.2920506
2379,0.0,-0.41348946
2389,0.0,-0.3567865
2399,0.0,-0.5584022
2409,0.0,-0.5149368
2419,0.0,-0.4402901
2429,0.0,-0.1885817
2439,0.0,0.043151736
2449,0.0,-0.16141367
2459,0.0,0.265455
2469,0.0,0.038096428
2479,0.0,-0.03723693
2489,0.0,-0.29252338
2499,0.0,-0.40966165
2509,0.0,-0.6344509
2519,0.0,-0.25416815
2529,1.0,0.72136366
2539,1.0,0.50651294
2549,1.0,-0.010195196
2559,1.0,0.91370165
2569,1.0,1.2152672
2579,1.0,1.0132618
2589,1.0,1.2942587
2599,1.0,1.6350739
2609,1.0,2.089686
2619,1.0,2.825766
2629,1.0,3.5278044
2639,1.0,3.2708483
2649,1.0,3.7024999
2659,1.0,3.1865191
2669,1.0,5.3013573
2679,1.0,5.341925
2689,1.0,6.597309
2699,1.0,6.611442
2709,1.0,8.205763
2719,1.0,9.112952
2729,1.0,13.30748
2739,1.0,13.644201
2749,1.0,12.890011
2759,1.0,10.923437
2769,1.0,11.233379
2779,1.0,8.407709
2789,1.0,5.6717615
2799,1.0,3.6179123
2809,1.0,3.0684547
2819,1.0,2.0239391
2829,1.0,0.9705352
2839,1.0,0.87543786
2849,1.0,0.568465
2859,1.0,0.5460236
2869,1.0,0.5670948
2879,1.0,0.87468004
2889,1.0,1.276282
2899,1.0,1.6554649
2909,1.0,2.7361715
2919,1.0,3.0707574
2929,1.0,4.534973
2939,1.0,6.4253125
2949,1.0,9.189449
2959,1.0,11.990263
2969,1.0,13.3232155
2979,1.0,13.393026
2989,1.0,13.695776
2999,1.0,12.666218
3009,1.0,8.947686
3019,1.0,7.3168254
3029,1.0,6.8568993
3039,1.0,5.523633
3049,1.0,4.551076
3059,1.0,4.4611444
3069,1.0,4.183829
3079,1.0,4.0177155
3089,1.0,3.5409005
3099,1.0,2.6668148
3109,1.0,3.2441716
3119,1.0,2.4558618
3129,1.0,1.9851992
3139,1.0,1.5404122
3149,1.0,1.2729205
3159,1.0,1.0267762
3169,1.0,1.5346531
3179,1.0,1.4195328
3189,1.0,0.82425296
3199,0.0,0.3865226
3209,0.0,0.12005317
3219,0.0,1.5266293
3229,0.0,1.0668443
3239,0.0,0.5481283
3249,0.0,0.58714676
3259,0.0,0.2813462
3269,0.0,0.39835835
3279,0.0,0.16773903
3289,0.0,0.1838432
3299,0.0,0.112835765
3309,0.0,0.02550435
3319,0.0,-0.002665639
3329,0.0,-0.33624113
3339,0.0,-0.47775626
3349,0.0,-0.014928997
3359,0.0,-0.6025295
3369,0.0,-0.28020966
3379,0.0,0.05079305
3389,0.0,0.17927468
3399,0.0,-0.43600142
3409,0.0,0.60948014
3419,0.0,0.7651371
3429,0.0,0.09144771
3439,0.0,0.5159721
3449,0.0,0.5116064
3459,0.0,0.743066
3469,0.0,0.5599071
3479,0.0,1.1356207
3489,0.0,0.5754285
3499,0.0,-0.21205378
3509,0.0,0.627478
3519,0.0,0.88769954
3529,0.0,0.58188623
3539,0.0,0.1168375
3549,0.0,0.3224262
3559,0.0,1.1328645
3569,0.0,0.6059872
3579,0.0,0.4889416
3589,0.0,0.49912238
3599,0.0,0.3872171
3609,0.0,-0.15190995
3619,0.0,-1.050853
3629,0.0,-0.32032478
3639,0.0,-0.543579
3649,0.0,0.13891459
3659,0.0,-0.13670528
3669,0.0,-0.17634022
3679,0.0,0.25038397
3689,0.0,-0.39238
3699,0.0,0.058154225
3709,0.0,0.24072385
3719,0.0,-0.18448508
3729,0.0,0.45834887
3739,0.0,-0.28199363
3749,0.0,-0.00532794
3759,0.0,0.2947651
3769,0.0,-0.32802045
3779,0.0,-0.20381021
3789,0.0,-0.34520113
3799,0.0,-0.60259724
3809,0.0,0.20475209
3819,0.0,-0.09493971
3829,0.0,-0.30669773
3839,0.0,-0.47844726
3849,0.0,0.119605064
3859,0.0,-0.11755252
3869,0.0,-0.053579092
3879,0.0,-0.54445434
3889,0.0,-0.22792721
3899,0.0,-0.27897942
3909,0.0,0.12107992
3919,0.0,-0.2302866
3929,0.0,-0.23048615
3939,0.0,0.12966931
3949,0.0,-0.6711505
3959,0.0,0.03268373
3969,0.0,-0.25224406
3979,0.0,-0.46790147
3989,0.0,0.29205894
3999,0.0,0.11024487
4009,0.0,0.4458164
4019,0.0,0.3508008
4029,0.0,0.2996211
4039,0.0,0.036992908
4049,0.0,-0.019863367
4059,0.0,0.0814718
4069,0.0,0.51840615
4079,0.0,0.50640255
4089,0.0,0.23194784
4099,0.0,-0.32065642
4109,0.0,-0.14355934
4119,0.0,0.1288197
4129,0.0,-0.2768762
4139,0.0,-0.36584288
4149,0.0,-0.016717076
4159,0.0,0.028829217
4169,0.0,-0.51737326
4179,0.0,0.26178038
4189,0.0,0.8837775
4199,0.0,1.5507125
4209,0.0,0.5918092
4219,0.0,0.2936237
4229,0.0,0.30003703
4239,0.0,1.0011585
4249,0.0,0.2757486
4259,0.0,-0.30117714
4269,0.0,0.24234968
4279,0.0,-0.32644433
4289,0.0,0.35194308
4299,0.0,-0.18100572
4309,0.0,0.21971935
4319,0.0,-0.13722992
4329,0.0,-0.39682496
4339,0.0,0.3575713
4349,0.0,-0.10322261
4359,0.0,-0.11986792
4369,0.0,-0.34765184
4379,0.0,-0.37959683
4389,0.0,-0.40501463
4399,0.0,-0.25090265
4409,0.0,-0.6627803
4419,0.0,0.03358233
4429,0.0,0.34997427
4439,0.0,-0.26796
4449,0.0,-0.27211
4459,0.0,-0.24589086
4469,0.0,-0.07563186
4479,0.0,-0.32993704
4489,0.0,-0.103931665
4499,0.0,-0.3664708
4509,0.0,-0.06482947
4519,0.0,-0.1653567
4529,0.0,-0.52415526
4539,0.0,-0.19502425
4549,0.0,-0.5574157
4559,0.0,-0.12074441
4569,0.0,-0.29298747
4579,0.0,-0.41081214
4589,0.0,-0.11819291
4599,0.0,0.05787587
4609,0.0,-0.32418567
4619,0.0,-0.2959727
4629,0.0,-0.42618728
4639,0.0,-0.6192047
4649,0.0,-0.46299446
4659,0.0,0.20891607
4669,0.0,0.5023788
4679,0.0,0.097673595
4689,0.0,0.0999496
4699,0.0,0.32609236
4709,0.0,-0.065953374
4719,0.0,-0.2813877
4729,0.0,-0.3078838
4739,0.0,-0.21155715
4749,0.0,-0.090224504
4759,0.0,0.7152933
4769,0.0,0.32940853
4779,0.0,0.16687149
4789,0.0,0.1747179
4799,0.0,-0.13381624
4809,0.0,-0.19067228
4819,0.0,0.28976536
4829,0.0,-0.055230737
4839,0.0,-0.26237994
4849,0.0,-0.57469535
4859,0.0,0.12468016
4869,0.0,0.224805
4879,0.0,0.30817294
4889,0.0,-0.08624804
4899,0.0,-0.27383065
4909,0.0,-0.18446481
4919,0.0,0.4333505
4929,0.0,-0.0013160706
4939,0.0,-0.08611572
4949,0.0,0.038143277
4959,0.0,-0.32528698
4969,0.0,-0.055127323
4979,0.0,-0.03962195
4989,0.0,-0.23091829
4999,0.0,-0.12980282
5009,0.0,-0.18053812
5019,0.0,-0.770562
5029,0.0,-0.5298314
5039,0.0,-0.7646
5049,0.0,0.0762043
5059,0.0,0.10735798
5069,0.0,0.2160747
5079,0.0,-0.3611079
5089,0.0,0.4102124
5099,0.0,0.39322895
5109,0.0,0.11776161
5119,0.0,0.37406206
5129,0.0,0.3975395
5139,0.0,-0.47316653
5149,0.0,-0.09486747
5159,0.0,0.15649426
5169,0.0,0.26039445
5179,0.0,-0.3080827
5189,0.0,0.15439844
5199,0.0,0.2537672
5209,0.0,-0.17253435
5219,0.0,-0.08529174
5229,0.0,0.7804691
5239,0.0,0.28780532
5249,0.0,0.0961957
5259,0.0,0.033255816
5269,0.0,-0.19992292
5279,0.0,-0.24431694
5289,0.0,-0.051992178
5299,0.0,0.704281
5309,0.0,0.41777742
5319,0.0,-0.0068668127
5329,0.0,-0.12929356
5339,0.0,0.035343647
5349,0.0,0.16473031
5359,0.0,0.36641592
5369,0.0,-0.48289132
5379,0.0,0.09942895
5389,0.0,-0.34798872
5399,0.0,-0.8731577
5409,0.0,0.038786948
5419,0.0,-0.1854949
5429,0.0,0.37308013
5439,0.0,-0.1371026
5449,0.0,0.19274926
5459,0.0,-0.40644825
5469,0.0,-0.1557591
5479,0.0,0.01634109
5489,0.0,-0.48268592
5499,0.0,-0.40869206
5509,0.0,-0.24316132
5519,0.0,-0.15278065
5529,0.0,0.09124601
5539,0.0,-0.2529893
5549,0.0,0.25635326
5559,0.0,0.27763224
5569,0.0,0.16824198
5579,0.0,0.38176215
5589,0.0,0.07970148
5599,0.0,0.20816827
5609,0.0,1.2666329
5619,0.0,1.0265489
5629,0.0,2.0659149
5639,0.0,1.7347794
5649,0.0,2.496851
5659,0.0,2.4668431
5669,0.0,2.0107384
5679,0.0,1.4210916
5689,0.0,1.1391704
5699,0.0,1.0586739
5709,0.0,0.76663387
5719,0.0,0.44116998
5729,0.0,-0.015870154
5739,0.0,-0.3475449
5749,0.0,0.03411901
5759,0.0,-0.39694202
5769,0.0,0.21654767
5779,0.0,-0.3686707
5789,0.0,-0.36519587
5799,0.0,-0.5288935
5809,0.0,0.4235766
5819,0.0,0.42079377
5829,0.0,0.63033664
5839,0.0,1.3698778
5849,0.0,0.45047438
5859,0.0,1.6091013
5869,0.0,1.1748062
5879,0.0,1.3090662
5889,0.0,0.67468154
5899,0.0,1.4851732
5909,0.0,1.8834921
5919,0.0,0.21812999
5929,0.0,0.39444268
5939,0.0,0.22541273
5949,0.0,1.348396
5959,0.0,1.0741631
5969,0.0,0.2602961
5979,0.0,-0.4923156
5989,0.0,0.26851928
5999,0.0,-0.7487657
6009,0.0,-0.4379441
6019,0.0,-0.033912897
6029,0.0,-0.8841127
6039,0.0,-0.8240119
6049,0.0,-0.28217363
6059,0.0,-0.32105243
6069,0.0,0.0057570934
6079,0.0,-0.2990607
6089,0.0,-0.21077085
6099,0.0,-0.006878495
6109,0.0,0.027168512
6119,0.0,0.0204314
6129,0.0,-0.33997148
6139,0.0,-0.26271278
6149,0.0,-0.12291658
6159,0.0,0.31884462
6169,0.0,0.14506114
6179,0.0,-0.10888791
6189,0.0,0.13934755
6199,0.0,0.20342916
6209,0.0,0.08435035
6219,0.0,-0.26234663
6229,0.0,0.07365036
6239,0.0,-0.29180348
6249,0.0,-0.06619614
6259,0.0,0.07385361
6269,0.0,0.29935455
6279,0.0,0.1925531
6289,0.0,0.498209
6299,0.0,-0.75858676
6309,0.0,0.12561202
6319,0.0,-0.26292002
6329,0.0,0.31284833
6339,0.0,0.19854856
6349,0.0,0.3502425
6359,0.0,0.30481017
6369,0.0,0.35138035
6379,0.0,1.0040195
6389,0.0,-0.10260272
6399,0.0,0.5818807
6409,0.0,0.40347266
6419,0.0,0.45310616
6429,0.0,0.09343684
6439,0.0,0.23199022
6449,0.0,-0.29288614
6459,0.0,0.6776012
6469,0.0,0.95027256
6479,0.0,0.9103833
6489,0.0,0.92262375
6499,0.0,0.9164144
6509,0.0,0.7957173
6519,0.0,0.39143753
6529,0.0,0.08292413
6539,0.0,-0.04198742
6549,0.0,0.24057817
6559,0.0,0.009615719
6569,0.0,-0.03595698
6579,0.0,0.23810452
6589,0.0,-0.36813527
6599,0.0,0.12286079
6609,0.0,0.0038461685
6619,0.0,-0.03929925
6629,0.0,0.28975344
6639,0.0,0.23936617
6649,0.0,-0.09471953
6659,0.0,0.048581302
6669,0.0,0.7945261
6679,0.0,0.58536196
6689,0.0,0.4804716
6699,0.0,1.5141615
6709,0.0,0.5067488
6719,0.0,0.6198173
6729,0.0,1.4150295
6739,0.0,0.9497783
6749,0.0,0.63372487
6759,0.0,1.7084106
6769,0.0,1.2521424
6779,0.0,0.98687655
6789,0.0,0.9739006
6799,0.0,0.67923766
6809,0.0,0.5496943
6819,0.0,0.71169996
6829,0.0,0.30409604
6839,0.0,0.34765851
6849,0.0,-0.4540136
6859,0.0,-0.39466226
6869,0.0,-0.3185985
6879,0.0,0.24663293
6889,0.0,0.11034572
6899,0.0,0.7642248
6909,0.0,0.47618687
6919,0.0,0.46315885
6929,0.0,0.77835524
6939,0.0,1.3311987
6949,0.0,1.1095222
6959,0.0,0.82588863
6969,0.0,1.2486691
6979,0.0,0.1507914
6989,0.0,0.24057996
6999,0.0,0.39371526
7009,0.0,0.53876746
7019,0.0,0.067174435
7029,0.0,-0.17197597
7039,0.0,-0.3042711
7049,0.0,-0.11643499
7059,0.0,-0.78382325
7069,0.0,-0.53488225
7079,0.0,-0.36508477
7089,0.0,0.19541311
7099,0.0,0.076815665
7109,0.0,-0.1815114
7119,0.0,0.6663884
7129,0.0,0.4234928
7139,0.0,-0.21104336
7149,0.0,0.27795047
7159,0.0,0.83909553
7169,0.0,0.8875639
7179,0.0,1.2723216
7189,0.0,0.45930547
7199,0.0,0.6120463
7209,0.0,0.91133356
7219,0.0,0.48318428
7229,0.0,0.25901997
7239,0.0,0.5704176
7249,0.0,0.017183304
7259,0.0,-0.055716276
7269,0.0,-0.49471724
7279,0.0,1.0010867
7289,0.0,0.037215233
7299,0.0,-0.4703278
7309,0.0,-0.25395977
7319,0.0,-0.050101817
7329,0.0,-0.66311777
7339,0.0,-0.8406428
7349,0.0,0.28628206
7359,0.0,0.30256188
7369,0.0,-0.2522998
7379,0.0,-0.566653
7389,0.0,-0.7348108
7399,0.0,-0.49805367
7409,0.0,-0.099948406
7419,0.0,0.05011201
7429,0.0,-0.9042942
7439,0.0,-0.7836219
7449,0.0,-0.25813198
7459,0.0,0.33135486
7469,0.0,-0.1387819
7479,0.0,0.19248867
7489,0.0,0.22439414
7499,0.0,0.095706284
7509,0.0,-0.0073913336
7519,0.0,-0.32744431
7529,0.0,-0.2885803
7539,0.0,1.2444048
7549,0.0,0.9090055
7559,0.0,1.5048405
7569,0.0,2.0074377
7579,0.0,0.87181044
7589,0.0,1.1917644
7599,0.0,1.3077747
7609,0.0,1.0959303
7619,0.0,1.5375333
7629,0.0,1.660105
7639,0.0,2.354924
7649,0.0,1.758748
7659,0.0,1.1267685
7669,0.0,2.2594557
7679,0.0,1.7165328
7689,0.0,2.0906246
7699,0.0,2.5551045
7709,0.0,2.386556
7719,1.0,1.6845232
7729,1.0,1.7760295
7739,1.0,1.4508502
7749,1.0,1.6338482
7759,1.0,1.5076624
7769,1.0,1.5084814
7779,1.0,1.796895
7789,1.0,2.4989505
7799,1.0,2.2300897
7809,1.0,2.73705
7819,1.0,3.491354
7829,1.0,3.6485693
7839,1.0,3.5180113
7849,1.0,4.8149176
7859,1.0,4.902397
7869,1.0,5.5572705
7879,1.0,6.891523
7889,1.0,7.8992004
7899,1.0,8.105482
7909,1.0,11.664258
7919,1.0,13.724735
7929,1.0,13.344303
7939,1.0,11.856232
7949,1.0,9.857302
7959,1.0,8.6348295
7969,1.0,6.951298
7979,1.0,5.0420623
7989,1.0,2.6948256
7999,1.0,1.6075845
8009,1.0,1.4156986
8019,1.0,1.1463225
8029,1.0,0.8081278
8039,1.0,0.2835456
8049,1.0,0.45790482
8059,1.0,0.5804725
8069,1.0,1.3408997
8079,1.0,1.3376621
8089,1.0,1.6529025
8099,1.0,1.8007102
8109,1.0,5.4358344
8119,1.0,7.334463
8129,1.0,10.446123
8139,1.0,9.849892
8149,1.0,10.624582
8159,1.0,12.966083
8169,1.0,13.753988
8179,1.0,13.483755
8189,1.0,10.048204
8199,1.0,7.746183
8209,1.0,7.3478203
8219,1.0,6.0938272
8229,1.0,5.4211736
8239,1.0,4.215314
8249,1.0,3.7051902
8259,1.0,3.9624662
8269,1.0,3.3480265
8279,1.0,2.9763522
8289,1.0,2.7675366
8299,1.0,2.2059796
8309,1.0,1.2039855
8319,1.0,1.4400922
8329,1.0,0.9734799
8339,1.0,0.68507993
8349,1.0,0.5494921
8359,1.0,0.1023407
8369,1.0,-0.2716453
8379,0.0,0.084178686
8389,0.0,0.028124452
8399,0.0,0.17875308
8409,0.0,0.83537114
8419,0.0,0.7877879
8429,0.0,0.47769392
8439,0.0,-0.41033387
8449,0.0,0.40703142
8459,0.0,0.3717767
8469,0.0,0.9342794
8479,0.0,1.0419536
8489,0.0,0.3933797
8499,0.0,0.94711137
8509,0.0,0.67674994
8519,0.0,0.038812995
8529,0.0,0.14846969
8539,0.0,0.62281793
8549,0.0,0.51912737
8559,0.0,0.19106102
8569,0.0,0.367527
8579,0.0,0.21780634
8589,0.0,0.22425246
8599,0.0,0.31942427
8609,0.0,0.22176504
8619,0.0,0.25962555
8629,0.0,0.074519634
8639,0.0,-0.16337991
8649,0.0,0.44346422
8659,0.0,-0.08672732
8669,0.0,-0.6797437
8679,0.0,-0.7487223
8689,0.0,-0.20007133
8699,0.0,-0.16279924
8709,0.0,0.04655832
8719,0.0,-0.6323904
8729,0.0,0.140831
8739,0.0,-0.03829658
8749,0.0,-0.19759548
8759,0.0,0.013506174
8769,0.0,0.12906623
8779,0.0,-0.13985932
8789,0.0,-0.34888256
8799,0.0,-0.4279039
8809,0.0,-0.26789224
8819,0.0,-0.5096972
8829,0.0,-0.3465898
8839,0.0,-0.20356941
8849,0.0,-0.9354087
8859,0.0,-0.2146936
8869,0.0,-0.4351865
8879,0.0,0.08513951
8889,0.0,-0.24323678
8899,0.0,-0.20699531
8909,0.0,0.16283989
8919,0.0,-0.2533574
8929,0.0,-0.5850349
8939,0.0,-0.4844743
8949,0.0,-0.42760527
8959,0.0,-0.087145805
8969,0.0,0.08653009
8979,0.0,0.096747875
8989,0.0,-0.02211976
8999,0.0,0.24895585
9009,0.0,0.24774384
9019,0.0,0.218521
9029,0.0,0.21953142
9039,0.0,0.1564244
9049,0.0,-0.021967888
9059,0.0,0.1854738
9069,0.0,-0.86678475
9079,0.0,-0.092814684
9089,0.0,-0.3901102
9099,0.0,-0.19249988
9109,0.0,-0.48103565
9119,0.0,-0.31686556
9129,0.0,-0.19662786
9139,0.0,-0.36528468
9149,0.0,-0.019978642
9159,0.0,-0.38977873
9169,0.0,-0.1699673
9179,0.0,0.17687392
9189,0.0,0.061346352
9199,0.0,-0.5758729
9209,0.0,0.08485985
9219,0.0,-0.14268678
9229,0.0,0.32934678
9239,0.0,0.37583768
9249,0.0,1.0265671
9259,0.0,0.3830253
9269,0.0,0.4491598
9279,0.0,-0.21056193
9289,0.0,0.41588598
9299,0.0,-0.19567204
9309,0.0,-0.5202787
9319,0.0,-0.6845234
9329,0.0,-0.42485476
9339,0.0,-0.26527858
9349,0.0,-0.4956069
9359,0.0,-0.040815353
9369,0.0,-0.5207006
9379,0.0,-0.25934935
9389,0.0,0.26590884
9399,0.0,-0.36299998
9409,0.0,-0.3717543
9419,0.0,-0.51991737
9429,0.0,-0.42401004
9439,0.0,-0.6985973
9449,0.0,-0.4569556
9459,0.0,0.05820203
9469,0.0,-0.350062
9479,0.0,0.048816323
9489,0.0,-0.20166981
9499,0.0,-0.57394636
9509,0.0,-0.49665213
9519,0.0,-0.0665862
9529,0.0,-0.47356296
9539,0.0,0.1177789
9549,0.0,-0.76262015
9559,0.0,0.5646764
9569,0.0,0.054002404
9579,0.0,-0.44123977
9589,0.0,-0.6498378
9599,0.0,-0.27964646
9609,0.0,0.018041015
9619,0.0,0.34839392
9629,0.0,-0.56032467
9639,0.0,-0.5292586
9649,0.0,-0.1092239
9659,0.0,-0.42716837
9669,0.0,-0.45439684
9679,0.0,-0.5277347
9689,0.0,0.23498023
9699,0.0,-0.3619972
9709,0.0,-0.4537245
9719,0.0,-0.21895826
9729,0.0,-0.2469163
9739,0.0,-0.2164458
9749,0.0,-0.25475824
9759,0.0,-0.17993307
9769,0.0,-0.31771958
9779,0.0,-0.09670079
9789,0.0,-0.47638035
9799,0.0,-0.02066636
9809,0.0,0.21711397
9819,0.0,0.15939808
9829,0.0,0.3495375
9839,0.0,0.023987532
9849,0.0,0.43819273
9859,0.0,-0.2794888
9869,0.0,-0.6523706
9879,0.0,0.014959812
9889,0.0,-0.36607045
9899,0.0,-0.07761055
9909,0.0,0.37144512
9919,0.0,-0.62845844
9929,0.0,-0.27087563
9939,0.0,-0.30778992
9949,0.0,-0.24359429
9959,0.0,0.113916755
9969,0.0,-0.36432052
9979,0.0,0.11985695
9989,0.0,-0.4472754
9999,0.0,0.11886418
10009,0.0,-0.023611903
10019,0.0,0.022856712
10029,0.0,-0.3558194
10039,0.0,0.6695077
10049,0.0,0.031249821
10059,0.0,-0.032426476
10069,0.0,0.15632164
10079,0.0,0.10055745
10089,0.0,-0.30033445
10099,0.0,-0.30732346
10109,0.0,0.021475315
10119,0.0,0.16048145
10129,0.0,-0.16699469
10139,0.0,-0.30172592
10149,0.0,-0.2881037
10159,0.0,-0.3523507
10169,0.0,-0.45681298
10179,0.0,-0.33076262
10189,0.0,-0.0967083
10199,0.0,-0.6482321
10209,0.0,-0.34320772
10219,0.0,0.07592738
10229,0.0,-0.0009611845
10239,0.0,-0.4023049
10249,0.0,-0.2879237
10259,0.0,-0.7282146
10269,0.0,0.11752498
10279,0.0,0.057709098
10289,0.0,-0.5016692
10299,0.0,-0.65782607
10309,0.0,-0.28421038
10319,0.0,-0.34477758
10329,0.0,-0.51584375
10339,0.0,-0.34817314
10349,0.0,0.15528989
10359,0.0,-0.36172307
10369,0.0,0.5245406
10379,0.0,-0.56821156
10389,0.0,-0.21238029
10399,0.0,-0.3675872
10409,0.0,-0.7840939
10419,0.0,-0.5307081
10429,0.0,-0.8024937
10439,0.0,-0.21316803
10449,0.0,-0.32591712
10459,0.0,0.24276304
10469,0.0,-0.7766587
10479,0.0,0.12533367
10489,0.0,-0.027211368
10499,0.0,-0.40224326
10509,0.0,-0.08306056
10519,0.0,0.011447668
10529,0.0,-0.27365947
10539,0.0,-0.3004974
10549,0.0,-0.2795313
10559,0.0,-0.5507519
10569,0.0,0.30343276
10579,0.0,-0.011312246
10589,0.0,0.24158502
10599,0.0,-0.07960248
10609,0.0,0.063318014
10619,0.0,0.0050805807
10629,0.0,0.08600545
10639,0.0,-0.253743
10649,0.0,-0.045226455
10659,0.0,-0.38049173
10669,0.0,-0.45545477
10679,0.0,-0.18683827
10689,0.0,-0.04861772
10699,0.0,-0.41777748
10709,0.0,-0.3090219
10719,0.0,-0.058733463
10729,0.0,-0.18411487
10739,0.0,-0.45561093
10749,0.0,-0.16057706
10759,0.0,0.48048455
10769,0.0,-0.15257913
10779,0.0,0.88558227
10789,0.0,0.8307741
10799,0.0,1.1897826
10809,0.0,1.3951721
10819,0.0,0.8896942
10829,0.0,0.6407123
10839,0.0,1.0143294
10849,0.0,0.3601055
10859,0.0,0.43709654
10869,0.0,0.3938703
10879,0.0,0.9453695
10889,0.0,0.5011867
10899,0.0,0.8307955
10909,0.0,-0.14142567
10919,0.0,0.098620534
10929,0.0,-0.5682391
10939,0.0,0.44555974
10949,0.0,-0.34364605
10959,0.0,-0.37197077
10969,0.0,-0.5703881
10979,0.0,0.17109144
10989,0.0,0.30626947
10999,0.0,0.38846588
11009,0.0,-0.2065916
11019,0.0,-0.15703815
11029,0.0,-0.20678687
11039,0.0,-0.3747846
11049,0.0,0.03636098
11059,0.0,-0.45764124
11069,0.0,0.15043283
11079,0.0,-0.42329693
11089,0.0,-0.4518361
11099,0.0,-0.54018414
11109,0.0,-0.9184153
11119,0.0,-0.053643227
11129,0.0,-0.61058056
11139,0.0,0.41120702
11149,0.0,0.06586921
11159,0.0,0.16715097
11169,0.0,-0.20799935
11179,0.0,-0.30903065
11189,0.0,-0.4969766
11199,0.0,-0.21976995
11209,0.0,-0.18904734
11219,0.0,0.09771001
11229,0.0,-0.03530109
11239,0.0,-0.21923566
11249,0.0,-0.13065505
11259,0.0,-0.07078576
11269,0.0,0.6825013
11279,0.0,-0.095389366
11289,0.0,0.31176734
11299,0.0,0.40189773
11309,0.0,0.69480306
11319,0.0,0.4362688
11329,0.0,0.3265829
11339,0.0,0.0890125
11349,0.0,-0.17664099
11359,0.0,-0.41571045
11369,0.0,-0.8229148
11379,0.0,-0.35505295
11389,0.0,-0.29848576
11399,0.0,-0.3664844
11409,0.0,-0.5475561
11419,0.0,-0.2421552
11429,0.0,-0.30222905
11439,0.0,-0.2149893
11449,0.0,-0.04515809
11459,0.0,-0.42234218
11469,0.0,0.7367149
11479,0.0,0.8714665
11489,0.0,0.96534085
11499,0.0,1.18589
11509,0.0,0.6317405
11519,0.0,0.36333263
11529,0.0,0.5233529
11539,0.0,0.08013463
11549,0.0,-0.1361984
11559,0.0,-0.08768362
11569,0.0,-0.14415145
11579,0.0,-0.25349462
11589,0.0,0.47274673
11599,0.0,-0.68098897
11609,0.0,-0.44296098
11619,0.0,-0.07384837
11629,0.0,-0.30697274
11639,0.0,-0.39719176
11649,0.0,0.20719779
11659,0.0,-0.066883564
11669,0.0,0.20789051
11679,0.0,0.7602894
11689,0.0,0.29837835
11699,0.0,1.2116743
11709,0.0,0.3776647
11719,0.0,0.02592206
11729,0.0,0.074796915
11739,0.0,0.33169198
11749,0.0,-0.05486393
11759,0.0,-0.009132624
11769,0.0,-0.1827879
11779,0.0,-0.21644169
11789,0.0,-0.28193688
11799,0.0,-0.109818935
11809,0.0,-0.18997705
11819,0.0,-0.5364028
11829,0.0,-0.5407082
11839,0.0,-0.39789665
11849,0.0,-0.36323094
11859,0.0,0.031938314
11869,0.0,-0.044568896
11879,0.0,-0.2883743
11889,0.0,-0.5071218
11899,0.0,0.028006911
11909,0.0,-0.15190971
11919,0.0,0.85069406
11929,0.0,1.0567324
11939,0.0,1.2372291
11949,0.0,0.5022444
11959,0.0,0.6102834
11969,0.0,-0.023898363
11979,0.0,0.3495705
11989,0.0,0.8337914
11999,0.0,0.9329469
12009,0.0,-0.031745672
12019,0.0,-0.07152653
12029,0.0,0.25762498
12039,0.0,0.25764567
12049,0.0,0.99459475
12059,0.0,0.17663187
12069,0.0,0.10242653
12079,0.0,-0.084647775
12089,0.0,-0.24739397
12099,0.0,-0.2833951
12109,0.0,-0.00036001205
12119,0.0,-0.10084772
12129,0.0,-0.20052016
12139,0.0,-0.25277203
12149,0.0,0.11657739
12159,0.0,-0.32518458
12169,0.0,0.06500769
12179,0.0,0.27350414
12189,0.0,0.6690327
12199,0.0,0.6558018
12209,0.0,0.44375604
12219,0.0,-0.061008632
12229,0.0,0.500277
12239,0.0,-0.6001642
12249,0.0,-0.8588059
12259,0.0,-0.15549517
12269,0.0,-0.7411722
12279,0.0,-0.14719415
12289,0.0,0.0013016462
12299,0.0,-0.052897334
12309,0.0,0.15439248
12319,0.0,-0.5286069
12329,0.0,0.45374453
12339,0.0,0.80361086
12349,0.0,-0.21463037
12359,0.0,0.576809
12369,0.0,0.2324084
12379,0.0,1.041862
12389,0.0,0.84680605
12399,0.0,2.02464
12409,0.0,1.2490863
12419,0.0,0.27982736
12429,0.0,0.86665356
12439,0.0,0.5803624
12449,0.0,0.76298094
12459,0.0,0.523427
12469,0.0,1.0513964
12479,0.0,0.4744082
12489,0.0,0.20324731
12499,0.0,0.07953572
12509,0.0,-0.018093944
12519,0.0,-0.13632953
12529,0.0,-0.4079131
12539,0.0,0.27928162
12549,0.0,-0.18072772
12559,0.0,0.18488538
12569,0.0,-0.016257167
12579,0.0,0.13043088
12589,0.0,-0.14307165
12599,0.0,0.15188032
12609,0.0,-0.30229342
12619,0.0,0.16000742
12629,0.0,-0.7795996
12639,0.0,-0.37333107
12649,0.0,-0.0621624
12659,0.0,0.5445416
12669,0.0,0.6020265
12679,0.0,0.048953295
12689,0.0,0.02182591
12699,0.0,0.47422993
12709,0.0,0.3282206
12719,0.0,0.15518379
12729,0.0,0.26870972
12739,0.0,-0.71636295
12749,0.0,-0.0456416
12759,0.0,-0.11399937
12769,0.0,-0.33746648
12779,0.0,-0.07919061
12789,0.0,-0.15762866
12799,0.0,0.31212014
12809,0.0,-0.22240543
12819,0.0,-0.18662584
12829,0.0,-0.4616379
12839,0.0,-0.45007432
12849,0.0,-0.10038537
12859,0.0,-0.44971526
12869,0.0,-0.9929719
12879,0.0,-0.31124294
12889,0.0,-0.7082301
12899,0.0,0.02526784
12909,1.0,-0.04393804
12919,1.0,-0.44874203
12929,1.0,0.27250504
12939,1.0,0.6653682
12949,1.0,0.7276636
12959,1.0,1.2222745
12969,1.0,1.114511
12979,1.0,2.213131
12989,1.0,2.7216978
12999,1.0,2.1134071
13009,1.0,2.711864
13019,1.0,3.323193
13029,1.0,3.2965958
13039,1.0,4.1874256
13049,1.0,5.1818137
13059,1.0,5.159478
13069,1.0,5.868474
13079,1.0,6.396101
13089,1.0,7.4836473
13099,1.0,9.204521
13109,1.0,12.939808
13119,1.0,13.751089
13129,1.0,12.452421
13139,1.0,8.966044
13149,1.0,10.241232
13159,1.0,6.389049
13169,1.0,6.378684
13179,1.0,4.8904624
13189,1.0,2.5810301
13199,1.0,1.5457414
13209,1.0,0.91096663
13219,1.0,0.9515139
13229,1.0,0.49363095
13239,1.0,0.44367337
13249,1.0,0.59791476
13259,1.0,0.57147217
13269,1.0,0.8727843
13279,1.0,1.281836
13289,1.0,1.0156388
13299,1.0,3.1653101
13309,1.0,4.541324
13319,1.0,7.4709816
13329,1.0,7.6016536
13339,1.0,8.807173
13349,1.0,11.635809
13359,1.0,12.553019
13369,1.0,13.581899
13379,1.0,13.285011
13389,1.0,10.092661
13399,1.0,8.295002
13409,1.0,6.4132967
13419,1.0,5.747637
13429,1.0,4.975707
13439,1.0,4.474212
13449,1.0,3.456796
13459,1.0,3.299015
13469,1.0,3.1778264
13479,1.0,2.539341
13489,1.0,2.8149233
13499,1.0,2.4003808
13509,1.0,1.5700009
13519,1.0,1.3003697
13529,1.0,1.1600122
13539,1.0,1.2609757
13549,1.0,0.5660906
13559,1.0,0.31518102
13569,1.0,0.25412703
13579,0.0,0.026178062
13589,0.0,1.2027972
13599,0.0,0.9967793
13609,0.0,0.9403414
13619,0.0,0.66539973
13629,0.0,0.88260853
13639,0.0,0.17862147
13649,0.0,1.0161542
13659,0.0,0.7302704
13669,0.0,0.087951064
13679,0.0,0.76292646
13689,0.0,0.1819061
13699,0.0,0.3373379
13709,0.0,-0.3400435
13719,0.0,0.32350212
13729,0.0,-0.10463953
13739,0.0,0.28263175
13749,0.0,-0.11429584
13759,0.0,0.04778135
13769,0.0,-0.08284962
13779,0.0,0.3091867
13789,0.0,0.24697536
13799,0.0,0.53916657
13809,0.0,0.61946225
13819,0.0,-0.012630701
13829,0.0,-0.11101711
13839,0.0,0.6135723
13849,0.0,1.50253
13859,0.0,1.7061002
13869,0.0,0.6096197
13879,0.0,0.30319828
13889,0.0,0.87073904
13899,0.0,0.33277738
13909,0.0,0.6961827
13919,0.0,0.5383437
13929,0.0,0.14390504
13939,0.0,0.018090248
13949,0.0,0.2528243
13959,0.0,-0.3135147
13969,0.0,-0.3119216
13979,0.0,-0.27452648
13989,0.0,0.19686341
13999,0.0,0.41483915
14009,0.0,-0.4610027
14019,0.0,-0.2993586
14029,0.0,-0.4355529
14039,0.0,0.22833514
14049,0.0,-0.070580125
14059,0.0,1.1090851
14069,0.0,0.62925816
14079,0.0,1.2498084
14089,0.0,1.1866913
14099,0.0,1.2872488
14109,0.0,0.59783065
14119,0.0,1.2785403
14129,0.0,0.60247254
14139,0.0,0.61118114
14149,0.0,1.327301
14159,0.0,0.96085125
14169,0.0,0.7133928
14179,0.0,0.7358557
14189,0.0,0.7390938
14199,0.0,0.75973403
14209,0.0,0.43860102
14219,0.0,0.039904773
14229,0.0,0.42675382
14239,0.0,-0.02967453
14249,0.0,0.055766106
14259,0.0,0.14144814
14269,0.0,-0.38152385
14279,0.0,0.4322908
14289,0.0,0.41097593
14299,0.0,-0.5677054
14309,0.0,0.11953628
14319,0.0,-0.16774684
14329,0.0,-0.51188785
14339,0.0,0.3537745
14349,0.0,-0.34354913
14359,0.0,-0.13613242
14369,0.0,-0.4417262
14379,0.0,0.46562636
14389,0.0,0.4275484
14399,0.0,-0.39329576
14409,0.0,-0.06812906
14419,0.0,-0.024175763
14429,0.0,-0.055485547
14439,0.0,-0.180107
14449,0.0,0.51977926
14459,0.0,0.22343898
14469,0.0,0.40473628
14479,0.0,-0.17657995
14489,0.0,0.078882635
14499,0.0,0.13019574
14509,0.0,0.07126868
14519,0.0,0.2563178
14529,0.0,-0.30549586
14539,0.0,-0.27731633
14549,0.0,0.15684819
14559,0.0,0.640482
14569,0.0,-0.06008172
14579,0.0,0.30171192
14589,0.0,0.35675168
14599,0.0,0.23572922
14609,0.0,-0.36630666
14619,0.0,0.52376246
14629,0.0,0.476174
14639,0.0,0.3780675
14649,0.0,-0.1987192
14659,0.0,-0.36194307
14669,0.0,-0.8535101
14679,0.0,-0.6951935
14689,0.0,0.072933435
14699,0.0,0.014381051
14709,0.0,0.04123485
14719,0.0,-0.13744164
14729,0.0,0.021353602
14739,0.0,-0.5093521
14749,0.0,0.022783458
14759,0.0,0.09800762
14769,0.0,0.4471413
14779,0.0,0.085088134
14789,0.0,0.0843606
14799,0.0,0.038844705
14809,0.0,0.2271192
14819,0.0,0.7684948
14829,0.0,0.9927217
14839,0.0,-0.15393674
14849,0.0,0.51674235
14859,0.0,0.538856
14869,0.0,0.4950254
14879,0.0,0.34659123
14889,0.0,1.1780688
14899,0.0,0.69582546
14909,0.0,0.9950859
14919,0.0,0.46152407
14929,0.0,-0.014684081
14939,0.0,0.4881493
14949,0.0,-0.36560965
14959,0.0,0.1945219
14969,0.0,-0.6733946
14979,0.0,-0.5797882
14989,0.0,-0.059791565
14999,0.0,-0.17481327
15009,0.0,-0.16737938
15019,0.0,0.5274011
15029,0.0,-0.35972846
15039,0.0,0.048346996
15049,0.0,0.843536
15059,0.0,0.7237233
15069,0.0,0.05443406
15079,0.0,0.2907024
15089,0.0,0.14194322
15099,0.0,0.20787394
15109,0.0,0.39721727
15119,0.0,0.39700425
15129,0.0,-0.7041945
15139,0.0,-0.2073965
15149,0.0,-0.11804962
15159,0.0,-0.16379774
15169,0.0,-0.31802768
15179,0.0,-0.2645613
15189,0.0,-0.25451744
15199,0.0,-0.0039183497
15209,0.0,-0.18224543
15219,0.0,-0.343858
15229,0.0,-0.22600567
15239,0.0,0.16892052
15249,0.0,-0.20591694
15259,0.0,0.0045672655
15269,0.0,0.28750777
15279,0.0,-0.18012631
15289,0.0,-0.14473021
15299,0.0,-0.44768256
15309,0.0,-0.07212806
15319,0.0,-0.4400586
15329,0.0,0.13920975
15339,0.0,-0.16163051
15349,0.0,-0.27904487
15359,0.0,0.057238817
15369,0.0,0.26513767
15379,0.0,-0.19179648
15389,0.0,-0.33713937
15399,0.0,0.18633515
15409,0.0,0.061469615
15419,0.0,-0.43180156
15429,0.0,0.3499372
15439,0.0,-0.1884948
15449,0.0,0.6631967
15459,0.0,-0.17372727
15469,0.0,-0.22764659
15479,0.0,-0.47012156
15489,0.0,-0.9541896
15499,0.0,-0.88677675
15509,0.0,-0.57768804
15519,0.0,-0.039079428
15529,0.0,-0.5022342
15539,0.0,-0.46601284
15549,0.0,-0.501986
15559,0.0,-0.4726528
15569,0.0,-0.7066208
15579,0.0,-0.11265874
15589,0.0,0.13161558
15599,0.0,0.18177754
15609,0.0,-0.29447174
15619,0.0,-0.13352466
15629,0.0,0.43902874
15639,0.0,0.17727673
15649,0.0,-0.2498312
15659,0.0,0.06102681
15669,0.0,-0.299289
15679,0.0,0.49367404
15689,0.0,-0.23710048
15699,0.0,-0.026427269
15709,0.0,-0.09480232
15719,0.0,-0.033284187
15729,0.0,-0.2564252
15739,0.0,0.1592232
15749,0.0,-0.17045546
15759,0.0,-0.08517766
15769,0.0,0.103438854
15779,0.0,0.006126642
15789,0.0,-0.25563335
15799,0.0,-0.2489779
15809,0.0,0.05953586
15819,0.0,-0.3320583
15829,0.0,-0.37261248
15839,0.0,-0.7379859
15849,0.0,-0.7673378
15859,0.0,-0.54322326
15869,0.0,-0.60155356
15879,0.0,-0.23953396
15889,0.0,0.14707243
15899,0.0,-0.08016002
15909,0.0,0.110803604
15919,0.0,-0.06613517
15929,0.0,-0.4660319
15939,0.0,0.47052348
15949,0.0,0.24978268
15959,0.0,0.81463325
15969,0.0,0.83846956
15979,0.0,1.1759626
15989,0.0,1.4737568
15999,0.0,-0.13943827
16009,0.0,-0.23806018
16019,0.0,-0.03181237
16029,0.0,-0.54209244
16039,0.0,0.19582427
16049,0.0,0.04829395
16059,0.0,-0.04020548
16069,0.0,0.68906415
16079,0.0,0.20302308
16089,0.0,-0.46269977
16099,0.0,0.10753405
16109,0.0,-0.35883355
16119,0.0,-0.044639945
16129,0.0,-0.063396096
16139,0.0,-0.573058
16149,0.0,0.029427528
16159,0.0,-0.2514968
16169,0.0,0.46498728
16179,0.0,-0.08865404
16189,0.0,0.14349425
16199,0.0,0.031652093
16209,0.0,0.27353787
16219,0.0,-0.14546537
16229,0.0,0.3793633
16239,0.0,-0.49804598
16249,0.0,-0.4535228
16259,0.0,-0.40260363
16269,0.0,-0.14345825
16279,0.0,-0.30861342
16289,0.0,0.31136197
16299,0.0,0.43798745
16309,0.0,0.6542866
16319,0.0,0.37275767
16329,0.0,0.0014232397
16339,0.0,0.46393943
16349,0.0,0.19949728
16359,0.0,0.7987982
16369,0.0,0.32846677
16379,0.0,0.0026738644
16389,0.0,-0.52746165
16399,0.0,0.025707603
16409,0.0,-0.07066262
16419,0.0,-0.11924535
16429,0.0,-0.88882196
16439,0.0,-0.063780665
16449,0.0,0.35739952
16459,0.0,0.90744096
16469,0.0,-0.28761983
16479,0.0,0.5060441
16489,0.0,-0.04119897
16499,0.0,-0.069637775
16509,0.0,0.48181844
16519,0.0,0.1082629
16529,0.0,0.47643554
16539,0.0,0.08094227
16549,0.0,0.5414747
16559,0.0,1.1357906
16569,0.0,0.2969066
16579,0.0,1.2300303
16589,0.0,0.27017152
16599,0.0,0.12042725
16609,0.0,0.46276748
16619,0.0,-0.0723654
16629,0.0,0.41934955
16639,0.0,-0.1563853
16649,0.0,-0.21994382
16659,0.0,-0.024555087
16669,0.0,-0.2819363
16679,0.0,0.19491482
16689,0.0,-0.14424622
16699,0.0,0.51205266
16709,0.0,0.15693033
16719,0.0,0.21435583
16729,0.0,-0.5815718
16739,0.0,-0.08587444
16749,0.0,-0.39535022
16759,0.0,0.32598597
16769,0.0,0.47365224
16779,0.0,0.89218783
16789,0.0,0.02140069
16799,0.0,-0.2995789
16809,0.0,0.24982655
16819,0.0,0.34604812
16829,0.0,-0.13595998
16839,0.0,-0.17524087
16849,0.0,0.032066107
16859,0.0,0.23043144
16869,0.0,-0.10966396
16879,0.0,-0.38711268
16889,0.0,0.662235
16899,0.0,0.25219476
16909,0.0,0.19227958
16919,0.0,0.13458586
16929,0.0,0.6213969
16939,0.0,-0.38060874
16949,0.0,0.11026549
16959,0.0,0.17757171
16969,0.0,-0.31209302
16979,0.0,-0.51753783
16989,0.0,-0.24320537
16999,0.0,-0.19581532
17009,0.0,0.06524801
17019,0.0,-0.26560962
17029,0.0,0.25800353
17039,0.0,-0.29489732
17049,0.0,0.62380815
17059,0.0,0.90813816
17069,0.0,1.0727628
17079,0.0,1.3827264
17089,0.0,1.1894124
17099,0.0,0.64537466
17109,0.0,1.6921191
17119,0.0,1.2298839
17129,0.0,0.8731596
17139,0.0,-0.3089807
17149,0.0,-0.31497133
17159,0.0,-0.36843038
17169,0.0,-0.24072206
17179,0.0,-0.23254025
17189,0.0,-0.18112874
17199,0.0,0.10743952
17209,0.0,-0.28645277
17219,0.0,-0.37948596
17229,0.0,-0.38042092
17239,0.0,0.27469003
17249,0.0,0.48876834
17259,0.0,-0.27071512
17269,0.0,-0.28777158
17279,0.0,-0.25635767
17289,0.0,0.24202168
17299,0.0,0.76685774
17309,0.0,0.5493713
17319,0.0,0.057536185
17329,0.0,-0.7115516
17339,0.0,0.49365377
17349,0.0,-0.1578052
17359,0.0,-0.29786277
17369,0.0,-0.43107867
17379,0.0,-0.3476423
17389,0.0,0.26562154
17399,0.0,-0.26764524
17409,0.0,-0.5381932
17419,0.0,-0.037495017
17429,0.0,0.3729189
17439,0.0,0.34974015
17449,0.0,0.0048890114
17459,0.0,-0.044345498
17469,0.0,0.3070709
17479,0.0,0.055090785
17489,0.0,0.42553425
17499,0.0,-0.38963747
17509,0.0,-0.66093904
17519,0.0,-0.18974626
17529,0.0,-0.18644726
17539,0.0,0.5437288
17549,0.0,-0.45189345
17559,0.0,-0.11072278
17569,0.0,-0.11805093
17579,0.0,0.18696618
17589,0.0,-0.46024346
17599,0.0,-0.029506683
17609,0.0,-0.28856575
17619,0.0,-0.1450634
17629,0.0,0.24425066
17639,0.0,0.39438105
17649,0.0,0.9359095
17659,0.0,0.21484882
17669,0.0,0.3126949
17679,0.0,1.1549182
17689,0.0,0.24929976
17699,0.0,0.34969652
17709,0.0,0.04369366
17719,0.0,-0.11374068
17729,0.0,-0.21855831
17739,0.0,0.106930315
17749,0.0,-0.20719516
17759,0.0,-0.36810935
17769,0.0,0.18403333
17779,0.0,-0.3004182
17789,0.0,-0.25276738
17799,0.0,-0.494451
17809,0.0,0.2237575
17819,0.0,0.42332518
17829,0.0,0.5940469
17839,0.0,0.78212875
17849,0.0,0.42650926
17859,0.0,0.81583256
17869,0.0,0.04570484
17879,0.0,0.36219835
17889,0.0,1.0901904
17899,0.0,1.0129094
17909,0.0,1.6573701
17919,0.0,1.524935
17929,0.0,1.9638855
17939,0.0,0.4007494
17949,0.0,1.260033
17959,0.0,0.47310907
17969,0.0,-0.20304507
17979,0.0,-0.344033
17989,0.0,0.08678812
17999,0.0,-0.6665206
18009,0.0,0.39649022
18019,0.0,-0.059640765
18029,0.0,-0.4186691
18039,0.0,-0.28111255
18049,0.0,0.041915298
18059,0.0,-0.084554195
18069,0.0,0.0143277645
18079,0.0,-0.2536583
18089,0.0,-0.2495122
18099,1.0,-0.24759865
18109,1.0,0.55611885
18119,1.0,0.3167671
18129,1.0,1.1717224
18139,1.0,1.3465043
18149,1.0,1.1870039
18159,1.0,1.5952201
18169,1.0,1.9060156
18179,1.0,2.340958
18189,1.0,2.1950479
18199,1.0,2.8558578
18209,1.0,3.1993313
18219,1.0,3.6042309
18229,1.0,3.5066113
18239,1.0,4.197961
18249,1.0,4.7708926
18259,1.0,4.6125846
18269,1.0,6.4618716
18279,1.0,7.368779
18289,1.0,8.268215
18299,1.0,12.559246
18309,1.0,13.34071
18319,1.0,13.580088
18329,1.0,13.084082
18339,1.0,12.966698
18349,1.0,9.7581005
18359,1.0,6.467641
18369,1.0,6.807123
18379,1.0,4.862803
18389,1.0,3.908571
18399,1.0,1.4934883
18409,1.0,1.6434867
18419,1.0,0.8839567
18429,1.0,0.61355734
18439,1.0,0.27579647
18449,1.0,0.509729
18459,1.0,0.42118782
18469,1.0,0.92731553
18479,1.0,1.4994256
18489,1.0,2.7031908
18499,1.0,3.8752508
18509,1.0,5.4588375
18519,1.0,6.57665
18529,1.0,8.008543
18539,1.0,11.8074
18549,1.0,13.272263
18559,1.0,13.150131
18569,1.0,13.619698
18579,1.0,11.228447
18589,1.0,9.910572
18599,1.0,7.4794126
18609,1.0,6.9511113
18619,1.0,5.3196073
18629,1.0,4.639108
18639,1.0,4.7888484
18649,1.0,4.207382
18659,1.0,3.2728267
18669,1.0,2.6581392
18679,1.0,3.1931548
18689,1.0,2.6353617
18699,1.0,2.4615436
18709,1.0,1.966171
18719,1.0,1.4077617
18729,1.0,0.9478887
18739,1.0,0.67957956
18749,1.0,0.6977274
18759,1.0,0.38247633
18769,1.0,0.79843414
18779,1.0,0.73404527
18789,0.0,-0.11897707
18799,0.0,0.32186472
18809,0.0,0.6667473
18819,0.0,0.79322535
18829,0.0,0.63025033
18839,0.0,0.5376617
18849,0.0,0.1173656
18859,0.0,-0.378394
18869,0.0,-0.1520201
18879,0.0,-0.10904968
18889,0.0,0.4236095
18899,0.0,-0.03956878
18909,0.0,-0.1859554
18919,0.0,0.023190618
18929,0.0,-0.6928072
18939,0.0,0.4199087
18949,0.0,0.56509
18959,0.0,0.12355745
18969,0.0,0.46585572
18979,0.0,0.6308392
18989,0.0,0.5595972
18999,0.0,1.0801036
19009,0.0,0.30694574
19019,0.0,1.0967628
19029,0.0,0.46983552
19039,0.0,0.6058987
19049,0.0,1.1278434
19059,0.0,0.66170543
19069,0.0,0.26949704
19079,0.0,0.06981593
19089,0.0,0.1470815
19099,0.0,-0.14752913
19109,0.0,-0.072945476
19119,0.0,0.33384734
19129,0.0,-0.35701978
19139,0.0,-0.3318553
19149,0.0,-0.465312
19159,0.0,-0.012204766
19169,0.0,-0.2998978
19179,0.0,-0.35471976
19189,0.0,0.21883762
19199,0.0,-0.40759754
19209,0.0,-0.14471781
19219,0.0,0.5607512
19229,0.0,0.5075768
19239,0.0,-0.12804615
19249,0.0,-0.41349846
19259,0.0,-0.27334905
19269,0.0,-0.49022603
19279,0.0,-0.5282849
19289,0.0,-0.11303151
19299,0.0,0.40642083
19309,0.0,-0.43182325
19319,0.0,0.12119889
19329,0.0,-0.33853447
19339,0.0,-0.20473677
19349,0.0,0.2541774
19359,0.0,-0.2597415
19369,0.0,-0.5281598
19379,0.0,-0.09631407
19389,0.0,-0.14532292
19399,0.0,-0.016949296
19409,0.0,-0.6281086
19419,0.0,-0.17443627
19429,0.0,-0.15732563
19439,0.0,-0.5810194
19449,0.0,-0.50063455
19459,0.0,-0.31599963
19469,0.0,-0.04479444
19479,0.0,0.56112653
19489,0.0,0.11554265
19499,0.0,0.5962309
19509,0.0,0.5427973
19519,0.0,-0.10172069
19529,0.0,0.28203887
19539,0.0,0.43552822
19549,0.0,-0.046485662
19559,0.0,0.28460312
19569,0.0,0.13742423
19579,0.0,0.22226608
19589,0.0,-0.16058242
19599,0.0,-0.207268
19609,0.0,-0.25361228
19619,0.0,0.08681965
19629,0.0,0.26747143
19639,0.0,0.10274398
19649,0.0,-0.029642701
19659,0.0,-0.15369141
19669,0.0,-0.66184795
19679,0.0,-0.41435313
19689,0.0,-0.6494554
19699,0.0,-0.5361587
19709,0.0,-0.30018735
19719,0.0,-0.4441222
19729,0.0,0.037447453
19739,0.0,-0.5805258
19749,0.0,-0.49270284
19759,0.0,-0.4629491
19769,0.0,-0.091914535
19779,0.0,-0.0020868778
19789,0.0,0.30483377
19799,0.0,-0.5096142
19809,0.0,-0.03554839
19819,0.0,-0.2597661
19829,0.0,0.1172744
19839,0.0,-0.25132728
19849,0.0,-0.7099059
19859,0.0,0.40240884
19869,0.0,-0.091884255
19879,0.0,0.62555605
19889,0.0,-0.15955889
19899,0.0,-0.07645357
19909,0.0,-0.23403788
19919,0.0,0.12675071
19929,0.0,-0.16263723
19939,0.0,-0.4784751
19949,0.0,-0.48220158
19959,0.0,-0.2106005
19969,0.0,0.4000798
19979,0.0,0.24835223
19989,0.0,0.058653355
19999,0.0,0.13058424
20009,0.0,0.43071204
20019,0.0,0.09443283
20029,0.0,-0.46780688
20039,0.0,0.4326744
20049,0.0,-0.10201371
20059,0.0,-0.3545543
20069,0.0,-0.097512364
20079,0.0,0.29303718
20089,0.0,0.08670628
20099,0.0,-0.4900924
20109,0.0,-0.47643125
20119,0.0,-0.10115385
20129,0.0,-0.07735133
20139,0.0,-0.19643748
20149,0.0,0.076943755
20159,0.0,-0.46535707
20169,0.0,-0.50520456
20179,0.0,-0.0720799
20189,0.0,0.6074363
20199,0.0,0.6201782
20209,0.0,0.83400387
20219,0.0,0.69821465
20229,0.0,0.4444214
20239,0.0,0.048227787
20249,0.0,0.074269176
20259,0.0,0.32573164
20269,0.0,0.29783243
20279,0.0,-0.37913442
20289,0.0,0.43557298
20299,0.0,0.01628232
20309,0.0,-0.8201636
20319,0.0,0.0801065
20329,0.0,-0.11823249
20339,0.0,-0.14597529
20349,0.0,-0.25508553
20359,0.0,-0.026923299
20369,0.0,0.3400017
20379,0.0,-0.19824696
20389,0.0,0.5328572
20399,0.0,0.9759479
20409,0.0,0.5682226
20419,0.0,0.12874043
20429,0.0,1.2874966
20439,0.0,0.27747118
20449,0.0,0.24776733
20459,0.0,0.5016904
20469,0.0,0.4095956
20479,0.0,-0.09471309
20489,0.0,0.39580292
20499,0.0,0.3157364
20509,0.0,-0.019408703
20519,0.0,0.489249
20529,0.0,-0.2832054
20539,0.0,0.10934579
20549,0.0,0.39914036
20559,0.0,0.3946945
20569,0.0,0.42282742
20579,0.0,0.65434086
20589,0.0,0.8973497
20599,0.0,0.13520753
20609,0.0,0.15478444
20619,0.0,0.14273906
20629,0.0,0.24871671
20639,0.0,0.3868953
20649,0.0,0.07256979
20659,0.0,0.24300003
20669,0.0,-0.21707845
20679,0.0,-0.62659204
20689,0.0,-0.5038626
20699,0.0,-0.4996249
20709,0.0,-0.28372908
20719,0.0,0.1156255
20729,0.0,-0.45323908
20739,0.0,-0.33683056
20749,0.0,-0.39337146
20759,0.0,0.18821955
20769,0.0,-0.30123746
20779,0.0,0.18185824
20789,0.0,-0.34135795
20799,0.0,-0.49896336
20809,0.0,0.29787517
20819,0.0,0.23502827
20829,0.0,0.680696
20839,0.0,-0.21525788
20849,0.0,0.026120782
20859,0.0,-0.061750293
20869,0.0,0.43994367
20879,0.0,0.20356363
20889,0.0,-0.7516496
20899,0.0,-0.45977902
20909,0.0,-0.4162706
20919,0.0,-0.45057088
20929,0.0,-0.31220454
20939,0.0,-0.65723616
20949,0.0,0.11430043
20959,0.0,0.24144417
20969,0.0,-0.14880723
20979,0.0,0.22213185
20989,0.0,-0.24382198
20999,0.0,-0.47730136
21009,0.0,0.54086006
21019,0.0,-0.008344471
21029,0.0,-0.004766822
21039,0.0,0.40343022
21049,0.0,0.4466815
21059,0.0,-0.11142242
21069,0.0,0.42286038
21079,0.0,0.5264456
21089,0.0,0.79952085
21099,0.0,0.757365
21109,0.0,0.3459291
21119,0.0,-0.19715542
21129,0.0,-0.13518906
21139,0.0,0.35290253
21149,0.0,-0.123791814
21159,0.0,-0.077077806
21169,0.0,-0.7230941
21179,0.0,-0.09195602
21189,0.0,-0.9569889
21199,0.0,-0.4397471
21209,0.0,0.36536652
21219,0.0,-0.298164
21229,0.0,-0.307999
21239,0.0,-0.4339472
21249,0.0,-0.5325762
21259,0.0,0.3614775
21269,0.0,0.86718524
21279,0.0,0.2716605
21289,0.0,0.050518394
21299,0.0,-0.9877914
21309,0.0,-0.5983958
21319,0.0,-0.097693324
21329,0.0,-0.4198687
21339,0.0,0.11917549
21349,0.0,-1.1624142
21359,0.0,0.12440622
21369,0.0,0.46474093
21379,0.0,0.010156989
21389,0.0,-0.41494346
21399,0.0,-0.53132343
21409,0.0,-0.27445018
21419,0.0,0.19190216
21429,0.0,0.15515053
21439,0.0,-0.26276863
21449,0.0,0.31889844
21459,0.0,0.1927681
21469,0.0,0.28860366
21479,0.0,0.09600592
21489,0.0,0.05382979
21499,0.0,0.1444385
21509,0.0,0.6666004
21519,0.0,0.9376324
21529,0.0,-0.2760105
21539,0.0,0.18955642
21549,0.0,0.2872212
21559,0.0,-0.15106928
21569,0.0,-0.30141193
21579,0.0,0.45268947
21589,0.0,0.61046106
21599,0.0,0.122859955
21609,0.0,-0.5367866
21619,0.0,0.28027135
21629,0.0,-0.6588962
21639,0.0,0.2327553
21649,0.0,-0.17850053
21659,0.0,-0.28443313
21669,0.0,0.025980353
21679,0.0,0.13785303
21689,0.0,0.081633866
21699,0.0,-0.30810952
21709,0.0,0.18130279
21719,0.0,-0.20705771
21729,0.0,0.08864862
21739,0.0,-0.3959024
21749,0.0,0.23183656
21759,0.0,-0.4563018
21769,0.0,-0.60295486
21779,0.0,-0.6410893
21789,0.0,-0.23431706
21799,0.0,-0.5124504
21809,0.0,-0.27463925
21819,0.0,-0.14640772
21829,0.0,-0.5033909
21839,0.0,-0.7994254
21849,0.0,0.15001094
21859,0.0,-0.019922853
21869,0.0,-0.15719908
21879,0.0,-0.17254043
21889,0.0,0.36101484
21899,0.0,-0.2511608
21909,0.0,-0.25063032
21919,0.0,-0.74495536
21929,0.0,0.13963151
21939,0.0,-0.23699218
21949,0.0,0.3212579
21959,0.0,0.04596418
21969,0.0,0.023584723
21979,0.0,0.30610436
21989,0.0,0.25571668
21999,0.0,-0.3292235
22009,0.0,-0.26647615
22019,0.0,-0.29601634
22029,0.0,0.13264865
22039,0.0,-0.7710732
22049,0.0,0.33832312
22059,0.0,0.012762606
22069,0.0,-0.7024901
22079,0.0,-0.099282205
22089,0.0,0.057823777
22099,0.0,-0.47038412
22109,0.0,-1.139368
22119,0.0,-0.3010252
22129,0.0,0.14175767
22139,0.0,-0.35467887
22149,0.0,-0.265558
22159,0.0,-0.030359626
22169,0.0,0.0020532608
22179,0.0,-0.19183922
22189,0.0,0.08904368
22199,0.0,0.198668
22209,0.0,0.032034397
22219,0.0,-0.25587344
22229,0.0,0.26626986
22239,0.0,0.22867972
22249,0.0,0.00080788136
22259,0.0,-0.633443
22269,0.0,0.5721077
22279,0.0,0.06556511
22289,0.0,0.009420633
22299,0.0,0.15834403
22309,0.0,0.05599618
22319,0.0,-0.086859584
22329,0.0,-0.1573677
22339,0.0,-0.27920246
22349,0.0,-0.38751066
22359,0.0,0.022785664
22369,0.0,-0.16508389
22379,0.0,-0.57365537
22389,0.0,-0.37222028
22399,0.0,-0.13817525
22409,0.0,0.29885077
22419,0.0,-0.20879626
22429,0.0,0.14047003
22439,0.0,-0.38127202
22449,0.0,0.048665166
22459,0.0,-0.45116663
22469,0.0,-0.46468544
22479,0.0,-0.22868323
22489,0.0,-0.034504056
22499,0.0,-0.16025507
22509,0.0,-0.24349678
22519,0.0,-0.37609577
22529,0.0,-0.31181586
22539,0.0,0.43267322
22549,0.0,0.7057597
22559,0.0,-0.030097842
22569,0.0,0.5544021
22579,0.0,0.12765491
22589,0.0,0.7776599
22599,0.0,1.1292565
22609,0.0,1.16468
22619,0.0,0.30283177
22629,0.0,0.31700534
22639,0.0,-0.36222184
22649,0.0,-0.4036386
22659,0.0,0.21941018
22669,0.0,0.033956885
22679,0.0,-0.1357919
22689,0.0,-0.54020345
22699,0.0,-0.7157686
22709,0.0,-0.045744777
22719,0.0,-0.26293653
22729,0.0,-0.3707832
22739,0.0,-0.121622324
22749,0.0,-0.18915081
22759,0.0,-0.5609877
22769,0.0,-0.32487458
22779,0.0,-0.47930634
22789,0.0,-0.1510235
22799,0.0,-0.27818155
22809,0.0,0.6211611
22819,0.0,-0.15644747
22829,0.0,-0.16273999
22839,0.0,0.4413191
22849,0.0,0.15713012
22859,0.0,0.09290135
22869,0.0,0.47657615
22879,0.0,0.15862256
22889,0.0,-0.12934732
22899,0.0,0.48952532
22909,0.0,-0.041795492
22919,0.0,-0.012961745
22929,0.0,0.034623444
22939,0.0,-0.21560884
22949,0.0,-0.13027811
22959,0.0,-0.47898364
22969,0.0,-0.2952993
22979,0.0,-0.0117150545
22989,0.0,-0.12725496
22999,0.0,0.050576925
23009,0.0,-0.24628687
23019,0.0,-0.119895875
23029,0.0,0.7071861
23039,0.0,-0.71679986
23049,0.0,-0.24263275
23059,0.0,-0.36662567
23069,0.0,0.20565867
23079,0.0,0.10743153
23089,0.0,0.492957
23099,0.0,-0.4836803
23109,0.0,-0.1685009
23119,0.0,-0.11775923
23129,0.0,-0.19677591
23139,0.0,-0.32112902
23149,0.0,-0.5745653
23159,0.0,-0.17908764
23169,0.0,-0.38338327
23179,0.0,-0.15522993
23189,0.0,-0.20516717
23199,0.0,-0.5234269
23209,0.0,-0.41113406
23219,0.0,-0.5453917
23229,0.0,0.048379064
23239,0.0,-0.15524316
23249,0.0,-0.28585958
23259,0.0,-0.45103908
23269,0.0,0.06740832
23279,0.0,0.19478887
23289,0.0,-0.07173526
23299,0.0,0.90113354
23309,1.0,0.024796367
23319,1.0,0.15711701
23329,1.0,0.2690491
23339,1.0,0.21039963
23349,1.0,0.6096745
23359,1.0,1.645206
23369,1.0,1.1836069
23379,1.0,1.7661928
23389,1.0,1.5402489
23399,1.0,2.5577931
23409,1.0,3.0610933
23419,1.0,3.9585783
23429,1.0,4.406947
23439,1.0,4.0508404
23449,1.0,5.2156243
23459,1.0,5.5209746
23469,1.0,5.795209
23479,1.0,7.8589406
23489,1.0,8.733089
23499,1.0,9.37295
23509,1.0,13.394157
23519,1.0,13.557362
23529,1.0,13.475092
23539,1.0,12.173286
23549,1.0,9.424415
23559,1.0,5.9047937
23569,1.0,7.051442
23579,1.0,3.9018426
23589,1.0,2.3676312
23599,1.0,1.5160553
23609,1.0,1.5551723
23619,1.0,1.0079716
23629,1.0,0.51160187
23639,1.0,0.644704
23649,1.0,0.85142314
23659,1.0,0.84717625
23669,1.0,1.1056479
23679,1.0,1.7002976
23689,1.0,2.5919807
23699,1.0,4.616605
23709,1.0,5.5238037
23719,1.0,6.131619
23729,1.0,9.276678
23739,1.0,12.202444
23749,1.0,13.522871
23759,1.0,13.504775
23769,1.0,13.4714775
23779,1.0,11.793688
23789,1.0,8.756916
23799,1.0,6.027538
23809,1.0,6.1854362
23819,1.0,5.9952044
23829,1.0,4.9537706
23839,1.0,4.635334
23849,1.0,3.399407
23859,1.0,3.5876293
23869,1.0,3.5563807
23879,1.0,2.9194636
23889,1.0,2.8724446
23899,1.0,2.083292
23909,1.0,1.8731629
23919,1.0,1.0920388
23929,1.0,0.79257745
23939,1.0,0.54581887
23949,1.0,-0.012061238
23959,1.0,0.814436
23969,1.0,-0.2069006
23979,0.0,-0.041174054
23989,0.0,-0.6075653
23999,0.0,0.4700706
24009,0.0,-0.51772094
24019,0.0,-0.26043713
24029,0.0,0.048444033
24039,0.0,-0.33586824
24049,0.0,-0.009070635
24059,0.0,-0.014616609
24069,0.0,0.23618448
24079,0.0,0.3171053
24089,0.0,-0.69227743
24099,0.0,0.4110149
24109,0.0,0.013769865
24119,0.0,0.12744331
24129,0.0,0.043084204
24139,0.0,0.14439082
24149,0.0,-0.37751782
24159,0.0,-0.13342488
24169,0.0,-0.560323
24179,0.0,-0.6482646
24189,0.0,0.15650588
24199,0.0,-0.0043166876
24209,0.0,0.104103446
24219,0.0,-0.31949902
24229,0.0,-0.1719976
24239,0.0,0.120508194
24249,0.0,-0.052071095
24259,0.0,-0.14884305
24269,0.0,0.5369854
24279,0.0,-0.43840128
24289,0.0,-0.11667824
24299,0.0,-0.39589828
24309,0.0,-0.01892054
24319,0.0,-0.19432783
24329,0.0,-1.0961266
24339,0.0,-0.17856562
24349,0.0,0.37932384
24359,0.0,0.040238142
24369,0.0,-0.15075338
24379,0.0,0.336429
24389,0.0,0.28525054
24399,0.0,0.0036027431
24409,0.0,0.2088852
24419,0.0,0.123411596
24429,0.0,0.11035621
24439,0.0,-0.20003057
24449,0.0,-0.2126832
24459,0.0,0.21577406
24469,0.0,0.16204953
24479,0.0,-0.0641793
24489,0.0,-0.08523458
24499,0.0,0.080946565
24509,0.0,-0.51541114
24519,0.0,-0.5731458
24529,0.0,-0.28625047
24539,0.0,-0.17386049
24549,0.0,-0.5367279
24559,0.0,-0.45930564
24569,0.0,-0.6137022
24579,0.0,-0.39902574
24589,0.0,-0.31826282
24599,0.0,-0.3824618
24609,0.0,-0.031518936
24619,0.0,-0.39231062
24629,0.0,-0.07137358
24639,0.0,-0.030298948
24649,0.0,-0.00010573864
24659,0.0,-0.27621
24669,0.0,-0.29463613
24679,0.0,-0.19575882
24689,0.0,-0.16222596
24699,0.0,-0.36441755
24709,0.0,-0.23317683
24719,0.0,0.0679028
24729,0.0,-0.09938741
24739,0.0,0.22297585
24749,0.0,-0.45659602
24759,0.0,-0.41915524
24769,0.0,-0.32040536
24779,0.0,-0.46818578
24789,0.0,0.2523144
24799,0.0,0.2077769
24809,0.0,0.1814661
24819,0.0,-0.34277475
24829,0.0,-0.49183208
24839,0.0,0.0010647774
24849,0.0,-0.5709435
24859,0.0,0.21438497
24869,0.0,-0.3663516
24879,0.0,-0.49882126
24889,0.0,-0.5707027
24899,0.0,-0.044890106
24909,0.0,-0.33901143
24919,0.0,-0.41554594
24929,0.0,-0.4616226
24939,0.0,0.01755178
24949,0.0,0.21060789
24959,0.0,-0.15686756
24969,0.0,-0.031662703
24979,0.0,-0.33704102
24989,0.0,0.07415199
24999,0.0,-0.27360773
25009,0.0,-0.30184853
25019,0.0,0.07934117
25029,0.0,0.041332245
25039,0.0,-0.17747605
25049,0.0,0.20882815
25059,0.0,0.3001653
25069,0.0,0.18857777
25079,0.0,0.53367424
25089,0.0,-0.15197349
25099,0.0,0.2767533
25109,0.0,-0.16668665
25119,0.0,0.22455049
25129,0.0,-0.5372435
25139,0.0,0.44353652
25149,0.0,0.4302585
25159,0.0,0.37711424
25169,0.0,-0.001054883
25179,0.0,0.32166302
25189,0.0,0.89930487
25199,0.0,1.1104525
25209,0.0,1.0487689
25219,0.0,1.2028575
25229,0.0,2.0231056
25239,0.0,1.45193
25249,0.0,1.1362909
25259,0.0,0.42954338
25269,0.0,0.3150587
25279,0.0,0.14575195
25289,0.0,-0.11311829
25299,0.0,-0.035398364
25309,0.0,-0.34082592
25319,0.0,-0.092125416
25329,0.0,0.040115118
25339,0.0,0.38682938
25349,0.0,-0.37388843
25359,0.0,0.17135328
25369,0.0,-0.60655344
25379,0.0,-0.15746927
25389,0.0,0.031410217
25399,0.0,0.1278621
25409,0.0,0.48698938
25419,0.0,0.14315271
25429,0.0,0.32192814
25439,0.0,1.1010314
25449,0.0,0.34370756
25459,0.0,0.73539394
25469,0.0,0.19190812
25479,0.0,0.08146459
25489,0.0,-0.41183913
25499,0.0,-0.38037014
25509,0.0,-0.12635517
25519,0.0,-0.036528707
25529,0.0,-0.42551637
25539,0.0,0.16145027
25549,0.0,-0.3202526
25559,0.0,-0.3870778
25569,0.0,-0.42578822
25579,0.0,-0.15658212
25589,0.0,-0.034682155
25599,0.0,0.03788936
25609,0.0,-0.035197735
25619,0.0,0.40139186
25629,0.0,0.03203696
25639,0.0,-0.06039405
25649,0.0,-0.23434603
25659,0.0,-0.18525952
25669,0.0,-0.18869066
25679,0.0,0.35205638
25689,0.0,-0.64651215
25699,0.0,-0.15433395
25709,0.0,0.43327415
25719,0.0,-0.01753521
25729,0.0,-0.4337334
25739,0.0,-0.74990815
25749,0.0,-0.5131326
25759,0.0,-0.2973299
25769,0.0,-0.6565168
25779,0.0,-0.79347414
25789,0.0,-0.3622353
25799,0.0,0.31501752
25809,0.0,-0.25630975
25819,0.0,0.263416
25829,0.0,-0.040580988
25839,0.0,0.2348612
25849,0.0,-0.5624025
25859,0.0,-0.05036515
25869,0.0,-0.21787035
25879,0.0,-0.21506798
25889,0.0,-0.5741943
25899,0.0,-0.2663728
25909,0.0,-0.27857357
25919,0.0,-0.020270169
25929,0.0,-0.5335447
25939,0.0,-0.3984033
25949,0.0,0.19300288
25959,0.0,-0.19730115
25969,0.0,0.25873315
25979,0.0,0.2895695
25989,0.0,-0.16709363
25999,0.0,0.25699103
26009,0.0,0.21718216
26019,0.0,-0.22202337
26029,0.0,0.15876186
26039,0.0,-0.55979735
26049,0.0,-1.0206716
26059,0.0,-0.4565159
26069,0.0,-0.53158474
26079,0.0,-0.13005865
26089,0.0,0.25947487
26099,0.0,-0.2978137
26109,0.0,-0.05746007
26119,0.0,-0.625107
26129,0.0,-0.24037373
26139,0.0,0.3949648
26149,0.0,0.29767835
26159,0.0,0.65163535
26169,0.0,0.17432225
26179,0.0,0.3661108
26189,0.0,0.30051988
26199,0.0,0.27239782
26209,0.0,0.48233545
26219,0.0,0.86936903
26229,0.0,1.2313403
26239,0.0,0.6552988
26249,0.0,1.0889907
26259,0.0,1.0398914
26269,0.0,0.7667884
26279,0.0,-0.405748
26289,0.0,0.2793573
26299,0.0,-0.5913966
26309,0.0,-0.23206496
26319,0.0,-0.4876821
26329,0.0,-0.4169711
26339,0.0,0.11669874
26349,0.0,0.2821561
26359,0.0,0.16943705
26369,0.0,0.50215733
26379,0.0,-0.20158309
26389,0.0,-0.6424462
26399,0.0,0.015211344
26409,0.0,-0.013488054
26419,0.0,0.7258173
26429,0.0,0.743629
26439,0.0,0.3571893
26449,0.0,0.30993164
26459,0.0,0.14735782
26469,0.0,-0.4862324
26479,0.0,-0.40252018
26489,0.0,-0.15711927
26499,0.0,-0.007906675
26509,0.0,0.07057035
26519,0.0,-0.27217823
26529,0.0,-0.29298365
26539,0.0,-0.5793493
26549,0.0,-0.38239205
26559,0.0,0.012877941
26569,0.0,0.044323325
26579,0.0,-0.30896306
26589,0.0,0.25168312
26599,0.0,-0.44722497
26609,0.0,0.1436944
26619,0.0,-0.3098867
26629,0.0,-0.11212981
26639,0.0,0.33245575
26649,0.0,-0.04406202
26659,0.0,-0.14511752
26669,0.0,-0.009434581
26679,0.0,0.7957842
26689,0.0,0.7963499
26699,0.0,1.0792197
26709,0.0,0.88000077
26719,0.0,0.65917844
26729,0.0,1.5313199
26739,0.0,0.9041334
26749,0.0,0.09376323
26759,0.0,0.6863034
26769,0.0,0.2025472
26779,0.0,0.77703345
26789,0.0,0.45157778
26799,0.0,-0.20708287
26809,0.0,-0.23023438
26819,0.0,1.0205926
26829,0.0,-0.021584153
26839,0.0,-0.22891426
26849,0.0,0.104649425
26859,0.0,0.07745755
26869,0.0,0.22314572
26879,0.0,0.12499094
26889,0.0,0.34453082
26899,0.0,-0.49571228
26909,0.0,-0.05313313
26919,0.0,-0.3902756
26929,0.0,0.3087495
26939,0.0,-0.1202724
26949,0.0,0.2921493
26959,0.0,0.791435
26969,0.0,1.1380768
26979,0.0,1.9454373
26989,0.0,1.0427766
26999,0.0,0.2588017
27009,0.0,-0.34632182
27019,0.0,0.24690533
27029,0.0,0.33854866
27039,0.0,0.61605674
27049,0.0,0.35664284
27059,0.0,-0.24989963
27069,0.0,0.53146434
27079,0.0,0.083093524
27089,0.0,0.14315784
27099,0.0,-0.30179584
27109,0.0,-0.34778035
27119,0.0,-0.1986686
27129,0.0,0.16353893
27139,0.0,-0.65855485
27149,0.0,-0.415994
27159,0.0,0.17620713
27169,0.0,-0.4985448
27179,0.0,-0.11907667
27189,0.0,-0.09320575
27199,0.0,-0.42438293
27209,0.0,-0.4096709
27219,0.0,0.04261911
27229,0.0,-0.54207134
27239,0.0,-0.61599946
27249,0.0,-0.46388137
27259,0.0,-0.43964052
27269,0.0,0.15162706
27279,0.0,-0.4929372
27289,0.0,-0.3815409
27299,0.0,-1.1902313
27309,0.0,-0.33557868
27319,0.0,-0.5067218
27329,0.0,-0.076149285
27339,0.0,-0.7753928
27349,0.0,-0.20088238
27359,0.0,-0.3495685
27369,0.0,-0.3284868
27379,0.0,-0.035812974
27389,0.0,0.19038004
27399,0.0,-0.1419285
27409,0.0,-0.1477356
27419,0.0,-0.45806456
27429,0.0,-0.26953942
27439,0.0,-0.22463965
27449,0.0,0.026524305
27459,0.0,-0.43083048
27469,0.0,0.30127347
27479,0.0,-0.36402178
27489,0.0,-0.37548292
27499,0.0,-0.15161395
27509,0.0,0.06647259
27519,0.0,-0.4711479
27529,0.0,0.32002687
27539,0.0,0.083453834
27549,0.0,-0.19891691
27559,0.0,0.018598795
27569,0.0,-0.13906264
27579,0.0,0.7227304
27589,0.0,0.12941241
27599,0.0,-0.36834502
27609,0.0,-0.42721927
27619,0.0,0.08012855
27629,0.0,0.05894518
27639,0.0,-0.07474828
27649,0.0,-0.5138445
27659,0.0,-0.0044492483
27669,0.0,-0.6582121
27679,0.0,-0.52572787
27689,0.0,-0.32911658
27699,0.0,-0.081650615
27709,0.0,-0.29449296
27719,0.0,-0.5865909
27729,0.0,-0.04102415
27739,0.0,0.061448336
27749,0.0,-0.12832463
27759,0.0,0.010983944
27769,0.0,0.21155703
27779,0.0,0.008122921
27789,0.0,-0.37559128
27799,0.0,-0.0068962574
27809,0.0,-0.116444945
27819,0.0,0.5098988
27829,0.0,0.47737408
27839,0.0,-0.2658304
27849,0.0,0.07246536
27859,0.0,0.54782534
27869,0.0,-0.2363401
27879,0.0,0.32085884
27889,0.0,0.1563803
27899,0.0,0.18141901
27909,0.0,0.022284627
27919,0.0,0.17445105
27929,0.0,0.11073136
27939,0.0,-0.063412786
27949,0.0,-0.42301804
27959,0.0,-0.5194856
27969,0.0,-0.27764165
27979,0.0,-0.41705918
27989,0.0,-0.51074576
27999,0.0,0.20762312
28009,0.0,0.04404962
28019,0.0,0.11030483
28029,0.0,0.33751202
28039,0.0,0.5655327
28049,0.0,0.4592905
28059,0.0,-0.092990875
28069,0.0,-0.3711232
28079,0.0,-0.4751014
28089,0.0,-0.28151584
28099,0.0,0.008249998
28109,0.0,-0.79977196
28119,0.0,-0.193061
28129,0.0,-0.5429151
28139,0.0,-0.44886875
28149,0.0,-0.4293282
28159,0.0,-0.43328077
28169,0.0,-0.32047772
28179,0.0,-0.5105523
28189,0.0,-0.26878715
28199,0.0,-0.25028098
28209,0.0,-0.06817675
28219,0.0,-0.27044868
28229,0.0,0.07218826
28239,0.0,-0.31458747
28249,0.0,0.20878267
28259,0.0,0.36512208
28269,0.0,0.15161026
28279,0.0,-0.53141487
28289,0.0,-0.17909312
28299,0.0,-0.103138685
28309,0.0,-0.56049776
28319,0.0,-0.5241978
28329,0.0,-0.14524364
28339,0.0,-0.9317185
28349,0.0,-0.05513978
28359,0.0,-0.30622238
28369,0.0,0.43261057
28379,0.0,-0.1981045
28389,0.0,0.027663827
28399,0.0,-0.101632476
28409,0.0,0.27065432
28419,0.0,0.4409774
28429,0.0,-0.3209362
28439,0.0,0.20470119
28449,0.0,-0.67720455
28459,0.0,0.8048502
28469,0.0,0.251279
28479,0.0,-0.19052696
28489,0.0,0.060017824
28499,0.0,0.55016714
28509,1.0,0.56692517
28519,1.0,0.23537695
28529,1.0,0.8226487
28539,1.0,1.3481705
28549,1.0,1.3477335
28559,1.0,1.9606066
28569,1.0,1.7225769
28579,1.0,2.131268
28589,1.0,2.2448366
28599,1.0,2.429225
28609,1.0,3.1851282
28619,1.0,4.258749
28629,1.0,4.63772
28639,1.0,4.3428197
28649,1.0,5.180857
28659,1.0,5.6646504
28669,1.0,6.127074
28679,1.0,7.031672
28689,1.0,8.629349
28699,1.0,12.475216
28709,1.0,13.5769205
28719,1.0,13.486393
28729,1.0,13.044576
28739,1.0,10.60791
28749,1.0,12.282103
28759,1.0,7.894837
28769,1.0,7.0456786
28779,1.0,3.7969513
28789,1.0,2.6653895
28799,1.0,1.9419752
28809,1.0,1.3986937
28819,1.0,0.48962337
28829,1.0,0.87139124
28839,1.0,0.8968114
28849,1.0,0.6970739
28859,1.0,0.6653949
28869,1.0,1.4529608
28879,1.0,1.9477649
28889,1.0,1.490689
28899,1.0,4.133358
28909,1.0,7.460226
28919,1.0,7.127628
28929,1.0,9.482051
28939,1.0,12.26156
28949,1.0,13.072099
28959,1.0,13.698923
28969,1.0,13.268723
28979,1.0,10.537189
28989,1.0,8.835169
28999,1.0,6.8504457
29009,1.0,6.3824615
29019,1.0,5.941628
29029,1.0,4.4406867
29039,1.0,4.425257
29049,1.0,3.7802851
29059,1.0,3.1182969
29069,1.0,2.6098533
29079,1.0,2.4147785
29089,1.0,1.8334603
29099,1.0,1.5657488
29109,1.0,1.23484
29119,1.0,1.3741305
29129,1.0,0.878172
29139,1.0,0.7265763
29149,1.0,-0.14354575
29159,1.0,-0.021947384
29169,0.0,-0.48535013
29179,0.0,-0.029981017
29189,0.0,0.42085063
29199,0.0,-0.18710077
29209,0.0,-0.09459615
29219,0.0,-0.1890189
29229,0.0,0.05426407
29239,0.0,0.013448477
29249,0.0,0.23705316
29259,0.0,-0.13352156
29269,0.0,0.16230118
29279,0.0,-0.3430218
29289,0.0,0.19218624
29299,0.0,-0.33521378
29309,0.0,-0.18938828
29319,0.0,0.16748631
29329,0.0,0.010967016
29339,0.0,0.30841374
29349,0.0,-0.59978527
29359,0.0,0.07645643
29369,0.0,-0.094732285
29379,0.0,-0.13592517
29389,0.0,-0.49531162
29399,0.0,-0.57509977
29409,0.0,-0.024731278
29419,0.0,-0.4169581
29429,0.0,-0.45203042
29439,0.0,-0.4440483
29449,0.0,-0.53037333
29459,0.0,-0.17881215
29469,0.0,0.18140185
29479,0.0,-0.5059629
29489,0.0,-0.02947414
29499,0.0,-0.11953056
29509,0.0,-0.11452329
29519,0.0,0.0807091
29529,0.0,0.049649477
29539,0.0,0.10068357
29549,0.0,0.05521357
29559,0.0,0.2537533
29569,0.0,-0.048868895
29579,0.0,-0.28121704
29589,0.0,-0.32581025
29599,0.0,0.3235103
29609,0.0,-0.53826296
29619,0.0,-0.3045872
29629,0.0,-0.9240516
29639,0.0,-0.26467317
29649,0.0,-0.7154418
29659,0.0,-0.41576415
29669,0.0,-0.2649154
29679,0.0,-0.24609154
29689,0.0,0.3186394
29699,0.0,0.29095936
29709,0.0,0.13932812
29719,0.0,0.7361987
29729,0.0,0.6659085
29739,0.0,-0.44344693
29749,0.0,0.23556757
29759,0.0,-0.10153979
29769,0.0,-0.46137667
29779,0.0,-0.35606325
29789,0.0,-0.6698437
29799,0.0,0.004062891
29809,0.0,-0.44132543
29819,0.0,-0.3253278
29829,0.0,0.21586329
29839,0.0,-0.37105978
29849,0.0,0.77393717
29859,0.0,0.22315204
29869,0.0,0.22221643
29879,0.0,0.61816835
29889,0.0,0.52505106
29899,0.0,0.28545594
29909,0.0,0.44109166
29919,0.0,0.2730266
29929,0.0,-0.2623167
29939,0.0,0.06580627
29949,0.0,0.085591435
29959,0.0,-0.24133456
29969,0.0,-0.17837358
29979,0.0,-0.5241449
29989,0.0,-0.45434952
29999,0.0,-0.0061597824
30009,0.0,0.00094020367
30019,0.0,-0.39640135
30029,0.0,0.033148825
30039,0.0,-0.96384823
30049,0.0,0.6914087
30059,0.0,-0.2730621
30069,0.0,0.117453635
30079,0.0,-0.34486055
30089,0.0,-0.32912123
30099,0.0,-0.08349383
30109,0.0,-0.1126039
30119,0.0,-0.12585461
30129,0.0,-0.26241004
30139,0.0,0.12661946
30149,0.0,0.7085769
30159,0.0,0.2535321
30169,0.0,0.20399094
30179,0.0,0.11969799
30189,0.0,-0.13615906
30199,0.0,-0.50933075
30209,0.0,0.05088854
30219,0.0,-0.3415116
30229,0.0,-0.20686352
30239,0.0,0.38092637
30249,0.0,0.057785034
30259,0.0,0.48486537
30269,0.0,0.1815052
30279,0.0,0.4986496
30289,0.0,0.20456302
30299,0.0,-0.21935833
30309,0.0,-0.71691763
30319,0.0,-0.2746364
30329,0.0,-0.2404455
30339,0.0,-0.4413252
30349,0.0,-0.52985543
30359,0.0,-0.045305967
30369,0.0,-0.5843349
30379,0.0,-0.043136954
30389,0.0,-0.5268854
30399,0.0,-0.012716889
30409,0.0,-0.7676283
30419,0.0,-0.3539557
30429,0.0,-0.32435918
30439,0.0,0.03987074
30449,0.0,0.23208106
30459,0.0,-0.18527424
30469,0.0,0.011794448
30479,0.0,-0.014054775
30489,0.0,0.94669116
30499,0.0,0.4001432
30509,0.0,0.7264984
30519,0.0,0.8222427
30529,0.0,0.013758898
30539,0.0,-0.21149659
30549,0.0,-0.44433558
30559,0.0,0.13740778
30569,0.0,0.31178296
30579,0.0,-0.29775894
30589,0.0,0.015006065
30599,0.0,-0.38008106
30609,0.0,0.05081415
30619,0.0,-0.8656601
30629,0.0,-0.51623285
30639,0.0,-0.25604522
30649,0.0,-0.45978892
30659,0.0,-0.006222725
30669,0.0,-0.7370417
30679,0.0,0.010944009
30689,0.0,-0.09760213
30699,0.0,-0.0016802549
30709,0.0,-0.7862896
30719,0.0,0.119210005
30729,0.0,0.18586874
30739,0.0,-0.15376198
30749,0.0,0.021029234
30759,0.0,0.4740569
30769,0.0,0.14172542
30779,0.0,-0.053761125
30789,0.0,0.8365224
30799,0.0,0.17097974
30809,0.0,0.5008734
30819,0.0,0.3094076
30829,0.0,0.1393702
30839,0.0,-0.335387
30849,0.0,-0.10403299
30859,0.0,-0.009106755
30869,0.0,0.23719937
30879,0.0,-0.4512357
30889,0.0,0.14196682
30899,0.0,-0.2615481
30909,0.0,0.012418687
30919,0.0,0.13614392
30929,0.0,-0.46803546
30939,0.0,-0.39828837
30949,0.0,-0.24730247
30959,0.0,-0.5041247
30969,0.0,-0.30645084
30979,0.0,0.032179594
30989,0.0,0.010426283
30999,0.0,-0.15726084
31009,0.0,-0.15483737
31019,0.0,-0.23126566
31029,0.0,-0.046359062
31039,0.0,-0.025162697
31049,0.0,-0.004429221
31059,0.0,0.10817629
31069,0.0,0.43581897
31079,0.0,-0.22613776
31089,0.0,0.08342028
31099,0.0,-0.036618352
31109,0.0,-0.012289882
31119,0.0,0.26848078
31129,0.0,-0.006005287
31139,0.0,0.21572155
31149,0.0,-0.20080501
31159,0.0,-0.16141093
31169,0.0,0.21588218
31179,0.0,-0.73614955
31189,0.0,-0.45986813
31199,0.0,-0.49529904
31209,0.0,0.07084876
31219,0.0,0.19098568
31229,0.0,-0.039295793
31239,0.0,-0.24694419
31249,0.0,-0.6939585
31259,0.0,0.098694324
31269,0.0,0.2448256
31279,0.0,0.34114802
31289,0.0,0.35493863
31299,0.0,0.50526994
31309,0.0,0.30799705
31319,0.0,-0.4176892
31329,0.0,0.4374417
31339,0.0,0.18790054
31349,0.0,-0.29324365
31359,0.0,-0.256909
31369,0.0,-0.13522851
31379,0.0,1.0011132
31389,0.0,0.10233092
31399,0.0,-0.6235963
31409,0.0,-0.180861
31419,0.0,-0.14958513
31429,0.0,0.023255944
31439,0.0,0.35434115
31449,0.0,0.31157088
31459,0.0,0.14694428
31469,0.0,-0.24338114
31479,0.0,-0.09065342
31489,0.0,-0.36019838
31499,0.0,-0.14321291
31509,0.0,-0.4763646
31519,0.0,0.36522245
31529,0.0,-0.034954667
31539,0.0,0.2757097
31549,0.0,-0.14991665
31559,0.0,0.07767737
31569,0.0,0.4855305
31579,0.0,0.55601794
31589,0.0,0.48735607
31599,0.0,0.09662402
31609,0.0,0.749069
31619,0.0,0.21969438
31629,0.0,0.81596935
31639,0.0,1.0405904
31649,0.0,-0.22178626
31659,0.0,-0.060637593
31669,0.0,-0.3362533
31679,0.0,0.2488519
31689,0.0,-0.40312874
31699,0.0,0.10961223
31709,0.0,-0.3641348
31719,0.0,0.13456488
31729,0.0,-0.09665644
31739,0.0,-0.43713784
31749,0.0,0.11877906
31759,0.0,0.4143238
31769,0.0,1.6181992
31779,0.0,0.7637404
31789,0.0,1.2670555
31799,0.0,-0.16571808
31809,0.0,0.2989735
31819,0.0,0.24357915
31829,0.0,1.3281257
31839,0.0,0.48796052
31849,0.0,0.5232754
31859,0.0,0.67867184
31869,0.0,0.25902003
31879,0.0,0.5438118
31889,0.0,0.59716153
31899,0.0,0.29114735
31909,0.0,0.2917769
31919,0.0,-0.09419906
31929,0.0,0.5562042
31939,0.0,-0.6191626
31949,0.0,-0.21874762
31959,0.0,-0.07094622
31969,0.0,-0.28209507
31979,0.0,0.07857895
31989,0.0,-0.47895932
31999,0.0,-0.27783298
32009,0.0,-0.3967846
32019,0.0,-0.22159588
32029,0.0,-0.15082741
32039,0.0,0.27104962
32049,0.0,-0.52936393
32059,0.0,-0.4169516
32069,0.0,-0.4944638
32079,0.0,-0.32181293
32089,0.0,0.36189896
32099,0.0,-0.53890353
32109,0.0,-0.54111993
32119,0.0,-0.14853883
32129,0.0,-0.29877084
32139,0.0,0.09243244
32149,0.0,-0.12067437
32159,0.0,0.5738329
32169,0.0,0.6708442
32179,0.0,0.7399434
32189,0.0,0.32147622
32199,0.0,0.28445113
32209,0.0,0.027362704
32219,0.0,-0.06899679
32229,0.0,0.16067791
32239,0.0,-0.028774261
32249,0.0,0.89097106
32259,0.0,0.7541896
32269,0.0,0.19319081
32279,0.0,0.48476136
32289,0.0,0.3341812
32299,0.0,0.62058735
32309,0.0,0.095264435
32319,0.0,-0.40138435
32329,0.0,-0.27560914
32339,0.0,0.62931854
32349,0.0,0.22370094
32359,0.0,-0.35260534
32369,0.0,-0.6178542
32379,0.0,-0.78779817
32389,0.0,-0.7251898
32399,0.0,0.23455751
32409,0.0,-0.49665928
32419,0.0,0.12730122
32429,0.0,-0.3459288
32439,0.0,-0.32787323
32449,0.0,-0.07659435
32459,0.0,-0.04889822
32469,0.0,0.18476486
32479,0.0,-0.31061292
32489,0.0,0.5199342
32499,0.0,-0.0067409277
32509,0.0,-0.39045316
32519,0.0,0.19085515
32529,0.0,0.1243251
32539,0.0,-0.29478288
32549,0.0,-0.42370903
32559,0.0,-0.02707827
32569,0.0,0.30942404
32579,0.0,-0.506945
32589,0.0,-0.33048856
32599,0.0,-0.41541612
32609,0.0,-1.0437102
32619,0.0,-0.4458871
32629,0.0,-0.78505826
32639,0.0,0.11378527
32649,0.0,-0.5564431
32659,0.0,-0.116770744
32669,0.0,-0.3131889
32679,0.0,-0.17555177
32689,0.0,-0.08118677
32699,0.0,-0.14776313
32709,0.0,-0.15823734
32719,0.0,-0.2709192
32729,0.0,0.31337035
32739,0.0,-0.16022229
32749,0.0,-0.1257819
32759,0.0,-0.4854232
32769,0.0,-0.29350448
32779,0.0,-0.05681932
32789,0.0,0.16545272
32799,0.0,-0.43606496
32809,0.0,-0.70453703
32819,0.0,-0.0036188364
32829,0.0,0.3695218
32839,0.0,-0.16294521
32849,0.0,0.10866487
32859,0.0,0.51393247
32869,0.0,0.61539865
32879,0.0,0.37951398
32889,0.0,-0.5815652
32899,0.0,0.34568024
32909,0.0,0.02339834
32919,0.0,0.02556312
32929,0.0,0.15757078
32939,0.0,0.08900881
32949,0.0,0.33420813
32959,0.0,-0.28883028
32969,0.0,0.49106538
32979,0.0,-0.3558964
32989,0.0,0.06954777
32999,0.0,0.58214
33009,0.0,0.37523687
33019,0.0,0.16135722
33029,0.0,0.25471622
33039,0.0,-0.04976201
33049,0.0,0.49774104
33059,0.0,0.4638443
33069,0.0,0.17716026
33079,0.0,0.5165011
33089,0.0,-0.6644307
33099,0.0,-0.7121847
33109,0.0,0.16202211
33119,0.0,0.028254747
33129,0.0,0.23877573
33139,0.0,0.2399134
33149,0.0,0.856694
33159,0.0,0.12457335
33169,0.0,0.19591463
33179,0.0,-0.14645904
33189,0.0,-0.51381814
33199,0.0,-0.19563031
33209,0.0,-0.14823657
33219,0.0,-0.05622208
33229,0.0,0.036195517
33239,0.0,0.1347816
33249,0.0,-1.0762317
33259,0.0,0.20381057
33269,0.0,-0.29085588
33279,0.0,0.35772836
33289,0.0,0.020623088
33299,0.0,0.69473547
33309,0.0,0.2735181
33319,0.0,0.62551534
33329,0.0,1.3066659
33339,0.0,2.0730267
33349,0.0,1.821549
33359,0.0,0.76794076
33369,0.0,0.21937037
33379,0.0,0.4248308
33389,0.0,0.2509868
33399,0.0,0.55186224
33409,0.0,0.9768925
33419,0.0,0.6163124
33429,0.0,-0.64103013
33439,0.0,-0.3532828
33449,0.0,-0.52185667
33459,0.0,-0.13846087
33469,0.0,-0.090734005
33479,0.0,-0.062729
33489,0.0,-0.4472893
33499,0.0,-0.06116718
33509,0.0,-0.29111636
33519,0.0,0.48949307
33529,0.0,-0.26192224
33539,0.0,0.4137904
33549,0.0,0.62403035
33559,0.0,-0.3880434
33569,0.0,0.19255519
33579,0.0,-0.34802902
33589,0.0,0.15182489
33599,0.0,0.53231776
33609,0.0,1.4341824
33619,0.0,0.25377154
33629,0.0,0.76717407
33639,0.0,0.78752494
33649,0.0,1.4068544
33659,0.0,0.26203477
33669,0.0,0.6249038
33679,0.0,0.28229916
33689,1.0,0.21460807
33699,1.0,0.74223423
33709,1.0,1.1638322
33719,1.0,0.8775591
33729,1.0,1.023341
33739,1.0,1.0499072
33749,1.0,1.4581091
33759,1.0,1.6176822
33769,1.0,2.196795
33779,1.0,2.506374
33789,1.0,2.927711
33799,1.0,3.3506837
33809,1.0,3.6682396
33819,1.0,4.5165157
33829,1.0,5.353122
33839,1.0,5.4317856
33849,1.0,6.6497087
33859,1.0,7.242298
33869,1.0,5.5090036
33879,1.0,8.889206
33889,1.0,10.94706
33899,1.0,13.710644
33909,1.0,13.122818
33919,1.0,10.336996
33929,1.0,8.206573
33939,1.0,8.175393
33949,1.0,6.6757298
33959,1.0,5.921268
33969,1.0,2.7834454
33979,1.0,1.7618874
33989,1.0,1.0351236
33999,1.0,0.74763054
34009,1.0,0.75515664
34019,1.0,0.48594958
34029,1.0,0.54574496
34039,1.0,0.91713786
34049,1.0,1.1241474
34059,1.0,1.3824352
34069,1.0,1.9271207
34079,1.0,2.3860185
34089,1.0,5.645051
34099,1.0,6.335914
34109,1.0,8.47119
34119,1.0,12.0385685
34129,1.0,12.799583
34139,1.0,13.16637
34149,1.0,13.722172
34159,1.0,13.394791
34169,1.0,9.632082
34179,1.0,8.1097555
34189,1.0,6.6503315
34199,1.0,6.301546
34209,1.0,5.5986185
34219,1.0,5.0311203
34229,1.0,3.5162578
34239,1.0,3.6319113
34249,1.0,2.9828951
34259,1.0,2.7219334
34269,1.0,1.6878175
34279,1.0,2.2268908
34289,1.0,1.8111811
34299,1.0,1.31663
34309,1.0,1.0273198
34319,1.0,0.60437655
34329,1.0,0.4851029
34339,1.0,0.14354473
34349,1.0,0.072316885
34359,0.0,-0.27677602
34369,0.0,-0.450706
34379,0.0,-0.11986995
34389,0.0,-0.11074352
34399,0.0,0.90788347
34409,0.0,0.3436318
34419,0.0,1.146219
34429,0.0,0.4853841
34439,0.0,0.7402568
34449,0.0,0.82136196
34459,0.0,1.138542
34469,0.0,0.28093266
34479,0.0,0.30895114
34489,0.0,0.39625347
34499,0.0,0.79131424
34509,0.0,0.33515447
34519,0.0,0.33327854
34529,0.0,0.266986
34539,0.0,0.31794965
34549,0.0,0.40098536
34559,0.0,-0.40808463
34569,0.0,0.21393996
34579,0.0,-0.664842
34589,0.0,0.020863652
34599,0.0,-0.083593726
34609,0.0,0.05327356
34619,0.0,0.20909226
34629,0.0,-0.16741985
34639,0.0,0.5090499
34649,0.0,-0.58915794
34659,0.0,-0.47900927
34669,0.0,-0.6291575
34679,0.0,-0.11608553
34689,0.0,-0.4904368
34699,0.0,-0.017728686
34709,0.0,-0.1062395
34719,0.0,-0.3009143
34729,0.0,-0.13672417
34739,0.0,-0.20583236
34749,0.0,-0.11417639
34759,0.0,0.23989034
34769,0.0,-0.3862859
34779,0.0,-0.26115584
34789,0.0,0.34758192
34799,0.0,-0.28068566
34809,0.0,-0.42387563
34819,0.0,0.2800287
34829,0.0,-0.114950895
34839,0.0,0.3936236
34849,0.0,-0.3157072
34859,0.0,-0.37294102
34869,0.0,0.077557325
34879,0.0,-0.30288565
34889,0.0,-0.12274051
34899,0.0,-0.041877866
34909,0.0,0.1425317
34919,0.0,0.26200652
34929,0.0,0.08079851
34939,0.0,0.8671193
34949,0.0,1.3656497
34959,0.0,0.60700047
34969,0.0,0.79450774
34979,0.0,0.52744174
34989,0.0,0.4500922
34999,0.0,-0.49884582
35009,0.0,0.32159954
35019,0.0,-0.23949349
35029,0.0,0.32612133
35039,0.0,-0.3124019
35049,0.0,-0.47322202
35059,0.0,-0.118552685
35069,0.0,-0.13006312
35079,0.0,-0.26241124
35089,0.0,-0.2613412
35099,0.0,-0.19460773
35109,0.0,-0.020851314
35119,0.0,0.034701467
35129,0.0,-0.6206916
35139,0.0,-0.2407037
35149,0.0,-0.34014475
35159,0.0,0.04662764
35169,0.0,0.60048276
35179,0.0,-0.6236484
35189,0.0,-0.5998405
35199,0.0,-0.084118724
35209,0.0,-0.2540093
35219,0.0,0.20253533
35229,0.0,0.3322298
35239,0.0,-0.19574547
35249,0.0,-0.11904168
35259,0.0,-0.34720588
35269,0.0,-0.076483846
35279,0.0,0.67000085
35289,0.0,0.30472386
35299,0.0,0.6748284
35309,0.0,0.35136688
35319,0.0,0.8388529
35329,0.0,1.1854237
35339,0.0,0.41884035
35349,0.0,0.26544166
35359,0.0,0.28422242
35369,0.0,-0.11343491
35379,0.0,0.30256784
35389,0.0,-0.20004714
35399,0.0,0.01844567
35409,0.0,-0.7347204
35419,0.0,-0.28743684
35429,0.0,-0.23279274
35439,0.0,0.74380046
35449,0.0,-0.039905548
35459,0.0,0.2591884
35469,0.0,0.06926918
35479,0.0,-0.15006852
35489,0.0,-0.4659282
35499,0.0,0.28248262
35509,0.0,0.534081
35519,0.0,0.38847274
35529,0.0,0.29922366
35539,0.0,0.2618407
35549,0.0,0.74580824
35559,0.0,0.14295459
35569,0.0,0.47129118
35579,0.0,0.05200988
35589,0.0,0.25573945
35599,0.0,0.48855948
35609,0.0,0.2302705
35619,0.0,-0.3218943
35629,0.0,-0.27890813
35639,0.0,0.05951512
35649,0.0,-0.28983963
35659,0.0,-0.45670366
35669,0.0,0.2832209
35679,0.0,-0.16567397
35689,0.0,-0.8789161
35699,0.0,-0.44188476
35709,0.0,0.12579429
35719,0.0,-0.43381512
35729,0.0,0.26308048
35739,0.0,0.21076298
35749,0.0,-0.3077699
35759,0.0,-0.5932224
35769,0.0,0.100681365
35779,0.0,-0.3844211
35789,0.0,0.13341796
35799,0.0,-0.13847709
35809,0.0,0.08395529
35819,0.0,-0.5388313
35829,0.0,0.14514971
35839,0.0,0.63627505
35849,0.0,0.7036042
35859,0.0,0.57301414
35869,0.0,0.7950727
35879,0.0,0.25073743
35889,0.0,0.07705879
35899,0.0,0.022535324
35909,0.0,-0.64004266
35919,0.0,0.22007847
35929,0.0,0.18763041
35939,0.0,-0.115608454
35949,0.0,-0.03639388
35959,0.0,-0.6608149
35969,0.0,-0.5096077
35979,0.0,-0.1269815
35989,0.0,0.425084
35999,0.0,0.45221418
36009,0.0,0.21683806
36019,0.0,0.33715016
36029,0.0,0.51967037
36039,0.0,0.093640625
36049,0.0,0.4086362
36059,0.0,0.30788457
36069,0.0,0.07367277
36079,0.0,0.17494869
36089,0.0,-0.46108806
36099,0.0,0.37663245
36109,0.0,-0.22973967
36119,0.0,0.1528486
36129,0.0,-0.15251553
36139,0.0,-0.3621533
36149,0.0,-0.6486315
36159,0.0,-0.0010489225
36169,0.0,-0.027509093
36179,0.0,0.23592126
36189,0.0,-0.119185805
36199,0.0,-0.29540014
36209,0.0,-0.17377591
36219,0.0,0.3839147
36229,0.0,-0.03670883
36239,0.0,0.037715912
36249,0.0,0.38083565
36259,0.0,-0.3533057
36269,0.0,0.027161539
36279,0.0,-0.19307292
36289,0.0,-0.04237795
36299,0.0,0.36214733
36309,0.0,0.37672853
36319,0.0,0.6653764
36329,0.0,0.0481382
36339,0.0,0.17112815
36349,0.0,0.32304525
36359,0.0,-0.5904825
36369,0.0,-0.16060245
36379,0.0,-0.26293886
36389,0.0,0.12187016
36399,0.0,0.13690114
36409,0.0,0.3268497
36419,0.0,-0.28622687
36429,0.0,-0.02539754
36439,0.0,0.25679588
36449,0.0,-0.4507872
36459,0.0,0.2914461
36469,0.0,0.21354353
36479,0.0,-0.2689048
36489,0.0,-0.5081768
36499,0.0,-0.36967194
36509,0.0,-0.13426483
36519,0.0,-0.32312208
36529,0.0,-0.57447076
36539,0.0,-0.13077211
36549,0.0,-0.43174744
36559,0.0,-0.39805162
36569,0.0,-0.0835135
36579,0.0,-0.889861
36589,0.0,-0.3084767
36599,0.0,-0.43086112
36609,0.0,-0.2938366
36619,0.0,-0.50879514
36629,0.0,-0.55780554
36639,0.0,-0.58845776
36649,0.0,-0.6487543
36659,0.0,-0.5966298
36669,0.0,-0.55767727
36679,0.0,-0.7146201
36689,0.0,-0.26607066
36699,0.0,0.18028677
36709,0.0,-0.7582022
36719,0.0,-0.24728525
36729,0.0,-0.52028626
36739,0.0,-0.115137935
36749,0.0,0.21697211
36759,0.0,-0.23161411
36769,0.0,-0.20417356
36779,0.0,-0.093235135
36789,0.0,0.0031539202
36799,0.0,0.17561114
36809,0.0,0.3288499
36819,0.0,-0.29462385
36829,0.0,0.38446236
36839,0.0,0.1746999
36849,0.0,0.09664905
36859,0.0,0.5408586
36869,0.0,0.06026435
36879,0.0,-0.047034085
36889,0.0,-0.3746937
36899,0.0,0.39292783
36909,0.0,0.36946332
36919,0.0,-0.6248082
36929,0.0,-0.11732769
36939,0.0,-0.57424843
36949,0.0,-0.46089715
36959,0.0,-0.59694123
36969,0.0,-0.29889512
36979,0.0,-0.41527343
36989,0.0,-0.71672654
36999,0.0,0.23527014
37009,0.0,0.3718319
37019,0.0,0.04038012
37029,0.0,-0.46204913
37039,0.0,-0.4127339
37049,0.0,-0.12631893
37059,0.0,-0.057980776
37069,0.0,-0.5392269
37079,0.0,-0.3514942
37089,0.0,-0.14986563
37099,0.0,-0.06936526
37109,0.0,0.16429478
37119,0.0,-0.2473383
37129,0.0,-0.51618683
37139,0.0,-0.3470515
37149,0.0,-0.04688871
37159,0.0,-0.09349191
37169,0.0,-0.19658542
37179,0.0,-0.57196295
37189,0.0,0.16216564
37199,0.0,-0.10570502
37209,0.0,0.15457529
37219,0.0,-0.13070732
37229,0.0,0.19044983
37239,0.0,-0.3900789
37249,0.0,0.10912931
37259,0.0,-0.33652472
37269,0.0,0.41885674
37279,0.0,0.26341426
37289,0.0,0.076737344
37299,0.0,0.12959564
37309,0.0,0.3689983
37319,0.0,0.24149758
37329,0.0,-0.09173882
37339,0.0,-0.27341878
37349,0.0,-0.16275573
37359,0.0,0.08866382
37369,0.0,-0.5226704
37379,0.0,0.15224719
37389,0.0,0.5900984
37399,0.0,-0.06974149
37409,0.0,0.31205535
37419,0.0,-0.23135495
37429,0.0,0.8188687
37439,0.0,-0.038633585
37449,0.0,-0.09437883
37459,0.0,0.07981348
37469,0.0,-0.2642355
37479,0.0,-0.10653114
37489,0.0,-0.15488851
37499,0.0,-0.058143735
37509,0.0,0.15927374
37519,0.0,-0.66049397
37529,0.0,-0.08845353
37539,0.0,-0.33833194
37549,0.0,-0.5306662
37559,0.0,0.50807464
37569,0.0,0.28684807
37579,0.0,0.13865864
37589,0.0,0.40264106
37599,0.0,0.06107235
37609,0.0,-0.41901898
37619,0.0,0.50459474
37629,0.0,0.7806356
37639,0.0,-0.42240727
37649,0.0,-0.21311063
37659,0.0,-0.24616408
37669,0.0,0.16223401
37679,0.0,0.37886655
37689,0.0,0.15573502
37699,0.0,-0.15885758
37709,0.0,-0.24026585
37719,0.0,-0.11601502
37729,0.0,0.19114983
37739,0.0,-0.23896146
37749,0.0,0.3209877
37759,0.0,-0.1979804
37769,0.0,-0.44343668
37779,0.0,0.035452604
37789,0.0,0.49580884
37799,0.0,-0.50672936
37809,0.0,-0.20648277
37819,0.0,0.090773106
37829,0.0,0.19156933
37839,0.0,-0.506673
37849,0.0,-0.033374965
37859,0.0,-0.15097713
37869,0.0,-0.33190453
37879,0.0,-0.1447376
37889,0.0,-0.5942492
37899,0.0,-0.4518137
37909,0.0,-0.81792635
37919,0.0,0.1084497
37929,0.0,-0.26923245
37939,0.0,-0.19028574
37949,0.0,-0.16498375
37959,0.0,-0.4267391
37969,0.0,-0.03161168
37979,0.0,0.07714474
37989,0.0,-0.0031080246
37999,0.0,0.12067366
38009,0.0,-0.3370198
38019,0.0,0.38249314
38029,0.0,-0.038261414
38039,0.0,0.07854688
38049,0.0,0.20380855
38059,0.0,0.15877569
38069,0.0,0.36633176
38079,0.0,0.23628473
38089,0.0,0.37893838
38099,0.0,0.6625474
38109,0.0,0.653116
38119,0.0,-0.20765448
38129,0.0,0.43400395
38139,0.0,0.755837
38149,0.0,0.24168277
38159,0.0,0.47054505
38169,0.0,0.51572734
38179,0.0,0.5348519
38189,0.0,0.51805806
38199,0.0,0.5526762
38209,0.0,-0.06697428
38219,0.0,0.008096099
38229,0.0,0.1562193
38239,0.0,-0.24659896
38249,0.0,0.036297083
38259,0.0,-0.64579666
38269,0.0,0.5398924
38279,0.0,-0.60095215
38289,0.0,0.0049767494
38299,0.0,0.29908192
38309,0.0,0.19850779
38319,0.0,0.41064698
38329,0.0,0.0053932667
38339,0.0,-0.13074636
38349,0.0,-0.002752781
38359,0.0,0.40400076
38369,0.0,0.7632127
38379,0.0,1.0021154
38389,0.0,0.46814132
38399,0.0,0.26335108
38409,0.0,0.72710735
38419,0.0,0.3393237
38429,0.0,0.92339885
38439,0.0,0.5839808
38449,0.0,1.0760646
38459,0.0,0.22222185
38469,0.0,0.8478881
38479,0.0,0.17088318
38489,0.0,-0.0643661
38499,0.0,-0.33644056
38509,0.0,-0.21180892
38519,0.0,-0.9999323
38529,0.0,0.079981565
38539,0.0,-0.35076296
38549,0.0,0.037710547
38559,0.0,0.6416639
38569,0.0,-0.17648041
38579,0.0,-0.07774663
38589,0.0,-0.63424766
38599,0.0,-0.30354548
38609,0.0,0.6750996
38619,0.0,0.3593986
38629,0.0,-0.02805698
38639,0.0,-0.40425658
38649,0.0,0.43974376
38659,0.0,-0.50263375
38669,0.0,0.08128214
38679,0.0,0.5977886
38689,0.0,0.6166961
38699,0.0,0.17515242
38709,0.0,-0.19811332
38719,0.0,0.09574437
38729,0.0,-0.28442335
38739,0.0,0.17564094
38749,0.0,-0.39025724
38759,0.0,-0.034538627
38769,0.0,-0.3658542
38779,0.0,0.4784652
38789,0.0,0.21937776
38799,0.0,0.18607503
38809,0.0,0.96654844
38819,0.0,0.26034927
38829,0.0,0.9115637
38839,0.0,0.2842878
38849,0.0,0.42643
38859,0.0,0.49744302
38869,0.0,0.3410461
38879,0.0,-0.33485407
38889,1.0,-0.18366611
38899,1.0,-0.23196042
38909,1.0,0.3795452
38919,1.0,1.0082138
38929,1.0,0.43134683
38939,1.0,1.2830138
38949,1.0,1.3350588
38959,1.0,1.7078822
38969,1.0,2.4667468
38979,1.0,2.0155592
38989,1.0,2.5186887
38999,1.0,3.1325116
39009,1.0,3.555551
39019,1.0,3.7939754
39029,1.0,5.224494
39039,1.0,5.2785053
39049,1.0,6.61281
39059,1.0,7.045039
39069,1.0,8.068587
39079,1.0,10.787982
39089,1.0,13.284378
39099,1.0,13.572073
39109,1.0,13.307707
39119,1.0,13.42717
39129,1.0,9.656597
39139,1.0,8.91592
39149,1.0,7.383564
39159,1.0,5.3623257
39169,1.0,2.5009813
39179,1.0,1.7577528
39189,1.0,1.4951261
39199,1.0,0.8613502
39209,1.0,0.9066817
39219,1.0,0.4716637
39229,1.0,0.45636648
39239,1.0,0.7716969
39249,1.0,1.252897
39259,1.0,1.6022004
39269,1.0,2.3608634
39279,1.0,4.3380146
39289,1.0,5.7862988
39299,1.0,6.8573565
39309,1.0,9.66083
39319,1.0,11.162249
39329,1.0,12.95904
39339,1.0,13.1786
39349,1.0,13.757414
39359,1.0,13.12327
39369,1.0,10.799824
39379,1.0,8.006327
39389,1.0,6.9364185
39399,1.0,6.7326336
39409,1.0,3.6078496
39419,1.0,4.7901773
39429,1.0,4.1210465
39439,1.0,3.4920301
39449,1.0,3.0572865
39459,1.0,3.1344094
39469,1.0,2.4846327
39479,1.0,2.1431582
39489,1.0,1.8062981
39499,1.0,1.7032872
39509,1.0,2.0208807
39519,1.0,1.4767854
39529,1.0,0.91191936
39539,1.0,0.5228865
39549,1.0,0.31216192
39559,0.0,0.29188734
39569,0.0,0.3371129
39579,0.0,1.2821338
39589,0.0,1.4635051
39599,0.0,1.7840536
39609,0.0,1.3037243
39619,0.0,0.49368
39629,0.0,0.5547319
39639,0.0,0.7852766
39649,0.0,0.712763
39659,0.0,0.6437128
39669,0.0,0.24956775
39679,0.0,-0.35497934
39689,0.0,0.08915508
39699,0.0,0.3085481
39709,0.0,-0.5747752
39719,0.0,0.34179342
39729,0.0,-0.47594357
39739,0.0,-0.012332499
39749,0.0,-0.5768523
39759,0.0,-0.3961491
39769,0.0,-0.18265235
39779,0.0,0.175511
39789,0.0,0.069857836
39799,0.0,-0.31723464
39809,0.0,0.21985841
39819,0.0,0.59424525
39829,0.0,-0.013363957
39839,0.0,0.24525464
39849,0.0,0.13794929
39859,0.0,0.58451724
39869,0.0,-0.09216881
39879,0.0,-0.4625619
39889,0.0,-0.80960137
39899,0.0,-1.1735444
39909,0.0,-0.06755531
39919,0.0,-0.20440114
39929,0.0,-0.09349847
39939,0.0,-0.14872181
39949,0.0,-0.52461445
39959,0.0,-1.0930278
39969,0.0,-0.4922191
39979,0.0,-0.53194475
39989,0.0,-0.72419536
39999,0.0,-0.4584465
40009,0.0,-0.34441823
40019,0.0,-0.0041763783
40029,0.0,-0.4370063
40039,0.0,-0.23878431
40049,0.0,0.14025259
40059,0.0,-0.0479998
40069,0.0,-0.18831956
40079,0.0,0.003776908
40089,0.0,0.07185149
40099,0.0,-0.35797977
40109,0.0,-0.45080566
40119,0.0,-0.23640466
40129,0.0,0.1156286
40139,0.0,-0.084304094
40149,0.0,0.13769424
40159,0.0,-0.016972542
40169,0.0,-0.19271958
40179,0.0,-0.40899456
40189,0.0,-0.034666657
40199,0.0,-0.08280563
40209,0.0,0.6217903
40219,0.0,0.8753493
40229,0.0,-0.008338332
40239,0.0,0.5151627
40249,0.0,0.5126602
40259,0.0,-0.26954448
40269,0.0,-0.08546126
40279,0.0,0.16673613
40289,0.0,0.34830272
40299,0.0,0.0819093
40309,0.0,0.60881037
40319,0.0,0.59656405
40329,0.0,0.57392895
40339,0.0,0.57537246
40349,0.0,0.16682577
40359,0.0,0.29351306
40369,0.0,-0.30529237
40379,0.0,0.7639024
40389,0.0,0.3825447
40399,0.0,-0.38244796
40409,0.0,-0.5148032
40419,0.0,0.43960565
40429,0.0,0.2539314
40439,0.0,0.028469563
40449,0.0,0.057550788
40459,0.0,-0.6882442
40469,0.0,0.14613569
40479,0.0,-0.012442589
40489,0.0,-0.09623432
40499,0.0,0.13469696
40509,0.0,-0.32393146
40519,0.0,0.023330688
40529,0.0,-0.6558211
40539,0.0,-0.31872523
40549,0.0,0.045660734
40559,0.0,-0.22266245
40569,0.0,-0.21044338
40579,0.0,-0.3808993
40589,0.0,-0.1753009
40599,0.0,0.22712195
40609,0.0,-0.16293216
40619,0.0,-0.012745857
40629,0.0,-0.32284188
40639,0.0,-0.41679692
40649,0.0,0.578534
40659,0.0,0.119583964
40669,0.0,0.013673663
40679,0.0,0.092188
40689,0.0,0.09782517
40699,0.0,0.34040558
40709,0.0,0.2213887
40719,0.0,0.48646462
40729,0.0,0.23664999
40739,0.0,-0.23162758
40749,0.0,0.046105087
40759,0.0,0.25772095
40769,0.0,0.1650796
40779,0.0,0.007860601
40789,0.0,-0.3384784
40799,0.0,0.405074
40809,0.0,-0.06415725
40819,0.0,-0.35674214
40829,0.0,0.5033319
40839,0.0,-0.13549459
40849,0.0,0.007221222
40859,0.0,-0.11329317
40869,0.0,-0.16126764
40879,0.0,0.11393732
40889,0.0,-0.07707828
40899,0.0,-0.5440192
40909,0.0,-0.21421206
40919,0.0,0.18392587
40929,0.0,-0.40170932
40939,0.0,-0.2840367
40949,0.0,0.022369862
40959,0.0,-0.25749016
40969,0.0,0.022458434
40979,0.0,0.18204409
40989,0.0,-0.13574481
40999,0.0,0.5235816
41009,0.0,-0.15162468
41019,0.0,0.23860037
41029,0.0,0.5699967
41039,0.0,0.09109676
41049,0.0,0.3414588
41059,0.0,0.56761694
41069,0.0,0.6382601
41079,0.0,0.6380035
41089,0.0,0.41297007
41099,0.0,0.5070952
41109,0.0,0.31455266
41119,0.0,0.43069875
41129,0.0,0.17107832
41139,0.0,0.5149424
41149,0.0,-0.025145054
41159,0.0,-0.51308143
41169,0.0,-0.2856843
41179,0.0,0.010139108
41189,0.0,0.21584177
41199,0.0,0.3018769
41209,0.0,-0.5725335
41219,0.0,0.036982536
41229,0.0,0.09083915
41239,0.0,0.33037335
41249,0.0,-0.1860584
41259,0.0,-0.11879414
41269,0.0,0.18100578
41279,0.0,-0.4568225
41289,0.0,0.57241994
41299,0.0,-0.6424993
41309,0.0,-0.13942158
41319,0.0,-0.19761825
41329,0.0,0.11216116
41339,0.0,-0.011286855
41349,0.0,-0.011445761
41359,0.0,-0.1259172
41369,0.0,-0.33572012
41379,0.0,-0.41700155
41389,0.0,0.28150916
41399,0.0,-0.4225098
41409,0.0,-0.16613173
41419,0.0,-0.5442296
41429,0.0,-0.36426955
41439,0.0,-0.33195138
41449,0.0,-0.19857824
41459,0.0,0.013004243
41469,0.0,-0.3382243
41479,0.0,-0.63765407
41489,0.0,-0.7490106
41499,0.0,-0.657943
41509,0.0,-0.49618828
41519,0.0,-0.6196653
41529,0.0,0.10510671
41539,0.0,-0.24179554
41549,0.0,-0.05381286
41559,0.0,-0.14044535
41569,0.0,-0.5422801
41579,0.0,-0.40307188
41589,0.0,0.44116253
41599,0.0,-0.37908614
41609,0.0,0.2160157
41619,0.0,0.029223442
41629,0.0,-0.19942427
41639,0.0,-0.25832975
41649,0.0,0.6937448
41659,0.0,-0.36141086
41669,0.0,0.38016784
41679,0.0,-0.62988186
41689,0.0,-0.5760006
41699,0.0,-0.42229515
41709,0.0,-0.44733787
41719,0.0,0.30325353
41729,0.0,-0.18755877
41739,0.0,0.3867451
41749,0.0,-0.003074348
41759,0.0,-0.00085264444
41769,0.0,-0.57163554
41779,0.0,-0.11133504
41789,0.0,0.36243415
41799,0.0,-0.22167772
41809,0.0,-0.023356318
41819,0.0,0.32839024
41829,0.0,0.8802498
41839,0.0,5.2571297e-05
41849,0.0,0.2854529
41859,0.0,0.2295357
41869,0.0,-0.21430433
41879,0.0,-0.27353084
41889,0.0,-0.83144104
41899,0.0,-0.26721537
41909,0.0,-0.22209752
41919,0.0,0.09367883
41929,0.0,-0.47392988
41939,0.0,-0.27401698
41949,0.0,-0.7123265
41959,0.0,0.03695762
41969,0.0,0.15242922
41979,0.0,0.18545723
41989,0.0,0.3463099
41999,0.0,0.114224076
42009,0.0,0.18225431
42019,0.0,1.1051013
42029,0.0,1.2492366
42039,0.0,0.87662214
42049,0.0,1.3450432
42059,0.0,1.6853125
42069,0.0,1.5052807
42079,0.0,0.37947237
42089,0.0,1.0994368
42099,0.0,0.055123806
42109,0.0,-0.29817963
42119,0.0,0.51460564
42129,0.0,0.7129153
42139,0.0,-0.19716096
42149,0.0,0.4091549
42159,0.0,-0.4619429
42169,0.0,-0.5222156
42179,0.0,-0.10051477
42189,0.0,0.052342534
42199,0.0,-0.5460403
42209,0.0,-0.11283302
42219,0.0,0.7772422
42229,0.0,0.73498464
42239,0.0,-0.09248662
42249,0.0,0.74689126
42259,0.0,-0.37293315
42269,0.0,0.23269224
42279,0.0,0.23645091
42289,0.0,-0.0151872635
42299,0.0,-0.6456522
42309,0.0,-0.27415705
42319,0.0,-0.25771165
42329,0.0,-0.4714387
42339,0.0,-0.01191318
42349,0.0,0.38434827
42359,0.0,0.3382458
42369,0.0,-0.19967479
42379,0.0,0.22011316
42389,0.0,-0.2076273
42399,0.0,-0.28311753
42409,0.0,-0.1879015
42419,0.0,-0.23508489
42429,0.0,0.42895347
42439,0.0,0.12691283
42449,0.0,0.37652504
42459,0.0,0.31316602
42469,0.0,0.4492566
42479,0.0,0.62141806
42489,0.0,0.9175576
42499,0.0,-0.22692418
42509,0.0,0.044002056
42519,0.0,0.42039776
42529,0.0,0.07855809
42539,0.0,0.32055163
42549,0.0,0.29523695
42559,0.0,0.012090683
42569,0.0,0.34177828
42579,0.0,0.35259223
42589,0.0,-0.36439437
42599,0.0,0.46874547
42609,0.0,0.49955565
42619,0.0,0.9002897
42629,0.0,-0.04057765
42639,0.0,-0.009715319
42649,0.0,-0.3148408
42659,0.0,-0.19026268
42669,0.0,-0.21161783
42679,0.0,-0.15041518
42689,0.0,0.5547881
42699,0.0,0.43477595
42709,0.0,0.2758777
42719,0.0,0.015074849
42729,0.0,0.15660387
42739,0.0,0.7257508
42749,0.0,0.27477562
42759,0.0,0.17015362
42769,0.0,-0.46203005
42779,0.0,0.9169973
42789,0.0,-0.06873131
42799,0.0,0.033759236
42809,0.0,-0.21505666
42819,0.0,-0.06658232
42829,0.0,-0.6426189
42839,0.0,-0.06695455
42849,0.0,-0.4384433
42859,0.0,-0.5890554
42869,0.0,0.11999357
42879,0.0,0.81862557
42889,0.0,-0.40381795
42899,0.0,-0.64243495
42909,0.0,-0.27836967
42919,0.0,-0.25877273
42929,0.0,0.29453623
42939,0.0,0.6082118
42949,0.0,0.5481981
42959,0.0,0.32563174
42969,0.0,0.53747284
42979,0.0,-0.4564321
42989,0.0,0.076063395
42999,0.0,0.2574498
43009,0.0,0.55494136
43019,0.0,0.22130173
43029,0.0,-0.09336412
43039,0.0,-0.12456274
43049,0.0,-0.23382652
43059,0.0,0.09847927
43069,0.0,0.1613555
43079,0.0,-0.025258303
43089,0.0,0.23209846
43099,0.0,0.57602805
43109,0.0,-0.29182518
43119,0.0,0.102914095
43129,0.0,0.16908348
43139,0.0,0.20653808
43149,0.0,-0.29061198
43159,0.0,0.115435004
43169,0.0,-0.19268131
43179,0.0,-0.14362419
43189,0.0,0.16417539
43199,0.0,0.25625485
43209,0.0,-0.17977965
43219,0.0,0.2196368
43229,0.0,-0.28265107
43239,0.0,0.016439557
43249,0.0,0.41611373
43259,0.0,0.10878301
43269,0.0,0.36542857
43279,0.0,-0.11132455
43289,0.0,0.32760656
43299,0.0,0.33500636
43309,0.0,0.23564446
43319,0.0,-0.27142274
43329,0.0,-0.47371316
43339,0.0,0.0747478
43349,0.0,-0.75324786
43359,0.0,0.24052739
43369,0.0,-0.33415246
43379,0.0,-0.1359222
43389,0.0,-0.4319805
43399,0.0,-0.056911826
43409,0.0,-0.1959238
43419,0.0,-0.1033144
43429,0.0,-0.46609795
43439,0.0,0.31425738
43449,0.0,-0.32584107
43459,0.0,0.30295372
43469,0.0,-0.6133225
43479,0.0,0.1321482
43489,0.0,-0.06417394
43499,0.0,0.0338037
43509,0.0,-0.5003296
43519,0.0,-0.500093
43529,0.0,-0.29449522
43539,0.0,-0.28120327
43549,0.0,-0.5943736
43559,0.0,-0.2303949
43569,0.0,-0.59101367
43579,0.0,-0.25322974
43589,0.0,-0.5183425
43599,0.0,-0.78049225
43609,0.0,0.770723
43619,0.0,-0.17536497
43629,0.0,-0.33543396
43639,0.0,0.042465568
43649,0.0,-0.21923518
43659,0.0,-0.63599896
43669,0.0,-0.31042564
43679,0.0,-0.3184365
43689,0.0,-0.56829846
43699,0.0,-0.43968654
43709,0.0,-0.65419114
43719,0.0,-0.23513067
43729,0.0,-0.37709337
43739,0.0,-0.12065101
43749,0.0,-0.14334917
43759,0.0,-0.20111507
43769,0.0,-0.24999201
43779,0.0,-0.008546829
43789,0.0,-0.029283643
43799,0.0,0.30164397
43809,0.0,0.068210244
43819,0.0,-0.4524188
43829,0.0,0.053040862
43839,0.0,0.14506006
43849,0.0,0.06837034
43859,0.0,-0.3700984
43869,0.0,-0.5425954
43879,0.0,-0.25247967
43889,0.0,0.12787074
43899,0.0,0.37276924
43909,0.0,0.49095768
43919,0.0,0.31501758
43929,0.0,0.052121997
43939,0.0,0.1127758
43949,0.0,0.0056892037
43959,0.0,-0.24536055
43969,0.0,-0.3087083
