Time,X1,X2,Label
0,-0.48974248061089076,0.03804360097622437,0
1,1.1304849379897077,0.0998049370177345,0
2,1.2429024563213957,-2.0527431521093527,0
3,-1.3991478386724123,1.1298853311733903,0
4,-1.0455610862899574,0.4688756510355098,0
5,0.2767715169835683,-0.493541404071485,0
6,0.24407095864145023,0.25734493571945694,0
7,-1.8427322957861256,1.395320542247222,0
8,0.581114384837126,-0.14070453554489654,0
9,0.47377762109205757,-0.11261996546450596,0
10,0.1988860570883033,-0.3013453541324502,0
11,-1.5938863901153737,-0.1370156165793435,0
12,0.10255440593949572,-0.7341805148962908,0
13,-0.006619101120546331,0.0722245742325328,0
14,-0.5403563910749863,-0.6138727533022774,0
15,0.36973582298700913,-0.17814162628787897,0
16,-0.7741250490926243,0.6195892507797706,0
17,1.2968146400999003,-2.1447774617153126,0
18,-0.08048779989371561,-0.19927433485649926,0
19,-1.0600153147731208,0.3538269280335593,0
20,-1.1359628698140936,0.9777531761070203,0
21,0.23847005924298093,0.7287819954223738,0
22,-0.5361113905273668,0.1308151112772873,0
23,-0.7809282433180692,1.0227220207528145,0
24,1.0516771615355691,-0.27693947971486554,0
25,0.6581617032228552,-0.7162985299556608,0
26,-0.4955708104698634,0.5732360932902215,0
27,-0.8450399709347487,0.039632978069607916,0
28,-0.4502255179567049,1.0491095107337398,0
29,-0.6990834928160082,0.7123223732836225,0
30,-0.13544879393394155,0.2453926183754916,0
31,1.4834712909664929,-2.035984310538899,0
32,-0.26457614572103255,-0.22159417571195958,0
33,2.0676518728551105,-2.009258475219789,0
34,0.7460789851285202,-0.8140231164568698,0
35,-1.1680903548748311,1.9921896311021723,0
36,0.2221841401986202,-0.6410730202066978,0
37,-0.26869529192328967,-0.23892450025419876,0
38,0.009440396839790229,0.03663020876206539,0
39,1.797517471484579,-2.927313560394782,0
40,0.1372662457435622,-0.06351961562359493,0
41,0.8422890057604827,-0.6738114582102502,0
42,-0.25914649793597666,0.39362053899880795,0
43,0.09837950727039922,0.824502291700622,0
44,-1.8258244604435558,0.4300790953701031,0
45,0.036486083266843106,-0.36853231571954265,0
46,0.7656852331615663,-0.6953443303750348,0
47,-0.6204913184777523,0.7567083282667104,0
48,0.9620827418294491,-1.0475169426947524,0
49,0.5765767106031896,-0.428741552721019,0
50,0.7214999281691271,-0.5994258832583609,0
51,0.7869831753120248,-0.4039225261119362,0
52,-0.5634932075994744,0.9986856418847126,0
53,2.453041654789212,-1.6076190477092969,0
54,0.7175789901165657,-0.3120501793111998,0
55,0.3342954631240278,-0.6371565173869751,0
56,0.005851216215840468,-0.4470294689857428,0
57,-0.5474853343329925,0.9718736342407319,0
58,-0.045003426318133456,0.8181516284692945,0
59,0.2630179529853721,0.06953547863608966,0
60,0.05504208567562996,-1.1909021002728264,0
61,-1.949766123694261,2.109459108783812,0
62,-0.7725720439809358,1.3041284465191516,0
63,-0.18494069163934546,0.29828739587964653,0
64,0.37374846969504144,-0.1617423636544691,0
65,0.2939470577020477,0.14390565198334687,0
66,-1.550400370475662,1.5048719027907387,0
67,1.8217427085755387,-1.6830564552456222,0
68,1.9399679784575468,-1.7386724581066122,0
69,-0.5496792872740706,0.30628225931231895,0
70,-0.5356846578002108,0.19545107396986722,0
71,-0.32097404130354923,1.3332005414544703,0
72,0.3434629662276324,0.7568249358748144,0
73,0.15549929284094777,-0.19501741305675085,0
74,-0.13976715570024842,-0.7932304156219372,0
75,-2.2033686466390905,2.864305826273645,0
76,-1.2044091001924835,0.29674347047012545,0
77,1.1978291242144044,-1.2186792168639882,0
78,-0.6730230210438257,1.4805135683468482,0
79,1.2356780810069417,-2.8328473502696285,0
80,-1.5574481028542455,0.8303983746173349,0
81,-1.5058341787283887,1.908622969772065,0
82,0.6316588924842316,-1.563387013105891,0
83,-0.5685917983766501,1.2919216902309811,0
84,-0.5664922707070879,-0.4715987295448314,0
85,-0.5471121877572259,2.191778542380529,0
86,1.4122671793378176,-0.7571151464586031,0
87,0.8953796129371745,-0.5539908175359816,0
88,0.2931838016620012,-0.1617623930341926,0
89,0.9378223452131661,-0.805697692888801,0
90,-1.0220120475742531,-0.22454926010882284,0
91,-0.46643655015478125,0.012145882838898428,0
92,-1.4153681173344796,1.3529360586988652,0
93,-0.49099494648507,-0.21985621172878872,0
94,0.9709358458899583,-0.18050053228867502,0
95,0.5502649303980963,-0.11615122051641388,0
96,-1.186768109806302,1.4281427793802606,0
97,-2.7193655217995034,2.0020712193099155,0
98,-0.8712227368424901,1.2689124861294492,0
99,0.6772526418666924,-1.3875168208479978,0
100,-0.7147344690210757,-1.084150785856855,1
101,-1.1810612633493205,-1.2865057075420112,0
102,1.0233779566928622,0.5194005715967069,0
103,0.13968363951888457,-0.2177995849741579,0
104,-0.6071978136969114,0.6753542281326437,0
105,1.9420230806535401,1.7359317887980208,0
106,0.6600241753114964,-0.07036666475538043,0
107,0.018645505326604486,0.09614458477569902,0
108,1.2510176156121022,1.3422412799761547,0
109,0.8738807310018419,-0.5798066688728606,0
110,-0.6053334811276059,0.1289255896786374,0
111,0.2347907497215232,0.03056246949306108,0
112,1.111253255972419,0.9618844462441769,0
113,-1.1852148273064853,-1.7884261423518404,0
114,0.12822211269095643,0.7968483147654326,0
115,0.20103514599116604,-0.4443889360124687,0
116,-0.33595474656861923,-0.2624784016587155,0
117,1.5288930191316028,0.7243326720798894,0
118,-0.8502620357807865,-0.5024234413275352,0
119,-0.3512313599553666,-1.2587730763471439,0
120,-0.3863016179964016,0.47123785919362593,0
121,-0.34838351929503397,-0.7069692340350558,0
122,0.7538691839364594,1.2768273468623839,0
123,-0.12336887312509695,-0.998760160515189,0
124,2.344012843653938,1.5597833332794042,0
125,-0.7013769715349513,0.3990444705454462,0
126,-0.0500778252892047,-0.08074536301701381,0
127,0.27043524246525924,-0.5226574264029171,0
128,0.7754227585283782,0.4374460080736514,0
129,1.6633584783848256,0.9176973661106699,0
130,-1.1587317367909187,-0.8504811772114507,0
131,0.1009655705520991,0.9183968547197174,0
132,-0.6011713027317275,0.5031355438701971,0
133,2.050993184678618,1.6854061479590858,0
134,0.648139680207048,0.2484248361046732,0
135,-0.6434064629579123,-0.5718358314139649,0
136,0.5266911549116249,0.5548761124330824,0
137,-1.944253556591159,-1.08425356672197,0
138,-0.5830743981134868,-1.3206375306021731,0
139,0.577057770097149,-0.09284907144971273,0
140,0.8615237163117516,0.8984150664433486,0
141,0.07494738544998517,0.2042121201575412,0
142,-0.08639754232630968,-0.12957867479591717,0
143,-0.9684477753244383,-1.2571200635714497,0
144,1.072709850139946,1.770162709122599,0
145,0.5415416309030199,0.4269070056748239,0
146,-0.998460824962887,-1.4923143587457455,0
147,0.044220204574617006,0.5161679691321887,0
148,-1.405526963116112,0.1267685963819359,0
149,-2.319166583220552,-1.444184992704654,0
150,0.880644917103281,0.5931698100789184,0
151,1.3321487672669559,0.8053105896284724,0
152,-1.2568938254541515,-1.3388499341909539,0
153,-0.18675063427964267,-0.4455054379115184,0
154,-2.5059076515039687,-1.1943538276872714,0
155,-0.9477117016131666,-0.20616532542357208,0
156,0.1597952974769488,0.012315872595646966,0
157,-0.45719614172842715,0.5937398295815807,0
158,-1.1082272489233882,-1.343574079319406,0
159,0.7023789590846077,0.019204983331783016,0
160,-0.3907874738112509,-0.3915603412934881,0
161,0.39866054673156576,0.31692005747573393,0
162,1.143736813550715,0.7450406326917323,0
163,-1.199401210562872,-0.9919769722344196,0
164,-1.0962844022058214,-2.0519092113169477,0
165,0.8736241794427086,0.30465781859545155,0
166,-0.8960536186795495,-0.859414604962804,0
167,1.1204660048137423,1.1417703641402956,0
168,1.2629006396927005,1.4222777377740492,0
169,0.5755479203091409,0.28152166609353124,0
170,-0.09614410418077461,-1.492639426781414,0
171,-0.5482828072183635,-0.961894588341905,0
172,-1.000850201259767,-0.4588141897791877,0
173,0.40532654342002716,-1.251331036737075,0
174,0.30615526230210055,-1.049054347510094,0
175,-0.009956449102324428,0.33956169161998495,0
176,0.24444502537695206,-0.3571786621475263,0
177,-1.1750232286296622,-0.8870984279638341,0
178,-2.181882436780876,-2.0536422860536203,0
179,-1.2938104290331636,-1.7968429324091877,0
180,1.552423600528961,1.500875794335459,0
181,1.2779921523480733,2.082053133859252,0
182,0.0023293619553889505,0.9172586326620835,0
183,1.2674503304042226,-0.528518432520029,0
184,0.8191804398082101,1.6648637127524006,0
185,-0.5570783545139052,-0.5748822167321168,0
186,-1.6515585884679924,-0.7666296491735484,0
187,0.5277702692130735,-0.3273652830462247,0
188,1.8009841359747787,1.6927485343957953,0
189,0.15462598862944918,0.8668956117034311,0
190,1.7809394086080432,1.9702963129051847,0
191,-0.15905988450714492,-0.4320711073421322,0
192,-1.3500763870811991,-0.9566263005031108,0
193,-0.700022448181451,-1.6816061304373977,0
194,0.8349766847124834,1.7933944681190865,0
195,0.5392532419426272,0.7801340175370166,0
196,-0.31736608190850935,-0.32040321618415296,0
197,-0.7234514629250084,-0.3371769418945113,0
198,0.06941814343232489,-0.7394073356544023,0
199,-0.06734605717284449,-0.14316436678463745,0
200,-0.49107904403709957,0.027027917434412563,1
201,-0.9428018281581423,1.1223237956098149,0
202,0.07392761819017828,-0.10893600892117936,0
203,0.7365176756755563,-0.7809774897986119,0
204,0.26371887147577383,0.6418118288205579,0
205,0.2956986521857073,-0.7418925389735539,0
206,2.2554496154431707,-2.378725619215283,0
207,-0.8055057504388036,0.887791176733022,0
208,0.23634964477497133,0.48634943382267626,0
209,-2.1956333804343804,0.34223386205385514,0
210,0.7802134322266131,-0.07455758108584237,0
211,-0.5592378526488234,0.3045492579610021,0
212,0.9638055866915487,-1.0990978503109226,0
213,0.1363076964107552,-0.1856497074318758,0
214,-0.564138257364663,0.5527664562743292,0
215,0.7125121784137481,0.6284686416768396,0
216,0.8329154077361137,-1.8279277699222682,0
217,0.6488385949708341,-0.5927854869365249,0
218,1.0921718528028443,-0.800431724649877,0
219,0.017113775276240785,0.1524784911782711,0
220,0.005147293191473666,-0.39996555283364854,0
221,0.2066535310167339,0.5059927165310905,0
222,0.7899944704686986,-0.1616000292424619,0
223,0.33526352599128884,0.36633180469016796,0
224,0.5934448256795769,0.3278244768986082,0
225,-0.8458901442764982,0.720062500316162,0
226,-1.066929299172042,0.6314584592264255,0
227,-0.7167681792718529,1.4367741044207758,0
228,-0.2792795465449346,1.137877992469262,0
229,2.000445198581772,-2.4005526602571923,0
230,-0.39329634707317135,0.9553620215608599,0
231,-0.6999719155388701,1.9150955114326367,0
232,-1.0441373460206747,0.8749360186917714,0
233,0.7633220008824408,-0.691283098097247,0
234,0.35918520151148914,-0.7137390806110939,0
235,0.46434923392011057,0.09774330388924746,0
236,-0.3850266703128501,1.0439658527052493,0
237,-0.07476503050353508,0.030860816556458504,0
238,0.18686472189922276,0.010685401967210979,0
239,-0.43587056327876783,0.5006356223489518,0
240,2.0409949964133935,-2.435408718285805,0
241,-0.05097554991306222,0.7451707776778189,0
242,1.8467677773382252,-1.145698214742829,0
243,2.6311716919843375,-2.9431049702589585,0
244,-1.1034521756018185,0.5684526906902844,0
245,-0.9991538918938238,0.04168249857521326,0
246,-0.5549667639644884,0.6039277613795522,0
247,-0.35794955967610087,-0.06064026491879982,0
248,0.4982377795152295,0.23910196092272473,0
249,-0.09244241282892264,-0.15648485470516205,0
250,-1.5910265816081393,1.0312338288053928,0
251,0.7526413188877139,-0.9052584122723785,0
252,1.5560467628834624,-2.2254523404057576,0
253,2.748901237617189,-1.9496878721174247,0
254,-0.09160160441717029,-0.22865294320505458,0
255,-1.1841613585473765,0.9341750820148584,0
256,-0.9077297352352597,1.938539787638152,0
257,-0.3076189090109267,0.02361420706834101,0
258,-1.382950153408815,1.706151921494673,0
259,0.0028084630312024336,1.0141624266448874,0
260,0.9300149405501124,-1.0058285438379777,0
261,-0.650034029312038,0.7610751106827311,0
262,0.8634542253656782,-0.8136044769156583,0
263,-1.5529144163866193,1.3555400295674163,0
264,-0.8849553653802631,1.2762154439326872,0
265,0.8537339157579587,-0.6397738546665636,0
266,-0.11468765639574982,0.5576441629535187,0
267,-1.5984419592058272,2.0897738582194325,0
268,0.01169143280082361,0.067303780435352,0
269,-0.30424413983216486,0.7172081238671248,0
270,0.7867951476059357,0.9172070173252365,0
271,1.2745968864177473,-1.1044814710339512,0
272,-1.2859442397208962,0.5889225643181073,0
273,-0.16733065697106816,-0.92810167075963,0
274,-0.576781514854319,0.20452126027848197,0
275,0.5936495395586712,-0.6612780799485677,0
276,0.6065324449589315,-0.494844967285755,0
277,-0.16809687298908593,-0.42101152221047705,0
278,-0.6417567029103141,-0.3426848101171582,0
279,-2.6135789443602886,2.9466628259479712,0
280,-1.4713119455886898,0.7014153507334117,0
281,0.7018274805439465,-0.7536309786122135,0
282,0.592109684561533,-1.7129432984651016,0
283,0.8419883535866052,-0.9680676013820426,0
284,0.5978625784017187,-0.5350174634933468,0
285,-0.3371090281751438,1.1226513049646107,0
286,-1.0861453943877655,1.635746822818038,0
287,-1.6152294527707558,1.359578054951421,0
288,0.28412479168669663,1.2049189155287061,0
289,0.6286012525728726,-2.02416028599762,0
290,0.07603088678560563,0.19806309481228848,0
291,0.3517726637365441,-0.4838288441310805,0
292,0.5750675339340977,-1.0348992965925188,0
293,0.7088383058135166,-1.1797080093711017,0
294,1.3751536581440673,-2.035405517507763,0
295,-0.01968849735874336,-0.2831965278373569,0
296,0.24715167800064125,-0.7058478245283226,0
297,0.7337050944851201,-1.2220778335931832,0
298,0.36230313943589865,0.3513268362591868,0
299,1.0289191472266699,-1.3236162450055562,0
300,-0.5167391413072221,0.28889536476576155,1
301,-0.6894567870787066,-0.24828548915948448,0
302,1.8137313313212633,1.9209830786442887,0
303,0.9237532772225393,0.5813866187816409,0
304,0.028882731601344556,-0.44997218018449586,0
305,-0.5028692338575285,0.7140486984143868,0
306,0.21435592790497704,-0.3440204292179598,0
307,0.6247175461522682,-0.6770476687640073,0
308,-1.2539184289483503,-1.91257893223515,0
309,-0.015332349068580109,-0.3919314707017099,0
310,-0.23465212170136013,-0.4209927868371585,0
311,-0.8989392343560716,-1.0320354454754403,0
312,0.7229401787195514,1.737459737986368,0
313,0.361542909247925,-0.13282271500074647,0
314,1.7640273089416356,0.6103407901531096,0
315,-0.2675399390684493,0.1720989122798441,0
316,0.5575083134562901,0.009941660159107494,0
317,-0.1609302227609943,-0.4067359594678554,0
318,0.9545725168009719,0.46040009175447727,0
319,0.2475260903661873,-0.749975611508451,0
320,-1.750775703794243,-1.816542964930021,0
321,-0.17539995158601207,-0.34367102518340364,0
322,-0.07191646966491211,-0.19125797364416725,0
323,0.2874499968211649,0.1933212883560729,0
324,-0.35331429182137997,-0.9496546322234224,0
325,-2.2524389042678683,-1.9667492192398526,0
326,-1.2989176779678369,-0.25976641080776136,0
327,0.643628226915113,0.5826927008724194,0
328,-0.5268053006157977,0.10289066927209413,0
329,-0.11046940453291385,0.16644846200130947,0
330,0.44566350024863116,0.7260979228752624,0
331,-0.25856856257780053,-0.7080364233535819,0
332,-1.3092952630035362,-1.261530113950152,0
333,-0.22828583140906678,-0.5172364032971586,0
334,0.39144387497100813,-0.718397580990641,0
335,-1.670061190367503,-2.32592301600981,0
336,0.8703119142823155,0.7830327063313409,0
337,1.4674553687175766,1.8977762378471028,0
338,-0.08683176618389621,-0.3351331136209644,0
339,0.18736258843428052,0.5561938020829251,0
340,0.8067423529070784,1.0407857429054213,0
341,0.2858971752554165,0.3923781455352505,0
342,1.8262564862761177,1.2051973959406015,0
343,0.6015198200596146,0.34731195715151164,0
344,-0.847267231970143,0.8582206788628658,0
345,1.3518843777982563,1.2847750732662753,0
346,-1.7243702794296232,-0.4916069180426044,0
347,0.16745840771040657,-0.19572531118157163,0
348,0.13145996889376693,0.6047071802971588,0
349,-0.9926563526201075,-0.083439996301552,0
350,0.6871114383640101,0.8617384575552471,0
351,0.1283660828645099,0.6176672017659989,0
352,1.7598413116164682,0.9259553314825888,0
353,0.8154776108298266,0.10018402570801109,0
354,0.4494491397330019,0.06060760134029551,0
355,-1.4546144150517666,-0.964596897263044,0
356,-1.340823538033762,-2.188671290799042,0
357,0.432584996555846,-0.03795344239981592,0
358,-0.39427744918011154,-0.7255603062407414,0
359,-0.3616739984461426,-0.5550594351048396,0
360,-0.728040602834873,-1.0335560254350102,0
361,0.36385486905404407,-0.5147624539565716,0
362,0.5547300269668928,0.128510699754527,0
363,-0.8687562029299606,-0.9250461858195059,0
364,-1.7498798775394153,-1.9264550530035827,0
365,0.09391426111955796,0.4475637143532198,0
366,1.3243546184388202,1.1687684274470684,0
367,1.099980004150709,-0.3932603963468527,0
368,0.5486657436166442,-0.09707597452469105,0
369,-0.4749449625460415,-0.8512269623057522,0
370,-0.7976815287591319,-0.40609792477404594,0
371,-0.3559885272351054,-0.8328897320575226,0
372,2.0599697783475106,2.0825007016563695,0
373,-0.8161135094475281,-0.6055846570109745,0
374,0.1665184236083199,1.1457085513524339,0
375,0.08329801086050223,0.43124333711705354,0
376,1.8602268407053921,1.0383243739354109,0
377,-0.7467390347012574,-0.5940900174300348,0
378,1.8063785059728896,0.6362277887511879,0
379,0.7366641486472311,1.7184289786607314,0
380,0.8024211985367068,1.4617474681633331,0
381,0.03039813083214382,-1.078429502261966,0
382,0.5192925919034241,0.9606405291693924,0
383,-0.2764860854701735,0.17057414037259722,0
384,1.3798704031660656,1.4081871628575626,0
385,-1.7104439193200114,-2.5549603199922877,0
386,-1.9694906164575408,-1.3916913774231927,0
387,0.9434813333633311,0.3406990959311363,0
388,-0.49924259922397557,-1.6570706042131462,0
389,0.29475515274862674,0.41969447126184617,0
390,-0.22671601878801437,0.0693100919327801,0
391,-0.21166094907432664,-1.1780821037961713,0
392,0.5704854850577991,0.19233417248475818,0
393,-1.858246361736051,-2.0930516989129577,0
394,-0.0788056137877242,-0.8690223990361609,0
395,1.4689975857409039,0.7881609247537044,0
396,0.3533439020980916,0.18438477490190744,0
397,-1.484507174812056,-0.2766938950954166,0
398,1.9767152698145476,2.493418557455894,0
399,-0.35049312243014885,-1.5827463883989241,0
400,-1.0542464502272733,0.47742999497378275,1
401,0.13261613805865427,0.48036153990186975,0
402,0.612502387323876,-0.855437003073894,0
403,-1.007800345611277,1.0571578174607699,0
404,0.15017861950504838,0.14297468447986977,0
405,0.2145154405701406,0.31718474593427104,0
406,-2.5576368141390766,1.9104922434626446,0
407,-0.3794879460638152,0.22776119919261764,0
408,1.3497877931487536,-1.5483901178031554,0
409,0.1769191754640681,0.02248873616370947,0
410,1.6185614133576727,-1.879288830930005,0
411,-0.25201283009191505,0.14444242115708458,0
412,-2.053973847429902,1.2735970258957905,0
413,-1.0018051510353034,0.9311681188465563,0
414,0.7502406860037897,-0.8943406804778765,0
415,-0.12341165755837981,0.5353342758416922,0
416,0.5002714549849832,0.8934100828465654,0
417,-0.04363936463075198,-0.18201012206740774,0
418,1.2000043922873171,-1.020294988764427,0
419,1.7728345547763977,-1.7648292600622346,0
420,0.7805022603107591,-0.7976805235681431,0
421,0.7146957402218344,-1.0839427970825972,0
422,-0.3372449491432966,1.822547270551602,0
423,-0.6042815547035043,0.42265204704328835,0
424,-1.6303522145581233,1.5043070261956315,0
425,-1.1975910962225278,1.6116368071963252,0
426,0.8029174060597134,-0.05633065154279808,0
427,0.2435503883636362,-0.38227155688535797,0
428,1.6965621045770007,-1.8209506128115975,0
429,0.42777046355739323,0.546489103889747,0
430,-1.1692052473342205,0.4452054298460891,0
431,-0.7232411156654136,1.3406126056992984,0
432,-0.8233691332728786,0.22838133011789907,0
433,0.8579892851820787,-1.3071250743665508,0
434,2.2244881809277772,-1.4410539235137114,0
435,0.3300568426403355,0.21082266019741064,0
436,-0.23417932621381973,0.9553872119875154,0
437,-2.0223198506221016,1.4666034037477442,0
438,0.8022840121843615,-0.3275512298764784,0
439,0.4400593081042015,-0.6349698265687156,0
440,-0.6671982518121022,-0.06523786547890677,0
441,2.6647780469179296,-2.1758340262370575,0
442,1.3377119764648537,-0.24935607508754434,0
443,2.38877960029502,-1.1824430802261592,0
444,-0.3900035973795632,0.43696787596345027,0
445,-0.9916901974524136,1.452289615638442,0
446,0.3854355782283305,0.5315172336817479,0
447,-1.137678464197058,2.131229658252288,0
448,-1.340022104775737,1.6360972331741006,0
449,0.4690647481570807,-0.013001368031015719,0
450,-0.43838935238685534,0.9109147061719599,0
451,-1.7847255703733456,1.756808403106201,0
452,-0.8680777222373978,0.5616029424094465,0
453,1.1627867847264397,-1.5392931798739131,0
454,-1.1015622678314476,0.057922394754495746,0
455,-0.9885614706069891,0.7368850965670869,0
456,0.48811227659416484,0.5090166189743536,0
457,-1.3071301880720223,1.2229342460185042,0
458,-1.5899323439289754,1.421926163005878,0
459,1.5402761376046912,-1.0967198257297426,0
460,-0.013981042416816079,-0.37568212424257535,0
461,-1.4312398575179768,1.7552653619909804,0
462,0.5693259906340575,-0.582481909155955,0
463,-1.8661006788733718,1.5345914347784053,0
464,-1.2542860572584256,1.7020226109118393,0
465,0.022152462345088615,-0.37383930016026246,0
466,-0.09552774646664444,-0.15727704590903044,0
467,-0.4267254835454846,-0.33978279997003497,0
468,1.439883760423229,-0.901650542152239,0
469,1.067743422986248,-0.11717708327895197,0
470,-0.5548546068187634,0.13624572951483158,0
471,-0.5497397469840255,0.2084624447268865,0
472,-0.273620314373447,0.11548270260774522,0
473,-0.16129821735615738,1.2846540630700483,0
474,-1.570282846069832,1.668827888175309,0
475,-0.6638330352132223,1.0376407405206347,0
476,0.5016222027974065,-0.9525008931773992,0
477,0.9439385660312196,-1.5256355119739113,0
478,-0.5747050143658113,0.6318981543424679,0
479,1.1485487542163253,-0.6882495064611539,0
480,0.08099604198870924,-0.3432737217209208,0
481,-0.6306555985780338,1.6250999242535138,0
482,1.8113465757179912,-0.9040351418808631,0
483,0.8004672793727793,0.2982953180321856,0
484,-0.3398941676102198,-0.2827681662775732,0
485,1.5151132725909668,-1.3800491743907675,0
486,-0.8816689154122697,1.1893236985972682,0
487,1.1964362552666452,-0.8984888216699277,0
488,0.7870167471992208,-0.6398049393664474,0
489,-0.017868714149927443,0.42279311859582946,0
490,0.607217436926175,-0.47276541236688996,0
491,-0.11049073898725324,1.643824366508002,0
492,-0.21980878391616482,-0.12919631495588912,0
493,-0.41124233264681653,-0.22919656802871347,0
494,0.24362727361415282,0.3791466301261327,0
495,-1.416778184782806,2.0145075971758915,0
496,0.5176589104009629,-0.18966079628244242,0
497,-0.061075647847347425,0.5096253157302578,0
498,0.10927195530029658,-0.4459137138488745,0
499,1.4648646447737026,-1.3317015370570624,0
500,0.2483540925961045,0.6147770659075833,1
501,0.836872092169275,0.7429241194219897,0
502,-0.03795901014956493,0.8283803604322533,0
503,-0.21514685086943877,-0.3832396543411315,0
504,-0.8269280210610348,-1.3626608657726575,0
505,0.15657182475588155,0.6184911289865413,0
506,0.31195869755851363,-0.35568531752834587,0
507,1.0447029520625268,0.8950850121782764,0
508,0.1935067861715949,-0.9833958792207196,0
509,-0.4202078609920119,-1.4648962884121155,0
510,-0.06444528959559778,0.3235721923411115,0
511,-2.4257534505733935,-2.160451125647723,0
512,0.6376781176456633,0.6857219150506567,0
513,-0.08615643614936568,0.7539688282716392,0
514,-0.9442899182603475,-0.5894684187005976,0
515,0.14141009505756658,-0.5234765645913478,0
516,-0.33876912604486736,0.2621703725947924,0
517,-0.29466569036754175,-1.3599074486245493,0
518,-0.4451125512010886,-0.5683450971381186,0
519,-1.4327292213944156,-0.45328122969144424,0
520,-0.7177882016144489,-0.11443056943814638,0
521,0.2784018624369097,1.4100818500721022,0
522,-1.1451158341626668,-0.3871026425592108,0
523,-2.3402642958150723,-1.9917175008136183,0
524,-0.2891502226457408,1.0807438369350009,0
525,0.6977047313495646,1.1592986549733413,0
526,-0.06372688718976463,1.3551451111160475,0
527,-0.4951005693067478,-0.609382325275266,0
528,-0.6639946422151266,0.06656380322310351,0
529,-1.482135781762447,-1.4030504036832971,0
530,-0.7380689279390023,-0.727403393783693,0
531,-1.2826244342634747,-1.2963652849264449,0
532,-0.021809141105921966,0.36806664632661396,0
533,0.6844386317021655,0.3901906057223946,0
534,2.1577212986369725,0.6339002765126995,0
535,0.033999420355926,0.5473865074607405,0
536,0.11445506195969075,0.5162806153162234,0
537,-0.7155662912698342,-1.7658669589250249,0
538,0.19212072753608558,-0.10202584805010337,0
539,-1.4750643545096356,-1.2975317618598061,0
540,-1.223556751726538,-1.0420537557668046,0
541,-1.4583715587199437,-0.5814167764109395,0
542,-0.969568445750806,-0.8963308156783829,0
543,-0.4201276828838664,-0.696104673464519,0
544,0.6671372929095392,0.2773933077629309,0
545,-0.2919630314873089,-0.27105240424244476,0
546,0.2212781396954929,1.3896027704799137,0
547,0.04991819114541136,0.3922200806013519,0
548,-0.615372216599597,-0.7091613312622387,0
549,-1.8651485757676707,-1.5209146909933777,0
550,-0.9390495334020061,-1.466469858680395,0
551,-0.7646687209919519,-1.4264444027204979,0
552,-0.21314830478080332,-0.2791702506498223,0
553,-1.0480287964554054,-1.0667075813808513,0
554,0.6578094231300707,0.43769675451747136,0
555,0.45222947270106073,0.8653779540361233,0
556,-0.9067649686766593,-0.2987468220263977,0
557,-1.4580599717172376,-1.4972034538696046,0
558,0.8083151630409613,0.12201719787346034,0
559,-1.561361748257199,-1.0682893860898313,0
560,-0.5732838587943027,0.6271963167189682,0
561,1.4943620650733251,-0.25815381203286564,0
562,-0.17722365823766556,-1.2649546881954619,0
563,-1.3015416321445177,-0.33937898997514404,0
564,2.1610121695954523,1.7914711714512417,0
565,-0.6188391098598919,-1.5698449905755958,0
566,-0.6672541203775881,-0.21888350478340518,0
567,-0.48458121931291176,0.2013495685309666,0
568,1.2918175608791427,0.3188649617004142,0
569,-0.9528216221925911,-0.8611538882576488,0
570,-1.1564300793679467,-1.456783052445299,0
571,0.05115654123143775,-0.2116364968376833,0
572,1.2895985529978264,1.8549749143681216,0
573,0.811896290727867,0.08005207568358895,0
574,0.6377586706266838,-0.05041670138822688,0
575,0.5855056784166828,0.9296013134769103,0
576,0.1618357457479598,0.5712704462249634,0
577,-0.6534156577819716,-0.5726116236599881,0
578,-1.8825242872605759,-1.856544736711236,0
579,0.9021778188892368,0.9719065819818201,0
580,-0.6505825423357939,-1.0505334388521386,0
581,-0.5754538349273551,-0.6399152414519601,0
582,0.7043794562614105,-0.24051071169089308,0
583,1.3597811334573247,1.974580135666022,0
584,0.20834010847752585,-0.2637562738459365,0
585,0.9956198977428141,-0.001254085303195275,0
586,-0.053075111294638246,-0.5516627861894996,0
587,-0.4873218184827133,-0.4314894142371326,0
588,1.2657726092920982,0.4224250715638046,0
589,-0.1665774823871686,-0.9113341138735831,0
590,3.5477898378964525,1.8435912116532966,0
591,0.006665039669196812,-0.6365209497251436,0
592,-0.3606283157342306,0.5770937264422414,0
593,-0.2368390539254325,-1.5052967789382736,0
594,-0.6196223430364164,-1.0480935813757588,0
595,0.01490549331569477,-0.3350399390356976,0
596,-1.706742181259872,-0.8516764339984869,0
597,0.05695172769238438,0.679893547806739,0
598,1.3916880826025502,1.761661155555035,0
599,0.296965908037091,0.8324271813648911,0
600,0.12437372051292307,-0.3175381301534146,1
601,2.1383924192647106,-2.1766070370973503,0
602,0.46648181087193585,-0.42257837986521396,0
603,-0.15349846269861764,0.8703438580650943,0
604,0.5513113876151936,-0.17555506911123336,0
605,0.24201982180440892,-0.15451945186415056,0
606,0.1756370015742366,-0.12178447183611073,0
607,0.32529015294086594,-0.5173820306220895,0
608,0.10514639687673011,0.5295197989573587,0
609,-0.4980138090415036,0.8282416280886693,0
610,0.23257649559533145,-0.40348771294644487,0
611,-1.1283997419168914,1.192067245659117,0
612,-0.47778645623451027,0.13027138307254724,0
613,0.54506932133873,-0.7834535376050968,0
614,-1.4407925423424002,-0.014298956056601217,0
615,0.45259055215232746,-0.29635655285805407,0
616,-1.8411898393310966,0.5903968149235097,0
617,0.5711818538817719,-0.41409762079519297,0
618,0.5984670747110232,-0.17744427270901728,0
619,-1.5153514301461746,0.15633332040683404,0
620,-0.774087605129076,-0.07174125165030219,0
621,0.9685733197521402,-0.8437755436933292,0
622,0.711282061417752,-0.43680103399477016,0
623,0.4064103369042769,0.2858704950505812,0
624,1.8389065695165208,-1.7832753288743508,0
625,-1.4638729371842047,1.351783648810515,0
626,0.8399562188924531,-1.1224246248783438,0
627,-0.3823201488155719,0.40330644513671887,0
628,-0.3500609523662174,-0.4557083104154514,0
629,-0.7398952539495431,0.39933483164711736,0
630,0.5243931762064991,-0.6088175360298285,0
631,-0.1613669181220598,-0.23563755296170644,0
632,-1.0170739651137983,0.5688065234664791,0
633,2.9006698161084317,-2.240765734942228,0
634,-0.23811480415256053,1.5756306731629142,0
635,-0.36649108497905514,0.3828426142144913,0
636,-0.501639859683523,-0.0276287982954101,0
637,-0.40525524607051316,0.5519578098580463,0
638,0.11830375086728752,0.2626007601702686,0
639,-0.06140793483077768,0.05437742238373043,0
640,0.019231195360803564,0.05530432125803575,0
641,1.284096985642577,-2.0096831354309184,0
642,0.6694894592541548,-0.7108941713317094,0
643,1.0392807787704128,-0.14305172382757916,0
644,0.5034543279060504,-0.9454463501204042,0
645,0.42683243679235866,-1.026331864019545,0
646,0.5244066762522157,-0.6482117788532603,0
647,-0.4878479080415586,-1.5366595055987546,0
648,-0.14899112479360857,1.1684620571531246,0
649,0.9906576763379046,-1.602125311073571,0
650,-1.8096827005980975,0.5935739239656871,0
651,-0.13682681911541067,-0.5015025402782337,0
652,0.8029250438443697,-0.4425447364851338,0
653,0.22205204850543034,-0.009754403277073888,0
654,-0.25348971341190685,0.43709720565902216,0
655,-0.7841019348983447,0.47511567859841736,0
656,-0.6383915855192954,1.0925274956422177,0
657,1.2358777123172002,-1.8656259208541932,0
658,1.5214130934786647,-1.9941364005744922,0
659,-0.7425313507903147,0.2783314450936453,0
660,0.08110530160674419,-0.31256160286471724,0
661,0.22710638870935518,-0.5086306144738255,0
662,0.9385522486521329,-0.9923718294759083,0
663,-0.053987113312733426,0.3372882197252998,0
664,-0.18984924610893505,0.4142474483424676,0
665,-1.038385672008566,0.6376922850077179,0
666,0.35547997563538125,-0.251645127896341,0
667,-0.1119209562064267,-1.228629243933222,0
668,-0.5961664010319101,0.8201689569340729,0
669,1.4231044694392168,-1.63541565712134,0
670,1.1195703953355443,-0.49622894323937117,0
671,0.15225171088058678,0.252020588711778,0
672,1.04304681391777,-0.8287224149451972,0
673,-0.05126452689190586,0.18771826739493574,0
674,0.15038658122453755,-1.2166952097208967,0
675,0.05149830770599961,-1.1692905772819746,0
676,-0.8766667135232091,1.1050893586731259,0
677,0.9813672366881883,-0.9588807451679082,0
678,-1.4313023831952945,1.150523950526382,0
679,0.2701477662891785,-0.028126283181919207,0
680,0.9284624439851479,-0.4374720059471704,0
681,-0.19529735113897118,0.16537160403537043,0
682,-0.29101793988192337,0.34634309575925587,0
683,-1.635130539271551,1.5036033171567769,0
684,-0.9291469030295084,1.1829137892220785,0
685,0.7295102295925184,0.29664511602408133,0
686,-1.5074691497538582,0.9251148636947361,0
687,0.6061636886968513,-0.21645572139261246,0
688,0.02679123300802443,-0.810070789535521,0
689,0.9184232797863646,-0.04975223879660644,0
690,0.30339276480516264,-0.8693077121017029,0
691,2.181073278353636,-1.58370996175711,0
692,0.29051121701520327,0.10848490588776265,0
693,-0.8951459671186927,1.1435416787493582,0
694,-0.11340083838833237,0.12458155364536705,0
695,-1.3427891043919704,0.733693122726255,0
696,0.8706239759845568,-1.6541653942546972,0
697,1.0522702364305427,-1.2168486444441766,0
698,1.1560499129866926,-1.9166465480599315,0
699,-0.4425601988468699,0.3634072096169131,0
700,-0.6443254045843283,0.5999048379522565,1
701,0.45706150073291757,-0.0794426940472061,0
702,2.2435169424512815,2.5394926607347985,0
703,-0.90652867422646,0.061563494618628145,0
704,0.04871995770883509,0.4268040323280537,0
705,0.6475605984249011,-0.34210286939067985,0
706,-1.2699519371157164,-0.9251220055229306,0
707,-1.0290424366495785,-0.7129355706161038,0
708,0.8939444850397682,0.9425396444021479,0
709,-0.029958183030917497,-0.2521862318649972,0
710,-0.06024230151265252,0.8791478532093413,0
711,-0.42303988753063193,-0.33635877544305814,0
712,-1.3703914085465707,-0.88889441693218,0
713,1.501560975872419,0.8029521732199981,0
714,-0.41430488677288907,-1.8754215559979859,0
715,2.123567934715523,2.2298110671272124,0
716,-2.3872306338391636,-1.8457676192793597,0
717,0.39274401850299717,-0.6491630712930259,0
718,0.6460393325041909,1.4275760929582535,0
719,-1.5596660051343216,-1.2926700779580498,0
720,0.7420766754802026,1.4563799380967661,0
721,0.772254141707884,1.1695472623840186,0
722,-0.9514526620493579,-1.4687900159647485,0
723,0.6442910632432667,0.8623085710261501,0
724,-1.0874372590268124,-0.5165920697489663,0
725,1.1069812821790728,0.9000766624236701,0
726,0.1451114255454329,0.3927995146559083,0
727,-1.2612360242825653,-1.224684744096908,0
728,-1.5040705565123016,-0.678734585529354,0
729,0.6253138169469613,0.30484546032428445,0
730,0.914540075209938,-0.007232573938116032,0
731,2.583959019723275,1.4047652222037679,0
732,-0.07080731389745279,-0.6851558963742663,0
733,-1.3120613816249744,-1.2877511917335218,0
734,2.05554777124536,1.108816214868494,0
735,1.3015383091752444,0.18564290507564438,0
736,-0.013966333753247694,-0.25410777147372265,0
737,0.05736465294479388,-1.0814686597443668,0
738,1.2475001503962688,0.7956113691186035,0
739,-2.2417300233715007,-1.8596164949623342,0
740,-0.09543319243438093,-0.6703876428195147,0
741,0.46438719850237603,0.8424831883178534,0
742,0.05815919962499668,-0.09512354517184518,0
743,0.4572825324614241,0.19048778148174247,0
744,-0.5567043118606034,-0.8566364741324558,0
745,-0.6793902640265399,-1.0620607000632099,0
746,-0.10225618796909776,-1.0500702780305073,0
747,0.5087794528830986,0.1480932772299632,0
748,1.0797729331290749,0.11442457941652233,0
749,0.6164684142349285,0.35128726699768026,0
750,0.005695268208947874,-0.7226240391277182,0
751,-1.2670507728948324,-0.657944274874948,0
752,0.1816550297611008,1.0126656803511531,0
753,-0.24883691353061524,0.17608145104638842,0
754,1.8053937124719541,-0.0335293942339849,0
755,0.14871813358255917,-0.3692802465096405,0
756,0.3418445155202637,0.6406163421563659,0
757,-1.1651790554332557,-0.7133418148808544,0
758,-1.2175606729297552,-0.8530399452816232,0
759,0.5190707764122372,0.4291403003440008,0
760,-1.7932438737699563,-1.1004912432567462,0
761,1.1507549787970002,1.1335496408451227,0
762,-0.4759735785232729,-0.46195607001052935,0
763,-0.3653844448195585,-1.1016181389170903,0
764,0.30201841124698436,0.6262218355461513,0
765,-0.061167809337488964,-0.46016371324894856,0
766,0.03391280405526749,-0.16577417602146485,0
767,-0.004438819316997359,0.07261158388160695,0
768,1.0760214385764573,-0.20089229216173407,0
769,-0.17330449832701725,0.6435684729571183,0
770,0.6840433829138488,0.6098896727442061,0
771,0.03015479046944443,-0.8493660270821917,0
772,0.19168244243573385,0.3959819519153347,0
773,-0.3921029170425416,-0.6392183461482748,0
774,-0.7504643781713961,-0.2806114256267829,0
775,-0.7360782202503449,-1.2618444661164951,0
776,0.7116867528310657,1.311411028016591,0
777,0.6377443691189942,0.1765433858283151,0
778,-0.016590355510076604,-0.5400716770949097,0
779,-0.46728329882322917,0.3085802837316757,0
780,-0.2524110616346573,-0.5030408949597537,0
781,-0.38035271973732443,-1.1620281647798754,0
782,1.950233970920823,1.9763331485810884,0
783,-0.32186239201324474,-0.4946034990156717,0
784,0.3671792021093462,0.1596676122229725,0
785,1.3214674428726567,0.6254625907364633,0
786,0.3732929583212068,-0.11230564949974522,0
787,1.9812627385626045,1.2518240047312204,0
788,0.11802521362810196,-0.2830365559962991,0
789,-1.5207765577961139,-3.035067665138202,0
790,-0.37365946366713276,1.1831829338806545,0
791,-0.15634803395932076,-0.6068687282223547,0
792,-1.7596496611649424,-1.4422620776671682,0
793,-0.7149761801288406,0.19481001446542845,0
794,0.19408125305557605,0.04077200453102111,0
795,1.531337159100238,2.6606584333663337,0
796,0.8854994876892469,0.5270123189480602,0
797,2.308572729915552,1.6874831734192357,0
798,-0.3141274666720182,-1.05361820783475,0
799,-1.0326748139734336,-1.2133578343738407,0
800,0.7495747073779359,0.26093745342591546,1
801,-0.4986192649335225,1.067821063032672,0
802,-0.8862509381482785,0.05864000129305435,0
803,0.3103464773303024,0.09986226818539551,0
804,-0.6418545186403317,0.7003978580661784,0
805,0.6706000727061153,0.012561489335522109,0
806,0.17421181209358383,0.047350386564332166,0
807,-0.7000669600770367,0.2939195488281797,0
808,0.01733097881771311,0.11801406787506602,0
809,-0.40687884226373855,0.2721975696103397,0
810,-0.012824533738881438,-0.22904959225998137,0
811,-1.0508159071931928,0.5809696275357245,0
812,-1.4937304681291923,0.9650126670398088,0
813,0.8866526845396061,-1.0564415450647175,0
814,-1.2530333637239361,1.8352792871341668,0
815,-1.9663008409361846,2.3243529762913657,0
816,-0.6412950435083439,0.9198997951176391,0
817,0.26634377663940095,-1.4606987213949518,0
818,-0.6937963404188706,0.36827415660675755,0
819,-1.0948470120949165,1.285148075376054,0
820,-1.1500471563367707,1.4409937094998537,0
821,0.7452409436588084,-0.9690979007731629,0
822,0.17793500771726495,0.14694037001982493,0
823,-0.5116995586982748,0.27498000078030205,0
824,0.2108858581246631,-1.1282178838248356,0
825,0.1642435117005776,-0.419486370374766,0
826,-0.8367793019606542,1.3376575032670466,0
827,1.5740736979254588,-0.7892706884600769,0
828,-0.0939738184388366,-0.4284047642624955,0
829,-0.06664470628135138,-0.9015261359104656,0
830,-0.7166779980155552,-0.2631344796677183,0
831,0.37194574854191265,-0.02647754838694701,0
832,-0.4721483880961654,0.6096092396020055,0
833,0.7488150448902663,-1.416248767133506,0
834,-1.8004804602435116,0.7372916522229531,0
835,-0.817489510956002,0.23123770750825415,0
836,0.13375206571092796,-1.335025320714009,0
837,1.7050402372721898,-1.8547846034861992,0
838,-0.5754308601649981,-0.4728822509993561,0
839,1.04316820110249,-0.9569350561065428,0
840,1.1755932408806018,-1.205564969105212,0
841,-0.35098852434360417,1.1162558672829364,0
842,0.8075923508441297,-0.9388765682471207,0
843,0.8891992211262486,-0.02889858766893127,0
844,1.1179582511432362,-1.1566065820821003,0
845,-1.362688590528442,0.7510949050523903,0
846,0.31698052432824336,-0.9125878686609455,0
847,0.0597773946295551,-1.4592094654449763,0
848,1.3428985687591157,-1.3442876407807094,0
849,1.5312582035728746,-0.5295979666526873,0
850,-0.8045630730189741,0.5327315651286331,0
851,-2.2677058549925118,1.8040775690447732,0
852,-1.703758704268082,-0.24030874409255137,0
853,-0.7321471197550445,0.38315823759252693,0
854,-0.85204108699908,0.5929915916682709,0
855,-0.1740221082481986,0.6010378079138796,0
856,0.6212222936063675,-1.8875352211308845,0
857,0.16452734982583286,-0.4877491825546942,0
858,-1.0385570913128508,1.1583355915427191,0
859,0.42606347435577124,0.22209196115074079,0
860,-0.9009238840031325,0.5365294104419608,0
861,0.3344301932559473,-0.4265386663926651,0
862,0.7606504389554941,-0.7345249607973795,0
863,1.0214953609628703,-1.2780856153194364,0
864,-1.2699638165502614,1.0872121037582358,0
865,0.7847921617772468,-0.8993110087231322,0
866,1.0495456199884043,-0.7226649405684222,0
867,0.20428809686621655,0.5062857377387142,0
868,0.4356775296496078,0.07002128493799159,0
869,1.8561621568137074,-2.0709121936797645,0
870,0.15994945371771105,0.3483357062165582,0
871,1.1566863052937286,-0.7336460488109097,0
872,-0.18447612369656,0.8144885004765232,0
873,0.08619592203591286,0.6915643830702892,0
874,-0.21383212615857664,0.39673608590491144,0
875,0.26270212733737264,0.08170905409899287,0
876,0.7007865725339626,-0.6599368915596278,0
877,0.8093451615978282,-0.3445024310638077,0
878,1.5597826699128168,-1.585738322571361,0
879,1.4622845930059667,-1.0516281359855297,0
880,-0.7962348487385963,1.8782267992972552,0
881,1.1317396731295604,-0.5549113883344113,0
882,-0.5641039761597291,-0.20691746097223118,0
883,0.3026221232921576,-0.7077349824787155,0
884,0.2203326623813495,-0.911424116173146,0
885,-1.5365715679498921,1.502631039355011,0
886,-0.0053892643090825785,0.39161794208740913,0
887,-1.0818888561457576,0.8470279360462829,0
888,0.36646789125168805,0.7857647738637542,0
889,-1.3737466164139667,1.5981201421118656,0
890,0.4071293918753757,-0.4848238169149481,0
891,0.05254358888442051,-0.3978549972800707,0
892,-0.29869306087900593,-0.6039247017454266,0
893,0.0644887187681554,-0.10332235464986732,0
894,-1.1003032819690015,1.6632848140202603,0
895,0.37197216060202026,-0.5777975150833479,0
896,0.342049344119631,-0.607590789056065,0
897,-0.49231068929266586,0.4771788921807351,0
898,-1.6618530427471931,1.3206812990071835,0
899,0.0775330964290177,0.7936663879552017,0
900,-0.9030817513315337,-2.1576400152252786,1
901,-1.886879185322012,-1.086717360417913,0
902,-0.30111989613843587,-0.21220800901864828,0
903,2.004878754238747,2.2852460515762307,0
904,-1.492389355672656,-0.5377004610345262,0
905,-0.3205921448950568,0.43561504429618936,0
906,0.2783134248078487,0.30677147502779645,0
907,-1.4338805065790186,-2.5212916514600168,0
908,-0.14255251207876696,-0.33058379679787414,0
909,0.4322402547577114,-0.4309853736226191,0
910,0.20405410764124846,-0.9283146242107994,0
911,0.11413662529999093,-0.08036663243110265,0
912,0.5676548356028849,1.010655196023136,0
913,1.2863011318619701,0.945340209400658,0
914,2.09653302889863,2.19078677129622,0
915,0.7833738141691864,1.4018623872171334,0
916,-0.38337683533758743,-0.516535501727818,0
917,-1.2071149719772925,-0.5661955668178332,0
918,-0.7602572343645863,-0.9483463834189098,0
919,-0.9868539144681359,-1.2045858441378483,0
920,-0.3620327320324712,-0.7004462248143735,0
921,-1.020165592410198,-0.7579329701002148,0
922,0.35841897834856357,0.42397267227338337,0
923,0.2737253406480652,0.6338278783913347,0
924,-1.588445077578317,-0.7835508713202143,0
925,-1.0591399576436533,-0.5093653026190588,0
926,1.3973260146866153,1.8255892756507188,0
927,0.6987776352039309,1.1964939077594228,0
928,-1.9256239085386768,-0.8464057232147711,0
929,0.6920424975359866,0.026265160752968548,0
930,1.7083109798263885,2.0589391867488804,0
931,-0.37163917167992805,-0.09096134384789849,0
932,-0.8508936774473747,-0.6904841493162767,0
933,-0.1641933953869937,-0.9733808433788388,0
934,-1.92208594302575,-1.855178995053758,0
935,0.5132735159541874,0.7974227260286156,0
936,-0.9062356334226179,-0.7499954616077792,0
937,0.15445799727797127,0.23332277498233756,0
938,-1.3829106660354296,-0.11751682205510537,0
939,-0.4666022175835862,-0.6876844908081852,0
940,-1.849698372314725,-1.1315387771310097,0
941,-0.884736319574348,-0.4066925283111063,0
942,0.1689210247255942,-0.07039137938925247,0
943,0.06782264779096299,0.5350733068316178,0
944,0.8943181129260341,0.2152094116503159,0
945,-0.33103594827580285,0.02146646325930123,0
946,-1.1950783196093362,-1.237449412513593,0
947,0.4561582903603531,0.9160710703683773,0
948,1.4042798198175221,1.1572620792814794,0
949,-0.3552107356198623,-0.7162146972550937,0
950,-0.5196567206093509,0.11242150784159209,0
951,-1.342502310236212,-1.1940833567968188,0
952,1.5504267311783058,1.415016362848604,0
953,1.4665748099724076,0.81860821286905,0
954,0.07038201097730112,-0.3040376676306671,0
955,1.068464223778645,0.8567023742936677,0
956,0.2602420970726594,0.110206527702561,0
957,1.3960091448477276,1.0575581379608405,0
958,1.0787940263884352,0.4777265479505437,0
959,-0.17950352463426802,-0.5273224498004215,0
960,0.010042453850742086,-0.22159694915630324,0
961,0.6582980374841307,-0.06113110306048383,0
962,-0.07969161154652944,-0.33616907616356895,0
963,-0.7405454536845764,-0.44951303555583544,0
964,0.793922111295114,-0.10165101447137878,0
965,0.20466235564784724,0.04748198032821776,0
966,0.009801312288226248,-1.4103624465818247,0
967,0.982166200312467,1.4532153648076092,0
968,-0.012703067731461423,0.2163913240254459,0
969,1.2284729640084704,0.9234553087883192,0
970,0.1260639406207341,0.36188979055624637,0
971,-0.4068482229876804,-0.6119121514195318,0
972,0.0545602322192913,-0.20458906695027596,0
973,0.31098576416918233,0.7056784038687219,0
974,-0.7972372964024564,-0.498646745175512,0
975,0.5368798233415915,0.17582879647028898,0
976,-1.2438959030701529,-1.3724326050308624,0
977,-0.9201919247521396,-0.8876398551407999,0
978,0.5208511674130608,0.6586388768420898,0
979,-0.8750851406388352,-0.6643250565439919,0
980,1.5482642891598115,1.9940870555430548,0
981,-1.2746454624174544,-0.8990421858357276,0
982,-0.35394703123492327,-0.9550981648977005,0
983,0.8586892712909499,1.358377970753358,0
984,-0.1270447321359417,-0.5259311822426055,0
985,1.238493943602003,0.9666760468524841,0
986,1.3748219161017576,-0.022564024292329066,0
987,-1.9434995440959322,-1.6527165842449654,0
988,-0.9236451181449536,-0.9570369187283476,0
989,-0.6949619270541434,-0.16443316373717365,0
990,0.500898210785632,-0.2925650573743302,0
991,1.4766332061669676,1.2439395835455347,0
992,1.359613444580702,1.4500315014360274,0
993,1.1364450511939552,1.3636656991654361,0
994,2.0553694378365135,0.8054692836926424,0
995,-1.576752606248138,-0.7902475243445954,0
996,-0.3784786804961046,-0.37426502756309027,0
997,1.4287171925851063,0.5950004850789808,0
998,-0.5462131326630585,-0.5032891678179306,0
999,0.6957917498902736,0.48003570294406883,0
