Time,X1,Label
0,0.0427979340330428,0.0
1,0.22370605193148618,0.0
2,0.06554762384723108,0.0
3,-0.23459510514483795,0.0
4,0.009186279091961439,0.0
5,-0.31686402043179385,0.0
6,-0.10279722603918003,0.0
7,0.046338398747925585,0.0
8,0.209041797364711,0.0
9,0.12983331282151855,0.0
10,-0.12152247154914156,0.0
11,-0.0404490525668203,0.0
12,0.033456898861890565,0.0
13,0.3005622870620572,0.0
14,-0.07938392366854247,0.0
15,0.09619243611147721,0.0
16,0.039775056189203746,0.0
17,-0.20547360530586142,0.0
18,0.1037763770026971,0.0
19,0.16292152898289125,0.0
20,0.10982865017348711,0.0
21,0.5672430674629577,0.0
22,-0.11199382162395917,0.0
23,-0.12856190619824306,0.0
24,-0.19797627119083375,0.0
25,-0.22151325799360222,0.0
26,0.08394165599324212,0.0
27,-0.16290672796012273,0.0
28,-0.47269020130791833,0.0
29,0.2901492220060081,0.0
30,-0.056580050649543884,0.0
31,-0.5745442776871679,0.0
32,-0.1491296001092583,0.0
33,0.038058013343231896,0.0
34,0.6697674751002505,0.0
35,-0.22307281930505513,0.0
36,0.2544447548498693,0.0
37,-0.14803736938152393,0.0
38,0.3163962471332693,0.0
39,-0.22558954648409407,0.0
40,0.35056483670751787,0.0
41,0.2515129142648224,0.0
42,-0.3548175772032687,0.0
43,0.023746012042955324,0.0
44,-0.12980579651605334,0.0
45,-0.0026774360057281784,0.0
46,-0.21852455859269157,0.0
47,-0.027394073323865988,0.0
48,-0.1636588108338215,0.0
49,-0.07424720939800127,0.0
50,-0.17282603145792816,0.0
51,0.0024899865590928176,0.0
52,-0.2874158892914075,0.0
53,-0.13345138701687623,0.0
54,-0.19329262779982265,0.0
55,-0.015277263967697477,0.0
56,0.16075261580721123,0.0
57,0.10817209884631605,0.0
58,-0.11510906874103113,0.0
59,0.015916331557264074,0.0
60,0.06321303616145332,0.0
61,-0.03615230577126609,0.0
62,-0.11896787691587106,0.0
63,-0.5513098692971795,0.0
64,0.016321504574111554,0.0
65,0.1679724640390184,0.0
66,-0.0698306784641818,0.0
67,-0.14819820219880275,0.0
68,-0.09298309054848072,0.0
69,0.13545133610895585,0.0
70,0.08571909905059155,0.0
71,0.13398917271336583,0.0
72,0.009482154089436671,0.0
73,-0.5603790678616914,0.0
74,0.7146583456554954,0.0
75,0.08156593161030096,0.0
76,-0.043235044972564814,0.0
77,0.036596471799088794,0.0
78,-0.11813593843257325,0.0
79,-0.08794705305287322,0.0
80,-0.24585861812350163,0.0
81,0.05546812307903435,0.0
82,0.3345161445586107,0.0
83,-0.13191163422272534,0.0
84,-0.22633035691413897,0.0
85,-0.019364571168954056,0.0
86,-0.27107468876383367,0.0
87,-0.10842631555895654,0.0
88,0.10869072005220684,0.0
89,-0.22740038237923935,0.0
90,0.11639808163769827,0.0
91,-0.0945900830307601,0.0
92,0.46978489509518034,0.0
93,-0.0029891232119211527,0.0
94,0.33063705968988527,0.0
95,0.04698432574956774,0.0
96,-0.17424820077979936,0.0
97,0.2582255651609283,0.0
98,0.04421634748678201,0.0
99,-0.07517878763966657,0.0
100,-0.04356542146018907,0.0
101,0.014329810595924853,0.0
102,-0.23456025339163575,0.0
103,0.3431445502148761,0.0
104,-0.06740336649609864,0.0
105,0.11650653293963407,0.0
106,0.120584155065806,0.0
107,0.05155953815700574,0.0
108,0.07655471627921068,0.0
109,0.01612049526592731,0.0
110,0.048773703901039675,0.0
111,0.3694998159495113,0.0
112,0.08086539867991482,0.0
113,0.11223772454137171,0.0
114,-0.2813389408665953,0.0
115,0.2767824965885374,0.0
116,-0.018198179468358135,0.0
117,0.2363739509316071,0.0
118,0.08863636212965555,0.0
119,0.11942760190912485,0.0
120,-0.02174368686670513,0.0
121,0.21639297320082848,0.0
122,-0.10818693079948044,0.0
123,0.25772602336187533,0.0
124,-0.0042105715435875645,0.0
125,0.060165935210825465,0.0
126,0.38322540815734585,0.0
127,0.306344424733406,0.0
128,0.26646548140378407,0.0
129,0.026603744899411388,0.0
130,-0.4096022905107084,0.0
131,0.23988054247906154,0.0
132,0.2126096163322967,0.0
133,0.3255182930114926,0.0
134,-0.05016966631941427,0.0
135,0.04492305604270169,0.0
136,-0.1073997467473372,0.0
137,-0.0693579318641233,0.0
138,0.013079247907941053,0.0
139,0.09302111212275584,0.0
140,-0.12548638379184512,0.0
141,0.05423182236800914,0.0
142,-0.24367805359894437,0.0
143,-0.1769254209640454,0.0
144,-0.10717010265043381,0.0
145,-0.11976791314955093,0.0
146,0.10433923799347262,0.0
147,0.23084059818391572,0.0
148,0.13328657635838295,0.0
149,-0.17343514867912355,0.0
150,0.07098586563688847,0.0
151,-0.3814945480698051,0.0
152,0.05469870085422068,0.0
153,-0.15842019560934262,0.0
154,-0.2279274326197748,0.0
155,-0.1432779553912146,0.0
156,-0.4952058867370422,0.0
157,0.00045797955578368016,0.0
158,-0.057920958290334994,0.0
159,0.12600604604504814,0.0
160,-0.19134717420437472,0.0
161,0.3623527609529,0.0
162,0.1773985141176656,0.0
163,-0.32568987285131723,0.0
164,-0.060566727045196,0.0
165,-0.16019097322556258,0.0
166,-0.11266819084333007,0.0
167,0.20854370234004535,0.0
168,-0.22554092615934557,0.0
169,-0.0028590623976294024,0.0
170,-0.3055929156691066,0.0
171,-0.011347347761252423,0.0
172,0.28987465334471757,0.0
173,0.06840646671458976,0.0
174,-0.23789320691906288,0.0
175,0.21024828859807532,0.0
176,0.08418249080693413,0.0
177,-0.06057031719112587,0.0
178,0.0832662266551824,0.0
179,-0.16653701817835884,0.0
180,-0.038123872534350275,0.0
181,-0.11801734881888758,0.0
182,-0.15080167506405537,0.0
183,-0.04905366108149362,0.0
184,0.04831256643379481,0.0
185,0.017962359819180217,0.0
186,-0.1343131889642258,0.0
187,0.0498935257076084,0.0
188,0.18417265717453613,0.0
189,0.1860912289763613,0.0
190,0.07034878656198527,0.0
191,0.45210025020952815,0.0
192,-0.4250072406536829,0.0
193,0.0014247033643545203,0.0
194,-0.06827256594972482,0.0
195,0.07016359417633432,0.0
196,-0.007782293220784955,0.0
197,0.05828811812621283,0.0
198,-0.17342460953953925,0.0
199,-0.18116171991668495,0.0
200,-0.07494888160762667,0.0
201,0.15063944225227305,0.0
202,-0.3765743631666639,0.0
203,0.21478817300017275,0.0
204,-0.055258749620894845,0.0
205,0.2874402392160793,0.0
206,-0.11699388199834262,0.0
207,-0.2552330895518546,0.0
208,-0.0033666725424306206,0.0
209,0.022990729053575677,0.0
210,-0.17325425101640995,0.0
211,0.15120462761122758,0.0
212,0.040512700547637365,0.0
213,-0.09426194806248775,0.0
214,-0.15032762198521016,0.0
215,-0.026776031992162965,0.0
216,0.037968207878869675,0.0
217,0.022624369860345123,0.0
218,-0.20281350170063012,0.0
219,-0.044288889744039946,0.0
220,-0.34508463090078384,0.0
221,0.11226032370962025,0.0
222,0.12587163504997095,0.0
223,-0.1937759300910102,0.0
224,0.09857170351140808,0.0
225,-0.37778428587591995,0.0
226,0.31136644794887036,0.0
227,0.24849565675816684,0.0
228,0.04607855963630813,0.0
229,0.042213301031200134,0.0
230,0.10077775940366462,0.0
231,0.11664474637871436,0.0
232,-0.27361331068732947,0.0
233,0.1623751656679907,0.0
234,0.13137286767984827,0.0
235,-0.11684860986254048,0.0
236,0.11905090298861741,0.0
237,-0.10805775683890172,0.0
238,0.19892811077881337,0.0
239,-0.13243990745908363,0.0
240,0.07257919354308984,0.0
241,-0.4791499295261143,0.0
242,-0.29050153502223347,0.0
243,-0.20402803104754824,0.0
244,0.23401125416158663,0.0
245,-0.24921621843161673,0.0
246,0.22518810979466242,0.0
247,0.033104517895917736,0.0
248,-0.019568577017851575,0.0
249,0.3986972293100119,0.0
250,0.16497629243305645,1.0
251,0.3598063329763936,0.0
252,0.14213737451329028,0.0
253,0.2527711920233494,0.0
254,0.24528353870259387,0.0
255,0.06278457115404423,0.0
256,0.16874454245241793,0.0
257,0.11958369068441135,0.0
258,0.6100735335478518,0.0
259,0.3719203007238525,0.0
260,0.3115331511924223,0.0
261,0.6737805971048727,0.0
262,0.6576751579905503,0.0
263,0.40167839410796774,0.0
264,0.7933384341530071,0.0
265,0.6269799785661323,0.0
266,0.6771274468388505,0.0
267,0.6086863784507024,0.0
268,0.6606661817339435,0.0
269,0.6629037538999519,0.0
270,0.8073808022792062,0.0
271,0.9965456694374459,0.0
272,0.9735860350172507,0.0
273,0.7572493353048998,0.0
274,0.8733607497729922,0.0
275,1.0701521013227768,0.0
276,0.8194186455291326,0.0
277,0.9679752124546437,0.0
278,1.3081443962621129,0.0
279,1.080388397347861,0.0
280,1.354720540858134,0.0
281,1.1973686011388482,0.0
282,1.7455991430118878,0.0
283,1.3905666253454485,0.0
284,1.0742251046982196,0.0
285,1.437583934598762,0.0
286,1.255164448728757,0.0
287,1.8985206859594788,0.0
288,1.5272705175223529,0.0
289,1.8897432302439094,0.0
290,1.4533854372653803,0.0
291,1.647940784009374,0.0
292,1.7546297125923263,0.0
293,1.8026756401667812,0.0
294,1.9150287684871692,0.0
295,1.8662121868642785,0.0
296,1.7632863325720392,0.0
297,1.7785794261943249,0.0
298,2.052015205009323,0.0
299,1.9645985435571895,0.0
300,2.0002222256773203,0.0
301,2.100895549513214,0.0
302,2.1181648099305765,0.0
303,2.070077667252059,0.0
304,2.0043497113481994,0.0
305,2.360190516825224,0.0
306,1.961371351658784,0.0
307,2.3120568669681623,0.0
308,2.26843479211637,0.0
309,2.398873950599191,0.0
310,2.2289566152512226,0.0
311,2.357556366425634,0.0
312,2.4570863935523226,0.0
313,2.5578201941931815,0.0
314,2.4521622109478294,0.0
315,2.235764497999854,0.0
316,2.51831768176322,0.0
317,2.4592040011497467,0.0
318,2.6250441154784787,0.0
319,2.7470337603338626,0.0
320,2.9648294414567875,0.0
321,2.803893235154469,0.0
322,2.7297272977810327,0.0
323,2.940346973451069,0.0
324,3.1717160813498966,0.0
325,2.759737047712986,0.0
326,3.1279969050285845,0.0
327,3.2033102965670786,0.0
328,2.759572789173868,0.0
329,3.046280724766627,0.0
330,3.318394495372191,0.0
331,3.453811125568345,0.0
332,3.477483369195886,0.0
333,3.4861996659489867,0.0
334,3.2752418054916137,0.0
335,3.4860083627157166,0.0
336,3.6149336299189807,0.0
337,3.0789703291073987,0.0
338,3.4713620791523616,0.0
339,3.5273722425369662,0.0
340,3.6427784823550846,0.0
341,3.3366370271810863,0.0
342,3.7082613859697884,0.0
343,3.587763378074224,0.0
344,3.7682962736941525,0.0
345,3.700628416389471,0.0
346,3.606804114347896,0.0
347,4.002610186272882,0.0
348,3.8775753739887744,0.0
349,4.114231993565967,0.0
350,4.481430487183499,0.0
351,3.911137618986113,0.0
352,3.9990914008355976,0.0
353,4.216629109191975,0.0
354,4.155045612603464,0.0
355,4.150256564000683,0.0
356,4.718923988936162,0.0
357,4.067557195676152,0.0
358,4.497835314632024,0.0
359,4.212940905627753,0.0
360,4.286866826453557,0.0
361,4.355638734568555,0.0
362,4.345870486134839,0.0
363,4.615818776800447,0.0
364,5.00688836778551,0.0
365,4.520068881352787,0.0
366,4.492381398480855,0.0
367,4.694927775989228,0.0
368,4.70833392158451,0.0
369,4.718217019784012,0.0
370,4.749414273815417,0.0
371,4.936163717619516,0.0
372,4.840303721206759,0.0
373,4.982448362877179,0.0
374,5.069378617737859,0.0
375,5.1069291691755385,0.0
376,4.659604247122988,0.0
377,4.852113236444632,0.0
378,5.000882881603009,0.0
379,5.379720646439956,0.0
380,5.221913622162413,0.0
381,5.401396786750552,0.0
382,5.377563056668803,0.0
383,5.436938451499085,0.0
384,5.155105825908675,0.0
385,5.674043014160954,0.0
386,5.577614761843905,0.0
387,5.60591889419666,0.0
388,5.675066146165046,0.0
389,5.7026689891271465,0.0
390,5.592061465121717,0.0
391,5.665855026562224,0.0
392,6.2035933843938125,0.0
393,5.657734414455325,0.0
394,5.878028019736944,0.0
395,5.574550012691051,0.0
396,5.798862946110271,0.0
397,6.154148061507997,0.0
398,5.999463927585241,0.0
399,5.943754866267648,0.0
400,5.944902467681332,0.0
401,5.989100481694189,0.0
402,6.062611330438309,0.0
403,6.11752800735953,0.0
404,6.265576930862353,0.0
405,5.9866023038975795,0.0
406,6.15428460559299,0.0
407,6.4652497021956,0.0
408,6.253079607525112,0.0
409,6.090020726439318,0.0
410,6.517572757719528,0.0
411,6.593027997810753,0.0
412,6.520232546713611,0.0
413,6.626875854241007,0.0
414,6.408647642042117,0.0
415,6.704146988019203,0.0
416,7.0253792901706404,0.0
417,7.008638116755201,0.0
418,6.706518350877648,0.0
419,6.979832575238927,0.0
420,6.740827879855132,0.0
421,6.537060107280519,0.0
422,6.74952520886279,0.0
423,7.04899408971397,0.0
424,7.31387714537847,0.0
425,7.008613207204225,0.0
426,7.352080289503031,0.0
427,7.180307694349682,0.0
428,7.102409595838062,0.0
429,7.280627349461442,0.0
430,7.195708262338574,0.0
431,7.325564026201415,0.0
432,7.57434051429307,0.0
433,7.528360237444601,0.0
434,7.225376682684276,0.0
435,7.500235434203724,0.0
436,7.425581855941884,0.0
437,7.930966621460512,0.0
438,7.543892050785683,0.0
439,7.373788443269894,0.0
440,7.579610771380917,0.0
441,8.165898837445294,0.0
442,7.637900340476073,0.0
443,7.385853682992707,0.0
444,7.911744201528079,0.0
445,7.981206019449065,0.0
446,7.80684176568623,0.0
447,8.061195201357043,0.0
448,7.988551384191326,0.0
449,7.881883799877399,0.0
450,7.908386713534271,0.0
451,7.991312659279331,0.0
452,8.13717364582051,0.0
453,8.160589984746196,0.0
454,8.174045623566332,0.0
455,8.148672823248766,0.0
456,8.19040078413564,0.0
457,7.956012077190531,0.0
458,8.493532910283422,0.0
459,8.440626102505064,0.0
460,8.711086717969337,0.0
461,8.42530275346645,0.0
462,8.946348373851885,0.0
463,8.551554749048773,0.0
464,8.279642942343873,0.0
465,8.764305614151485,0.0
466,8.815769344417426,0.0
467,8.575433754532083,0.0
468,8.212046709108066,0.0
469,8.465346465121124,0.0
470,9.030737910870297,0.0
471,9.091465431392502,0.0
472,9.202403595210074,0.0
473,8.842156516234796,0.0
474,9.16476266454174,0.0
475,8.88722986560055,0.0
476,9.028242276176508,0.0
477,9.110735124082726,0.0
478,9.074255110726716,0.0
479,9.26195524510924,0.0
480,9.13694580880961,0.0
481,9.358272208485076,0.0
482,9.699336121599401,0.0
483,9.31582708272271,0.0
484,9.293800861312302,0.0
485,9.082045820481001,0.0
486,9.009454100714004,0.0
487,9.716998941708301,0.0
488,9.12091927199921,0.0
489,9.468055943555212,0.0
490,9.706981109384898,0.0
491,9.792334760687854,0.0
492,9.601961374296737,0.0
493,9.554332678839824,0.0
494,10.144784749527206,0.0
495,10.088664956516071,0.0
496,9.935825186160118,0.0
497,9.593547044853338,0.0
498,9.801581053517527,0.0
499,10.245402814376162,0.0
