Time,X1,Label
0,0.598407398054403,0.0
1,0.3631162994601916,0.0
2,0.4497137264728264,0.0
3,0.3832138934400513,0.0
4,0.05208374182540837,0.0
5,-0.15661749569431072,0.0
6,-0.6233131498861186,0.0
7,-0.5538723653253277,0.0
8,-0.317320910156928,0.0
9,0.01638165263515293,0.0
10,0.19363323271896177,0.0
11,-0.08588382754129681,0.0
12,-0.49399686256853903,0.0
13,-0.011766036175092856,0.0
14,0.05931121837903039,0.0
15,-0.1923875931646093,0.0
16,0.03736391799658672,0.0
17,-0.3578642659484336,0.0
18,-0.16718549109050895,0.0
19,0.11832938928618726,0.0
20,0.14276989990392203,0.0
21,-0.21239893964529563,0.0
22,0.05367677288953181,0.0
23,0.04626245160255265,0.0
24,0.017122646806478837,0.0
25,-0.12409015072051727,0.0
26,-0.5267858837129273,0.0
27,-0.06287405370700902,0.0
28,-0.0018896736640101016,0.0
29,0.061778934150218984,0.0
30,0.5832722771242576,0.0
31,0.0034613908703451522,0.0
32,0.0050883870507951335,0.0
33,0.3583785501136394,0.0
34,0.3317665106814818,0.0
35,0.0768300759149558,0.0
36,-0.32889115672639874,0.0
37,0.11671941385337914,0.0
38,0.5092187898298233,0.0
39,-0.7625818626862187,0.0
40,0.5355839992596304,0.0
41,-0.002717947934752659,0.0
42,0.19223680624453715,0.0
43,0.7260364961501437,0.0
44,-0.25322426911334434,0.0
45,0.11631903508531737,0.0
46,-0.2733069212677624,0.0
47,0.14449154020201652,0.0
48,-0.32603667808557085,0.0
49,0.017355866085688725,0.0
50,4.008846910367726,1.0
51,3.9978365735061376,0.0
52,4.397467350289178,0.0
53,3.79042193018946,0.0
54,4.144048092838278,0.0
55,3.689119697698156,0.0
56,3.9699289514200617,0.0
57,4.2629372419045515,0.0
58,4.137556926434185,0.0
59,4.312618571752705,0.0
60,4.124244868161133,0.0
61,3.578138695792123,0.0
62,3.6933946945732106,0.0
63,4.492621683434272,0.0
64,4.177998200154111,0.0
65,3.66422055788836,0.0
66,4.156489924616372,0.0
67,4.112343748652696,0.0
68,4.0750767671354735,0.0
69,3.9243150745656976,0.0
70,4.260166307316663,0.0
71,3.708108989994436,0.0
72,3.876787063876857,0.0
73,3.9114626627467457,0.0
74,3.831851967602035,0.0
75,3.9319118165146967,0.0
76,4.281613480925277,0.0
77,4.092163279443998,0.0
78,3.4709510538241606,0.0
79,3.81837545141269,0.0
80,4.276131902982304,0.0
81,4.242389469736497,0.0
82,3.895686417103918,0.0
83,3.730805885438214,0.0
84,3.4211732549258,0.0
85,4.454617807197745,0.0
86,4.009561846282601,0.0
87,4.301454387394233,0.0
88,3.6795092739339577,0.0
89,3.7182766545041366,0.0
90,3.806169185121747,0.0
91,3.5760636041762095,0.0
92,4.159130606133567,0.0
93,4.422897717399461,0.0
94,4.325191289933256,0.0
95,3.9176373224640186,0.0
96,4.288291352035277,0.0
97,3.9681513523376126,0.0
98,4.303000641347207,0.0
99,3.448171639302872,0.0
100,-16.08294791630992,1.0
101,-15.732773775383073,0.0
102,-16.089291877126463,0.0
103,-15.548980821802044,0.0
104,-15.863792411080492,0.0
105,-15.463597871290876,0.0
106,-15.799353727504794,0.0
107,-15.60627715892031,0.0
108,-15.302303323539935,0.0
109,-15.514169130416974,0.0
110,-16.03074623992562,0.0
111,-15.14773021424634,0.0
112,-15.443983041819237,0.0
113,-15.723469865543091,0.0
114,-15.9362350454157,0.0
115,-15.708102915835404,0.0
116,-15.292864174050397,0.0
117,-15.467395117252998,0.0
118,-15.315510321671763,0.0
119,-14.98391578893039,0.0
120,-14.790050863983048,0.0
121,-14.896612088210698,0.0
122,-14.637015540474554,0.0
123,-14.834580495660159,0.0
124,-15.382502755582088,0.0
125,-15.293037547219612,0.0
126,-15.182299874361384,0.0
127,-14.22275497188227,0.0
128,-14.896828490389101,0.0
129,-14.753604338115295,0.0
130,-14.939074671521624,0.0
131,-14.57489425562035,0.0
132,-15.006421429253777,0.0
133,-14.767429163133052,0.0
134,-14.326931877470166,0.0
135,-14.618753523881406,0.0
136,-14.62855784320736,0.0
137,-14.775572030271817,0.0
138,-14.362094135819639,0.0
139,-14.460364287949638,0.0
140,-14.466632028562369,0.0
141,-14.04306109906583,0.0
142,-14.47839279978978,0.0
143,-13.808182986554172,0.0
144,-14.134197050356484,0.0
145,-14.274671737843661,0.0
146,-14.136904281006007,0.0
147,-14.040772828366737,0.0
148,-13.892899284056018,0.0
149,-14.523931141861109,0.0
150,-13.688589348648723,0.0
151,-13.546598335237793,0.0
152,-13.758542090332849,0.0
153,-13.953439785488051,0.0
154,-13.846913398837533,0.0
155,-14.261631028655497,0.0
156,-13.919171632158292,0.0
157,-13.544937967917726,0.0
158,-13.281705830408512,0.0
159,-13.942240138668552,0.0
160,-13.68435207949544,0.0
161,-12.981221015119171,0.0
162,-13.728583198191451,0.0
163,-13.674594028258511,0.0
164,-13.494698787035968,0.0
165,-13.683020598942157,0.0
166,-13.428488709410686,0.0
167,-12.98896207784842,0.0
168,-12.893553088446545,0.0
169,-13.089717662466583,0.0
170,-12.992724246558296,0.0
171,-13.464556428081465,0.0
172,-13.267669798450086,0.0
173,-13.114389131718987,0.0
174,-12.988483621716572,0.0
175,-8.682011048542432,1.0
176,-8.858368423059584,0.0
177,-9.717206112566814,0.0
178,-8.447527879835299,0.0
179,-8.749799905933806,0.0
180,-9.01060184065749,0.0
181,-8.748459311658074,0.0
182,-8.546846995718873,0.0
183,-8.435904535334274,0.0
184,-8.809514141403586,0.0
185,-8.45151555471691,0.0
186,-8.309842837823322,0.0
187,-8.300157395379486,0.0
188,-8.502348719661413,0.0
189,-8.223911197252761,0.0
190,-8.269557709916782,0.0
191,-8.220959155318702,0.0
192,-8.551209421124337,0.0
193,-8.073680824388802,0.0
194,-8.084054858303542,0.0
195,-8.35649130819882,0.0
196,-7.855321504452013,0.0
197,-8.3262664001469,0.0
198,-7.11838734763821,0.0
199,-8.026917119410456,0.0
200,-8.050374894549034,0.0
201,-8.019291273429673,0.0
202,-7.842755356034669,0.0
203,-7.523144256996492,0.0
204,-8.30877254461959,0.0
205,-7.558473230313197,0.0
206,-7.538398536835025,0.0
207,-8.1493543361666,0.0
208,-7.801299626600658,0.0
209,-7.624269380606247,0.0
210,-8.206101243048892,0.0
211,-7.690274165563011,0.0
212,-7.964539602210587,0.0
213,-7.310214679585034,0.0
214,-7.301007960663158,0.0
215,-7.910646115789225,0.0
216,-7.805552418387309,0.0
217,-6.960068228160811,0.0
218,-7.373630865056779,0.0
219,-7.602446230566329,0.0
220,-7.143826354472694,0.0
221,-7.613839682272115,0.0
222,-6.8433821079101556,0.0
223,-6.854020152875092,0.0
224,-6.762902013566112,0.0
225,-6.717384094583926,0.0
226,-6.658610336796761,0.0
227,-7.612518772610464,0.0
228,-6.860806940670017,0.0
229,-7.24140156011654,0.0
230,-6.21986346692394,0.0
231,-6.935714720095309,0.0
232,-6.740049321328193,0.0
233,-6.269877453247048,0.0
234,-6.514688585211847,0.0
235,-6.8163596008464555,0.0
236,-7.0276751226957845,0.0
237,-6.209862071404814,0.0
238,-6.393536423896485,0.0
239,-6.519275187568459,0.0
240,-6.9922869941794605,0.0
241,-6.5359661531453686,0.0
242,-6.144292820855711,0.0
243,-6.282031255592841,0.0
244,-6.291422104550518,0.0
245,-5.5829660720217635,0.0
246,-5.959677980539951,0.0
247,-6.0554231541826695,0.0
248,-5.524824468315376,0.0
249,-6.138533371687114,0.0
250,-5.804858669723419,1.0
251,-5.646579453585913,0.0
252,-5.471565483366589,0.0
253,-5.233001173770205,0.0
254,-5.61053682543487,0.0
255,-5.462119463073302,0.0
256,-5.191485429885745,0.0
257,-4.521489547882986,0.0
258,-4.620563210713243,0.0
259,-5.142117349805247,0.0
260,-4.58542263170219,0.0
261,-4.976207385174067,0.0
262,-4.418445398776402,0.0
263,-4.518711595546403,0.0
264,-4.0576203658589804,0.0
265,-3.969190963412686,0.0
266,-3.6694050010880854,0.0
267,-4.573441996661725,0.0
268,-3.837453846401246,0.0
269,-3.705796561471786,0.0
270,-3.1934558118763103,0.0
271,-3.2813602674428743,0.0
272,-3.779943603845295,0.0
273,-2.7318613652335983,0.0
274,-2.6422221076845265,0.0
275,-2.6859446566614817,0.0
276,-2.7886480433095446,0.0
277,-2.8058402449552045,0.0
278,-2.807830570189264,0.0
279,-1.8902961753316934,0.0
280,-2.9391629830642323,0.0
281,-1.9907603308975776,0.0
282,-1.7685921639848647,0.0
283,-2.057629062198229,0.0
284,-2.105152104438517,0.0
285,-1.9897706890255495,0.0
286,-1.5501306558547334,0.0
287,-1.4637828273107054,0.0
288,-1.39010358857076,0.0
289,-1.048200520794115,0.0
290,-1.7677837886444348,0.0
291,-0.8210371720256866,0.0
292,-0.7479209607651569,0.0
293,-0.6652708639138254,0.0
294,-0.7182084189120452,0.0
295,-0.5793210526083872,0.0
296,-0.13524982194409496,0.0
297,-0.565084066794137,0.0
298,-0.048517496840776886,0.0
299,-0.13388487410741412,0.0
300,0.0543183407551453,0.0
301,-0.0368437952614844,0.0
302,0.3334059471559563,0.0
303,0.7039276514585815,0.0
304,0.48174256386271175,0.0
305,0.6926155515344483,0.0
306,0.5239347839253128,0.0
307,1.2941862288392016,0.0
308,1.275477383264242,0.0
309,0.8603440745405848,0.0
310,1.546804887728861,0.0
311,1.4760469332198767,0.0
312,2.1033227379494726,0.0
313,1.3737374336409047,0.0
314,0.9916619585287574,0.0
315,2.143504285871254,0.0
316,2.0081077225953443,0.0
317,2.0608891479086964,0.0
318,1.804555189119446,0.0
319,2.770094538023516,0.0
320,2.584235080498406,0.0
321,2.6733384681773646,0.0
322,2.517582004098589,0.0
323,2.7322240422464397,0.0
324,2.2459155722913557,0.0
325,7.168422256312532,1.0
326,6.9385803577987755,0.0
327,7.4178860383652605,0.0
328,7.675191246498873,0.0
329,7.648061223111426,0.0
330,7.576314262136643,0.0
331,8.277192421962532,0.0
332,8.025629139801314,0.0
333,7.9528183188207695,0.0
334,8.492522356855662,0.0
335,8.299920541731495,0.0
336,7.9741374993658365,0.0
337,8.735598385974079,0.0
338,8.542611491895215,0.0
339,8.456741585952873,0.0
340,9.087094055339527,0.0
341,8.659633110258444,0.0
342,9.141838702014226,0.0
343,9.616452497792508,0.0
344,9.5742427932313,0.0
345,9.521651751191346,0.0
346,9.770796912414468,0.0
347,9.742425427783118,0.0
348,9.969705843808569,0.0
349,9.891553508490624,0.0
350,10.278744271806069,0.0
351,10.465996897170669,0.0
352,10.958884159771664,0.0
353,10.498432316880095,0.0
354,10.406731238219109,0.0
355,10.666351950627007,0.0
356,10.80380687159985,0.0
357,10.98757609269682,0.0
358,11.108601338395381,0.0
359,10.857130453405667,0.0
360,11.42839245357591,0.0
361,11.8872424099767,0.0
362,11.458761743386912,0.0
363,11.996293683852585,0.0
364,11.763829074563404,0.0
365,11.996501312044852,0.0
366,11.99064016963558,0.0
367,12.394650398378865,0.0
368,12.547754401157782,0.0
369,12.253939606051418,0.0
370,12.743347949509868,0.0
371,12.8195850682839,0.0
372,13.296049549358564,0.0
373,12.953722130740026,0.0
374,13.291669979473628,0.0
375,12.966605172418731,0.0
376,13.840732738257003,0.0
377,13.403132371811978,0.0
378,13.000539033827316,0.0
379,13.276139585792126,0.0
380,13.393639431928221,0.0
381,13.67248116627206,0.0
382,14.077394635044115,0.0
383,14.436379177816718,0.0
384,14.183673854741436,0.0
385,14.322493764325642,0.0
386,14.456426390894954,0.0
387,14.269615513429127,0.0
388,14.93761458375548,0.0
389,14.477145832874168,0.0
390,14.684007229092586,0.0
391,14.989815395773753,0.0
392,14.853546743540605,0.0
393,15.240583575051957,0.0
394,14.79846081960099,0.0
395,15.374080807853549,0.0
396,15.404976623463149,0.0
397,16.34153750109283,0.0
398,15.942569610923073,0.0
399,15.945696693685179,0.0
400,15.84812936947251,0.0
401,16.34546402774308,0.0
402,16.558175131269643,0.0
403,16.7588689612728,0.0
404,17.0186548489298,0.0
405,16.818186339029474,0.0
406,16.574625231742157,0.0
407,16.757512006855826,0.0
408,17.028334674739614,0.0
409,17.071501775048493,0.0
410,17.442561712236326,0.0
411,17.558474432061914,0.0
412,17.397143259589427,0.0
413,17.40808416108403,0.0
414,18.01707330473325,0.0
415,17.749548879670073,0.0
416,18.193449243652417,0.0
417,17.65108827649147,0.0
418,17.775417062391575,0.0
419,18.642041137769315,0.0
420,18.561231595590503,0.0
421,18.35623256203381,0.0
422,18.74152678060909,0.0
423,19.23012715789494,0.0
424,18.810780302425492,0.0
425,19.282582461660624,1.0
426,20.243208983953423,0.0
427,20.845331103529986,0.0
428,20.88729018737412,0.0
429,21.55031906638642,0.0
430,22.242975239044,0.0
431,22.535644046981588,0.0
432,23.46029015812593,0.0
433,23.28095728900182,0.0
434,24.24259525894101,0.0
435,25.31291305629958,0.0
436,24.98191389711291,0.0
437,25.468761476532798,0.0
438,27.118854733467472,0.0
439,27.10550151065219,0.0
440,27.567770994023853,0.0
441,27.838578233364345,0.0
442,28.89031528924817,0.0
443,29.025428477666765,0.0
444,29.509930514367326,0.0
445,29.999411881488328,0.0
446,30.24587155902327,0.0
447,30.654531195735387,0.0
448,31.233188810870658,0.0
449,32.1628235564292,0.0
450,32.7596719908447,0.0
451,32.54411106116019,0.0
452,33.3549034651434,0.0
453,34.36421728417595,0.0
454,34.674008928314784,0.0
455,34.77344948117658,0.0
456,35.55184150906645,0.0
457,35.949249206023076,0.0
458,36.57031492537472,0.0
459,37.50157150148219,0.0
460,37.3380599459942,0.0
461,37.8624011761151,0.0
462,37.97221632856761,0.0
463,38.958371582291406,0.0
464,40.15634754446049,0.0
465,40.279996499831235,0.0
466,40.55599719794257,0.0
467,41.36037287676921,0.0
468,41.46064112117368,0.0
469,42.66171651809081,0.0
470,42.63512901669557,0.0
471,43.614809489006575,0.0
472,43.897724213964835,0.0
473,44.57991951420033,0.0
474,44.81068662148512,0.0
475,45.56050378742488,0.0
476,45.62751481255562,0.0
477,46.306668798209714,0.0
478,47.084774997788145,0.0
479,46.9400170633307,0.0
480,47.8890506866316,0.0
481,48.04332256798989,0.0
482,49.29857282623301,0.0
483,49.085313418971225,0.0
484,49.83374728835159,0.0
485,51.07610200745631,0.0
486,51.371835505829466,0.0
487,51.689983565109586,0.0
488,52.37801246883535,0.0
489,52.75438343267258,0.0
490,53.495772864871824,0.0
491,53.67479650790132,0.0
492,54.30262754371897,0.0
493,54.630578270676864,0.0
494,55.42357978574583,0.0
495,55.4707037584613,0.0
496,56.853132755647636,0.0
497,57.38229289383362,0.0
498,57.54949663708737,0.0
499,58.04007369761828,0.0
