Time,X1,Label
0,0.28987171758441566,0.0
1,-0.18512598142371206,0.0
2,0.09713274257111298,0.0
3,-0.1709718780125106,0.0
4,-0.3026607487665449,0.0
5,0.32806233644340593,0.0
6,0.38867455724986294,0.0
7,-0.2802458741689088,0.0
8,-0.568491066188146,0.0
9,0.07892001960388066,0.0
10,0.2828074902476892,0.0
11,0.11995937979230345,0.0
12,0.5203809282979546,0.0
13,-0.08887469789205381,0.0
14,0.1321955572180784,0.0
15,0.03314807034617907,0.0
16,-0.5003538357270476,0.0
17,-0.22579920012427973,0.0
18,-0.3322161216299484,0.0
19,0.14833144444716065,0.0
20,-0.2991036660630044,0.0
21,-0.14443142494064062,0.0
22,-0.27765104769118787,0.0
23,-0.29055555291767043,0.0
24,-0.41940715527904987,0.0
25,0.4227981927340372,0.0
26,-0.3572044037462245,0.0
27,0.27976268663205445,0.0
28,0.14372212785671923,0.0
29,0.2780475849213668,0.0
30,-0.3760167759730782,0.0
31,-0.33212656209824637,0.0
32,-0.06206372320491868,0.0
33,0.6305778596129361,0.0
34,-0.07143691867097417,0.0
35,0.07517727124178454,0.0
36,0.035843263508556045,0.0
37,-0.12272590466916959,0.0
38,0.4080358140981541,0.0
39,-0.6747412609657539,0.0
40,0.05209900342259665,0.0
41,0.05637956452229544,0.0
42,0.01976916812122189,0.0
43,-0.38896462878366495,0.0
44,0.37876523764098574,0.0
45,0.27639255107823846,0.0
46,-0.41172329968531945,0.0
47,-0.021901110521441138,0.0
48,0.19088885222962468,0.0
49,0.019476276940909542,0.0
50,4.391338912241749,1.0
51,4.058974521211804,0.0
52,4.324011425640529,0.0
53,3.814811872869169,0.0
54,3.9240401256698556,0.0
55,3.721341147195166,0.0
56,3.3446031024038128,0.0
57,4.2620762626444275,0.0
58,3.9791550650438254,0.0
59,4.143518830485352,0.0
60,4.259056796207132,0.0
61,4.160632957641482,0.0
62,3.7472800340342203,0.0
63,3.1847499427810417,0.0
64,3.746196025779585,0.0
65,3.5166483698654036,0.0
66,4.005191922029244,0.0
67,3.889944226062894,0.0
68,3.6205838457003083,0.0
69,3.379345094767888,0.0
70,3.8479619183184037,0.0
71,3.943363646581834,0.0
72,4.188347202024853,0.0
73,4.116357640676087,0.0
74,4.157999024127511,0.0
75,4.118838804816614,0.0
76,4.370890434913505,0.0
77,3.92418593839741,0.0
78,3.6688459913964064,0.0
79,4.0269073707834355,0.0
80,4.119830567749389,0.0
81,3.7519055244771287,0.0
82,4.427843966557122,0.0
83,4.10955368630589,0.0
84,4.168829435158388,0.0
85,3.6956120289023042,0.0
86,3.9027975162292736,0.0
87,4.014052346349158,0.0
88,4.055244406099005,0.0
89,3.5868098435135614,0.0
90,3.942955938377045,0.0
91,4.05762046109662,0.0
92,4.059331208254773,0.0
93,3.908136766463628,0.0
94,3.3418064261554097,0.0
95,3.886066310421022,0.0
96,3.947035579096864,0.0
97,4.3500601256061024,0.0
98,4.090750127668883,0.0
99,3.8258797452332454,0.0
100,-15.882235212205156,1.0
101,-15.875442061108,0.0
102,-15.80959804698124,0.0
103,-16.153624752237118,0.0
104,-15.803963826433549,0.0
105,-15.306064590930053,0.0
106,-16.061914788189384,0.0
107,-16.32682049825176,0.0
108,-15.12880792321782,0.0
109,-15.45608883949118,0.0
110,-15.38246400735311,0.0
111,-15.602936579623506,0.0
112,-15.437719056664953,0.0
113,-15.950579359257958,0.0
114,-15.495019397255366,0.0
115,-15.453779763628937,0.0
116,-15.545936460134904,0.0
117,-15.566447759552567,0.0
118,-15.071278943754507,0.0
119,-15.202281933672936,0.0
120,-14.898132394366865,0.0
121,-15.535494866931685,0.0
122,-15.11751863111493,0.0
123,-14.982943481156276,0.0
124,-15.170081198233873,0.0
125,-15.007402532650488,0.0
126,-14.650984704264612,0.0
127,-14.472680048775182,0.0
128,-14.984610844898178,0.0
129,-14.708671800796328,0.0
130,-14.85589734594069,0.0
131,-14.700235014975764,0.0
132,-14.804796145052137,0.0
133,-14.679802576919027,0.0
134,-14.592799227348369,0.0
135,-14.406993094411863,0.0
136,-14.641200591872057,0.0
137,-14.923230818584116,0.0
138,-14.730683108679969,0.0
139,-13.92742914422546,0.0
140,-14.291901606346137,0.0
141,-14.728577294141093,0.0
142,-14.838096141191379,0.0
143,-13.914617098201045,0.0
144,-14.027719573108655,0.0
145,-13.975531301556337,0.0
146,-14.444996543522116,0.0
147,-13.740065405152947,0.0
148,-13.974544800075801,0.0
149,-13.896934416345267,0.0
150,-14.056278354787292,0.0
151,-14.34566661717026,0.0
152,-13.438029011190707,0.0
153,-13.62338334287347,0.0
154,-13.441544424487724,0.0
155,-13.50460719834527,0.0
156,-13.954380404437781,0.0
157,-13.752563969902639,0.0
158,-13.598357326845008,0.0
159,-13.544761721091245,0.0
160,-14.126266005150821,0.0
161,-13.071174220207638,0.0
162,-13.719561190496098,0.0
163,-13.77041299028902,0.0
164,-13.503805265504216,0.0
165,-13.719842366342089,0.0
166,-12.805017395942915,0.0
167,-13.760220387358373,0.0
168,-13.407432733747907,0.0
169,-13.407512933904176,0.0
170,-13.243801775652415,0.0
171,-13.034960921295525,0.0
172,-13.515620199060653,0.0
173,-12.973693385299288,0.0
174,-13.126346363811884,0.0
175,-9.017549106249497,1.0
176,-9.54378179430956,0.0
177,-9.173357904777575,0.0
178,-8.630381145099228,0.0
179,-8.767505359811526,0.0
180,-8.859846821791965,0.0
181,-8.881663741249849,0.0
182,-8.837480028538046,0.0
183,-8.378464290238664,0.0
184,-9.300595845558146,0.0
185,-8.487545415449361,0.0
186,-8.842520992952092,0.0
187,-8.788042264628363,0.0
188,-8.572979166508134,0.0
189,-8.867870234176834,0.0
190,-8.443219201351905,0.0
191,-7.950379481743131,0.0
192,-8.413548963004093,0.0
193,-8.216591198766714,0.0
194,-8.255403797199754,0.0
195,-8.022607315511376,0.0
196,-8.328400846993887,0.0
197,-7.810954392822886,0.0
198,-8.275310540803886,0.0
199,-8.575284634825508,0.0
200,-8.732421027381985,0.0
201,-7.988341847225559,0.0
202,-8.243868788237638,0.0
203,-7.9447302047558725,0.0
204,-7.875543210239023,0.0
205,-8.069758362937634,0.0
206,-7.780272399963991,0.0
207,-7.840282042862675,0.0
208,-7.805995838562325,0.0
209,-7.671382118244621,0.0
210,-7.53090097862912,0.0
211,-7.575256074568259,0.0
212,-7.474619365472986,0.0
213,-7.652437976449644,0.0
214,-7.509070127190046,0.0
215,-7.088927370129909,0.0
216,-7.229411882404765,0.0
217,-7.336547781758629,0.0
218,-7.170971587323649,0.0
219,-6.6859771690302825,0.0
220,-7.194835171433894,0.0
221,-7.337334059828237,0.0
222,-7.6453480086983525,0.0
223,-7.204275528528184,0.0
224,-7.09225706744958,0.0
225,-7.085692399370172,0.0
226,-7.108490654235506,0.0
227,-7.292161337279165,0.0
228,-7.289586824487186,0.0
229,-7.273299933626916,0.0
230,-6.838617471170073,0.0
231,-6.638646189162186,0.0
232,-6.556707839927595,0.0
233,-6.3906300553964535,0.0
234,-7.055639607623226,0.0
235,-6.1785577866823935,0.0
236,-6.248542032349045,0.0
237,-6.720600252054904,0.0
238,-6.690979983730127,0.0
239,-6.330384121772756,0.0
240,-6.325471422291173,0.0
241,-6.518632360818229,0.0
242,-6.855814486214296,0.0
243,-6.106923924013715,0.0
244,-6.420493306320733,0.0
245,-6.447887804437659,0.0
246,-5.655148378802762,0.0
247,-5.319614900454118,0.0
248,-6.079456080826878,0.0
249,-5.882051487897339,0.0
250,-6.628977666820585,1.0
251,-5.9871548814911595,0.0
252,-6.304514347029379,0.0
253,-5.704378185775454,0.0
254,-4.978346502926325,0.0
255,-5.722609180531855,0.0
256,-5.21389094834473,0.0
257,-4.404375148482023,0.0
258,-4.833752832229253,0.0
259,-5.4542100668908216,0.0
260,-4.080588473020644,0.0
261,-4.289216818263924,0.0
262,-4.366941753834091,0.0
263,-4.351691526138975,0.0
264,-3.4756984223393346,0.0
265,-4.225511980572307,0.0
266,-4.1187360578320185,0.0
267,-3.7350922560332833,0.0
268,-4.208247099539957,0.0
269,-3.558291571910143,0.0
270,-3.9227224792221698,0.0
271,-3.9358809924937397,0.0
272,-3.3741678402146036,0.0
273,-3.0518568197338993,0.0
274,-2.9807968597826147,0.0
275,-2.938519330652536,0.0
276,-3.064282496752053,0.0
277,-2.3863207086790013,0.0
278,-2.4374930335037384,0.0
279,-2.479579822300014,0.0
280,-2.1778706691459373,0.0
281,-2.1351352539957364,0.0
282,-2.1080221188053674,0.0
283,-2.1137954662949348,0.0
284,-1.8776468067994383,0.0
285,-1.8883351556712924,0.0
286,-1.9729384390616538,0.0
287,-1.625682742163697,0.0
288,-1.5722934525809897,0.0
289,-1.1255735305525132,0.0
290,-1.2711014106220233,0.0
291,-0.6075214249488337,0.0
292,-0.5450623077472674,0.0
293,-0.8923048700611798,0.0
294,-0.4948941731871379,0.0
295,-0.41229893321057,0.0
296,-0.49146242396164475,0.0
297,-0.1625351604309344,0.0
298,-0.1907189016794284,0.0
299,0.07128608633569122,0.0
300,0.05726841463475729,0.0
301,0.3345796628091122,0.0
302,0.42175891695956835,0.0
303,0.41382528436799504,0.0
304,0.2054057125231612,0.0
305,0.6183864873090048,0.0
306,0.5766738521787875,0.0
307,1.1131603246664827,0.0
308,0.9916864814820467,0.0
309,1.1107487908062286,0.0
310,1.0420100820146203,0.0
311,1.2912527490031724,0.0
312,1.4390465689430343,0.0
313,1.5978426200854763,0.0
314,1.6776902055381004,0.0
315,2.394554979288582,0.0
316,1.9464654847509202,0.0
317,1.3463485219771556,0.0
318,1.9256404132964207,0.0
319,2.7012878926204706,0.0
320,2.1087243376077875,0.0
321,2.3831650620015417,0.0
322,2.748230526688431,0.0
323,3.1552368006637046,0.0
324,2.997136813561884,0.0
325,7.263336120622764,1.0
326,7.375729257240897,0.0
327,7.60849125974114,0.0
328,7.623892925714255,0.0
329,7.772190127699071,0.0
330,7.634159406005619,0.0
331,7.836370336518662,0.0
332,8.196450069895882,0.0
333,8.463356123771042,0.0
334,7.868175169878887,0.0
335,8.08196924506105,0.0
336,8.1360229379674,0.0
337,8.71741251634327,0.0
338,8.820389665284559,0.0
339,9.084127840067378,0.0
340,8.710949372422292,0.0
341,9.570717829892143,0.0
342,9.171012359467927,0.0
343,9.069681600392585,0.0
344,9.458053126156084,0.0
345,9.431994295986186,0.0
346,9.375419353601938,0.0
347,10.230367961388403,0.0
348,9.343073818287774,0.0
349,9.934780671585546,0.0
350,9.960239125721756,0.0
351,10.434343356557388,0.0
352,10.06234034279754,0.0
353,10.373177066946482,0.0
354,11.086744044611795,0.0
355,10.802027056139242,0.0
356,10.235192313738445,0.0
357,11.251687442290926,0.0
358,10.910000893097916,0.0
359,10.906487824221813,0.0
360,11.375017109449349,0.0
361,11.754238270078673,0.0
362,11.469872550254976,0.0
363,11.971080536852604,0.0
364,11.914940201923152,0.0
365,12.106913886769402,0.0
366,12.406655972738825,0.0
367,11.863641879244273,0.0
368,11.9934673653486,0.0
369,12.328074091359944,0.0
370,12.675527099093422,0.0
371,12.744336412788595,0.0
372,12.746260426301504,0.0
373,12.599952885175263,0.0
374,13.192452876499882,0.0
375,13.214229560231601,0.0
376,13.357442399809585,0.0
377,14.154940123749341,0.0
378,13.113159857202383,0.0
379,13.754057860908034,0.0
380,13.867632684875336,0.0
381,13.487526418030143,0.0
382,14.485109880927869,0.0
383,14.197034377963753,0.0
384,13.809805877570234,0.0
385,13.707660492600368,0.0
386,14.375051452973533,0.0
387,14.493445453368569,0.0
388,15.050486671115738,0.0
389,15.012865669351644,0.0
390,14.652322860968766,0.0
391,14.825903214187072,0.0
392,15.775034819322748,0.0
393,15.593080295684302,0.0
394,15.526054620284519,0.0
395,15.198251788339299,0.0
396,15.740243828492591,0.0
397,15.609187555900924,0.0
398,15.950687762192167,0.0
399,15.61626807126499,0.0
400,15.455380728169079,0.0
401,16.538403807748367,0.0
402,16.522478900485336,0.0
403,17.06553787584907,0.0
404,16.358115509826522,0.0
405,16.012566801932508,0.0
406,16.753361537133284,0.0
407,16.940628733425864,0.0
408,17.27872056561315,0.0
409,17.45916579234448,0.0
410,17.202309836586714,0.0
411,17.19405783728361,0.0
412,17.410648568851098,0.0
413,18.01878080544685,0.0
414,17.205668495581076,0.0
415,17.54177199976144,0.0
416,17.82886919503191,0.0
417,18.078697203784476,0.0
418,18.557214155629673,0.0
419,18.129791622786573,0.0
420,18.675905981235275,0.0
421,18.668420200237875,0.0
422,18.32654224549062,0.0
423,18.80437452675026,0.0
424,19.235688573411778,0.0
425,19.457493681170668,1.0
426,19.682345290160754,0.0
427,20.51659880587686,0.0
428,20.89451911951177,0.0
429,21.12640389884089,0.0
430,21.575257991161195,0.0
431,22.370052094860952,0.0
432,23.000841835392904,0.0
433,23.925294679127546,0.0
434,24.196733673267417,0.0
435,24.756761694591958,0.0
436,25.64925748360462,0.0
437,25.542278105630174,0.0
438,25.992322146757566,0.0
439,26.612193968239225,0.0
440,26.856540191927166,0.0
441,27.668703310452216,0.0
442,27.971866712826156,0.0
443,28.414612314071775,0.0
444,29.099056943273027,0.0
445,30.061058470048152,0.0
446,30.592433533563323,0.0
447,30.97705093345253,0.0
448,31.468908547761245,0.0
449,31.849368793411443,0.0
450,32.61015957849188,0.0
451,33.03126706931844,0.0
452,33.75854882874616,0.0
453,34.205854741591644,0.0
454,34.411669574119685,0.0
455,35.18732874886384,0.0
456,35.40031351656037,0.0
457,36.26897665951959,0.0
458,36.48637647773934,0.0
459,37.23277747774864,0.0
460,37.89017553150319,0.0
461,38.48765524740348,0.0
462,38.90846047053141,0.0
463,39.69929498118282,0.0
464,39.43432060246039,0.0
465,39.74509094679979,0.0
466,40.7362096312999,0.0
467,41.216549613524634,0.0
468,41.96391298502814,0.0
469,42.030482504045345,0.0
470,43.43216869578906,0.0
471,43.40068398770604,0.0
472,44.41968824045804,0.0
473,44.29900697713637,0.0
474,45.13052251054846,0.0
475,45.65217850318413,0.0
476,46.00457439312139,0.0
477,46.970335838478476,0.0
478,46.982306700232925,0.0
479,47.65907070454874,0.0
480,48.05372783101672,0.0
481,48.9979983993822,0.0
482,49.101953451027086,0.0
483,49.83711302681522,0.0
484,50.30621204610233,0.0
485,50.087862030702865,0.0
486,51.30564548946495,0.0
487,51.38044097626489,0.0
488,52.69286985807169,0.0
489,52.67629826633245,0.0
490,54.0165901049852,0.0
491,54.03702936148592,0.0
492,54.798487218853666,0.0
493,55.24009797927478,0.0
494,55.42479680183389,0.0
495,55.932589551873605,0.0
496,56.837909880676506,0.0
497,57.29254276403819,0.0
498,57.5597973889427,0.0
499,58.069489398533676,0.0
