Time,X1,Label6,Label8,Label12,Label13,Label14
0,62.0,0.0,0.0,0.0,0.0,0.0
1,86.0,0.0,0.0,0.0,0.0,0.0
2,88.0,0.0,0.0,0.0,0.0,0.0
3,91.0,0.0,0.0,0.0,0.0,0.0
4,88.0,0.0,0.0,0.0,0.0,0.0
5,89.0,0.0,0.0,0.0,0.0,0.0
6,106.0,0.0,0.0,0.0,0.0,0.0
7,105.0,0.0,0.0,0.0,0.0,0.0
8,152.0,0.0,0.0,0.0,0.0,0.0
9,143.0,0.0,0.0,0.0,0.0,0.0
10,151.0,0.0,0.0,0.0,0.0,0.0
11,125.0,0.0,0.0,0.0,0.0,0.0
12,106.0,0.0,0.0,0.0,0.0,0.0
13,107.0,0.0,0.0,0.0,0.0,0.0
14,99.0,0.0,0.0,0.0,0.0,0.0
15,118.0,0.0,0.0,0.0,0.0,0.0
16,141.0,0.0,0.0,0.0,0.0,0.0
17,95.0,0.0,0.0,0.0,0.0,0.0
18,71.0,0.0,0.0,0.0,0.0,0.0
19,81.0,0.0,0.0,0.0,0.0,0.0
20,90.0,0.0,0.0,0.0,0.0,0.0
21,89.0,0.0,0.0,0.0,0.0,0.0
22,84.0,0.0,0.0,0.0,0.0,0.0
23,76.0,0.0,0.0,0.0,0.0,0.0
24,62.0,0.0,0.0,0.0,0.0,0.0
25,96.0,0.0,0.0,0.0,0.0,0.0
26,99.0,0.0,0.0,0.0,0.0,0.0
27,127.0,0.0,0.0,0.0,0.0,0.0
28,131.0,0.0,0.0,0.0,0.0,0.0
29,85.0,0.0,0.0,0.0,0.0,0.0
30,72.0,0.0,0.0,0.0,0.0,0.0
31,71.0,0.0,0.0,0.0,0.0,0.0
32,72.0,0.0,0.0,0.0,0.0,0.0
33,83.0,0.0,0.0,0.0,0.0,0.0
34,94.0,0.0,0.0,0.0,0.0,0.0
35,103.0,0.0,0.0,0.0,0.0,0.0
36,119.0,0.0,0.0,0.0,0.0,0.0
37,136.0,0.0,0.0,0.0,0.0,0.0
38,139.0,0.0,0.0,0.0,0.0,0.0
39,133.0,0.0,0.0,0.0,0.0,0.0
40,133.0,0.0,0.0,0.0,0.0,0.0
41,162.0,0.0,0.0,0.0,0.0,0.0
42,173.0,0.0,0.0,0.0,0.0,0.0
43,155.0,0.0,0.0,0.0,0.0,0.0
44,143.0,0.0,0.0,0.0,0.0,0.0
45,151.0,0.0,0.0,0.0,0.0,0.0
46,155.0,0.0,0.0,0.0,0.0,0.0
47,148.0,0.0,0.0,0.0,0.0,0.0
48,163.0,0.0,0.0,0.0,0.0,0.0
49,143.0,0.0,0.0,0.0,0.0,0.0
50,131.0,0.0,0.0,0.0,0.0,0.0
51,120.0,0.0,0.0,0.0,0.0,0.0
52,99.0,0.0,0.0,0.0,0.0,0.0
53,89.0,0.0,0.0,0.0,0.0,0.0
54,92.0,0.0,0.0,0.0,0.0,0.0
55,92.0,0.0,0.0,0.0,0.0,0.0
56,75.0,0.0,0.0,0.0,0.0,0.0
57,102.0,0.0,0.0,0.0,0.0,0.0
58,114.0,0.0,0.0,0.0,0.0,0.0
59,97.0,0.0,0.0,0.0,0.0,0.0
60,78.0,0.0,0.0,0.0,0.0,0.0
61,75.0,0.0,0.0,0.0,0.0,0.0
62,78.0,0.0,0.0,0.0,0.0,0.0
63,78.0,0.0,0.0,0.0,0.0,0.0
64,78.0,0.0,0.0,0.0,0.0,0.0
65,67.0,0.0,0.0,0.0,0.0,0.0
66,77.0,0.0,0.0,0.0,0.0,0.0
67,91.0,0.0,0.0,0.0,0.0,0.0
68,79.0,0.0,0.0,0.0,0.0,0.0
69,64.0,0.0,0.0,0.0,0.0,0.0
70,70.0,0.0,0.0,0.0,0.0,0.0
71,81.0,0.0,0.0,0.0,0.0,0.0
72,74.0,0.0,0.0,0.0,0.0,0.0
73,76.0,0.0,0.0,0.0,0.0,0.0
74,71.0,0.0,0.0,0.0,0.0,0.0
75,68.0,0.0,0.0,0.0,0.0,0.0
76,70.0,0.0,0.0,0.0,0.0,0.0
77,69.0,0.0,0.0,0.0,0.0,0.0
78,82.0,0.0,0.0,0.0,0.0,0.0
79,107.0,0.0,0.0,0.0,0.0,0.0
80,133.0,0.0,0.0,0.0,0.0,0.0
81,152.0,0.0,0.0,0.0,0.0,0.0
82,123.0,0.0,0.0,0.0,0.0,0.0
83,74.0,0.0,0.0,0.0,0.0,0.0
84,73.0,0.0,0.0,0.0,0.0,0.0
85,103.0,0.0,0.0,0.0,0.0,0.0
86,132.0,0.0,0.0,0.0,0.0,0.0
87,156.0,0.0,0.0,0.0,0.0,0.0
88,108.0,0.0,0.0,0.0,0.0,0.0
89,110.0,0.0,0.0,0.0,0.0,0.0
90,122.0,0.0,0.0,0.0,0.0,0.0
91,107.0,0.0,0.0,0.0,0.0,0.0
92,107.0,0.0,0.0,0.0,0.0,0.0
93,131.0,0.0,0.0,0.0,0.0,0.0
94,122.0,0.0,0.0,0.0,0.0,0.0
95,104.0,0.0,0.0,0.0,0.0,0.0
96,94.0,0.0,0.0,0.0,0.0,0.0
97,77.0,0.0,0.0,0.0,0.0,0.0
98,93.0,0.0,0.0,0.0,0.0,0.0
99,104.0,0.0,0.0,0.0,0.0,0.0
100,88.0,0.0,0.0,0.0,0.0,0.0
101,99.0,0.0,0.0,0.0,0.0,0.0
102,125.0,0.0,0.0,0.0,0.0,0.0
103,122.0,0.0,0.0,0.0,0.0,0.0
104,79.0,0.0,0.0,0.0,0.0,0.0
105,102.0,0.0,0.0,0.0,0.0,0.0
106,159.0,0.0,0.0,0.0,1.0,0.0
107,244.0,0.0,0.0,0.0,0.0,0.0
108,255.0,0.0,0.0,0.0,0.0,0.0
109,238.0,0.0,0.0,0.0,0.0,0.0
110,238.0,0.0,0.0,0.0,0.0,0.0
111,215.0,0.0,0.0,0.0,0.0,0.0
112,168.0,0.0,0.0,0.0,0.0,0.0
113,162.0,0.0,0.0,0.0,0.0,0.0
114,160.0,0.0,0.0,0.0,0.0,0.0
115,158.0,0.0,0.0,0.0,0.0,0.0
116,144.0,0.0,0.0,0.0,0.0,0.0
117,117.0,0.0,0.0,0.0,0.0,0.0
118,89.0,0.0,0.0,0.0,0.0,0.0
119,72.0,0.0,0.0,0.0,0.0,0.0
120,70.0,0.0,0.0,0.0,1.0,0.0
121,100.0,0.0,0.0,0.0,0.0,0.0
122,118.0,0.0,0.0,0.0,0.0,0.0
123,102.0,0.0,0.0,0.0,0.0,0.0
124,79.0,0.0,0.0,0.0,0.0,0.0
125,73.0,0.0,0.0,0.0,0.0,0.0
126,79.0,0.0,0.0,0.0,0.0,0.0
127,82.0,0.0,0.0,0.0,0.0,0.0
128,81.0,0.0,0.0,0.0,0.0,0.0
129,80.0,0.0,0.0,0.0,0.0,0.0
130,81.0,0.0,0.0,0.0,0.0,0.0
131,85.0,0.0,0.0,0.0,0.0,0.0
132,89.0,0.0,0.0,0.0,0.0,0.0
133,90.0,0.0,0.0,0.0,0.0,0.0
134,89.0,0.0,0.0,0.0,0.0,0.0
135,89.0,0.0,0.0,0.0,0.0,0.0
136,97.0,0.0,0.0,0.0,0.0,0.0
137,105.0,0.0,0.0,0.0,0.0,0.0
138,113.0,0.0,0.0,0.0,0.0,0.0
139,116.0,0.0,0.0,0.0,0.0,0.0
140,114.0,0.0,0.0,0.0,0.0,0.0
141,112.0,0.0,0.0,0.0,0.0,0.0
142,114.0,0.0,0.0,0.0,0.0,0.0
143,116.0,0.0,0.0,0.0,0.0,0.0
144,109.0,0.0,0.0,0.0,0.0,0.0
145,109.0,0.0,0.0,0.0,0.0,0.0
146,108.0,0.0,0.0,0.0,0.0,0.0
147,112.0,0.0,0.0,0.0,0.0,0.0
148,125.0,0.0,0.0,0.0,0.0,0.0
149,140.0,0.0,0.0,0.0,0.0,0.0
150,146.0,0.0,0.0,0.0,0.0,0.0
151,144.0,0.0,0.0,0.0,0.0,0.0
152,130.0,0.0,0.0,0.0,0.0,0.0
153,106.0,0.0,0.0,0.0,1.0,0.0
154,85.0,0.0,0.0,0.0,0.0,0.0
155,81.0,0.0,0.0,0.0,0.0,0.0
156,84.0,0.0,0.0,0.0,0.0,0.0
157,83.0,0.0,0.0,0.0,0.0,0.0
158,89.0,0.0,0.0,0.0,0.0,0.0
159,97.0,0.0,0.0,0.0,0.0,0.0
160,95.0,0.0,0.0,0.0,0.0,0.0
161,90.0,0.0,0.0,0.0,0.0,0.0
162,87.0,0.0,0.0,0.0,0.0,0.0
163,75.0,0.0,0.0,0.0,0.0,0.0
164,56.0,0.0,0.0,0.0,0.0,0.0
165,55.0,0.0,0.0,0.0,0.0,0.0
166,63.0,0.0,0.0,0.0,0.0,0.0
167,61.0,0.0,0.0,0.0,0.0,0.0
168,61.0,0.0,0.0,0.0,0.0,0.0
169,56.0,0.0,0.0,0.0,0.0,0.0
170,58.0,0.0,0.0,0.0,0.0,0.0
171,59.0,0.0,0.0,0.0,0.0,0.0
172,58.0,0.0,0.0,0.0,0.0,0.0
173,79.0,0.0,0.0,0.0,0.0,0.0
174,111.0,0.0,0.0,0.0,0.0,0.0
175,126.0,0.0,0.0,0.0,0.0,0.0
176,124.0,0.0,0.0,0.0,0.0,0.0
177,107.0,0.0,0.0,0.0,0.0,0.0
178,83.0,0.0,0.0,0.0,0.0,0.0
179,64.0,0.0,0.0,0.0,0.0,0.0
180,57.0,0.0,0.0,0.0,0.0,0.0
181,56.0,0.0,0.0,0.0,0.0,0.0
182,57.0,0.0,0.0,0.0,0.0,0.0
183,57.0,0.0,0.0,0.0,0.0,0.0
184,61.0,0.0,0.0,0.0,0.0,0.0
185,67.0,0.0,0.0,0.0,0.0,0.0
186,69.0,0.0,0.0,0.0,0.0,0.0
187,65.0,0.0,0.0,0.0,0.0,0.0
188,64.0,0.0,0.0,0.0,0.0,0.0
189,67.0,0.0,0.0,0.0,0.0,0.0
190,67.0,0.0,0.0,0.0,0.0,0.0
191,63.0,0.0,0.0,0.0,0.0,0.0
192,63.0,0.0,0.0,0.0,0.0,0.0
193,64.0,0.0,0.0,0.0,0.0,0.0
194,65.0,0.0,0.0,0.0,0.0,0.0
195,64.0,0.0,0.0,0.0,0.0,0.0
196,59.0,0.0,0.0,0.0,0.0,0.0
197,55.0,0.0,0.0,0.0,0.0,0.0
198,57.0,0.0,0.0,0.0,0.0,0.0
199,61.0,0.0,0.0,0.0,0.0,0.0
200,60.0,0.0,0.0,0.0,0.0,0.0
201,63.0,0.0,0.0,0.0,0.0,0.0
202,64.0,0.0,0.0,0.0,0.0,0.0
203,59.0,0.0,0.0,0.0,0.0,0.0
204,53.0,0.0,0.0,0.0,0.0,0.0
205,53.0,0.0,0.0,0.0,0.0,0.0
206,60.0,0.0,0.0,0.0,0.0,0.0
207,68.0,0.0,0.0,0.0,0.0,0.0
208,60.0,0.0,0.0,0.0,0.0,0.0
209,62.0,0.0,0.0,0.0,0.0,0.0
210,64.0,0.0,0.0,0.0,0.0,0.0
211,66.0,0.0,0.0,0.0,0.0,0.0
212,67.0,0.0,0.0,0.0,0.0,0.0
213,66.0,0.0,0.0,0.0,0.0,0.0
214,65.0,0.0,0.0,0.0,0.0,0.0
215,64.0,0.0,0.0,0.0,0.0,0.0
216,50.0,0.0,0.0,0.0,0.0,0.0
217,59.0,0.0,0.0,0.0,0.0,0.0
218,71.0,0.0,0.0,0.0,0.0,0.0
219,71.0,0.0,0.0,0.0,0.0,0.0
220,77.0,0.0,0.0,0.0,0.0,0.0
221,104.0,0.0,0.0,0.0,0.0,0.0
222,102.0,0.0,0.0,0.0,0.0,0.0
223,64.0,0.0,0.0,0.0,0.0,0.0
224,46.0,0.0,0.0,0.0,0.0,0.0
225,72.0,0.0,0.0,0.0,0.0,0.0
226,83.0,0.0,0.0,0.0,0.0,0.0
227,66.0,0.0,0.0,0.0,0.0,0.0
228,54.0,0.0,0.0,0.0,0.0,0.0
229,61.0,0.0,0.0,0.0,0.0,0.0
230,66.0,0.0,0.0,0.0,0.0,0.0
231,60.0,0.0,0.0,0.0,0.0,0.0
232,50.0,0.0,0.0,0.0,0.0,0.0
233,54.0,0.0,0.0,0.0,0.0,0.0
234,59.0,0.0,0.0,0.0,0.0,0.0
235,62.0,0.0,0.0,0.0,0.0,0.0
236,63.0,0.0,0.0,0.0,0.0,0.0
237,63.0,0.0,0.0,0.0,0.0,0.0
238,64.0,0.0,0.0,0.0,0.0,0.0
239,65.0,0.0,0.0,0.0,0.0,0.0
240,72.0,0.0,0.0,0.0,0.0,0.0
241,54.0,0.0,0.0,0.0,0.0,0.0
242,60.0,0.0,0.0,0.0,0.0,0.0
243,63.0,0.0,0.0,0.0,0.0,0.0
244,63.0,0.0,0.0,0.0,0.0,0.0
245,60.0,0.0,0.0,0.0,0.0,0.0
246,53.0,0.0,0.0,0.0,0.0,0.0
247,70.0,0.0,0.0,0.0,0.0,0.0
248,66.0,0.0,0.0,0.0,0.0,0.0
249,65.0,0.0,0.0,0.0,0.0,0.0
250,62.0,1.0,0.0,0.0,0.0,0.0
251,92.0,0.0,1.0,0.0,1.0,1.0
252,114.0,0.0,0.0,0.0,0.0,0.0
253,112.0,0.0,0.0,0.0,0.0,0.0
254,114.0,0.0,0.0,0.0,0.0,0.0
255,103.0,0.0,0.0,0.0,0.0,0.0
256,132.0,0.0,0.0,0.0,0.0,0.0
257,230.0,0.0,0.0,0.0,0.0,0.0
258,122.0,0.0,0.0,0.0,0.0,0.0
259,104.0,0.0,0.0,0.0,0.0,0.0
260,106.0,0.0,0.0,0.0,0.0,0.0
261,102.0,0.0,0.0,0.0,0.0,0.0
262,91.0,0.0,0.0,0.0,0.0,0.0
263,168.0,0.0,0.0,0.0,0.0,0.0
264,226.0,0.0,0.0,0.0,0.0,0.0
265,70.0,0.0,0.0,0.0,0.0,0.0
266,57.0,0.0,0.0,0.0,0.0,0.0
267,53.0,0.0,0.0,0.0,1.0,0.0
268,45.0,0.0,0.0,0.0,0.0,0.0
269,46.0,0.0,0.0,0.0,0.0,0.0
270,44.0,0.0,0.0,0.0,0.0,0.0
271,44.0,0.0,0.0,0.0,0.0,0.0
272,40.0,0.0,0.0,0.0,0.0,0.0
273,40.0,0.0,0.0,0.0,0.0,0.0
274,41.0,0.0,0.0,0.0,0.0,0.0
275,42.0,0.0,0.0,0.0,0.0,0.0
276,44.0,0.0,0.0,0.0,0.0,0.0
277,45.0,0.0,0.0,0.0,0.0,0.0
278,46.0,0.0,0.0,0.0,0.0,0.0
279,46.0,0.0,0.0,0.0,0.0,0.0
280,107.0,0.0,0.0,0.0,1.0,0.0
281,115.0,0.0,0.0,0.0,0.0,0.0
282,111.0,0.0,0.0,0.0,0.0,0.0
283,102.0,0.0,0.0,0.0,0.0,0.0
284,100.0,0.0,0.0,0.0,0.0,0.0
285,98.0,0.0,0.0,0.0,0.0,0.0
286,103.0,0.0,0.0,0.0,0.0,0.0
287,118.0,0.0,0.0,0.0,0.0,0.0
288,109.0,0.0,0.0,0.0,0.0,0.0
289,114.0,0.0,0.0,0.0,0.0,0.0
290,105.0,0.0,0.0,0.0,0.0,0.0
291,135.0,0.0,0.0,0.0,1.0,0.0
292,254.0,0.0,0.0,0.0,0.0,0.0
293,254.0,0.0,0.0,0.0,0.0,0.0
294,255.0,0.0,0.0,0.0,0.0,0.0
295,254.0,0.0,0.0,0.0,0.0,0.0
296,255.0,0.0,0.0,0.0,0.0,0.0
297,250.0,0.0,0.0,0.0,0.0,0.0
298,253.0,0.0,0.0,0.0,0.0,0.0
299,207.0,0.0,0.0,0.0,0.0,0.0
300,242.0,0.0,0.0,0.0,0.0,0.0
301,241.0,0.0,0.0,0.0,0.0,0.0
302,246.0,0.0,0.0,0.0,0.0,0.0
303,250.0,0.0,0.0,0.0,0.0,0.0
304,254.0,0.0,0.0,0.0,0.0,0.0
305,244.0,0.0,0.0,0.0,0.0,0.0
306,232.0,0.0,0.0,0.0,0.0,0.0
307,81.0,0.0,0.0,0.0,1.0,0.0
308,76.0,0.0,0.0,0.0,0.0,0.0
309,80.0,0.0,0.0,0.0,0.0,0.0
310,84.0,0.0,0.0,0.0,0.0,0.0
311,84.0,0.0,0.0,0.0,0.0,0.0
312,84.0,0.0,0.0,0.0,0.0,0.0
313,104.0,0.0,0.0,0.0,0.0,0.0
314,112.0,0.0,0.0,0.0,0.0,0.0
315,101.0,0.0,0.0,0.0,0.0,0.0
316,171.0,0.0,0.0,0.0,1.0,0.0
317,248.0,0.0,0.0,0.0,0.0,0.0
318,245.0,0.0,0.0,0.0,0.0,0.0
319,255.0,0.0,0.0,0.0,0.0,0.0
320,251.0,0.0,0.0,0.0,0.0,0.0
321,242.0,0.0,0.0,0.0,0.0,0.0
322,245.0,0.0,0.0,0.0,0.0,0.0
323,236.0,0.0,0.0,0.0,0.0,0.0
324,162.0,0.0,0.0,0.0,1.0,0.0
325,61.0,0.0,0.0,0.0,1.0,0.0
326,78.0,0.0,0.0,0.0,0.0,0.0
327,86.0,0.0,0.0,0.0,0.0,0.0
328,72.0,0.0,0.0,0.0,0.0,0.0
329,73.0,0.0,0.0,0.0,0.0,0.0
330,73.0,0.0,0.0,0.0,0.0,0.0
331,72.0,0.0,0.0,0.0,0.0,0.0
332,70.0,0.0,0.0,0.0,0.0,0.0
333,67.0,0.0,0.0,0.0,0.0,0.0
334,64.0,0.0,0.0,0.0,0.0,0.0
335,63.0,0.0,0.0,0.0,0.0,0.0
336,55.0,0.0,0.0,0.0,0.0,0.0
337,64.0,0.0,0.0,0.0,0.0,0.0
338,104.0,0.0,0.0,0.0,0.0,0.0
339,86.0,0.0,0.0,0.0,0.0,0.0
340,66.0,0.0,0.0,0.0,0.0,0.0
341,65.0,0.0,0.0,0.0,0.0,0.0
342,70.0,0.0,0.0,0.0,1.0,0.0
343,108.0,0.0,0.0,0.0,0.0,0.0
344,109.0,0.0,0.0,0.0,0.0,0.0
345,99.0,0.0,0.0,0.0,0.0,0.0
346,109.0,0.0,0.0,0.0,0.0,0.0
347,112.0,0.0,0.0,0.0,0.0,0.0
348,98.0,0.0,0.0,0.0,0.0,0.0
349,104.0,0.0,0.0,0.0,0.0,0.0
350,104.0,0.0,0.0,0.0,0.0,0.0
351,106.0,0.0,0.0,0.0,0.0,0.0
352,104.0,0.0,0.0,0.0,0.0,0.0
353,61.0,0.0,0.0,0.0,1.0,0.0
354,51.0,0.0,0.0,0.0,0.0,0.0
355,54.0,0.0,0.0,0.0,0.0,0.0
356,37.0,0.0,0.0,0.0,0.0,0.0
357,40.0,0.0,0.0,0.0,0.0,0.0
358,51.0,0.0,0.0,0.0,0.0,0.0
359,38.0,0.0,0.0,0.0,0.0,0.0
360,44.0,0.0,0.0,0.0,0.0,0.0
361,45.0,0.0,0.0,0.0,0.0,0.0
362,46.0,0.0,0.0,0.0,0.0,0.0
363,47.0,0.0,0.0,0.0,0.0,0.0
364,71.0,0.0,0.0,0.0,1.0,0.0
365,94.0,0.0,0.0,0.0,0.0,0.0
366,98.0,0.0,0.0,0.0,0.0,0.0
367,109.0,0.0,0.0,0.0,1.0,0.0
368,107.0,0.0,0.0,0.0,0.0,0.0
369,105.0,0.0,0.0,0.0,0.0,0.0
370,103.0,0.0,0.0,0.0,0.0,0.0
371,89.0,0.0,0.0,0.0,0.0,0.0
372,79.0,0.0,0.0,0.0,0.0,0.0
373,85.0,0.0,0.0,0.0,0.0,0.0
374,130.0,0.0,0.0,0.0,1.0,0.0
375,99.0,0.0,0.0,0.0,0.0,0.0
376,170.0,0.0,0.0,0.0,1.0,0.0
377,249.0,0.0,0.0,0.0,0.0,0.0
378,251.0,0.0,0.0,0.0,0.0,0.0
379,255.0,0.0,0.0,0.0,0.0,0.0
380,255.0,0.0,0.0,0.0,0.0,0.0
381,246.0,0.0,0.0,0.0,0.0,0.0
382,218.0,0.0,0.0,0.0,0.0,0.0
383,219.0,0.0,0.0,0.0,0.0,0.0
384,230.0,0.0,0.0,0.0,0.0,0.0
385,252.0,0.0,0.0,0.0,0.0,0.0
386,252.0,0.0,0.0,0.0,0.0,0.0
387,253.0,0.0,0.0,0.0,0.0,0.0
388,245.0,0.0,0.0,0.0,0.0,0.0
389,255.0,0.0,0.0,0.0,0.0,0.0
390,113.0,0.0,0.0,0.0,0.0,0.0
391,70.0,0.0,0.0,0.0,0.0,0.0
392,69.0,0.0,0.0,0.0,1.0,0.0
393,106.0,0.0,0.0,0.0,0.0,0.0
394,255.0,0.0,0.0,0.0,0.0,0.0
395,255.0,0.0,0.0,0.0,1.0,0.0
396,243.0,0.0,0.0,0.0,0.0,0.0
397,252.0,0.0,0.0,0.0,0.0,0.0
398,247.0,0.0,0.0,0.0,0.0,0.0
399,158.0,0.0,0.0,0.0,0.0,0.0
400,157.0,0.0,0.0,0.0,0.0,0.0
401,162.0,0.0,0.0,0.0,0.0,0.0
402,188.0,0.0,0.0,0.0,0.0,0.0
403,88.0,0.0,0.0,0.0,0.0,0.0
404,65.0,1.0,0.0,0.0,1.0,0.0
405,70.0,0.0,0.0,0.0,0.0,0.0
406,79.0,0.0,0.0,0.0,0.0,0.0
407,62.0,0.0,0.0,0.0,0.0,0.0
408,66.0,0.0,0.0,0.0,0.0,0.0
409,65.0,0.0,0.0,0.0,0.0,0.0
410,62.0,0.0,0.0,0.0,0.0,0.0
411,60.0,0.0,0.0,0.0,0.0,0.0
412,58.0,0.0,0.0,0.0,0.0,0.0
413,57.0,0.0,0.0,0.0,0.0,0.0
414,56.0,0.0,0.0,0.0,0.0,0.0
415,56.0,0.0,0.0,0.0,0.0,0.0
416,58.0,0.0,0.0,0.0,0.0,0.0
417,59.0,0.0,0.0,0.0,0.0,0.0
418,60.0,0.0,0.0,0.0,0.0,0.0
419,61.0,0.0,0.0,0.0,0.0,0.0
420,61.0,0.0,0.0,0.0,0.0,0.0
421,63.0,0.0,0.0,0.0,0.0,0.0
422,67.0,0.0,0.0,0.0,0.0,0.0
423,70.0,0.0,0.0,0.0,0.0,0.0
424,65.0,0.0,0.0,0.0,0.0,0.0
425,61.0,0.0,0.0,0.0,0.0,0.0
426,59.0,0.0,0.0,0.0,0.0,0.0
427,66.0,0.0,0.0,0.0,1.0,0.0
428,76.0,0.0,0.0,0.0,0.0,0.0
429,80.0,0.0,0.0,0.0,0.0,0.0
430,75.0,0.0,0.0,0.0,0.0,0.0
431,68.0,0.0,0.0,0.0,0.0,0.0
432,61.0,0.0,0.0,0.0,0.0,0.0
433,55.0,0.0,0.0,0.0,0.0,0.0
434,52.0,0.0,0.0,0.0,0.0,0.0
435,54.0,0.0,0.0,0.0,0.0,0.0
436,55.0,0.0,0.0,0.0,0.0,0.0
437,56.0,0.0,0.0,0.0,0.0,0.0
438,64.0,0.0,0.0,0.0,0.0,0.0
439,74.0,0.0,0.0,0.0,0.0,0.0
440,65.0,0.0,0.0,0.0,0.0,0.0
441,67.0,0.0,0.0,0.0,0.0,0.0
442,64.0,0.0,0.0,0.0,0.0,0.0
443,57.0,0.0,0.0,0.0,0.0,0.0
444,55.0,0.0,0.0,0.0,0.0,0.0
445,62.0,0.0,0.0,0.0,0.0,0.0
446,70.0,0.0,0.0,0.0,0.0,0.0
447,73.0,0.0,0.0,0.0,0.0,0.0
448,63.0,0.0,0.0,0.0,0.0,0.0
449,73.0,0.0,0.0,0.0,0.0,0.0
450,79.0,0.0,0.0,0.0,0.0,0.0
451,77.0,0.0,0.0,0.0,0.0,0.0
452,75.0,0.0,0.0,0.0,0.0,0.0
453,74.0,0.0,0.0,0.0,0.0,0.0
454,69.0,0.0,0.0,0.0,0.0,0.0
455,62.0,0.0,0.0,0.0,0.0,0.0
456,58.0,0.0,0.0,0.0,0.0,0.0
457,54.0,0.0,0.0,0.0,0.0,0.0
458,49.0,0.0,0.0,0.0,0.0,0.0
459,49.0,0.0,0.0,0.0,0.0,0.0
460,58.0,0.0,0.0,0.0,0.0,0.0
461,67.0,0.0,0.0,0.0,0.0,0.0
462,66.0,0.0,0.0,0.0,0.0,0.0
463,60.0,0.0,0.0,0.0,0.0,0.0
464,55.0,0.0,0.0,0.0,0.0,0.0
465,73.0,0.0,0.0,0.0,1.0,0.0
466,91.0,0.0,0.0,0.0,0.0,0.0
467,95.0,0.0,0.0,0.0,0.0,0.0
468,92.0,0.0,0.0,0.0,0.0,0.0
469,92.0,0.0,0.0,0.0,0.0,0.0
470,96.0,0.0,0.0,0.0,0.0,0.0
471,100.0,0.0,0.0,0.0,0.0,0.0
472,76.0,0.0,0.0,0.0,0.0,0.0
473,83.0,0.0,0.0,0.0,0.0,0.0
474,90.0,0.0,0.0,0.0,0.0,0.0
475,77.0,0.0,0.0,0.0,0.0,0.0
476,52.0,0.0,0.0,0.0,0.0,0.0
477,46.0,0.0,0.0,0.0,0.0,0.0
478,49.0,0.0,0.0,0.0,0.0,0.0
479,43.0,0.0,0.0,0.0,0.0,0.0
480,59.0,0.0,0.0,0.0,0.0,0.0
