Time,X1,Label6,Label7,Label8,Label9,Label13
0,0.00568,0.0,0.0,0.0,0.0,0.0
1,0.00561,0.0,0.0,0.0,0.0,0.0
2,0.00555,0.0,0.0,0.0,0.0,0.0
3,0.00548,0.0,0.0,0.0,0.0,0.0
4,0.00542,0.0,0.0,0.0,0.0,0.0
5,0.00536,0.0,0.0,0.0,0.0,0.0
6,0.00529,0.0,0.0,0.0,0.0,0.0
7,0.00523,0.0,0.0,0.0,0.0,0.0
8,0.00517,0.0,0.0,0.0,0.0,0.0
9,0.00511,0.0,0.0,0.0,0.0,0.0
10,0.00504,0.0,0.0,0.0,0.0,0.0
11,0.00497,0.0,0.0,0.0,0.0,0.0
12,0.0049,0.0,0.0,0.0,0.0,0.0
13,0.00483,0.0,0.0,0.0,0.0,0.0
14,0.00475,0.0,0.0,0.0,0.0,0.0
15,0.00466,0.0,0.0,0.0,0.0,0.0
16,0.00457,0.0,0.0,0.0,0.0,0.0
17,0.00447,0.0,0.0,0.0,0.0,0.0
18,0.00438,0.0,0.0,0.0,0.0,0.0
19,0.00427,0.0,0.0,0.0,0.0,0.0
20,0.00417,0.0,0.0,0.0,0.0,0.0
21,0.00406,0.0,0.0,0.0,0.0,0.0
22,0.00395,0.0,0.0,0.0,0.0,0.0
23,0.00384,0.0,0.0,0.0,0.0,0.0
24,0.00373,0.0,0.0,0.0,0.0,0.0
25,0.00362,0.0,0.0,0.0,0.0,0.0
26,0.0035,0.0,0.0,0.0,0.0,0.0
27,0.00339,0.0,0.0,0.0,0.0,0.0
28,0.00327,0.0,0.0,0.0,0.0,0.0
29,0.00316,0.0,0.0,0.0,0.0,0.0
30,0.00305,0.0,0.0,0.0,0.0,0.0
31,0.00294,0.0,0.0,0.0,0.0,0.0
32,0.00283,0.0,0.0,0.0,0.0,0.0
33,0.00273,0.0,0.0,0.0,0.0,0.0
34,0.00263,0.0,0.0,0.0,0.0,0.0
35,0.00253,0.0,0.0,0.0,0.0,0.0
36,0.00244,0.0,0.0,0.0,0.0,0.0
37,0.00235,0.0,0.0,0.0,0.0,0.0
38,0.00227,0.0,0.0,0.0,0.0,0.0
39,0.00218,0.0,0.0,0.0,0.0,0.0
40,0.0021,0.0,0.0,0.0,0.0,0.0
41,0.00202,0.0,0.0,0.0,0.0,0.0
42,0.00195,0.0,0.0,0.0,0.0,0.0
43,0.00188,0.0,0.0,0.0,0.0,0.0
44,0.00181,0.0,0.0,0.0,0.0,0.0
45,0.00175,0.0,0.0,0.0,0.0,0.0
46,0.0118,0.0,0.0,0.0,0.0,0.0
47,0.0147,0.0,0.0,0.0,0.0,0.0
48,0.0174,0.0,0.0,0.0,0.0,0.0
49,0.0198,0.0,0.0,0.0,0.0,0.0
50,0.0236,0.0,0.0,0.0,0.0,0.0
51,0.0271,0.0,0.0,0.0,0.0,0.0
52,0.0318,0.0,0.0,0.0,0.0,0.0
53,0.0376,0.0,0.0,0.0,0.0,0.0
54,0.0445,0.0,0.0,0.0,0.0,0.0
55,0.0522,0.0,0.0,0.0,0.0,0.0
56,0.0608,0.0,0.0,0.0,0.0,0.0
57,0.0715,0.0,0.0,0.0,0.0,0.0
58,0.0853,0.0,0.0,0.0,0.0,0.0
59,0.0996,0.0,0.0,0.0,0.0,0.0
60,0.118,0.0,0.0,0.0,0.0,0.0
61,0.139,0.0,0.0,0.0,0.0,0.0
62,0.167,0.0,0.0,0.0,0.0,0.0
63,0.206,0.0,0.0,0.0,0.0,0.0
64,0.242,0.0,0.0,0.0,0.0,0.0
65,0.288,0.0,0.0,0.0,0.0,0.0
66,0.346,0.0,0.0,0.0,0.0,0.0
67,0.436,0.0,0.0,0.0,0.0,1.0
68,0.255,0.0,0.0,0.0,0.0,0.0
69,0.182,0.0,0.0,0.0,0.0,0.0
70,0.321,0.0,0.0,0.0,0.0,0.0
71,0.461,0.0,0.0,0.0,0.0,0.0
72,0.471,0.0,0.0,0.0,0.0,0.0
73,0.406,0.0,0.0,0.0,0.0,0.0
74,0.404,0.0,0.0,0.0,0.0,0.0
75,0.461,0.0,0.0,0.0,0.0,0.0
76,0.45,0.0,0.0,0.0,0.0,0.0
77,0.484,0.0,0.0,0.0,0.0,0.0
78,0.456,0.0,0.0,0.0,0.0,0.0
79,0.508,0.0,0.0,0.0,0.0,0.0
80,1.2,1.0,1.0,1.0,1.0,1.0
81,1.27,0.0,0.0,0.0,0.0,0.0
82,1.48,0.0,0.0,0.0,0.0,0.0
83,1.64,0.0,0.0,0.0,0.0,0.0
84,1.87,0.0,0.0,0.0,0.0,0.0
85,1.78,0.0,0.0,0.0,0.0,0.0
86,1.87,0.0,0.0,0.0,0.0,0.0
87,2.14,0.0,0.0,0.0,0.0,0.0
88,2.77,0.0,0.0,0.0,0.0,0.0
89,2.33,0.0,0.0,0.0,0.0,0.0
90,2.53,0.0,0.0,0.0,0.0,0.0
91,2.81,0.0,0.0,0.0,0.0,0.0
92,2.78,0.0,0.0,0.0,0.0,0.0
93,2.94,0.0,0.0,0.0,0.0,0.0
94,2.78,0.0,0.0,0.0,0.0,0.0
95,2.62,0.0,0.0,0.0,0.0,0.0
96,2.81,0.0,0.0,0.0,0.0,0.0
97,2.8,0.0,0.0,0.0,0.0,0.0
98,2.94,0.0,0.0,0.0,0.0,0.0
99,3.53,0.0,0.0,0.0,0.0,0.0
100,3.73,0.0,0.0,0.0,0.0,0.0
101,4.24,0.0,0.0,0.0,0.0,0.0
102,4.49,0.0,0.0,0.0,0.0,0.0
103,4.78,0.0,0.0,0.0,0.0,0.0
104,5.5,0.0,0.0,0.0,0.0,0.0
105,5.72,0.0,0.0,0.0,0.0,0.0
106,5.87,0.0,0.0,0.0,0.0,0.0
107,7.18,1.0,1.0,0.0,0.0,1.0
108,7.02,0.0,0.0,0.0,0.0,0.0
109,6.51,0.0,0.0,0.0,0.0,0.0
110,7.2,0.0,0.0,0.0,1.0,0.0
111,8.18,0.0,0.0,0.0,0.0,0.0
112,8.86,0.0,0.0,0.0,0.0,0.0
113,10.1,0.0,0.0,0.0,0.0,0.0
114,8.53,0.0,0.0,0.0,0.0,0.0
115,7.51,0.0,0.0,0.0,0.0,0.0
116,9.33,0.0,0.0,0.0,0.0,0.0
117,10.3,0.0,0.0,0.0,0.0,0.0
118,10.7,0.0,0.0,0.0,0.0,0.0
119,8.91,0.0,0.0,0.0,0.0,0.0
120,9.64,0.0,0.0,0.0,0.0,0.0
121,8.98,0.0,0.0,0.0,0.0,0.0
122,7.6,0.0,0.0,0.0,0.0,0.0
123,10.1,0.0,0.0,0.0,0.0,0.0
124,8.27,0.0,0.0,0.0,0.0,0.0
125,7.91,0.0,0.0,0.0,0.0,0.0
126,8.75,0.0,0.0,0.0,0.0,0.0
127,9.32,0.0,0.0,0.0,0.0,0.0
128,9.32,0.0,0.0,0.0,0.0,0.0
129,9.66,0.0,0.0,0.0,0.0,0.0
130,9.04,0.0,0.0,0.0,0.0,0.0
131,7.15,0.0,0.0,0.0,0.0,0.0
132,6.53,0.0,0.0,0.0,0.0,0.0
133,6.39,0.0,1.0,0.0,0.0,0.0
134,7.28,0.0,0.0,0.0,0.0,1.0
135,7.11,0.0,0.0,0.0,0.0,0.0
136,7.7,0.0,0.0,0.0,0.0,0.0
137,8.27,0.0,0.0,0.0,0.0,0.0
138,7.5,0.0,0.0,0.0,0.0,0.0
139,8.25,0.0,0.0,0.0,0.0,0.0
140,9.33,0.0,0.0,0.0,0.0,0.0
141,10.2,0.0,0.0,0.0,0.0,0.0
142,11.0,0.0,0.0,0.0,0.0,0.0
143,11.4,0.0,0.0,0.0,0.0,0.0
144,11.5,0.0,0.0,0.0,0.0,1.0
145,10.5,0.0,0.0,0.0,1.0,0.0
146,11.0,0.0,0.0,0.0,0.0,0.0
147,11.2,0.0,0.0,0.0,0.0,0.0
148,12.1,0.0,0.0,0.0,0.0,0.0
149,10.8,0.0,1.0,0.0,0.0,0.0
150,11.2,0.0,0.0,0.0,0.0,0.0
151,11.5,0.0,0.0,0.0,0.0,0.0
152,11.0,0.0,0.0,0.0,0.0,0.0
153,10.8,0.0,0.0,0.0,0.0,0.0
154,10.7,0.0,0.0,0.0,0.0,0.0
155,10.8,0.0,0.0,0.0,0.0,0.0
156,11.7,0.0,0.0,0.0,0.0,0.0
157,11.0,0.0,0.0,0.0,0.0,0.0
158,10.7,0.0,0.0,0.0,0.0,0.0
159,10.5,0.0,0.0,0.0,0.0,0.0
160,10.8,0.0,0.0,0.0,0.0,0.0
161,10.6,0.0,0.0,0.0,0.0,0.0
162,11.1,0.0,0.0,0.0,0.0,0.0
163,11.1,0.0,0.0,0.0,0.0,1.0
164,12.3,0.0,1.0,1.0,1.0,0.0
165,12.8,0.0,0.0,0.0,0.0,0.0
166,12.9,0.0,0.0,0.0,0.0,0.0
167,13.8,0.0,0.0,0.0,0.0,0.0
168,14.6,0.0,0.0,0.0,0.0,0.0
169,14.6,0.0,0.0,0.0,0.0,0.0
170,15.9,0.0,0.0,0.0,0.0,0.0
171,16.2,0.0,0.0,0.0,0.0,0.0
172,17.2,0.0,0.0,0.0,0.0,0.0
173,17.0,0.0,1.0,0.0,1.0,1.0
174,17.1,0.0,0.0,0.0,0.0,0.0
175,17.2,0.0,0.0,0.0,0.0,0.0
176,17.0,0.0,0.0,0.0,0.0,0.0
177,17.2,0.0,0.0,0.0,0.0,0.0
178,17.3,0.0,0.0,0.0,0.0,0.0
179,18.2,0.0,0.0,0.0,0.0,0.0
180,18.1,0.0,0.0,0.0,0.0,0.0
181,17.3,0.0,0.0,0.0,0.0,0.0
182,16.6,0.0,0.0,0.0,0.0,0.0
183,16.2,0.0,0.0,0.0,0.0,0.0
184,16.6,0.0,0.0,0.0,0.0,0.0
185,16.3,0.0,0.0,0.0,0.0,0.0
186,15.5,0.0,0.0,0.0,0.0,0.0
187,16.2,0.0,0.0,0.0,0.0,0.0
188,16.9,0.0,0.0,0.0,0.0,0.0
189,17.0,0.0,0.0,0.0,0.0,0.0
190,15.7,0.0,0.0,0.0,0.0,0.0
191,15.2,0.0,0.0,0.0,0.0,0.0
192,15.5,0.0,0.0,0.0,0.0,0.0
193,15.5,0.0,0.0,0.0,0.0,0.0
194,15.7,0.0,0.0,0.0,0.0,0.0
195,15.9,0.0,0.0,0.0,0.0,0.0
196,16.2,0.0,0.0,0.0,0.0,0.0
197,16.6,0.0,0.0,0.0,0.0,0.0
198,16.8,0.0,0.0,0.0,0.0,0.0
199,16.9,0.0,0.0,0.0,0.0,0.0
200,17.4,0.0,0.0,0.0,0.0,0.0
201,17.0,0.0,0.0,0.0,0.0,0.0
202,16.6,0.0,0.0,0.0,0.0,0.0
203,17.5,0.0,0.0,0.0,0.0,0.0
204,17.3,0.0,0.0,0.0,0.0,0.0
205,17.3,0.0,0.0,0.0,0.0,0.0
206,16.7,0.0,0.0,0.0,0.0,0.0
207,16.8,0.0,0.0,0.0,0.0,0.0
208,16.8,0.0,0.0,0.0,0.0,0.0
209,15.9,0.0,0.0,0.0,0.0,0.0
210,15.6,0.0,0.0,0.0,0.0,0.0
211,15.6,0.0,0.0,0.0,0.0,0.0
212,14.8,0.0,0.0,0.0,0.0,0.0
213,14.7,0.0,0.0,0.0,0.0,0.0
214,15.1,0.0,0.0,0.0,0.0,0.0
