Time,X1,X2,Label
0,-0.06844134353266258,0.2886653060199618,0
1,-0.08704099657305552,-0.087138600354213,0
2,-0.16018428323090741,0.22605986176817333,0
3,-0.0018534507822894235,0.8381390012502347,0
4,-0.131519644244154,0.46837828883877586,0
5,0.2838876672366432,-0.11756870925621535,0
6,0.21610722218344777,0.36584924549536196,0
7,0.23516086856449622,-0.13233715272528376,0
8,0.5730638341763482,0.026197822608080217,0
9,0.383161584620399,0.22522633198280467,0
10,0.16558933170526172,-0.004024473186425518,0
11,-0.029292380233017508,-0.059709157594453235,0
12,-0.013287986420801237,-0.3969491819126235,0
13,0.15513475208430086,0.5759222000281115,0
14,0.15491272648437251,-0.010999641860845398,0
15,-0.2934558879417722,0.41147534675362996,0
16,-0.2655811917098276,-0.07242902395109105,0
17,0.5178069716062849,0.3220792019130822,0
18,-0.38182491572137317,-0.017444122496431423,0
19,0.084686178230161,-0.3530023094660592,0
20,0.14448153251811852,-0.8288558074678051,0
21,0.5512876370107335,0.22776806687975026,0
22,-0.16919826250253778,0.38372364820373345,0
23,-0.027726456860994935,0.16191397467828447,0
24,-0.22022105306423598,-0.11876089060677682,0
25,-0.4998447004824207,0.255329697521142,0
26,0.21389499864585307,0.46140531171248916,0
27,-0.094456874909064,-0.04335208901922787,0
28,0.16973637676950534,-0.4042467870136221,0
29,-0.2081252747277375,-0.48730261290239646,0
30,-0.4335558746634584,-0.3352119405430478,0
31,-0.1942606546834226,-0.015950860469212964,0
32,0.1326347435374205,0.3332932857615886,0
33,0.5031419448920968,0.22906528309731264,0
34,-0.4493418182331898,0.1947838703568095,0
35,0.6220326912584863,0.09219189672910796,0
36,0.17696504398608412,-0.6410387911702733,0
37,-0.08247202204505096,-0.5432148151762577,0
38,0.10013140865720728,0.36082191326542945,0
39,-0.01432169944358117,0.14068828312873766,0
40,0.6277397268190847,-0.10819554358774004,0
41,0.12442196581458663,-0.4689015122072111,0
42,-0.021196929644112968,-0.13892367752509155,0
43,0.05728907495082467,0.32636666712382717,0
44,-0.36807421524695577,-0.18785889309118245,0
45,0.1287843775647339,0.41370699255879406,0
46,0.08716392409575917,-0.19833617748239715,0
47,0.3596714498537239,-0.2236321874059193,0
48,0.04101072550537242,-0.3186200665052853,0
49,-0.04735596392065463,0.7022241905691583,0
50,0.10442960354500286,-0.03603082675678148,0
51,0.45143263423278474,-0.08173163860990777,0
52,0.4386087668333865,0.23225219923743531,0
53,0.106391756484348,0.20572721629010193,0
54,-0.4419646370564409,0.2557717696806125,0
55,-0.03748327907053506,0.01658637119608565,0
56,-0.28111175411497186,0.12388763078627003,0
57,-0.1341703340648663,-0.0003302817008624382,0
58,0.46945411674005116,-0.28674354727430285,0
59,-0.22823820857868518,0.2849019317023853,0
60,-0.13184863826681203,0.34297576889137293,0
61,0.6440484068799862,-0.5855615956444467,0
62,0.2987362956815836,-0.21136692097122944,0
63,0.6971545359098167,-0.04006979780712532,0
64,-0.07586918118973872,0.1709205609131577,0
65,-0.7621542991685282,0.42987676949908615,0
66,0.11160368711214307,0.3826962796120413,0
67,0.03767208450720524,0.20650963518316204,0
68,-0.08624578557767278,-0.0020024865676578425,0
69,0.19875751535616418,0.1067168708717702,0
70,-0.37842305318567754,0.4122928920613675,0
71,0.11598149458488538,0.1702880155535602,0
72,0.43612506485191305,-0.05231229680562894,0
73,0.222136801156344,-0.0008267446504906468,0
74,0.4495764977230968,0.1738277873507061,0
75,-0.14233726834262594,-0.2114899669857137,0
76,-0.32624644592180274,-0.0827904291885143,0
77,-0.09512358354200937,-0.20404629905136754,0
78,0.07744731856739918,0.5822571435426226,0
79,0.5368904058921738,0.1613324673761075,0
80,0.13805013781818157,0.3185867681560652,0
81,0.02869653256077997,0.3838021673266579,0
82,-0.2581108118126817,0.34306480243478893,0
83,0.06437091886855356,0.01406971512749699,0
84,0.037869201130004596,0.19028278066541163,0
85,-0.4412042823694895,-0.023139784403362777,0
86,0.06594166195116294,0.09283894075035627,0
87,0.3893571954734842,0.013372910645766374,0
88,-0.3240331025896324,-0.3056066799949758,0
89,-0.12090182750857233,-0.05305105527666162,0
90,-0.07951672861779903,0.27110376767421707,0
91,-0.09810746330915086,-0.02574346684086629,0
92,-0.010213351557679115,-0.23658461043299284,0
93,-0.2654971898237034,-0.48543930036550925,0
94,-0.09198350067695088,0.13773378517150262,0
95,-0.017797651862910404,0.8020660155422815,0
96,0.5419034309559944,-0.09855179058503084,0
97,0.39361471417750554,-0.03838053924705636,0
98,-0.24966292371745438,-0.34830002537423027,0
99,-0.11701266208763095,0.11533357467104795,0
100,-0.8774510999813003,-0.03868632935216709,1
101,0.47741515253819955,0.19982484974490333,0
102,0.21155646671858364,-0.08272327519185296,0
103,0.07653475468260496,-0.2709857919022767,0
104,-0.11478633238078828,0.09290635899452937,0
105,-0.4051411215254497,0.37497394518944915,0
106,-0.19378851866335012,0.36001930463165976,0
107,-0.1586767086204759,-0.11302572720519066,0
108,-0.48829617495085387,0.3180954563430589,0
109,-0.20654391567640928,-0.7717906705521465,0
110,-0.3711882861964675,0.2809978995529967,0
111,-0.18559122460540678,-0.12520354139503453,0
112,-0.10817688966901784,0.007705856432068003,0
113,0.24694075862323217,-0.11949011788103192,0
114,0.4427397686058008,-0.14981057163943134,0
115,0.6645282784810753,0.09770210694257742,0
116,-0.28163292159068476,-0.09728849321121658,0
117,-0.24563319535612038,0.08270461286697994,0
118,-0.06943708481302835,-0.08329271437764874,0
119,-0.18450738342411555,-0.003565395884066902,0
120,0.19315629226930753,0.12671095057778103,0
121,-0.12751584485378942,0.3613205272570923,0
122,0.4711316971107955,0.19355923924740637,0
123,0.25156855371321285,0.4033805149243008,0
124,0.15181898077442213,0.04086087964917695,0
125,0.14677847926695975,0.22985934645587847,0
126,0.03875623403448358,-0.07316403800653859,0
127,-0.5212146989468138,-0.31021486346170946,0
128,-0.27740605846141264,0.30559370054468715,0
129,0.22103241813889696,-0.25724392153953346,0
130,0.10507327705564506,-0.18895956467304487,0
131,-0.9092222436764672,0.6814252725212526,0
132,-0.16242512023872635,0.11716767390367977,0
133,-0.1217302873004833,-0.18322121554642123,0
134,0.04505503159836621,0.39327175357202293,0
135,-0.06737099068832464,-0.14915407862419272,0
136,-0.35986249074628773,-0.17740798599442087,0
137,0.06229684592209139,0.1323451856195632,0
138,0.10162324630569586,0.507286007295999,0
139,-0.07416660587934132,-0.11936364715329617,0
140,0.14035671137594363,-0.05862706733773848,0
141,-0.7929168739041508,0.0862374321954249,0
142,-0.11637450116254655,0.28273495148786054,0
143,-0.07406211489797343,-0.27349407020058436,0
144,-0.4478840836722924,0.009194887971428756,0
145,-0.14522194088456786,-0.12728419567565652,0
146,-0.11672455898404621,0.17948177727776127,0
147,-0.029421119164950937,0.11623553039407852,0
148,-0.13139784535531618,-0.2862268453646699,0
149,-0.7499286321408007,-0.0634487460273796,0
150,-0.0748928259848114,-0.2602793611659031,0
151,0.338907665012659,0.1254017407226229,0
152,0.06037638928036415,0.27651115888428635,0
153,0.3406534154314613,-0.4426364714688944,0
154,-0.20589236318109627,-0.32023053253542955,0
155,0.2741990500512479,-0.2302368196267608,0
156,0.051942545074215474,0.2553233558933634,0
157,-0.014308772248607937,0.08773232435017775,0
158,-0.14876492412499687,0.09366062744636139,0
159,0.3606417171620073,0.1660521079315096,0
160,-0.06481427436244047,0.14822055012934854,0
161,-0.10562032961423284,-0.13152571698227788,0
162,-0.003932781464303758,-0.04005619688437889,0
163,-0.07192759791441716,0.23188460948261636,0
164,0.307305218663668,-0.4329501935006377,0
165,0.05016565713318499,-0.2055193883834221,0
166,-0.12243123765399488,0.07620866864958131,0
167,0.2208500229710495,0.15498316933772216,0
168,-0.17084290788961098,0.4056246659732068,0
169,-0.0942203853943937,-0.09716933257108096,0
170,0.13974034553964287,0.0943589727583749,0
171,0.15093315872779556,0.5006607032320289,0
172,0.0823342367763864,-0.2839724296926107,0
173,0.23220110360933077,0.04761406861373274,0
174,0.3112194777845332,-0.2862259663168203,0
175,-0.15630547823976926,0.27905968287463523,0
176,0.1888316223502926,0.0024439475333366545,0
177,-0.6299261571793089,-0.13856036628630974,0
178,-0.3907328396714611,0.09449324122089209,0
179,-0.19243191431835172,0.08523531243282534,0
180,-0.424845686482513,0.20290718618284487,0
181,-0.3941231908429188,0.04895427817207221,0
182,0.1888066196453586,0.03920860707734164,0
183,0.13084535026020916,0.7559697924321682,0
184,-0.019727398451525602,0.027170743808611064,0
185,0.30640348202599554,-0.38545403892778296,0
186,0.7036352229270371,-0.19156140513259956,0
187,-0.06196091021113048,0.4152981026689986,0
188,0.40346678319810536,-0.23271428092215274,0
189,0.29107284907595243,-0.19955113954787862,0
190,0.05938542468240726,0.05268544769629813,0
191,-0.09263032837671048,0.26090052412063613,0
192,0.04084671475556689,0.4171969328980474,0
193,-0.05522368132096389,-0.0861123424336192,0
194,-0.1437537348119342,-0.006495801183667993,0
195,-0.2616552995456978,-0.37153283330771814,0
196,-0.3658963191418714,-0.00995221793079537,0
197,-0.2722623103684825,0.0637180944362008,0
198,0.12301801096632303,0.6761327903893424,0
199,-0.05195357360658548,0.27409774213209914,0
200,0.0016714494349940878,0.21086734450144107,0
201,-0.15636015772735234,0.5368928152845847,0
202,-0.21732567447003248,0.02755134155859551,0
203,0.25101953313168224,0.11648578350595074,0
204,-0.3294864757085705,0.10643515097613232,0
205,-0.31950050520639195,-0.017279495612235962,0
206,0.20370621418035384,-0.37714009058540654,0
207,0.25504831430362174,-0.09388177997773184,0
208,-0.15265847235960095,0.12461020034426795,0
209,0.275078753523907,0.527303207813393,0
210,0.4117690664242879,0.6708377662227392,0
211,0.4274333123570315,-0.02036602966825285,0
212,-0.689791883839419,-0.1966133291001455,0
213,0.09761498854431494,0.3677624605990317,0
214,0.15897748927671174,0.022047017735143726,0
215,0.07566838100396822,-0.02035693686405793,0
216,-0.05209813563545751,0.6115896765329687,0
217,-0.4686972279668815,-0.11506273406936884,0
218,-0.8909110393753537,0.23963548944202628,0
219,0.0036354856716478423,-0.18000741997602887,0
220,-0.3987663844304308,-0.19096424380611055,0
221,-0.2469578815907525,-0.11000432862492815,0
222,0.13850101359886224,0.24175904101146628,0
223,0.34777173771714587,0.16744882490555923,0
224,0.10906547947779188,0.33651864766115835,0
225,-0.10280342497497585,0.1900846260208482,0
226,-0.05725293563689959,0.3869287960596921,0
227,-0.27147726489596735,-0.40811987975573416,0
228,0.16461178697936418,-0.42024781533153543,0
229,0.4507132850994182,-0.15013964359957654,0
230,0.10692491650915414,0.3249433458634776,0
231,-0.39306050949956983,0.3595485745779321,0
232,0.30077667387855556,-0.04067448961020759,0
233,0.269400988931757,0.11389202832506129,0
234,0.16776072322557667,0.026530138914854007,0
235,-0.09330429443403787,0.013210554983530187,0
236,-0.3255917991564985,-0.0398805854919857,0
237,0.10272992034814621,0.6749765008349904,0
238,-0.092927539303858,0.13294979100798088,0
239,0.18445811912424404,-0.3620187284615497,0
240,0.6340347648949631,0.6486493019868185,0
241,-0.48456112997287804,0.07403093352909096,0
242,0.055380314716561685,0.055308213784662996,0
243,-0.1403588357418819,0.1952590886615866,0
244,-0.4392137432421528,-0.011445968494435022,0
245,0.0322767868289624,-0.6102848625480739,0
246,0.21367012923731465,0.480048579657236,0
247,-0.34769835623879786,-0.1612915390003522,0
248,0.4473167211697877,-0.19050310280893612,0
249,-0.660181638079095,0.3044773688578566,0
250,-0.16854097709497395,-0.06369473155425709,1
251,0.12676041057572718,-0.03209955968996425,0
252,0.3734560516359622,-0.05841976021636697,0
253,-0.14703046071831238,0.20773100864309058,0
254,0.2195766805870818,0.4658596397753456,0
255,0.5525399337793502,0.40058631311995185,0
256,0.7034882461872307,0.13489144608639236,0
257,0.3792061516196341,0.6030113775081105,0
258,0.5114148160801761,-0.02962534737249456,0
259,0.8805090605939014,0.5313711083194477,0
260,0.6455614473057061,0.867060936285764,0
261,1.3451271304426378,0.5510913012483449,0
262,1.8498056032734134,0.93384046920891,0
263,1.1163451609201438,1.0812158057156118,0
264,1.0556972082433091,1.4958983643962007,0
265,1.0749527792871838,0.9161174978576554,0
266,1.3790667717293985,1.3539036764051957,0
267,1.4356820553646514,1.4186307212849947,0
268,1.3186305942900063,1.2295965399390454,0
269,2.0735666147328757,1.6247334288768904,0
270,2.017289570422207,1.6492740063931777,0
271,1.751787739599088,1.7864736532450394,0
272,1.848015232397188,1.527964379625839,0
273,1.9788243095985472,1.641282855452502,0
274,2.1444336308890932,2.1722394552865616,0
275,1.8346163352050695,1.7797328833809303,0
276,2.0698021535689435,2.1024051858130406,0
277,2.624894996010269,1.5286560682904806,0
278,2.203292733906949,2.173345173695857,0
279,2.315794770673886,2.964473468566535,0
280,1.9774697976131286,2.6320417707479535,0
281,2.0201296640216917,3.186675125659143,0
282,2.6599791197402602,2.8214108174219774,0
283,2.715229361619194,3.4064501508767435,0
284,2.640755401668436,2.177420009300395,0
285,3.050327799756076,2.5259329924176726,0
286,2.926377588364918,2.8826176255798828,0
287,2.7804048325632316,3.1754695571139067,0
288,3.169964554304979,3.420744378875117,0
289,3.255432825576836,2.91629687249117,0
290,3.0693504971170853,3.1838907821751548,0
291,3.481803621263033,2.9772513396989524,0
292,2.429040066780818,3.2722492903995963,0
293,3.0534881543263523,3.6207670150309035,0
294,3.412709939321971,3.49731942943189,0
295,3.777509432755828,3.5065593686065775,0
296,3.924189562356112,3.688908708915548,0
297,4.085949619202429,3.111313564884565,0
298,4.395925016753015,4.1612232741195605,0
299,3.572689560199798,3.8405136324250897,0
300,3.4975578834808907,4.246208843537357,0
301,4.5298583658078755,4.329527106853188,0
302,4.211781582183946,3.663387595960984,0
303,4.547711104109535,4.729236364175591,0
304,4.931206419042088,4.373521965776035,0
305,3.828614155946319,4.935209968524621,0
306,4.511392557478368,4.519262030110642,0
307,4.481186964961804,4.95144644504397,0
308,4.291476615078931,4.541630391143853,0
309,4.478518383082491,4.846190427887546,0
310,4.9218656427182985,5.292750858059211,0
311,4.5464429719930255,4.956391473290672,0
312,5.013028896891804,4.439284572004411,0
313,5.274283110407762,4.4259075358494435,0
314,5.522115700047886,4.920282704952086,0
315,5.255390593732486,5.298633976884732,0
316,5.114745864118522,5.656923112965524,0
317,5.6301250214346865,5.571228936917491,0
318,5.338518115318363,5.349990684277298,0
319,5.620676896704957,6.011922090619109,0
320,5.984453513078634,5.454040390052075,0
321,5.354147126156242,5.889963060585341,0
322,5.572689643123802,5.702615421078885,0
323,6.041295722537852,5.576168059364047,0
324,6.19894919880138,5.623067644141326,0
325,5.827128265406111,5.959325639372695,0
326,6.462027894240272,6.103372212546846,0
327,6.723642390757403,6.004051303412529,0
328,6.036594045756555,5.79769864260696,0
329,6.517960550761979,7.017158782915397,0
330,6.7637462049689745,6.593431499444751,0
331,6.894255216514921,6.855260519592779,0
332,6.373102453602595,6.519852525110572,0
333,6.655643427279557,6.962768414553906,0
334,6.851533260813824,6.746277547722885,0
335,6.709517309407767,7.076670594428272,0
336,6.979353249965008,7.315362550862071,0
337,7.010572002923773,6.84564973162534,0
338,6.8299991930941495,7.357484039107328,0
339,7.276009138922028,6.8177096763209875,0
340,7.448684247924728,7.145581294316292,0
341,7.206951887940653,7.082446238871876,0
342,7.1113332915742635,7.349458407794099,0
343,7.635748262602581,7.690878341569547,0
344,7.839226988398472,7.9035466839093385,0
345,7.690815346045866,7.975474517280169,0
346,7.613912629643027,7.417150725909144,0
347,8.029800268851712,7.659307370234741,0
348,7.738685101789066,8.263628188552845,0
349,7.55527904788784,7.967875486960057,0
350,7.666474458204535,8.090201568163202,0
351,8.836632546158846,8.417079513506774,0
352,8.430756360606015,8.074775122239078,0
353,7.894951343174734,8.253306011688732,0
354,9.17117890626063,8.873823244232707,0
355,8.328663577484777,8.728500926500475,0
356,8.685713032732954,8.339988768783275,0
357,8.550853400595173,8.427447701680233,0
358,8.703755324268819,8.360334074928636,0
359,8.706799420712734,8.941718535231615,0
360,8.81341611475154,9.011356385673036,0
361,8.484657566596248,8.904891881806208,0
362,9.068079035704542,9.581478368930147,0
363,8.93527240998697,8.517708798003774,0
364,9.17692408367193,9.522666346089338,0
365,9.365492469053883,9.523373380661727,0
366,9.205473296927476,9.14962630520343,0
367,9.720094583630074,9.37614186449759,0
368,9.251513188727301,9.72883124319116,0
369,9.40188799387575,9.478864672285678,0
370,9.371576773402952,9.409039121782302,0
371,9.726436499849141,10.299360519609703,0
372,9.979333854585256,10.13244859936373,0
373,10.013802328628433,10.202803615727891,0
374,9.972928375786182,9.828426487117556,0
375,10.436875328021394,9.883105712158015,0
376,10.306837199972627,10.32817685481585,0
377,10.51403187541263,10.43265771095014,0
378,10.152692632026667,9.850639714477644,0
379,10.11458459772247,9.606763411838475,0
380,10.636983424632653,10.392287789153782,0
381,10.224848435740657,10.482985146787328,0
382,11.0291016041587,10.405462342500073,0
383,10.714993615327916,10.852454329801777,0
384,11.38459430878746,10.748735069691886,0
385,11.242820317213909,11.099982309142732,0
386,10.647363247562712,10.46306834203322,0
387,11.1739659022839,11.154903807056499,0
388,11.427148668853803,11.419056904968432,0
389,11.28264009711903,11.430823396050803,0
390,11.708528150243017,11.948609083359695,0
391,11.255226684526402,11.383031109553695,0
392,10.908170097992883,11.329027979399655,0
393,11.243304613341621,11.734880642948728,0
394,11.500175830603053,11.671950751573288,0
395,11.681099583115,11.364180326853523,0
396,11.555598966184593,11.712117455977612,0
397,11.793591907555903,11.656060753781905,0
398,11.756374861714832,12.252413145745304,0
399,11.546790160500287,12.092467964915677,0
400,12.289572303156927,11.856905415271054,0
401,12.174733797496216,11.911476504557339,0
402,12.447847445128454,12.272072543678245,0
403,11.873901155795618,12.256412323130679,0
404,12.626630504590548,12.220088279781157,0
405,12.597842871042896,12.368595518028286,0
406,12.28946417958451,12.327997392477197,0
407,12.81427471488659,12.943791877648499,0
408,12.590308679453674,12.492435179412809,0
409,12.702269842938904,12.369878232976783,0
410,12.857907307980376,12.808496699415045,0
411,13.353657440884113,13.49473878763513,0
412,12.505659122917262,13.058764654997397,0
413,12.871417150353537,13.002587663956389,0
414,13.115137253483145,13.111256712065783,0
415,13.574606058276503,13.95253777525889,0
416,13.316790975969386,13.281535698422587,0
417,13.791398545890583,12.988481935860552,0
418,13.9041414048103,13.807590677275343,0
419,13.7720837584869,13.614716195066364,0
420,13.483957025331723,13.754898008248368,0
421,13.698550991698955,14.070790560334515,0
422,13.42847903547723,13.585933268512324,0
423,13.66483136845736,14.320019593359607,0
424,14.276240884057223,13.865546632820735,0
425,14.06595660627903,13.726500556815836,0
426,14.254329633497854,14.04687383663075,0
427,14.338016826818652,14.523391406709262,0
428,14.029525704410855,14.231040902922668,0
429,14.745723951224662,14.886750676255339,0
430,14.337555064901764,14.187198648397532,0
431,14.429815811480758,14.849740324907705,0
432,14.113408850671572,14.382669273533697,0
433,14.635102751055788,14.808387511580879,0
434,15.246128690448245,14.536878638434274,0
435,14.760587068728224,15.243774952827511,0
436,14.950486640311908,14.66999487606563,0
437,15.477485828650202,14.340309846972533,0
438,14.85108553259657,15.279072370682849,0
439,15.417397552823036,15.140087111205798,0
440,15.565072075186993,14.935552575015842,0
441,14.90735250716984,14.978578698282966,0
442,15.03328004901531,15.113852225474696,0
443,15.783826939319953,15.326766769750769,0
444,15.596562718407522,15.660073589687332,0
445,15.19304735603159,15.396871564110297,0
446,15.949951516111215,15.277922856668134,0
447,15.156079361545972,15.8408134964972,0
448,16.3305050591958,15.626582084950993,0
449,15.936673944590874,15.852210607340371,0
450,15.927023166542448,16.52071494524376,0
451,16.633135644294633,16.144357677323047,0
452,16.047998223712085,16.207833557024486,0
453,16.045730611219152,16.010368103071112,0
454,16.089144200414953,16.856828915921447,0
455,16.586369862360996,16.54164205908213,0
456,16.637462104467936,16.466262863905513,0
457,16.59116540496977,16.248006530393724,0
458,17.16541474124074,16.168745332219427,0
459,17.24385573047242,17.18090213061341,0
460,16.969841478635573,17.03505376131838,0
461,17.20278212007924,17.083836470957714,0
462,16.610185589563024,16.646619506093483,0
463,17.34320141467179,16.955302214714756,0
464,17.409374521937902,16.92136498175357,0
465,17.116135896881815,17.700027388197178,0
466,17.571126238450077,17.345962748224764,0
467,17.53635134680301,17.126689839507804,0
468,17.125296998147775,17.17272243608557,0
469,18.356151111359214,17.00052270620366,0
470,17.614939357219768,17.96668401065489,0
471,17.551338168407895,18.37813132680177,0
472,17.891743846862237,18.163954748566702,0
473,17.72244299653518,17.504482234944543,0
474,18.098986283235817,17.882012876069496,0
475,17.80043264204125,17.93522421040211,0
476,18.288913509267225,17.55387391369289,0
477,17.80867510758859,17.624553011491905,0
478,18.251048816929114,17.646333357569507,0
479,18.34368861795462,18.368533002130174,0
480,18.32637605270758,18.329631568432568,0
481,18.8716599067958,17.962215518968144,0
482,18.826063590583615,18.952053799089263,0
483,17.707348697613394,19.013063174360695,0
484,18.953647987457718,18.690910570326647,0
485,19.18409205057621,19.053136802239674,0
486,18.611527627221037,19.18011925511569,0
487,19.008823485124402,19.182004203811026,0
488,18.677151919180936,19.492146614625888,0
489,19.322223075126217,19.403840962188966,0
490,19.045787741516556,19.629448392475606,0
491,19.63366002745071,19.168453667202172,0
492,19.29821488250606,19.54037669036525,0
493,19.687309147452424,19.373838472448426,0
494,19.81740338431544,19.607992583546064,0
495,19.62356196407633,20.227695021535073,0
496,19.46782370163695,20.183017666541385,0
497,20.083021035128034,19.778519493947194,0
498,19.575536372366653,20.248850343206264,0
499,19.977632407101808,20.1376777060008,0
