Time,X1,X2,X3,X4,X5,X6,X7,X8,Label
2020-03-01 17:03:54,0.0810554999999999,0.132572,1.4094799999999998,-0.2732159999999999,86.8532,22.0867,231.247,77.0,0.0
2020-03-01 17:03:55,0.0814173,0.136616,1.942,0.054711,86.7155,22.0904,229.569,76.9794,0.0
2020-03-01 17:03:56,0.082209,0.132413,1.60694,0.054711,86.7442,22.0991,231.749,76.0209,0.0
2020-03-01 17:03:57,0.0813011,0.137628,1.13916,0.054711,86.8673,22.0944,218.121,77.0,0.0
2020-03-01 17:03:58,0.0819601,0.130911,1.57836,0.054711,86.9175,22.0887,231.304,77.0,0.0
2020-03-01 17:03:59,0.0808617,0.138537,1.84093,-0.2732159999999999,86.7062,22.0998,242.328,77.0,0.0
2020-03-01 17:04:00,0.0832623,0.132658,1.64818,0.054711,86.4951,22.0878,241.67,77.0,0.0
2020-03-01 17:04:01,0.0816611,0.136159,1.32774,0.054711,87.0097,22.0878,232.003,77.0209,0.0
2020-03-01 17:04:02,0.0809118,0.135046,1.99743,0.054711,86.9424,22.0911,228.966,77.9794,0.0
2020-03-01 17:04:03,0.0825833,0.131779,1.63478,0.382638,87.0255,22.1058,248.81,76.9794,0.0
2020-03-01 17:04:04,0.081112,0.138072,1.15871,-0.601143,87.05799999999999,22.099,229.105,76.0209,0.0
2020-03-01 17:04:05,0.082603,0.133141,1.69747,0.054711,87.1044,22.098000000000003,238.862,77.0,0.0
2020-03-01 17:04:06,0.081083,0.136789,1.68107,-0.2732159999999999,87.1435,22.0947,242.579,77.0,0.0
2020-03-01 17:04:07,0.0821666,0.131138,1.66831,-0.2732159999999999,86.8991,22.0947,206.299,76.9794,0.0
2020-03-01 17:04:08,0.0809112,0.138566,2.20756,-0.2732159999999999,87.2501,22.1047,237.81,76.042,0.0
2020-03-01 17:04:09,0.0821298999999999,0.134135,1.76918,-0.601143,87.2572,22.0975,204.983,77.959,0.0
2020-03-01 17:04:10,0.0821363,0.133596,2.16403,0.054711,87.0687,22.0961,243.729,76.0209,0.0
2020-03-01 17:04:12,0.080698,0.131735,1.14438,0.054711,86.8332,22.106,224.288,77.0,0.0
2020-03-01 17:04:13,0.0808323,0.138237,1.6909299999999998,-0.2732159999999999,87.1918,22.1077,221.871,77.0,0.0
2020-03-01 17:04:14,0.0828572,0.1339779999999999,2.0145,-0.2732159999999999,86.8119,22.114,251.542,77.0,0.0
2020-03-01 17:04:15,0.080886,0.135948,1.89637,0.054711,87.1066,22.1095,228.519,77.0,0.0
2020-03-01 17:04:16,0.0818685,0.133472,1.97367,0.054711,86.9965,22.1202,219.657,77.0209,0.0
2020-03-01 17:04:17,0.0823506,0.132999,1.89968,0.054711,87.1328,22.1202,204.568,77.959,0.0
2020-03-01 17:04:18,0.0811349,0.138225,1.96965,0.054711,87.12,22.114,232.233,76.042,0.0
2020-03-01 17:04:19,0.0827304,0.130682,1.69525,0.054711,86.7689,22.113000000000003,224.676,77.959,0.0
2020-03-01 17:04:20,0.0814909,0.137479,1.55042,0.054711,86.9928,22.1252,237.299,76.0209,0.0
2020-03-01 17:04:21,0.0819971999999999,0.130583,1.73565,0.054711,87.1133,22.1191,229.956,77.0,0.0
2020-03-01 17:04:22,0.0813108,0.137069,1.93209,0.054711,86.5001,22.1171,250.213,77.0,0.0
2020-03-01 17:04:23,0.0826481999999999,0.134186,2.10345,0.054711,86.9398,22.1209,235.633,77.0,0.0
2020-03-01 17:04:24,0.0813011999999999,0.134875,1.62057,0.054711,86.819,22.1214,230.13,77.0,0.0
2020-03-01 17:04:25,0.0812248999999999,0.136173,1.52996,0.054711,87.0218,22.1214,230.396,76.9794,0.0
2020-03-01 17:04:26,0.0827787,0.131999,1.83726,0.382638,86.6599,22.1191,232.651,76.0209,0.0
2020-03-01 17:04:27,0.0807092,0.139567,1.51111,-0.2732159999999999,86.6876,22.117,208.297,77.0,0.0
2020-03-01 17:04:28,0.0825843999999999,0.1343069999999999,1.84759,0.054711,86.5898,22.1193,239.756,77.0,0.0
2020-03-01 17:04:29,0.0811135,0.134703,1.31364,-0.601143,86.6661,22.1278,204.938,76.9794,0.0
2020-03-01 17:04:31,0.0813501,0.136736,1.40611,-0.601143,86.7894,22.1183,251.294,77.0,0.0
2020-03-01 17:04:32,0.081536,0.13729,1.37197,0.382638,86.7398,22.1272,246.365,77.0,0.0
2020-03-01 17:04:33,0.0825058,0.13276,1.2116,0.054711,86.7572,22.1285,243.227,77.0,0.0
2020-03-01 17:04:34,0.0810736,0.137538,1.26965,0.054711,86.824,22.1285,247.185,77.0,0.0
2020-03-01 17:04:35,0.0824033,0.131712,1.90583,0.054711,86.72399999999999,22.1284,231.299,77.0,0.0
2020-03-01 17:04:36,0.0811133,0.1374109999999999,1.05378,0.054711,86.8589,22.1277,229.544,77.0,0.0
2020-03-01 17:04:37,0.083063,0.135252,1.22753,-0.2732159999999999,86.7115,22.1309,253.528,76.9794,0.0
2020-03-01 17:04:38,0.0810244,0.135021,1.82096,0.382638,86.8751,22.1302,224.112,76.0209,0.0
2020-03-01 17:04:39,0.0816189,0.134799,1.72869,0.054711,86.9272,22.1246,233.921,77.0209,0.0
2020-03-01 17:04:40,0.0823341,0.133297,1.7616,0.054711,86.7195,22.1237,232.911,77.959,0.0
2020-03-01 17:04:41,0.0810187,0.140312,1.0909799999999998,0.054711,86.7999,22.1169,226.723,76.0209,0.0
2020-03-01 17:04:42,0.0821687,0.132273,1.23615,0.054711,86.8591,22.1169,250.697,77.0209,0.0
2020-03-01 17:04:43,0.0811369,0.137165,0.74369,-0.2732159999999999,86.8679,22.1145,223.321,77.9794,0.0
2020-03-01 17:04:44,0.0815679,0.131989,1.60745,0.054711,86.8258,22.1201,230.192,77.0,0.0
2020-03-01 17:04:45,0.080979,0.137762,1.89108,0.382638,86.8234,22.1169,241.18,77.0,0.0
2020-03-01 17:04:46,0.0829321,0.136007,1.77758,0.054711,86.7948,22.1118,230.742,77.0,0.0
2020-03-01 17:04:47,0.0813538999999999,0.133661,1.81749,0.054711,86.7207,22.1199,229.064,77.0209,0.0
2020-03-01 17:04:49,0.0807465,0.136615,1.5939299999999998,-0.601143,86.9053,22.1216,230.219,77.959,0.0
2020-03-01 17:04:50,0.0811056,0.1415809999999999,1.81733,0.054711,86.8804,22.1116,228.007,77.9794,0.0
2020-03-01 17:04:51,0.0819767,0.132852,1.65375,0.054711,87.3115,22.1131,229.792,77.0,0.0
2020-03-01 17:04:52,0.0812739,0.137138,1.9376400000000005,0.054711,86.868,22.1131,251.35,77.0,0.0
2020-03-01 17:04:53,0.0821539,0.132038,1.57805,0.382638,86.7139,22.1177,226.668,77.0,0.0
2020-03-01 17:04:54,0.080862,0.138526,1.60677,0.054711,86.8514,22.1137,226.144,77.0,0.0
2020-03-01 17:04:55,0.0826941,0.135294,1.53751,-0.2732159999999999,86.9155,22.1113,223.421,77.0209,0.0
2020-03-01 17:04:56,0.0816333,0.133928,1.02995,0.054711,86.9791,22.1218,232.97,77.9794,0.0
2020-03-01 17:04:57,0.0803335,0.136507,1.49389,0.382638,86.8221,22.111,231.118,77.0,0.0
2020-03-01 17:04:58,0.082311,0.132293,1.10437,0.054711,86.9095,22.1052,225.849,77.0,0.0
2020-03-01 17:04:59,0.0812756999999999,0.140071,1.23179,0.054711,86.7929,22.109,228.376,77.0,0.0
2020-03-01 17:05:00,0.081593,0.133466,1.99821,0.054711,86.9818,22.109,227.318,76.9794,0.0
2020-03-01 17:05:01,0.081343,0.135995,1.90084,0.054711,86.8674,22.1131,242.605,76.0209,0.0
2020-03-01 17:05:02,0.0820058,0.13292,1.91696,0.054711,86.7326,22.1068,236.823,77.0,0.0
2020-03-01 17:05:03,0.080727,0.136562,1.26737,0.054711,87.0,22.113000000000003,228.459,77.0,0.0
2020-03-01 17:05:04,0.0819091,0.137093,1.8599,-0.2732159999999999,87.0508,22.1204,218.789,77.0,0.0
2020-03-01 17:05:05,0.0815588999999999,0.132263,1.72505,0.382638,87.0523,22.1051,217.9,77.0,0.0
2020-03-01 17:05:06,0.080567,0.138277,1.45976,0.054711,86.84,22.1116,222.932,77.0,0.0
2020-03-01 17:05:07,0.0821002,0.131212,2.03533,0.054711,86.9071,22.1049,237.603,77.0,0.0
2020-03-01 17:05:09,0.0813515,0.139697,1.98424,0.054711,86.9625,22.1049,225.597,77.0,0.0
2020-03-01 17:05:10,0.0813442,0.1351619999999999,1.48219,-0.2732159999999999,86.8542,22.1113,231.859,77.0,0.0
2020-03-01 17:05:11,0.0815063,0.134195,1.55288,-0.2732159999999999,87.0405,22.1053,205.644,77.0,0.0
2020-03-01 17:05:12,0.0815998,0.134366,1.5921299999999998,0.054711,87.0595,22.1023,217.203,77.0,0.0
2020-03-01 17:05:13,0.0814119,0.139272,1.15,-0.2732159999999999,86.9608,22.1008,232.503,77.0,0.0
2020-03-01 17:05:14,0.0818665,0.1310079999999999,1.91197,-0.2732159999999999,87.3461,22.1063,228.113,77.0,0.0
2020-03-01 17:05:15,0.0809824,0.138261,2.02449,0.054711,86.9602,22.0996,233.758,77.0,0.0
2020-03-01 17:05:16,0.0817151,0.130991,2.25789,0.054711,87.29,22.0996,247.643,77.0,0.0
2020-03-01 17:05:17,0.0817158,0.1375829999999999,1.71387,0.054711,87.0952,22.0941,211.975,77.0,0.0
2020-03-01 17:05:18,0.0820809,0.13571,2.01416,-0.2732159999999999,87.1147,22.103,231.256,77.0,0.0
2020-03-01 17:05:19,0.0816298999999999,0.132994,1.3713,-0.601143,87.3282,22.1021,251.46400000000003,77.0,0.0
2020-03-01 17:05:20,0.0813001,0.135217,1.96322,-0.601143,87.4571,22.1027,232.879,76.9794,0.0
2020-03-01 17:05:21,0.0820443999999999,0.132396,1.6075700000000002,-0.601143,87.3385,22.0945,236.36,76.0209,0.0
2020-03-01 17:05:22,0.0809027,0.138242,2.05635,0.054711,87.3776,22.0972,232.402,77.0,0.0
2020-03-01 17:05:23,0.081991,0.131958,1.18474,0.054711,87.4288,22.0972,233.14,77.0,0.0
2020-03-01 17:05:24,0.0817031999999999,0.134457,1.22424,-0.2732159999999999,87.41799999999999,22.1111,225.69,77.0,0.0
2020-03-01 17:05:25,0.0809195,0.134245,1.95663,0.382638,87.4516,22.1066,206.389,76.9794,0.0
2020-03-01 17:05:26,0.082113,0.131523,1.15166,0.054711,87.4658,22.1028,229.749,76.0209,0.0
2020-03-01 17:05:27,0.0807683999999999,0.138414,2.10226,0.382638,87.4249,22.0931,248.732,77.0,0.0
2020-03-01 17:05:28,0.0818643,0.13143,1.01616,0.054711,87.3436,22.1031,205.853,76.9794,0.0
2020-03-01 17:05:30,0.0819425,0.133796,0.989196,0.054711,87.319,22.0991,224.492,76.0209,0.0
2020-03-01 17:05:31,0.0820381,0.13188,1.89066,-0.601143,87.4178,22.1092,232.546,77.0,0.0
2020-03-01 17:05:32,0.0809169,0.140587,0.982194,-0.601143,87.4639,22.1092,203.884,76.9794,0.0
2020-03-01 17:05:33,0.0818148999999999,0.132225,0.761096,0.054711,87.458,22.0984,216.034,76.0209,0.0
2020-03-01 17:05:34,0.0819039999999999,0.133947,2.0362400000000003,0.054711,87.5792,22.1074,247.898,77.0209,0.0
2020-03-01 17:05:35,0.0809247,0.134269,2.03951,-0.2732159999999999,87.5067,22.1068,245.43,77.9794,0.0
2020-03-01 17:05:36,0.0819876,0.131528,0.94149,0.382638,87.5065,22.1103,216.307,77.0,0.0
2020-03-01 17:05:37,0.081314,0.137702,1.638,-0.601143,87.5717,22.0947,234.212,77.0,0.0
2020-03-01 17:05:38,0.0820346,0.131246,1.81899,-0.601143,87.5663,22.0947,231.106,77.0,0.0
2020-03-01 17:05:39,0.0816867,0.134618,1.45566,0.054711,87.45100000000001,22.0989,226.83,77.0,0.0
2020-03-01 17:05:40,0.0814299,0.133965,0.7295229999999999,0.054711,87.4333,22.1078,208.241,77.0,0.0
2020-03-01 17:05:41,0.0810531999999999,0.133617,1.79585,0.054711,87.4955,22.1056,230.826,77.0,0.0
2020-03-01 17:05:42,0.081192,0.136035,1.26154,0.054711,87.469,22.0992,234.991,77.0,0.0
2020-03-01 17:05:43,0.0821896999999999,0.130569,1.7611599999999998,0.054711,87.5334,22.111,229.113,77.0,0.0
2020-03-01 17:05:44,0.0799286999999999,0.137214,1.87308,0.382638,87.4402,22.1041,239.961,76.9794,0.0
2020-03-01 17:05:45,0.0816322,0.131163,1.12801,0.054711,87.4578,22.1069,228.634,76.042,0.0
2020-03-01 17:05:46,0.0808933999999999,0.135481,1.41317,0.054711,87.5666,22.1069,226.117,77.9794,0.0
2020-03-01 17:05:48,0.0817633,0.134247,1.41882,0.382638,87.3954,22.1188,235.873,77.0,0.0
2020-03-01 17:05:49,0.0803106,0.137403,0.614404,0.054711,87.4337,22.1128,212.475,76.0209,0.0
2020-03-01 17:05:50,0.0818536999999999,0.131681,1.42481,-0.601143,87.42299999999999,22.1087,229.393,77.0209,0.0
2020-03-01 17:05:51,0.0805388,0.137472,1.65874,0.054711,87.8506,22.1202,220.286,77.9794,0.0
2020-03-01 17:05:52,0.0816576,0.132333,1.09863,-0.2732159999999999,87.5753,22.1088,232.55,77.0,0.0
2020-03-01 17:05:53,0.0814824,0.13552,1.72504,-0.601143,87.5094,22.1083,243.368,77.0,0.0
2020-03-01 17:05:54,0.0806953,0.13507,1.10361,-0.2732159999999999,87.6803,22.1208,226.733,77.0,0.0
2020-03-01 17:05:55,0.0822166999999999,0.1310839999999999,1.0863,-0.2732159999999999,87.6524,22.1208,231.673,77.0209,0.0
2020-03-01 17:05:56,0.0809726,0.138531,1.74242,0.054711,87.5537,22.1095,237.426,77.9794,0.0
2020-03-01 17:05:57,0.0817026,0.131594,2.00725,0.054711,87.5898,22.1081,245.298,77.0,0.0
2020-03-01 17:05:58,0.0809631,0.137071,1.7373900000000002,0.710565,87.6444,22.1146,231.648,77.0,0.0
2020-03-01 17:05:59,0.0825331,0.1314779999999999,1.72498,-0.2732159999999999,87.5463,22.1141,218.663,77.0,0.0
2020-03-01 17:06:00,0.0809574,0.1363869999999999,1.1151,0.382638,87.6603,22.1109,222.46,77.0209,0.0
2020-03-01 17:06:01,0.0813658,0.135952,1.75015,0.054711,87.6007,22.1115,232.336,77.9794,0.0
2020-03-01 17:06:02,0.0822315,0.131623,1.5794700000000002,-0.2732159999999999,87.6508,22.1206,239.017,77.0,0.0
2020-03-01 17:06:03,0.0807956,0.137159,1.52294,0.054711,87.4646,22.1125,235.288,76.9794,0.0
2020-03-01 17:06:04,0.0820882,0.131748,1.16239,0.382638,87.3678,22.1217,212.758,76.0209,0.0
2020-03-01 17:06:06,0.0808807,0.137444,1.5266,0.382638,87.3417,22.1217,238.886,77.0209,0.0
2020-03-01 17:06:07,0.0809051,0.135328,1.94449,0.054711,87.5039,22.1144,253.463,76.0209,0.0
2020-03-01 17:06:08,0.0817372,0.13295,2.18803,0.054711,87.1442,22.1248,240.274,77.0,0.0
2020-03-01 17:06:09,0.0818553,0.133049,1.91842,0.054711,87.0693,22.1201,233.014,77.0,0.0
2020-03-01 17:06:10,0.0811137,0.13737,1.64448,0.054711,87.3824,22.1144,216.502,77.0,0.0
2020-03-01 17:06:11,0.0820641,0.13042,2.11356,0.382638,87.1845,22.1154,227.972,77.0,0.0
2020-03-01 17:06:12,0.0812831,0.136579,2.02166,-0.601143,87.5789,22.1221,232.895,77.0209,0.0
2020-03-01 17:06:13,0.0824616,0.13219,1.30856,-0.2732159999999999,87.2461,22.1268,230.743,77.959,0.0
2020-03-01 17:06:14,0.0807302,0.136638,1.53079,-0.2732159999999999,87.0505,22.1268,215.675,76.0209,0.0
2020-03-01 17:06:15,0.0819689,0.132568,0.630733,-0.2732159999999999,87.1767,22.124,205.222,77.0209,0.0
2020-03-01 17:06:16,0.0816327999999999,0.1336619999999999,1.40154,-0.2732159999999999,87.1706,22.1317,230.662,77.9794,0.0
2020-03-01 17:06:17,0.0812794,0.1345859999999999,1.3627,0.054711,86.9513,22.1255,228.812,76.9794,0.0
2020-03-01 17:06:18,0.0822984,0.130313,1.96671,0.382638,87.0999,22.1328,230.595,76.042,0.0
2020-03-01 17:06:19,0.0810187,0.138258,1.47206,0.054711,86.8908,22.128,228.409,77.9794,0.0
2020-03-01 17:06:20,0.0817755,0.128983,1.90392,0.382638,87.1065,22.1307,231.439,77.0,0.0
2020-03-01 17:06:21,0.0812064,0.135567,1.3505200000000002,0.054711,87.0274,22.1301,232.303,77.0,0.0
2020-03-01 17:06:22,0.0821911999999999,0.130613,1.45997,0.054711,86.9833,22.1301,249.425,77.0,0.0
2020-03-01 17:06:24,0.0810779,0.135152,1.3080200000000002,-0.2732159999999999,87.0146,22.131,224.751,77.0,0.0
2020-03-01 17:06:25,0.0819904,0.131154,1.29607,0.710565,86.87100000000001,22.1298,230.914,77.0,0.0
2020-03-01 17:06:26,0.0809006,0.136064,1.68687,0.054711,86.7953,22.1189,225.224,77.0209,0.0
2020-03-01 17:06:27,0.0827609,0.129345,1.4372,0.382638,87.042,22.1202,240.09,77.959,0.0
2020-03-01 17:06:28,0.0809154,0.138261,0.616386,-0.2732159999999999,86.992,22.1339,204.709,76.0209,0.0
2020-03-01 17:06:29,0.0818253999999999,0.129127,1.31725,0.054711,86.8508,22.1247,232.144,77.0,0.0
2020-03-01 17:06:30,0.0816962,0.135147,1.43677,-0.2732159999999999,86.9075,22.1121,231.851,77.0,0.0
2020-03-01 17:06:31,0.0819012,0.131121,1.39415,-0.2732159999999999,87.0755,22.1257,223.82,77.0,0.0
2020-03-01 17:06:32,0.0819448,0.132263,0.601484,-0.2732159999999999,86.9726,22.1257,205.998,77.0209,0.0
2020-03-01 17:06:33,0.0815106,0.134748,0.621675,-0.2732159999999999,86.8188,22.1119,205.158,77.9794,0.0
2020-03-01 17:06:34,0.0818508,0.130018,1.35636,0.382638,86.6717,22.1161,221.232,77.0,0.0
2020-03-01 17:06:35,0.0810146,0.135217,1.39914,0.382638,86.9601,22.1146,250.05900000000003,77.0,0.0
2020-03-01 17:06:36,0.082587,0.131119,1.25713,0.382638,86.8674,22.1265,241.489,76.9794,0.0
2020-03-01 17:06:37,0.08108,0.134029,1.87459,0.054711,86.5205,22.1137,230.416,76.0209,0.0
2020-03-01 17:06:38,0.0816995,0.132218,1.32765,-0.601143,86.9283,22.1168,225.319,77.0,0.0
2020-03-01 17:06:39,0.0817898,0.130902,1.1717799999999998,-0.601143,86.8344,22.1168,227.795,77.0,0.0
2020-03-01 17:06:40,0.0812325,0.133658,1.19887,0.054711,86.8331,22.1263,242.334,77.0,0.0
2020-03-01 17:06:41,0.082658,0.130693,1.79742,0.054711,86.5595,22.119,220.577,77.0,0.0
2020-03-01 17:06:43,0.0808004,0.128773,1.11006,-0.601143,86.6579,22.1227,232.038,77.0209,0.0
2020-03-01 17:06:44,0.0811698,0.1358069999999999,2.16378,0.054711,86.59899999999999,22.123,246.276,77.9794,0.0
2020-03-01 17:06:45,0.0820447,0.131975,1.90905,0.054711,86.5221,22.1204,213.656,77.0,0.0
2020-03-01 17:06:46,0.0822057,0.132905,1.8069,0.054711,86.50299999999999,22.1173,243.007,77.0,0.0
2020-03-01 17:06:47,0.0809034,0.134169,1.93738,0.054711,86.5165,22.1147,213.063,76.9794,0.0
2020-03-01 17:06:48,0.0822008,0.130162,0.998302,0.382638,86.6179,22.1191,206.286,76.0209,0.0
2020-03-01 17:06:49,0.081189,0.136049,1.94116,0.054711,86.4635,22.1082,229.986,77.0,0.0
2020-03-01 17:06:50,0.0827909,0.130947,1.93587,0.054711,86.3825,22.1082,224.588,77.0,0.0
2020-03-01 17:06:51,0.0814979,0.134331,2.18798,0.382638,86.3844,22.1168,247.138,77.0,0.0
2020-03-01 17:06:52,0.0815547,0.132652,1.84669,0.382638,86.6782,22.1119,231.157,77.0,0.0
2020-03-01 17:06:53,0.0817141,0.131805,1.92573,0.382638,86.3952,22.1165,216.111,76.9794,0.0
2020-03-01 17:06:54,0.0814196,0.135127,1.40124,0.054711,86.6214,22.1157,218.015,76.042,0.0
2020-03-01 17:06:55,0.0825358,0.130915,1.29425,-0.2732159999999999,86.5005,22.1206,240.687,77.9794,0.0
2020-03-01 17:06:56,0.0810138999999999,0.135356,1.13893,0.054711,86.2982,22.1255,226.522,77.0,0.0
2020-03-01 17:06:57,0.0820136,0.129893,2.25818,0.054711,86.7282,22.1255,244.328,77.0,0.0
2020-03-01 17:06:58,0.0808455,0.136207,1.27362,0.054711,86.5971,22.1239,231.621,77.0,0.0
2020-03-01 17:06:59,0.0829703,0.131636,1.26434,-0.2732159999999999,86.5674,22.116,207.908,76.9794,0.0
2020-03-01 17:07:01,0.0818377,0.133839,1.71765,-0.601143,86.179,22.1208,225.595,76.0209,0.0
2020-03-01 17:07:02,0.0828366,0.130084,1.24546,-0.2732159999999999,86.6265,22.1196,232.754,77.0209,0.0
2020-03-01 17:07:03,0.080857,0.136539,1.24807,0.054711,86.5299,22.1132,219.21400000000003,77.9794,0.0
2020-03-01 17:07:04,0.0828111,0.131894,1.92655,0.382638,86.3995,22.1091,233.632,77.0,0.0
2020-03-01 17:07:05,0.0813861,0.1335319999999999,1.6852900000000002,0.054711,86.5381,22.1157,236.894,77.0,0.0
2020-03-01 17:07:06,0.0815498,0.131672,1.22838,0.054711,86.5069,22.1157,225.148,77.0,0.0
2020-03-01 17:07:07,0.0816746,0.13282,1.17621,0.054711,86.4766,22.1063,225.126,77.0,0.0
2020-03-01 17:07:08,0.0819544,0.1336,2.0066900000000003,-0.2732159999999999,86.1502,22.1036,225.395,77.0,0.0
2020-03-01 17:07:09,0.0820764,0.131707,0.659877,-0.2732159999999999,86.345,22.1168,247.598,77.0,0.0
2020-03-01 17:07:10,0.0809362,0.134911,0.666327,0.054711,86.4133,22.1176,214.759,77.0,0.0
2020-03-01 17:07:11,0.0824616,0.12827,1.15814,-0.2732159999999999,86.3359,22.1127,220.273,77.0,0.0
2020-03-01 17:07:12,0.0810903,0.136165,1.17456,0.054711,86.2946,22.1049,218.596,76.9794,0.0
2020-03-01 17:07:13,0.0829075,0.131996,1.82477,-0.2732159999999999,86.4453,22.1175,243.644,76.042,0.0
2020-03-01 17:07:14,0.0818365,0.13153,1.1455799999999998,-0.2732159999999999,86.3062,22.1175,234.567,77.9794,0.0
2020-03-01 17:07:15,0.0809916,0.133923,1.1627,0.054711,86.2634,22.1094,232.03,77.0,0.0
2020-03-01 17:07:16,0.0824561,0.129327,0.996409,0.710565,86.3004,22.1147,221.285,76.9794,0.0
2020-03-01 17:07:17,0.0810733,0.13627,0.745491,-0.2732159999999999,86.1906,22.1083,213.49400000000003,76.042,0.0
2020-03-01 17:07:18,0.0827692,0.130954,1.70154,0.054711,86.3663,22.1025,244.4,77.9794,0.0
2020-03-01 17:07:19,0.0809379,0.133661,1.87875,0.054711,86.2158,22.1042,229.239,77.0,0.0
2020-03-01 17:07:21,0.0822428,0.129838,0.958027,-0.2732159999999999,86.1374,22.1036,219.097,77.0,0.0
2020-03-01 17:07:22,0.0813488999999999,0.133674,1.5919,-0.2732159999999999,86.1925,22.1036,239.641,76.9794,0.0
2020-03-01 17:07:23,0.0823131999999999,0.130262,1.01778,0.054711,86.0863,22.1026,225.355,76.9794,0.0
2020-03-01 17:07:24,0.0807341999999999,0.134424,1.7145400000000002,-0.2732159999999999,86.124,22.0978,233.133,76.0209,0.0
2020-03-01 17:07:25,0.0825311,0.128092,1.70318,0.054711,85.9989,22.1065,231.32,77.0,0.0
2020-03-01 17:07:26,0.0813462,0.1353859999999999,1.0527799999999998,0.054711,85.988,22.1015,232.273,76.9794,0.0
2020-03-01 17:07:27,0.0822473,0.132678,1.48645,0.054711,86.3654,22.1028,223.409,76.0209,0.0
2020-03-01 17:07:28,0.0816831,0.130734,2.06783,0.054711,86.1297,22.1018,252.793,77.0,0.0
2020-03-01 17:07:29,0.0812808,0.132555,1.06145,0.054711,85.9818,22.1046,233.407,77.0,0.0
2020-03-01 17:07:30,0.0819786,0.1291759999999999,1.13855,0.054711,86.1963,22.1008,244.912,76.9794,0.0
2020-03-01 17:07:31,0.0809579,0.134482,2.13948,0.054711,86.009,22.1008,252.849,76.0209,0.0
2020-03-01 17:07:32,0.0824725,0.131743,2.15111,0.054711,86.0635,22.1056,253.859,76.9794,0.0
2020-03-01 17:07:33,0.0814765,0.130207,1.90283,0.382638,85.9279,22.1079,231.064,76.0209,0.0
2020-03-01 17:07:34,0.0813661,0.132445,1.09138,-0.2732159999999999,85.9379,22.0982,220.519,77.0,0.0
2020-03-01 17:07:35,0.0819395,0.129995,1.97283,-0.2732159999999999,85.9138,22.1006,225.942,77.0,0.0
2020-03-01 17:07:36,0.0807831,0.1347529999999999,1.11006,0.054711,85.9641,22.1092,234.178,76.9794,0.0
2020-03-01 17:07:37,0.0829097,0.132379,1.7869700000000002,0.054711,86.0857,22.0965,229.22,76.0209,0.0
2020-03-01 17:07:38,0.0812438,0.130733,1.00603,0.054711,85.9376,22.0965,226.518,77.0,0.0
2020-03-01 17:07:39,0.0814062,0.132723,1.22095,0.054711,86.2836,22.1047,228.45,76.9794,0.0
2020-03-01 17:07:41,0.0821723999999999,0.1355309999999999,1.09183,0.054711,85.9384,22.0907,226.333,77.0,0.0
2020-03-01 17:07:42,0.0830541,0.132491,2.18853,-0.2732159999999999,86.133,22.1021,234.448,77.0,0.0
2020-03-01 17:07:43,0.0810234,0.1312279999999999,1.88847,-0.601143,86.1861,22.102,231.239,77.0,0.0
2020-03-01 17:07:44,0.0818043,0.131854,1.73002,-0.2732159999999999,85.9075,22.0975,230.76,77.0,0.0
2020-03-01 17:07:45,0.082422,0.129948,1.10468,0.382638,86.0027,22.0955,214.604,77.0,0.0
2020-03-01 17:07:46,0.0807335,0.1377789999999999,2.04075,0.382638,86.0089,22.0996,239.68,77.0,0.0
2020-03-01 17:07:47,0.0827659,0.129197,2.02446,0.054711,85.9929,22.1001,242.11,77.0,0.0
2020-03-01 17:07:48,0.0810285,0.134921,2.21882,0.054711,86.0956,22.1001,224.094,77.0,0.0
2020-03-01 17:07:49,0.0817512,0.130923,1.7426,-0.601143,86.068,22.0941,232.829,77.0,0.0
2020-03-01 17:07:50,0.0816406,0.133903,1.8946,0.382638,85.9882,22.0989,212.932,77.0,0.0
2020-03-01 17:07:51,0.0826416,0.135823,1.7995599999999998,0.054711,85.9452,22.098000000000003,231.183,76.9794,0.0
2020-03-01 17:07:52,0.0814883999999999,0.1317569999999999,1.91965,0.054711,86.1079,22.0949,227.295,76.042,0.0
2020-03-01 17:07:53,0.0815081,0.1350559999999999,2.21307,0.054711,86.0615,22.1041,249.037,77.9794,0.0
2020-03-01 17:07:54,0.0824765,0.131078,1.92131,-0.601143,86.0313,22.0962,230.868,77.0,0.0
2020-03-01 17:07:55,0.081055,0.138762,1.72382,0.054711,85.5492,22.0975,233.074,76.9794,0.0
2020-03-01 17:07:56,0.0825963,0.132786,1.83652,0.054711,85.7405,22.0998,237.26,76.0209,0.0
2020-03-01 17:07:57,0.0816513999999999,0.134552,1.84398,0.054711,86.1016,22.0998,213.49,77.0209,0.0
2020-03-01 17:07:58,0.0815786,0.133016,1.7875,0.054711,85.5869,22.0958,226.958,77.9794,0.0
2020-03-01 17:08:00,0.0822171,0.13745,1.62234,-0.2732159999999999,86.0095,22.0961,226.611,76.0209,0.0
2020-03-01 17:08:01,0.0815253,0.1320619999999999,0.702021,0.382638,86.1253,22.0955,206.065,77.0,0.0
2020-03-01 17:08:02,0.0814264,0.135945,1.61588,-0.2732159999999999,85.5387,22.0926,227.962,77.0,0.0
2020-03-01 17:08:03,0.082739,0.130673,2.09963,0.382638,85.9337,22.0946,245.144,77.0,0.0
2020-03-01 17:08:04,0.0814605,0.13978,1.6760700000000002,0.054711,85.6385,22.1006,212.288,77.0209,0.0
2020-03-01 17:08:05,0.0823819,0.133205,0.6606920000000001,0.054711,85.7266,22.0968,223.159,77.9794,0.0
2020-03-01 17:08:06,0.0818476,0.133918,1.69737,0.054711,86.1239,22.0968,240.249,77.0,0.0
2020-03-01 17:08:07,0.0815733999999999,0.133253,1.6166200000000002,0.054711,85.7478,22.0915,233.965,77.0,0.0
2020-03-01 17:08:08,0.081744,0.1345589999999999,0.630005,0.054711,85.7523,22.0988,208.787,77.0,0.0
2020-03-01 17:08:09,0.0822978,0.136235,1.62869,0.054711,85.8966,22.09,234.669,77.0,0.0
2020-03-01 17:08:10,0.0817123,0.132349,0.797971,0.054711,85.6699,22.0811,215.814,77.0,0.0
2020-03-01 17:08:11,0.0811635,0.136183,1.09549,0.054711,86.3722,22.0854,228.2,77.0,0.0
2020-03-01 17:08:12,0.0826708999999999,0.130739,1.63152,0.054711,85.8876,22.0816,209.148,77.0211,0.0
2020-03-01 17:08:13,0.0813921,0.138574,1.85516,0.054711,85.8405,22.0872,223.413,77.9791,0.0
2020-03-01 17:08:14,0.0822755,0.134206,1.8434,-0.2732159999999999,85.7774,22.0932,229.959,77.0,0.0
2020-03-01 17:08:15,0.0819628999999999,0.133241,1.54106,-0.2732159999999999,85.8996,22.0932,230.014,77.0,0.0
2020-03-01 17:08:16,0.0814011,0.135642,1.59855,0.382638,85.83,22.0805,213.307,77.0211,0.0
2020-03-01 17:08:18,0.0817638,0.132118,1.08583,0.382638,85.9128,22.0841,224.77,77.9791,0.0
2020-03-01 17:08:19,0.081728,0.13136,1.55143,0.382638,86.0486,22.0901,224.646,77.0,0.0
2020-03-01 17:08:20,0.0815431,0.136121,1.88599,0.054711,86.0752,22.0904,226.874,76.9791,0.0
2020-03-01 17:08:21,0.0822758999999999,0.1305069999999999,1.85685,0.054711,86.1414,22.0797,220.381,76.0211,0.0
2020-03-01 17:08:22,0.0814871,0.138147,1.90182,-0.2732159999999999,86.1497,22.0931,250.639,77.0,0.0
2020-03-01 17:08:23,0.0821337,0.1340559999999999,1.05969,0.054711,86.015,22.0948,221.18,77.0211,0.0
2020-03-01 17:08:24,0.0822676,0.13359,0.686116,0.054711,86.0342,22.0948,215.552,77.9585,0.0
2020-03-01 17:08:25,0.0807278,0.136326,1.6561099999999995,-0.2732159999999999,86.3092,22.0941,240.937,76.0425,0.0
2020-03-01 17:08:26,0.0821398,0.13149,1.63798,0.382638,86.0476,22.0936,234.765,77.9791,0.0
2020-03-01 17:08:27,0.0815294,0.139191,1.36281,0.054711,86.1377,22.1044,221.792,77.0,0.0
2020-03-01 17:08:28,0.0818938,0.13166,1.58415,0.054711,86.0787,22.0923,239.087,77.0,0.0
2020-03-01 17:08:29,0.0817209,0.136347,1.41701,0.382638,86.461,22.0931,232.516,77.0,0.0
2020-03-01 17:08:30,0.0819757,0.132331,1.46581,0.710565,86.089,22.1006,216.292,77.0,0.0
2020-03-01 17:08:31,0.0812273,0.1365819999999999,1.48796,0.054711,86.0075,22.0956,224.575,77.0,0.0
2020-03-01 17:08:32,0.0821633999999999,0.1352529999999999,1.20326,0.054711,86.3196,22.0941,228.304,76.9791,0.0
2020-03-01 17:08:33,0.0825192,0.132872,1.60321,0.054711,86.2894,22.1029,241.771,76.0211,0.0
2020-03-01 17:08:34,0.0804616,0.136855,1.07475,0.054711,86.2382,22.1029,231.497,77.0,0.0
2020-03-01 17:08:35,0.082453,0.131303,1.42527,0.054711,86.18700000000001,22.1068,220.269,77.0211,0.0
2020-03-01 17:08:36,0.081202,0.138907,1.47254,0.054711,86.2029,22.0965,230.518,78.0,0.0
2020-03-01 17:08:38,0.0821623,0.133078,1.60398,0.054711,86.7501,22.1007,219.53,76.0211,0.0
2020-03-01 17:08:39,0.0815265,0.134095,1.2014,0.054711,86.3279,22.1057,214.075,77.0,0.0
2020-03-01 17:08:40,0.0818988,0.134304,1.62078,0.054711,86.2167,22.1057,242.463,77.0,0.0
2020-03-01 17:08:41,0.0822978,0.136971,1.92981,-0.601143,86.2495,22.1081,228.577,77.0211,0.0
2020-03-01 17:08:42,0.0822863,0.13247,1.36631,-0.601143,86.2716,22.1081,218.34,77.9791,0.0
2020-03-01 17:08:43,0.0806534,0.137803,1.39736,0.054711,86.3081,22.1093,252.822,77.0,0.0
2020-03-01 17:08:44,0.0825773,0.13146,1.4139,0.054711,86.4106,22.1083,225.48,77.0,0.0
2020-03-01 17:08:45,0.0814212,0.13808,1.3313700000000002,0.054711,86.3297,22.1049,211.376,77.0,0.0
2020-03-01 17:08:46,0.0819836,0.13413,1.24776,-0.601143,86.2751,22.1091,225.513,77.0,0.0
2020-03-01 17:08:47,0.0818803999999999,0.133841,1.4060700000000002,0.382638,86.3218,22.1178,240.805,77.0,0.0
2020-03-01 17:08:48,0.0813643,0.134891,1.43572,-0.601143,86.3236,22.1157,246.507,77.0211,0.0
2020-03-01 17:08:49,0.0818247,0.1343089999999999,1.35471,-0.2732159999999999,86.3565,22.1156,228.647,77.9791,0.0
2020-03-01 17:08:50,0.081713,0.1371369999999999,1.53176,0.054711,86.3711,22.1215,221.69,77.0,0.0
2020-03-01 17:08:51,0.0823846,0.13204,1.3955799999999998,0.054711,86.4025,22.1215,231.029,77.0,0.0
2020-03-01 17:08:52,0.0810008999999999,0.138589,1.65473,0.054711,86.4232,22.1045,218.681,77.0,0.0
2020-03-01 17:08:53,0.0826889,0.1317829999999999,2.06628,0.054711,86.404,22.126,223.291,77.0211,0.0
2020-03-01 17:08:54,0.0814379,0.137337,2.02358,0.054711,86.4355,22.1192,234.316,77.9791,0.0
2020-03-01 17:08:55,0.0817206,0.135552,1.47882,0.054711,86.3972,22.1159,230.055,77.0,0.0
2020-03-01 17:08:57,0.0821755,0.132915,1.59515,-0.601143,86.8162,22.1222,206.817,77.0211,0.0
2020-03-01 17:08:58,0.0821631999999999,0.132937,2.0108200000000003,0.054711,87.0111,22.1116,230.496,77.0,0.0
2020-03-01 17:08:59,0.0813045,0.138987,1.73171,0.054711,86.7721,22.1124,236.496,77.0,0.0
2020-03-01 17:09:00,0.0824826,0.13079,1.44359,0.054711,86.5489,22.1124,232.907,77.0,0.0
2020-03-01 17:09:01,0.0808074,0.139631,1.58666,0.054711,86.8713,22.1109,222.04,77.0,0.0
2020-03-01 17:09:02,0.0828539,0.13176,2.17275,0.054711,86.9748,22.1066,242.946,77.0211,0.0
2020-03-01 17:09:03,0.0816456,0.137754,1.54443,0.054711,87.0244,22.1129,205.946,77.9791,0.0
2020-03-01 17:09:04,0.0821127,0.135149,2.1511400000000003,0.054711,86.8449,22.1107,248.208,77.0,0.0
2020-03-01 17:09:05,0.0816672,0.134044,1.66953,0.054711,87.0033,22.1116,228.987,76.9791,0.0
2020-03-01 17:09:06,0.0818617,0.136154,0.986596,0.054711,87.0345,22.11,230.251,76.0211,0.0
2020-03-01 17:09:07,0.0824211,0.133293,1.66138,0.054711,86.9676,22.1012,229.956,77.0211,0.0
2020-03-01 17:09:08,0.0810607,0.139329,2.18753,0.054711,87.0023,22.1012,231.496,77.9585,0.0
2020-03-01 17:09:09,0.0823281999999999,0.130675,0.7846,-0.2732159999999999,86.9197,22.1172,215.864,76.0425,0.0
2020-03-01 17:09:10,0.0809541,0.139519,1.38139,-0.2732159999999999,86.9805,22.119,231.454,77.9585,0.0
2020-03-01 17:09:11,0.0826181,0.132627,1.69665,0.054711,87.0168,22.1042,230.086,76.0425,0.0
2020-03-01 17:09:12,0.0818111,0.136903,1.35794,0.054711,86.8789,22.1096,223.931,77.9791,0.0
2020-03-01 17:09:13,0.0817801,0.135552,2.00339,0.054711,86.9701,22.1211,228.778,77.0,0.0
2020-03-01 17:09:14,0.0819578,0.133435,1.43088,0.054711,86.9484,22.1168,252.44,77.0,0.0
2020-03-01 17:09:16,0.0817233,0.136214,1.52955,0.054711,87.1965,22.1078,235.122,77.0,0.0
2020-03-01 17:09:17,0.0821619,0.139587,0.613839,0.054711,87.0663,22.1078,205.802,77.0211,0.0
2020-03-01 17:09:18,0.0822693,0.131093,1.543,0.054711,86.9694,22.1115,240.507,77.9791,0.0
2020-03-01 17:09:19,0.0809561,0.138789,1.2876,0.054711,87.2464,22.1096,231.079,77.0211,0.0
2020-03-01 17:09:20,0.0826187,0.1329789999999999,1.93188,-0.2732159999999999,87.0633,22.1037,222.094,77.9791,0.0
2020-03-01 17:09:21,0.081554,0.13588,1.3493700000000002,0.054711,87.1567,22.1079,237.044,77.0211,0.0
2020-03-01 17:09:22,0.0814901,0.137063,1.32644,0.054711,87.1273,22.1168,229.715,77.9791,0.0
2020-03-01 17:09:23,0.0820993,0.1323099999999999,1.29843,0.382638,87.14,22.1106,230.616,77.0,0.0
2020-03-01 17:09:24,0.0812736,0.13756,1.42957,0.382638,87.0721,22.1106,244.097,77.0,0.0
2020-03-01 17:09:25,0.0826041999999999,0.133139,1.32559,0.054711,87.4262,22.1126,214.036,76.9791,0.0
2020-03-01 17:09:26,0.0811073,0.139468,1.26289,0.054711,87.3044,22.1113,226.512,76.0211,0.0
2020-03-01 17:09:27,0.082064,0.130357,1.69355,0.382638,87.2029,22.109,225.118,77.0,0.0
2020-03-01 17:09:28,0.0811412,0.138812,1.40552,0.054711,87.3073,22.1066,231.352,77.0,0.0
2020-03-01 17:09:29,0.0820838,0.133467,1.7133900000000002,0.382638,87.3415,22.1075,228.441,77.0,0.0
2020-03-01 17:09:30,0.0819255,0.135389,1.4001,0.054711,87.3816,22.1087,230.068,77.0,0.0
2020-03-01 17:09:31,0.0813697,0.137296,1.33785,0.054711,87.4381,22.1057,242.797,77.0,0.0
2020-03-01 17:09:32,0.0821138999999999,0.132453,1.53835,0.054711,87.459,22.1031,242.663,77.0,0.0
2020-03-01 17:09:33,0.0808613,0.137596,1.44006,-0.2732159999999999,87.3588,22.1048,234.123,77.0,0.0
2020-03-01 17:09:34,0.0826596,0.133842,1.32141,-0.2732159999999999,87.1953,22.1048,216.014,77.0,0.0
2020-03-01 17:09:35,0.0814669,0.137079,0.8971959999999999,-0.601143,87.4139,22.0975,228.778,77.0,0.0
2020-03-01 17:09:37,0.0816289,0.134239,1.81434,-0.2732159999999999,87.3371,22.1045,230.128,77.0,0.0
2020-03-01 17:09:38,0.0817541999999999,0.136224,1.32871,0.054711,87.6392,22.1089,227.906,77.0,0.0
2020-03-01 17:09:39,0.0826681,0.133011,1.43265,-0.2732159999999999,87.2123,22.1032,230.23,77.0,0.0
2020-03-01 17:09:40,0.0810439,0.139285,1.85193,0.054711,87.5986,22.1017,231.294,77.0211,0.0
2020-03-01 17:09:41,0.0820373,0.131277,2.00604,0.382638,87.6051,22.1148,230.863,77.9791,0.0
2020-03-01 17:09:42,0.0812813,0.137392,1.29699,0.054711,87.65299999999999,22.0993,226.63,77.0,0.0
2020-03-01 17:09:43,0.0829511,0.134745,1.16428,0.054711,87.5502,22.1,233.337,77.0,0.0
2020-03-01 17:09:44,0.081657,0.13632,1.86324,0.054711,87.5322,22.1,242.668,77.0,0.0
2020-03-01 17:09:45,0.0815103,0.134273,1.54245,0.382638,87.7437,22.1093,236.101,77.0211,0.0
2020-03-01 17:09:46,0.0819179999999999,0.1340849999999999,1.07926,-0.2732159999999999,87.4216,22.0999,228.168,77.9791,0.0
2020-03-01 17:09:47,0.0814343999999999,0.135931,1.47078,0.382638,87.6092,22.1143,235.333,77.0,0.0
2020-03-01 17:09:48,0.0829666999999999,0.132371,1.09301,0.054711,87.569,22.1085,230.863,77.0,0.0
2020-03-01 17:09:49,0.0807075,0.13945,1.6469900000000002,0.054711,87.5686,22.1046,233.477,77.0,0.0
2020-03-01 17:09:50,0.0819605,0.130711,2.25952,0.054711,87.5811,22.1023,245.694,77.0211,0.0
2020-03-01 17:09:51,0.0814899999999999,0.136791,1.51784,0.382638,87.5031,22.1015,227.104,77.9791,0.0
2020-03-01 17:09:52,0.0821118,0.1350829999999999,1.76784,0.382638,87.6047,22.0965,220.166,77.0,0.0
2020-03-01 17:09:53,0.0824054,0.1337559999999999,1.65992,0.382638,87.6722,22.0965,238.404,76.9791,0.0
2020-03-01 17:09:54,0.0809646999999999,0.138164,2.03062,0.054711,87.7076,22.1,230.787,76.0425,0.0
2020-03-01 17:09:56,0.0821636,0.131118,1.70743,0.054711,87.6363,22.0978,217.513,77.0,0.0
2020-03-01 17:09:57,0.0827321,0.134574,2.25278,0.054711,87.4633,22.1045,251.911,77.0,0.0
2020-03-01 17:09:58,0.0813433,0.136194,1.54579,0.382638,87.7538,22.0971,205.571,77.0,0.0
2020-03-01 17:09:59,0.08163,0.13449,1.7898,0.382638,87.2613,22.1003,241.777,77.0211,0.0
2020-03-01 17:10:00,0.0815898999999999,0.133972,1.63925,0.054711,87.6904,22.1039,214.72,77.9791,0.0
2020-03-01 17:10:01,0.0814155,0.137021,1.59873,0.054711,87.1536,22.0908,233.74,76.9791,0.0
2020-03-01 17:10:02,0.0828238,0.133353,1.68583,0.710565,87.2227,22.0955,231.832,76.0425,0.0
2020-03-01 17:10:03,0.0805342,0.138042,1.7554299999999998,0.054711,87.154,22.0905,232.403,77.9791,0.0
2020-03-01 17:10:04,0.0821735,0.131231,1.78581,0.054711,87.3178,22.0905,249.306,77.0,0.0
2020-03-01 17:10:05,0.0812821,0.135796,2.26851,0.710565,87.35799999999999,22.0977,252.08,77.0,0.0
2020-03-01 17:10:06,0.0814301,0.134938,0.6273529999999999,0.054711,87.5376,22.0964,212.459,77.0,0.0
2020-03-01 17:10:07,0.0826066,0.1320309999999999,1.5248,0.054711,87.6381,22.1036,231.475,77.0,0.0
2020-03-01 17:10:08,0.0805462,0.137014,1.66682,-0.2732159999999999,87.2843,22.1001,247.249,77.0,0.0
2020-03-01 17:10:09,0.0822045,0.130302,1.4009,0.382638,87.2817,22.0995,219.727,77.0,0.0
2020-03-01 17:10:10,0.0814557,0.136076,1.02915,0.054711,87.5024,22.0987,233.168,77.0,0.0
2020-03-01 17:10:11,0.0815402,0.135645,1.41839,-0.2732159999999999,87.546,22.1035,231.891,77.0,0.0
2020-03-01 17:10:12,0.0825251999999999,0.131264,1.87081,-0.2732159999999999,87.28299999999999,22.1023,237.327,76.9791,0.0
2020-03-01 17:10:13,0.0807465,0.138626,1.54533,0.054711,87.2669,22.099,216.562,76.0211,0.0
2020-03-01 17:10:15,0.0822816,0.131038,1.69938,0.054711,87.32,22.099,242.039,77.9585,0.0
2020-03-01 17:10:16,0.0823011999999999,0.135724,1.32452,-0.2732159999999999,87.3158,22.0966,250.595,76.0211,0.0
2020-03-01 17:10:17,0.0823469,0.132759,1.96502,-0.2732159999999999,87.5026,22.0801,228.047,77.0,0.0
2020-03-01 17:10:18,0.0812259999999999,0.137746,1.92587,-0.2732159999999999,87.3988,22.0976,226.668,77.0,0.0
2020-03-01 17:10:19,0.0820672,0.132164,1.18454,0.054711,87.4037,22.0935,214.612,77.0211,0.0
2020-03-01 17:10:20,0.0812733,0.138409,1.43078,0.054711,87.4034,22.0884,228.745,77.9791,0.0
2020-03-01 17:10:21,0.0825597,0.135572,1.23419,0.054711,87.4154,22.0946,241.157,77.0,0.0
2020-03-01 17:10:22,0.0811678,0.135293,1.63212,0.054711,87.4608,22.0875,249.443,77.0,0.0
2020-03-01 17:10:23,0.0815799,0.134298,1.20701,0.054711,87.3311,22.097,234.283,77.0,0.0
2020-03-01 17:10:24,0.0821779,0.134196,1.41079,0.054711,87.2964,22.0948,229.026,77.0,0.0
2020-03-01 17:10:25,0.081151,0.1388579999999999,1.25068,0.054711,87.2883,22.0948,231.425,77.0,0.0
2020-03-01 17:10:26,0.0830312,0.1333089999999999,1.27144,0.382638,87.3643,22.0987,235.234,77.0,0.0
2020-03-01 17:10:27,0.0806518,0.138588,1.14171,0.054711,87.4477,22.096,242.62,77.0211,0.0
2020-03-01 17:10:28,0.0824028,0.132363,1.33734,0.054711,87.436,22.0966,235.767,77.9791,0.0
2020-03-01 17:10:29,0.0814723,0.137727,0.673978,-0.2732159999999999,87.3325,22.1016,204.605,76.9791,0.0
2020-03-01 17:10:30,0.0817702,0.1363599999999999,1.84726,0.054711,87.5144,22.0991,227.665,76.0211,0.0
2020-03-01 17:10:31,0.0817318,0.132945,1.24849,0.054711,87.5241,22.103,236.29,77.0,0.0
2020-03-01 17:10:32,0.0810286,0.137989,1.71987,0.054711,87.4467,22.101,229.479,77.0211,0.0
2020-03-01 17:10:34,0.082185,0.131448,1.17815,0.054711,87.561,22.101,218.42,77.9791,0.0
2020-03-01 17:10:35,0.0811443,0.138545,1.63027,-0.2732159999999999,87.5757,22.0875,239.371,77.0,0.0
2020-03-01 17:10:36,0.0811143,0.133899,1.54769,0.054711,87.4527,22.1037,211.992,77.0211,0.0
2020-03-01 17:10:37,0.0815704,0.134929,1.15982,0.054711,87.3814,22.0922,220.883,77.9791,0.0
2020-03-01 17:10:38,0.0817937,0.1335569999999999,1.90362,0.382638,87.4763,22.0959,230.233,77.0,0.0
2020-03-01 17:10:39,0.0813086,0.137028,1.6999099999999998,0.054711,87.5027,22.0951,244.222,77.0,0.0
2020-03-01 17:10:40,0.0824638,0.132893,1.12235,0.054711,87.4813,22.0952,213.636,77.0,0.0
2020-03-01 17:10:41,0.0807799999999999,0.136685,1.76256,-0.2732159999999999,87.4215,22.0974,239.515,77.0,0.0
2020-03-01 17:10:42,0.0821191,0.130528,0.711288,0.054711,87.2595,22.1025,214.548,77.0211,0.0
2020-03-01 17:10:43,0.0811077,0.1366619999999999,2.1445,-0.601143,87.4202,22.1021,240.053,77.9585,0.0
2020-03-01 17:10:44,0.0817677,0.13622,1.90598,0.054711,87.5731,22.0959,230.497,76.0211,0.0
2020-03-01 17:10:45,0.0822765,0.131418,0.972083,0.054711,87.4839,22.0959,230.208,77.0,0.0
2020-03-01 17:10:46,0.0805284,0.1364109999999999,0.982249,0.054711,87.4517,22.0936,217.884,77.0,0.0
2020-03-01 17:10:47,0.0822416999999999,0.130457,1.1774,0.054711,87.2861,22.1031,240.604,77.0,0.0
2020-03-01 17:10:48,0.0808265,0.136654,1.7617200000000002,0.054711,87.397,22.0973,229.003,77.0,0.0
2020-03-01 17:10:49,0.0814511,0.1353849999999999,0.8667020000000001,0.054711,87.4497,22.087,214.023,76.9791,0.0
2020-03-01 17:10:50,0.0815284,0.131636,1.89302,-0.2732159999999999,87.2713,22.0978,205.947,76.0211,0.0
2020-03-01 17:10:51,0.0806325,0.13693,2.0348900000000003,0.382638,87.4584,22.0867,222.366,77.0,0.0
2020-03-01 17:10:52,0.0818672,0.130173,1.73833,-0.2732159999999999,87.3398,22.0952,236.125,77.0,0.0
2020-03-01 17:10:54,0.081135,0.135066,1.21326,-0.2732159999999999,87.5165,22.0952,230.474,77.0,0.0
2020-03-01 17:10:55,0.0816278,0.131435,0.706889,0.382638,87.336,22.082,209.913,77.0,0.0
2020-03-01 17:10:56,0.0807679,0.136171,1.97315,0.054711,87.8608,22.079,229.789,77.0,0.0
2020-03-01 17:10:57,0.0815256999999999,0.1318089999999999,0.979338,0.054711,87.4885,22.0929,222.041,77.0,0.0
2020-03-01 17:10:58,0.0812813,0.1339119999999999,2.16796,0.054711,87.212,22.0912,242.984,76.9791,0.0
2020-03-01 17:10:59,0.0814692,0.1375579999999999,2.11561,0.382638,87.4115,22.0886,229.203,76.0211,0.0
2020-03-01 17:11:00,0.0815463999999999,0.132403,1.86112,0.054711,87.3477,22.0866,230.364,77.0,0.0
2020-03-01 17:11:01,0.0808076,0.135973,1.93858,0.054711,87.7701,22.0866,204.755,77.0,0.0
2020-03-01 17:11:02,0.0820442,0.132864,1.77795,0.054711,87.3814,22.0969,216.891,77.0,0.0
2020-03-01 17:11:03,0.0813651,0.134596,1.00237,0.054711,87.9515,22.0856,221.313,77.0,0.0
2020-03-01 17:11:04,0.0818469,0.137405,1.67497,0.054711,87.7387,22.0843,226.216,77.0211,0.0
2020-03-01 17:11:05,0.0820873,0.131299,1.51936,-0.2732159999999999,87.314,22.0932,231.768,77.9791,0.0
2020-03-01 17:11:06,0.0804638,0.137537,1.79506,0.054711,87.7605,22.1014,233.079,77.0,0.0
2020-03-01 17:11:07,0.0821961,0.130967,1.84637,0.054711,87.6523,22.1015,245.112,77.0,0.0
2020-03-01 17:11:08,0.0813443,0.137642,1.81525,0.054711,87.7701,22.1015,234.186,77.0,0.0
2020-03-01 17:11:09,0.081625,0.136192,1.87913,0.054711,87.5495,22.0888,206.673,77.0211,0.0
2020-03-01 17:11:10,0.0821028,0.1302029999999999,1.86666,-0.601143,87.5457,22.0904,215.01,77.9791,0.0
2020-03-01 17:11:11,0.080885,0.136318,1.66983,0.054711,87.9225,22.0921,238.871,77.0,0.0
2020-03-01 17:11:13,0.0821118,0.1312839999999999,1.56028,0.054711,87.7106,22.0818,232.084,77.0,0.0
2020-03-01 17:11:14,0.0817978999999999,0.134181,1.6939400000000002,0.382638,87.6401,22.0933,235.164,77.9791,0.0
2020-03-01 17:11:15,0.0816056,0.132047,1.78422,-0.601143,87.5473,22.0828,242.045,77.0,0.0
2020-03-01 17:11:16,0.081191,0.135495,1.60064,0.054711,87.6137,22.0925,216.556,77.0,0.0
2020-03-01 17:11:17,0.08169,0.1325039999999999,1.81572,0.054711,87.7397,22.0929,212.63,77.0,0.0
2020-03-01 17:11:18,0.0810776,0.136927,1.19925,0.382638,87.6579,22.0929,250.223,77.0,0.0
2020-03-01 17:11:19,0.0820132,0.1323369999999999,1.09611,-0.2732159999999999,87.7387,22.0811,236.333,77.0,0.0
2020-03-01 17:11:20,0.0813065,0.133881,1.7205400000000002,-0.2732159999999999,87.6093,22.0875,242.433,77.0,0.0
2020-03-01 17:11:21,0.0815462,0.1333619999999999,1.97454,0.054711,87.6283,22.0867,250.056,77.0,0.0
2020-03-01 17:11:22,0.0814898999999999,0.131381,1.61714,-0.2732159999999999,87.40899999999999,22.0901,223.151,77.0,0.0
2020-03-01 17:11:23,0.0812573,0.137699,1.75027,0.054711,87.6093,22.0905,234.18400000000003,77.0,0.0
2020-03-01 17:11:24,0.0822982,0.1298,1.03194,0.054711,87.5947,22.0803,223.576,77.0,0.0
2020-03-01 17:11:25,0.0810097,0.1367,1.77605,0.054711,87.5257,22.0958,229.114,77.0,0.0
2020-03-01 17:11:26,0.0816508,0.130601,1.16154,0.054711,87.5989,22.0921,243.457,77.0,0.0
2020-03-01 17:11:27,0.0816776999999999,0.135024,1.09968,0.054711,87.7554,22.0921,235.296,77.0,0.0
2020-03-01 17:11:28,0.0814222,0.135798,1.84559,0.054711,87.5137,22.0886,246.421,77.0211,0.0
2020-03-01 17:11:29,0.0820722,0.130064,1.1903700000000002,-0.2732159999999999,87.4679,22.0818,245.999,77.9791,0.0
2020-03-01 17:11:30,0.0807314,0.135853,1.16104,0.054711,87.4265,22.0884,234.413,77.0,0.0
2020-03-01 17:11:31,0.0815868,0.130689,1.74299,-0.2732159999999999,87.536,22.0845,234.907,76.9791,0.0
2020-03-01 17:11:32,0.0815846,0.1351109999999999,1.67818,0.054711,87.571,22.0826,229.112,76.0,0.0
2020-03-01 17:11:34,0.0821305,0.131313,0.723003,-0.2732159999999999,87.4668,22.0763,219.368,75.9791,0.0
2020-03-01 17:11:35,0.0808587,0.133749,1.65455,-0.2732159999999999,87.3743,22.0763,236.734,75.0,0.0
2020-03-01 17:11:36,0.0816358,0.130011,1.60336,0.382638,87.3515,22.0892,231.556,74.9791,0.0
2020-03-01 17:11:37,0.0812938,0.133632,1.84917,0.054711,87.3137,22.0836,238.765,74.0211,0.0
2020-03-01 17:11:38,0.0812619,0.133786,1.57426,0.382638,87.2985,22.0739,239.292,75.0211,0.0
2020-03-01 17:11:39,0.0821253999999999,0.12954,1.7042700000000002,0.382638,87.5577,22.0804,231.319,75.9791,0.0
2020-03-01 17:11:40,0.0805128,0.135217,1.00013,-0.2732159999999999,87.5083,22.0823,233.295,75.0211,0.0
2020-03-01 17:11:41,0.0817216,0.129909,1.7234,0.054711,87.3412,22.0736,230.658,76.0,0.0
2020-03-01 17:11:42,0.0814235,0.132744,1.62661,0.054711,87.2653,22.079,222.515,76.0,0.0
2020-03-01 17:11:43,0.0815125,0.133957,0.804705,-0.2732159999999999,87.3114,22.079,214.806,76.0,0.0
2020-03-01 17:11:44,0.0824044,0.129384,0.918692,0.054711,87.4469,22.0787,212.824,75.9791,0.0
2020-03-01 17:11:45,0.0808279,0.135526,1.19684,0.054711,87.2894,22.0819,241.73,75.0211,0.0
2020-03-01 17:11:46,0.0820082,0.129638,1.02682,0.054711,87.4041,22.0825,228.15,75.9791,0.0
2020-03-01 17:11:47,0.081276,0.133915,2.06638,-0.2732159999999999,87.4579,22.0797,239.331,75.0211,0.0
2020-03-01 17:11:48,0.0814503999999999,0.133175,1.74355,0.054711,87.2853,22.0803,233.421,75.9791,0.0
2020-03-01 17:11:49,0.0820031,0.12962,1.73355,0.054711,87.1798,22.0814,214.691,75.0,0.0
2020-03-01 17:11:50,0.0805286,0.134725,1.7264700000000002,0.382638,87.4725,22.0749,237.268,75.0,0.0
2020-03-01 17:11:52,0.081893,0.128841,1.85619,0.382638,87.2282,22.0792,207.636,75.0,0.0
2020-03-01 17:11:53,0.0814564,0.133242,1.81376,0.382638,87.2724,22.0792,241.84,75.0,0.0
2020-03-01 17:11:54,0.0818699,0.128194,1.54519,0.054711,87.2533,22.0824,215.442,75.0,0.0
2020-03-01 17:11:55,0.0808133,0.1340829999999999,1.4239700000000002,0.382638,87.4016,22.0762,225.27,75.0,0.0
2020-03-01 17:11:56,0.0817851,0.130053,1.69253,0.054711,87.1821,22.0814,229.804,75.0211,0.0
2020-03-01 17:11:57,0.0813981,0.131539,1.94527,-0.2732159999999999,87.1743,22.0845,230.524,75.9791,0.0
2020-03-01 17:11:58,0.0812732,0.135259,2.19826,0.054711,87.2058,22.0792,211.08,75.0,0.0
2020-03-01 17:11:59,0.0814396,0.12946,2.2055,-0.2732159999999999,87.228,22.0848,243.495,75.0,0.0
2020-03-01 17:12:00,0.0818376,0.13038,1.53667,-0.2732159999999999,86.99600000000001,22.0848,225.09,75.0,0.0
2020-03-01 17:12:01,0.0807731,0.13377,1.92657,0.382638,87.0197,22.0775,227.137,75.0,0.0
2020-03-01 17:12:02,0.0825566,0.128717,1.51903,0.054711,86.9607,22.0774,229.667,75.0,0.0
2020-03-01 17:12:03,0.0807085,0.135289,2.34786,0.054711,87.0832,22.0854,254.065,75.0,0.0
2020-03-01 17:12:04,0.081286,0.1310329999999999,1.62519,0.054711,87.0005,22.0751,206.261,75.0211,0.0
2020-03-01 17:12:05,0.0817275,0.1292849999999999,1.62104,-0.601143,86.9317,22.0883,230.09,75.9791,0.0
2020-03-01 17:12:06,0.0806171,0.134216,1.5340200000000002,0.054711,86.5181,22.0866,224.215,75.0,0.0
2020-03-01 17:12:07,0.0823415,0.129069,1.97348,0.382638,86.4745,22.0807,230.632,75.0211,0.0
2020-03-01 17:12:08,0.0809058,0.1327549999999999,1.8010700000000002,0.382638,86.3811,22.0797,227.604,75.9791,0.0
2020-03-01 17:12:09,0.0816756,0.133689,1.45765,0.382638,86.3416,22.0797,231.072,75.0211,0.0
2020-03-01 17:12:11,0.0815893999999999,0.129497,1.6938099999999998,0.054711,86.7194,22.0853,230.672,76.0,0.0
2020-03-01 17:12:12,0.0819059,0.130017,1.4741,0.054711,86.3271,22.0882,223.663,75.0211,0.0
2020-03-01 17:12:13,0.0814088,0.129661,1.75511,-0.2732159999999999,86.8736,22.0853,230.429,75.9791,0.0
2020-03-01 17:12:14,0.080946,0.136148,1.76978,-0.2732159999999999,86.4303,22.0952,240.952,75.0,0.0
2020-03-01 17:12:15,0.0815268,0.128841,1.54355,0.054711,86.2547,22.0904,235.003,75.0211,0.0
2020-03-01 17:12:16,0.0815909,0.13132,0.812159,-0.2732159999999999,86.5238,22.0727,234.161,75.9791,0.0
2020-03-01 17:12:17,0.0807141,0.133035,1.75408,0.054711,86.6451,22.0847,220.979,75.0,0.0
2020-03-01 17:12:18,0.0825718,0.128377,0.706184,0.054711,86.2403,22.0873,219.177,75.0,0.0
2020-03-01 17:12:19,0.0802662,0.13244,1.84488,0.054711,86.1873,22.0873,243.969,75.0,0.0
2020-03-01 17:12:20,0.0813155,0.1312849999999999,1.94042,0.054711,86.2403,22.0845,242.005,75.0211,0.0
2020-03-01 17:12:21,0.0812373,0.128265,1.96717,-0.2732159999999999,86.7268,22.0773,230.853,75.9789,0.0
2020-03-01 17:12:22,0.0809486,0.13276,1.72921,0.054711,86.2103,22.0894,227.956,75.0,0.0
2020-03-01 17:12:23,0.0812055,0.130754,1.72475,0.054711,86.1246,22.0888,239.634,75.0214,0.0
2020-03-01 17:12:24,0.0822735,0.128331,1.70891,0.382638,86.1082,22.0858,207.011,75.9789,0.0
2020-03-01 17:12:25,0.0803385,0.131557,0.640734,0.054711,86.00399999999999,22.0804,219.029,75.0,0.0
2020-03-01 17:12:26,0.0805975,0.1279819999999999,1.13941,0.054711,85.9023,22.0865,230.011,75.0,0.0
2020-03-01 17:12:27,0.0805935,0.12695,1.6989599999999998,0.054711,86.1159,22.0799,233.681,75.0,0.0
2020-03-01 17:12:28,0.0807228999999999,0.126692,1.19226,-0.2732159999999999,85.9178,22.0823,232.383,74.9789,0.0
2020-03-01 17:12:29,0.081023,0.128437,1.18991,-0.2732159999999999,85.9937,22.0823,204.355,74.043,0.0
2020-03-01 17:12:31,0.0814763999999999,0.128651,1.7092900000000002,0.054711,85.8733,22.0896,226.066,74.0214,0.0
2020-03-01 17:12:32,0.0817801,0.1282579999999999,1.3333700000000002,0.710565,86.0166,22.0864,246.382,75.0,0.0
2020-03-01 17:12:33,0.0806157,0.1293119999999999,1.66359,-0.2732159999999999,85.8985,22.0866,240.448,75.0,0.0
2020-03-01 17:12:34,0.080703,0.1301109999999999,1.93139,-0.2732159999999999,85.8605,22.0785,231.978,74.9789,0.0
2020-03-01 17:12:35,0.0807967,0.128096,1.20768,0.054711,85.6969,22.0888,232.316,74.043,0.0
2020-03-01 17:12:36,0.0817566,0.128475,1.21738,0.382638,85.8722,22.0842,237.262,75.9789,0.0
2020-03-01 17:12:37,0.0799512,0.131248,1.1775799999999998,0.054711,85.7585,22.0903,242.736,74.9789,0.0
2020-03-01 17:12:38,0.0813735,0.128844,1.993,0.054711,85.7361,22.0789,232.725,74.0214,0.0
2020-03-01 17:12:39,0.0819997,0.1279269999999999,1.18288,0.054711,85.6952,22.0901,214.795,74.9789,0.0
2020-03-01 17:12:41,0.080569,0.130699,1.28123,0.054711,85.9142,22.0838,230.604,75.0,0.0
2020-03-01 17:12:42,0.0811816,0.127528,2.29987,-0.601143,85.8474,22.0817,253.741,74.9789,0.0
2020-03-01 17:12:43,0.0816494,0.12925,1.81596,-0.601143,85.7183,22.0828,226.79,74.0214,0.0
2020-03-01 17:12:44,0.0801468,0.131925,1.1611,0.382638,85.7911,22.0828,233.89,75.0,0.0
2020-03-01 17:12:45,0.0823095,0.127819,1.72225,0.054711,85.8459,22.0813,235.025,75.0,0.0
2020-03-01 17:12:46,0.0817756,0.129897,1.53136,-0.2732159999999999,85.6794,22.0881,252.742,75.0,0.0
2020-03-01 17:12:47,0.0813406,0.132302,1.45182,0.382638,85.859,22.0788,214.439,75.0,0.0
2020-03-01 17:12:48,0.0811828999999999,0.129897,1.39198,0.054711,85.79299999999999,22.0767,232.098,75.0,0.0
2020-03-01 17:12:49,0.0819924,0.127251,1.65713,0.382638,85.5478,22.0823,235.95,74.9789,0.0
2020-03-01 17:12:50,0.0804155,0.133827,1.30864,0.054711,85.6626,22.0815,229.13,74.0214,0.0
2020-03-01 17:12:51,0.0818748999999999,0.130198,1.47589,0.054711,85.7263,22.0811,205.103,75.0,0.0
2020-03-01 17:12:52,0.0817853,0.130046,1.3009,-0.2732159999999999,85.815,22.081,222.61900000000003,75.0,0.0
2020-03-01 17:12:53,0.0810587,0.132813,1.56428,-0.2732159999999999,85.7333,22.081,227.026,75.0,0.0
2020-03-01 17:12:54,0.080665,0.13082,1.10349,-0.2732159999999999,85.6824,22.0817,218.835,75.0,0.0
2020-03-01 17:12:55,0.0817654,0.127944,2.04532,0.382638,85.7215,22.0751,227.643,75.0,0.0
2020-03-01 17:12:56,0.0802003999999999,0.134815,1.71176,0.054711,85.775,22.0724,223.989,75.0,0.0
2020-03-01 17:12:57,0.0817866,0.13033,1.60719,0.382638,85.5748,22.084,238.189,74.9789,0.0
2020-03-01 17:12:58,0.0818166999999999,0.13109,1.6282299999999998,-0.2732159999999999,85.573,22.0918,205.041,74.0214,0.0
2020-03-01 17:13:00,0.0808464,0.13277,1.65785,0.054711,85.7593,22.0788,235.83,75.0,0.0
2020-03-01 17:13:01,0.0817323,0.1295859999999999,1.97425,-0.601143,85.649,22.0759,228.407,75.0,0.0
2020-03-01 17:13:02,0.0801883,0.134669,1.70046,-0.2732159999999999,85.5768,22.0753,227.75,75.0,0.0
2020-03-01 17:13:03,0.0821083,0.13114,1.91761,0.054711,86.0037,22.0711,222.031,75.0,0.0
2020-03-01 17:13:04,0.0815241,0.130854,1.7537900000000002,0.054711,85.8913,22.0711,238.663,75.0,0.0
2020-03-01 17:13:05,0.0802132,0.135215,1.7821599999999995,0.382638,85.7574,22.0857,225.752,74.9789,0.0
2020-03-01 17:13:06,0.0815193999999999,0.1295069999999999,1.32521,-0.2732159999999999,86.1247,22.0739,206.425,74.0214,0.0
2020-03-01 17:13:07,0.0815357,0.131667,1.80843,-0.2732159999999999,85.8379,22.0742,231.986,75.0,0.0
2020-03-01 17:13:08,0.0810923,0.134338,1.15669,0.054711,86.2574,22.0843,215.044,74.9789,0.0
2020-03-01 17:13:09,0.0828549,0.131638,2.14266,-0.601143,86.0675,22.0821,241.1,74.0,0.0
2020-03-01 17:13:10,0.0813726,0.131424,1.95333,-0.2732159999999999,86.02,22.0955,228.977,74.0214,0.0
2020-03-01 17:13:11,0.0807023,0.13342,1.86565,0.382638,85.9832,22.0831,236.915,74.9789,0.0
2020-03-01 17:13:12,0.0816012,0.128225,1.99902,0.054711,86.2246,22.0887,222.635,74.0214,0.0
2020-03-01 17:13:13,0.081221,0.134104,1.99641,0.054711,85.8419,22.102,238.979,75.0,0.0
2020-03-01 17:13:14,0.0809059999999999,0.134167,1.93837,-0.2732159999999999,86.1757,22.0919,224.371,74.9789,0.0
2020-03-01 17:13:15,0.0824559,0.129748,1.94392,-0.2732159999999999,86.2844,22.0919,230.902,74.0,0.0
2020-03-01 17:13:17,0.0807281,0.133876,0.930624,-0.2732159999999999,86.3448,22.0914,214.59,74.0214,0.0
2020-03-01 17:13:18,0.0812178,0.132132,1.86122,-0.2732159999999999,86.3217,22.0877,221.202,75.0,0.0
2020-03-01 17:13:19,0.0802896,0.135916,1.74564,0.054711,86.2999,22.0974,228.405,74.9789,0.0
2020-03-01 17:13:20,0.0824249,0.131264,1.72602,0.054711,86.4693,22.0788,217.485,74.0,0.0
2020-03-01 17:13:21,0.0810082,0.132616,1.96444,0.054711,86.3658,22.0912,245.691,74.0214,0.0
2020-03-01 17:13:22,0.0805543,0.133291,1.7504400000000002,0.054711,86.0207,22.0912,230.384,74.9789,0.0
2020-03-01 17:13:23,0.0821008999999999,0.128807,1.94461,0.054711,86.3624,22.0882,232.448,74.0214,0.0
2020-03-01 17:13:24,0.0805959,0.136113,0.843585,0.054711,86.3896,22.0894,224.349,74.9789,0.0
2020-03-01 17:13:25,0.0817033,0.133667,2.02001,0.054711,86.4716,22.098000000000003,225.335,74.0214,0.0
2020-03-01 17:13:26,0.0820277,0.130842,1.39848,0.054711,86.2435,22.0901,233.673,75.0,0.0
2020-03-01 17:13:27,0.0802901,0.134534,1.8599,0.382638,86.4967,22.0874,244.472,74.9789,0.0
2020-03-01 17:13:28,0.0817625,0.130815,1.33386,0.054711,86.4582,22.0911,234.823,74.0214,0.0
2020-03-01 17:13:29,0.0815201,0.131716,1.62148,0.382638,86.3892,22.0832,247.578,75.0,0.0
2020-03-01 17:13:30,0.0807948,0.136415,1.56324,0.382638,86.5707,22.0832,242.625,75.0,0.0
2020-03-01 17:13:31,0.0824813,0.132605,1.86643,0.054711,86.6185,22.0874,229.861,75.0,0.0
2020-03-01 17:13:32,0.0809225,0.1323119999999999,1.18864,0.382638,86.6119,22.0935,237.151,75.0,0.0
2020-03-01 17:13:33,0.0814488999999999,0.132484,1.80073,0.054711,86.4925,22.0908,243.718,75.0,0.0
2020-03-01 17:13:34,0.081713,0.131395,1.0338200000000002,0.054711,86.7081,22.0892,230.347,75.0214,0.0
2020-03-01 17:13:35,0.0802298999999999,0.135698,1.76915,-0.2732159999999999,86.554,22.0859,227.255,75.9789,0.0
2020-03-01 17:13:36,0.0823453,0.132328,1.05114,0.054711,86.5538,22.0959,233.221,75.0,0.0
2020-03-01 17:13:37,0.0810067,0.133547,2.15033,0.054711,86.6717,22.0959,248.471,74.9789,0.0
2020-03-01 17:13:38,0.0810291,0.134198,1.11189,-0.2732159999999999,86.7678,22.0939,237.186,74.043,0.0
2020-03-01 17:13:40,0.0820842,0.136688,1.86244,0.054711,86.6589,22.0927,233.117,74.0214,0.0
2020-03-01 17:13:41,0.0819971,0.133418,1.30339,-0.2732159999999999,86.6448,22.0911,252.485,75.0,0.0
2020-03-01 17:13:42,0.081566,0.131222,2.1276900000000003,0.054711,86.7775,22.092,246.567,75.0,0.0
2020-03-01 17:13:43,0.0808808999999999,0.135727,1.44034,0.054711,86.7255,22.0884,236.918,74.9789,0.0
2020-03-01 17:13:44,0.0820393,0.1297869999999999,1.39849,-0.2732159999999999,86.9672,22.0921,206.073,74.0214,0.0
2020-03-01 17:13:45,0.0810453999999999,0.134394,1.41878,0.382638,87.0085,22.0775,230.977,75.0,0.0
2020-03-01 17:13:46,0.0813261,0.136687,1.52522,0.382638,86.8437,22.0856,230.789,75.0,0.0
2020-03-01 17:13:47,0.0823124,0.131568,2.2476,0.382638,86.9084,22.0874,250.428,75.0,0.0
2020-03-01 17:13:48,0.0804997,0.135099,0.675114,0.054711,86.9789,22.0844,208.667,75.0,0.0
2020-03-01 17:13:49,0.0817863,0.131046,1.87087,0.054711,87.1439,22.0844,230.199,74.9789,0.0
2020-03-01 17:13:50,0.0821641,0.13194,1.80258,0.054711,86.94,22.0884,247.672,74.0,0.0
2020-03-01 17:13:51,0.0806003,0.1374119999999999,1.80526,0.382638,87.145,22.0756,237.142,74.0,0.0
2020-03-01 17:13:52,0.0823108,0.1313349999999999,2.25681,-0.2732159999999999,87.0926,22.0867,247.727,74.0214,0.0
2020-03-01 17:13:53,0.0810713999999999,0.132863,1.6675,-0.2732159999999999,87.0175,22.0899,226.707,74.9789,1.0
2020-03-01 17:13:54,0.0809063,0.133938,1.93375,0.054711,86.9714,22.0846,228.093,74.0214,0.0
2020-03-01 17:13:55,0.0820379,0.130604,1.90591,0.054711,86.9852,22.0915,236.032,74.9789,0.0
2020-03-01 17:13:57,0.0807731,0.136545,1.08906,-0.601143,87.0366,22.0952,232.067,74.0214,0.0
2020-03-01 17:13:58,0.0810728999999999,0.131966,1.1414,-0.601143,86.8146,22.0952,221.885,74.9789,0.0
2020-03-01 17:13:59,0.0809399,0.134601,1.90184,0.710565,87.1179,22.0792,225.394,74.0214,0.0
2020-03-01 17:14:00,0.0817929999999999,0.130945,1.9042,0.054711,87.1837,22.0891,224.942,75.0,0.0
2020-03-01 17:14:01,0.0812211,0.135048,1.85045,0.054711,87.287,22.0896,248.401,75.0,0.0
2020-03-01 17:14:02,0.0817097,0.135667,1.91817,0.054711,86.7999,22.0875,209.552,74.9789,0.0
2020-03-01 17:14:03,0.0812336999999999,0.130641,1.97248,0.710565,86.8625,22.0907,230.667,74.0214,0.0
2020-03-01 17:14:04,0.0812026999999999,0.135157,2.0508,0.054711,87.2514,22.0808,223.183,74.9789,0.0
2020-03-01 17:14:05,0.081671,0.133049,1.10321,0.382638,86.6801,22.0957,219.465,74.0214,0.0
2020-03-01 17:14:06,0.0814708,0.132298,2.13118,0.382638,87.1179,22.0957,243.558,75.0214,0.0
2020-03-01 17:14:07,0.081702,0.137226,2.04809,-0.2732159999999999,87.2509,22.1033,251.447,75.9581,0.0
2020-03-01 17:14:08,0.0815843999999999,0.1317549999999999,1.63603,0.054711,87.40299999999999,22.0905,232.497,74.0214,0.0
2020-03-01 17:14:09,0.081469,0.133406,2.23686,0.054711,87.2621,22.0916,241.552,75.0,0.0
2020-03-01 17:14:10,0.0812128,0.133865,1.9746,0.054711,87.39399999999999,22.1008,229.556,75.0,0.0
2020-03-01 17:14:11,0.0817294,0.131397,2.23722,-0.2732159999999999,87.3421,22.0961,250.07,75.0,0.0
2020-03-01 17:14:12,0.0815966,0.137787,2.05301,0.382638,87.3756,22.1051,232.314,74.9789,0.0
2020-03-01 17:14:13,0.0817341,0.1327289999999999,0.7628010000000001,0.054711,86.8767,22.107,206.121,74.0214,0.0
2020-03-01 17:14:14,0.081636,0.132801,1.6412099999999998,0.054711,86.991,22.107,227.624,75.0,0.0
2020-03-01 17:14:16,0.0812481,0.134341,1.72049,0.382638,86.884,22.1137,235.245,74.9789,0.0
2020-03-01 17:14:17,0.0809167,0.136228,1.87234,-0.2732159999999999,86.9666,22.1058,240.98,74.0214,0.0
2020-03-01 17:14:18,0.0815062,0.132968,1.25789,-0.601143,87.0996,22.1047,231.473,75.0,0.0
2020-03-01 17:14:19,0.0817388999999999,0.131388,1.50088,0.054711,86.992,22.1095,221.284,74.9789,0.0
2020-03-01 17:14:20,0.0804136999999999,0.135274,2.25597,0.054711,86.9829,22.1049,236.044,74.0214,0.0
2020-03-01 17:14:21,0.0814946,0.130824,1.91625,0.382638,86.9706,22.1052,242.937,75.0,0.0
2020-03-01 17:14:22,0.0812496,0.136178,1.6657400000000002,0.382638,87.1345,22.1052,212.129,75.0,0.0
2020-03-01 17:14:23,0.0814896,0.134232,2.08419,0.382638,86.96799999999999,22.1061,230.931,74.9789,0.0
2020-03-01 17:14:24,0.0820554,0.131639,1.55151,0.054711,87.1641,22.1076,226.961,74.0214,0.0
2020-03-01 17:14:25,0.0801713999999999,0.1363049999999999,1.6064,-0.2732159999999999,87.0542,22.1081,234.693,74.9789,0.0
2020-03-01 17:14:26,0.0816472,0.130677,1.87318,-0.601143,87.0748,22.1057,237.094,73.9789,0.0
2020-03-01 17:14:27,0.0811483,0.136552,1.83982,0.054711,87.0048,22.1102,252.477,73.0431,0.0
2020-03-01 17:14:28,0.0812618,0.134499,1.84093,0.382638,87.1211,22.1063,236.868,74.9789,0.0
2020-03-01 17:14:29,0.0821001,0.131172,1.64263,0.054711,87.0894,22.1064,234.604,74.0,0.0
2020-03-01 17:14:30,0.0803046,0.135536,1.88675,0.054711,87.0698,22.1095,228.897,74.0,0.0
2020-03-01 17:14:31,0.0818416999999999,0.129855,0.6866,0.054711,87.1491,22.0946,223.661,74.0,0.0
2020-03-01 17:14:32,0.0810807,0.136351,1.10409,0.054711,87.2024,22.0946,222.58900000000003,73.9789,0.0
2020-03-01 17:14:33,0.0813363999999999,0.135299,1.08924,0.054711,87.1764,22.0972,229.846,73.0214,0.0
2020-03-01 17:14:35,0.0816884,0.130681,0.985323,-0.2732159999999999,87.1246,22.1049,208.19,73.9789,0.0
2020-03-01 17:14:36,0.0813551,0.13089,1.0484,0.382638,87.0735,22.0942,227.811,74.0,0.0
2020-03-01 17:14:37,0.0812866,0.132826,0.940883,-0.2732159999999999,87.1177,22.098000000000003,216.716,73.9789,0.0
2020-03-01 17:14:38,0.0812633999999999,0.136918,1.7300799999999998,0.054711,87.2764,22.0979,220.515,73.0,0.0
2020-03-01 17:14:39,0.0817748,0.131122,0.8871540000000001,-0.601143,87.2686,22.1074,212.3,73.0,0.0
2020-03-01 17:14:40,0.0816958999999999,0.132666,0.8710540000000001,-0.601143,87.2694,22.1074,215.51,73.0,0.0
2020-03-01 17:14:41,0.0806888,0.134494,1.00779,0.054711,87.1317,22.1023,230.345,73.0,0.0
2020-03-01 17:14:42,0.0819049,0.129814,1.78337,-0.2732159999999999,87.0832,22.1012,236.384,73.0,0.0
2020-03-01 17:14:43,0.0804386,0.1366619999999999,1.51394,0.054711,87.1293,22.1008,237.777,73.0,0.0
2020-03-01 17:14:44,0.0817386,0.132813,1.02735,0.382638,87.1624,22.101,225.617,72.9789,0.0
2020-03-01 17:14:45,0.0820113,0.1315,1.69635,0.054711,87.0129,22.0976,229.429,72.0,0.0
2020-03-01 17:14:46,0.0802026,0.135904,1.54715,-0.2732159999999999,87.1518,22.1134,227.206,72.0214,0.0
2020-03-01 17:14:47,0.0820911999999999,0.130383,1.92894,-0.601143,87.0193,22.0996,230.635,72.9789,0.0
2020-03-01 17:14:48,0.0806528,0.135183,1.57174,-0.601143,87.8527,22.0996,231.925,72.0,0.0
2020-03-01 17:14:49,0.0819013,0.1346119999999999,1.86011,0.054711,87.2289,22.1085,217.661,72.0214,0.0
2020-03-01 17:14:50,0.0813945,0.130745,1.93937,-0.2732159999999999,87.2706,22.1082,235.849,72.9789,0.0
2020-03-01 17:14:51,0.0810113,0.134801,1.81291,0.054711,87.1181,22.0987,232.831,72.0214,0.0
2020-03-01 17:14:53,0.0810358,0.133679,1.85174,0.054711,87.2218,22.0938,233.174,72.9581,1.0
2020-03-01 17:14:54,0.0819853999999999,0.130175,2.21044,0.054711,87.0498,22.1164,253.117,71.9789,0.0
2020-03-01 17:14:55,0.0813636,0.13269,1.17249,0.054711,87.1908,22.0988,219.111,71.0431,0.0
2020-03-01 17:14:56,0.0818038,0.131289,2.03092,0.054711,87.2781,22.1026,252.819,72.9581,0.0
2020-03-01 17:14:57,0.0798858,0.1363349999999999,1.93115,0.054711,87.1487,22.1026,237.008,71.0,0.0
2020-03-01 17:14:58,0.0819824,0.1297839999999999,1.88897,0.054711,87.1947,22.1012,237.147,71.0,0.0
2020-03-01 17:14:59,0.080404,0.135148,1.65966,0.054711,87.3065,22.102,226.498,71.0,0.0
2020-03-01 17:15:00,0.0809001,0.13519,1.2416200000000002,-0.2732159999999999,87.2791,22.1017,225.857,71.0,0.0
2020-03-01 17:15:01,0.0814271999999999,0.12995,1.78463,-0.2732159999999999,87.3914,22.0914,219.727,71.0,0.0
2020-03-01 17:15:02,0.0811013,0.132777,2.28053,-0.2732159999999999,87.234,22.1046,249.928,70.9789,0.0
2020-03-01 17:15:03,0.0806565,0.134261,1.84192,0.054711,87.2135,22.0966,235.866,70.0214,0.0
2020-03-01 17:15:04,0.0813728,0.1304789999999999,1.98758,-0.2732159999999999,87.4881,22.1038,233.146,71.0,0.0
2020-03-01 17:15:05,0.080426,0.136495,1.94401,0.382638,87.3454,22.0976,212.733,71.0,0.0
2020-03-01 17:15:06,0.0810818,0.13208,2.11901,0.382638,87.65100000000001,22.0976,244.921,71.0,0.0
2020-03-01 17:15:07,0.0813883,0.130064,1.7704799999999998,0.054711,87.8466,22.0909,224.513,71.0,0.0
2020-03-01 17:15:08,0.0801677,0.136368,2.20861,-0.2732159999999999,87.7976,22.0992,244.48,71.0214,0.0
2020-03-01 17:15:09,0.0817092,0.130628,1.92298,-0.2732159999999999,87.2947,22.0947,230.86,71.9581,0.0
2020-03-01 17:15:10,0.0811878,0.132966,1.89358,-0.601143,87.5545,22.0957,231.342,70.0431,0.0
2020-03-01 17:15:12,0.0806692,0.136032,1.23802,-0.2732159999999999,87.8195,22.0965,253.193,71.9789,0.0
2020-03-01 17:15:13,0.0814173,0.131119,2.03457,0.054711,87.8107,22.0886,236.304,71.0,0.0
2020-03-01 17:15:14,0.0807432,0.135208,2.05924,-0.2732159999999999,87.9013,22.0945,241.977,71.0,0.0
2020-03-01 17:15:15,0.0821151,0.131029,1.95295,-0.2732159999999999,87.7165,22.0945,226.466,71.0214,0.0
2020-03-01 17:15:16,0.0806419999999999,0.135729,2.00435,-0.2732159999999999,87.8389,22.0899,226.295,71.9789,0.0
2020-03-01 17:15:17,0.0810568,0.132635,1.92417,0.382638,87.7481,22.0892,234.284,71.0,0.0
2020-03-01 17:15:18,0.0822548,0.130885,1.6664,0.382638,87.8497,22.0788,227.205,71.0,0.0
2020-03-01 17:15:19,0.0802845,0.135791,1.91763,-0.2732159999999999,87.8326,22.0874,227.3,71.0,0.0
2020-03-01 17:15:20,0.082111,0.130382,1.79656,0.054711,87.8615,22.0871,221.255,71.0,0.0
2020-03-01 17:15:21,0.0807855,0.1328609999999999,1.09742,0.382638,87.89299999999999,22.0807,236.383,71.0,0.0
2020-03-01 17:15:22,0.0811091,0.1350829999999999,1.68248,0.382638,87.7326,22.0807,231.356,71.0,0.0
2020-03-01 17:15:23,0.0812003,0.13007,1.22802,-0.601143,87.8526,22.0722,253.344,71.0,0.0
2020-03-01 17:15:24,0.0805661999999999,0.132487,1.58282,-0.2732159999999999,87.9128,22.0777,226.936,71.0214,0.0
2020-03-01 17:15:25,0.0807944,0.133286,1.26161,-0.2732159999999999,87.8701,22.0768,243.472,71.9789,0.0
2020-03-01 17:15:26,0.0813078999999999,0.131052,1.62692,0.054711,87.7278,22.0876,227.296,71.0,0.0
2020-03-01 17:15:27,0.0812309,0.135525,1.0892,0.054711,87.9267,22.0729,236.254,71.0,0.0
2020-03-01 17:15:28,0.0808513999999999,0.133697,1.72862,-0.2732159999999999,87.7697,22.0775,225.692,71.0,0.0
2020-03-01 17:15:29,0.0819706,0.130122,1.00127,-0.2732159999999999,87.7813,22.0818,225.154,71.0,0.0
2020-03-01 17:15:30,0.0804784,0.135706,1.10601,-0.2732159999999999,87.7787,22.0818,231.276,71.0,0.0
2020-03-01 17:15:31,0.0821443,0.130557,0.923711,0.054711,87.7215,22.0736,218.758,71.0214,0.0
2020-03-01 17:15:32,0.0809733,0.134006,1.06587,0.054711,87.9298,22.0788,232.265,72.0,0.0
2020-03-01 17:15:34,0.0813794,0.12858,1.04184,0.054711,88.0308,22.0835,221.426,71.0,0.0
2020-03-01 17:15:35,0.0801277,0.136368,1.75635,0.054711,87.9194,22.0862,227.844,71.0,0.0
2020-03-01 17:15:36,0.0817242,0.131598,1.53774,-0.2732159999999999,88.0438,22.0834,228.394,71.0,0.0
2020-03-01 17:15:37,0.0817263,0.131525,1.16878,-0.601143,87.9556,22.0792,235.297,71.0214,0.0
2020-03-01 17:15:38,0.080356,0.137823,1.14822,-0.601143,88.086,22.0792,233.842,71.9789,0.0
2020-03-01 17:15:39,0.0815583,0.129528,1.17256,-0.2732159999999999,87.9413,22.0765,221.54,71.0,0.0
2020-03-01 17:15:40,0.0812768,0.134011,1.28362,-0.2732159999999999,87.9244,22.084,206.828,71.0214,0.0
2020-03-01 17:15:41,0.0806164,0.135066,1.31211,0.054711,87.9399,22.0817,228.635,71.9789,0.0
2020-03-01 17:15:42,0.0823536,0.130482,1.31833,0.054711,88.133,22.0888,233.458,71.0,0.0
2020-03-01 17:15:43,0.080618,0.136032,1.45869,0.054711,88.0434,22.0752,210.904,71.0214,0.0
2020-03-01 17:15:44,0.0808454,0.132347,1.49567,0.054711,87.9521,22.0745,215.661,71.9789,0.0
2020-03-01 17:15:45,0.0818979,0.130902,1.95128,0.054711,88.0698,22.0786,223.318,71.0,0.0
2020-03-01 17:15:46,0.0801495,0.135901,1.65095,0.054711,87.8285,22.0786,227.401,71.0214,0.0
2020-03-01 17:15:47,0.0827487,0.130941,2.13048,-0.601143,87.9936,22.0751,225.614,71.9789,0.0
2020-03-01 17:15:48,0.0811171,0.134839,2.01114,0.054711,87.6487,22.0719,232.265,71.0,0.0
2020-03-01 17:15:49,0.0800679,0.133653,1.90338,-0.2732159999999999,88.0253,22.0735,223.924,71.0214,0.0
2020-03-01 17:15:50,0.081867,0.1297849999999999,1.53873,0.054711,87.8053,22.0831,223.63,71.9789,0.0
2020-03-01 17:15:52,0.0800086,0.1318119999999999,1.68989,0.054711,87.9374,22.0769,225.57,71.0,0.0
2020-03-01 17:15:53,0.0816821,0.133146,1.16134,0.382638,87.9666,22.0835,231.011,71.0214,0.0
2020-03-01 17:15:54,0.0804472,0.1361109999999999,1.96625,0.054711,87.5377,22.0762,232.898,71.9789,0.0
2020-03-01 17:15:55,0.0817451,0.1295869999999999,1.7321799999999998,0.054711,87.2797,22.0639,216.051,71.0214,0.0
2020-03-01 17:15:56,0.0810032,0.135025,1.98741,0.054711,87.5128,22.0639,235.081,71.9789,0.0
2020-03-01 17:15:57,0.0814398,0.133028,1.50498,0.054711,87.3655,22.0856,221.21,71.0,0.0
2020-03-01 17:15:58,0.082015,0.131698,1.95858,0.054711,87.3962,22.0821,242.918,71.0214,0.0
2020-03-01 17:15:59,0.0804637,0.135316,1.82722,0.054711,87.6744,22.0869,237.399,71.9789,0.0
2020-03-01 17:16:00,0.0810114,0.13107,1.09223,0.054711,87.2321,22.0953,235.38,71.0214,0.0
2020-03-01 17:16:01,0.0812332,0.132188,1.7427700000000002,0.382638,87.32600000000001,22.0833,229.04,71.9789,0.0
2020-03-01 17:16:02,0.080602,0.135725,0.939047,0.054711,87.1425,22.0859,218.749,71.0,0.0
2020-03-01 17:16:03,0.0823909,0.131971,2.0098,0.054711,87.2038,22.0859,239.239,71.0214,0.0
2020-03-01 17:16:04,0.0810445,0.132616,1.7646,0.054711,87.3242,22.0696,224.503,71.9789,0.0
2020-03-01 17:16:05,0.0806447,0.133885,0.795895,0.382638,87.3304,22.0785,212.944,71.0214,0.0
2020-03-01 17:16:06,0.0818529,0.1303,1.80506,0.382638,87.3023,22.076,228.342,71.9789,0.0
2020-03-01 17:16:07,0.0808549,0.136245,1.67413,0.054711,87.3751,22.0718,221.799,71.0,0.0
2020-03-01 17:16:08,0.0815919,0.133385,2.06765,0.054711,87.3059,22.0803,235.506,71.0214,0.0
2020-03-01 17:16:10,0.08189,0.130441,0.758714,0.382638,87.3055,22.0755,216.757,71.9789,0.0
2020-03-01 17:16:11,0.0816858,0.129276,0.970366,-0.2732159999999999,87.2673,22.0708,207.038,71.0,0.0
2020-03-01 17:16:12,0.0815651999999999,0.132897,1.39953,-0.2732159999999999,87.3273,22.0708,236.642,71.0,0.0
2020-03-01 17:16:13,0.0807169,0.136346,1.04109,0.710565,87.3377,22.0777,218.166,71.0214,0.0
2020-03-01 17:16:14,0.0823141999999999,0.130476,1.03523,0.382638,87.3228,22.0635,225.179,71.9789,0.0
2020-03-01 17:16:15,0.0804735,0.13467,1.7667400000000002,0.054711,87.2959,22.079,240.675,71.0214,0.0
2020-03-01 17:16:16,0.0811672,0.131173,1.19204,0.054711,87.1766,22.0684,232.622,71.9789,0.0
2020-03-01 17:16:17,0.0819516999999999,0.130751,1.12826,0.382638,87.1582,22.0595,228.479,71.0214,0.0
2020-03-01 17:16:18,0.0802223,0.1345319999999999,1.06003,0.710565,87.1566,22.0723,209.414,71.9789,0.0
2020-03-01 17:16:19,0.0825615,0.131674,1.16516,0.382638,87.2234,22.0656,228.533,71.0,0.0
2020-03-01 17:16:20,0.0810865,0.132793,1.16566,0.054711,87.1243,22.0665,235.004,71.0214,0.0
2020-03-01 17:16:21,0.0808812,0.13314,0.652378,0.054711,87.2726,22.0665,253.051,71.9789,0.0
2020-03-01 17:16:22,0.0816273999999999,0.129765,1.19845,0.382638,87.1581,22.0857,204.862,71.0,0.0
2020-03-01 17:16:23,0.0808052,0.1345869999999999,0.6357189999999999,-0.2732159999999999,87.2253,22.0699,207.079,71.0214,0.0
2020-03-01 17:16:24,0.0817233999999999,0.132213,1.36226,-0.2732159999999999,87.1058,22.0748,230.973,71.9789,0.0
2020-03-01 17:16:25,0.0814802,0.131418,1.19436,0.054711,87.2616,22.0615,228.52,71.0,0.0
2020-03-01 17:16:26,0.0811629,0.134269,1.2294200000000002,-0.2732159999999999,87.1294,22.0754,216.297,71.0214,0.0
2020-03-01 17:16:27,0.0814472,0.129464,0.97709,0.054711,87.1376,22.0723,218.508,71.9789,0.0
2020-03-01 17:16:29,0.0812405,0.135366,1.33411,0.054711,87.0434,22.0723,228.264,71.9789,0.0
2020-03-01 17:16:30,0.0821108,0.130218,1.28786,-0.2732159999999999,87.2177,22.0613,227.627,71.0214,0.0
2020-03-01 17:16:31,0.0810376999999999,0.13143,1.09315,0.054711,87.0038,22.0688,227.392,72.0,0.0
2020-03-01 17:16:32,0.0809922,0.132177,1.61521,-0.2732159999999999,87.0893,22.0689,245.988,71.9787,0.0
2020-03-01 17:16:33,0.0820263,0.129878,1.64969,-0.2732159999999999,86.9571,22.0712,247.98,71.0,0.0
2020-03-01 17:16:34,0.0805396,0.135799,2.01419,0.382638,86.9553,22.069000000000003,230.403,71.0,0.0
2020-03-01 17:16:35,0.0821568999999999,0.131957,1.80589,0.054711,86.8981,22.0723,228.605,71.0216,0.0
2020-03-01 17:16:36,0.0815725,0.130125,0.697162,0.054711,86.8752,22.0656,217.034,71.9787,0.0
2020-03-01 17:16:37,0.0804148,0.132709,1.86687,0.382638,86.9475,22.0664,221.73,71.0216,0.0
2020-03-01 17:16:38,0.0821088,0.1282859999999999,1.56284,0.382638,86.7766,22.0722,221.913,71.9787,0.0
2020-03-01 17:16:39,0.0807039,0.135784,2.03161,0.382638,86.7626,22.0722,229.76,71.0,0.0
2020-03-01 17:16:40,0.0820766,0.13283,1.63209,0.054711,86.8469,22.0708,234.142,71.0216,0.0
2020-03-01 17:16:41,0.0817218,0.1291759999999999,2.05477,0.054711,86.7793,22.0735,227.29,71.9787,0.0
2020-03-01 17:16:42,0.080797,0.134217,2.33121,0.054711,86.7662,22.0684,249.958,71.0,0.0
2020-03-01 17:16:43,0.0820438,0.128216,1.02154,0.054711,86.81299999999999,22.0648,230.831,71.0216,0.0
2020-03-01 17:16:44,0.0808059999999999,0.134264,1.4413200000000002,0.054711,86.8115,22.0612,227.737,71.9787,0.0
2020-03-01 17:16:45,0.0815095,0.1336119999999999,1.87253,0.054711,86.6575,22.0724,205.531,71.0,0.0
2020-03-01 17:16:46,0.0818005,0.129821,1.78723,-0.2732159999999999,86.87799999999999,22.0598,228.401,71.0216,0.0
2020-03-01 17:16:48,0.080646,0.133553,1.76138,-0.2732159999999999,86.7831,22.0608,231.159,71.9787,0.0
2020-03-01 17:16:49,0.081817,0.1302579999999999,2.01216,-0.2732159999999999,86.6389,22.0604,230.698,71.0,0.0
2020-03-01 17:16:50,0.0809314,0.135067,1.71984,-0.2732159999999999,86.7152,22.0604,233.466,71.0216,0.0
2020-03-01 17:16:51,0.0820735,0.1306369999999999,1.7434599999999998,0.054711,86.5311,22.0708,231.221,72.0,0.0
2020-03-01 17:16:52,0.0812713,0.130372,1.92583,0.054711,86.5582,22.0619,228.91,71.9787,0.0
2020-03-01 17:16:53,0.080826,0.133368,1.11665,0.054711,86.5393,22.0658,208.697,71.0216,0.0
2020-03-01 17:16:54,0.0820765,0.129264,1.91813,-0.2732159999999999,86.4892,22.0545,235.327,72.0,0.0
2020-03-01 17:16:55,0.0809543,0.133677,1.7439099999999998,-0.601143,86.5309,22.0621,224.872,71.9787,0.0
2020-03-01 17:16:56,0.08179,0.132662,1.97257,0.382638,86.7052,22.0665,238.617,71.0216,0.0
2020-03-01 17:16:57,0.0816614,0.128667,1.9038,0.054711,86.5415,22.0627,228.607,71.9787,0.0
2020-03-01 17:16:58,0.0806216,0.133876,1.60057,0.054711,86.4179,22.0627,223.764,71.0216,0.0
2020-03-01 17:16:59,0.081977,0.128361,1.7290900000000002,0.054711,86.5559,22.07,224.843,71.9787,0.0
2020-03-01 17:17:00,0.0812447,0.132963,2.22175,0.054711,86.7474,22.062,247.476,71.0216,0.0
2020-03-01 17:17:01,0.0815768,0.1335849999999999,1.8453,0.054711,86.3599,22.0682,224.655,72.0,0.0
2020-03-01 17:17:02,0.0818791,0.128499,1.95525,0.054711,86.4127,22.0677,230.345,71.9787,0.0
2020-03-01 17:17:03,0.0805776999999999,0.133608,1.20346,0.054711,86.8529,22.0653,207.328,71.0,0.0
2020-03-01 17:17:04,0.0818218999999999,0.129745,1.78567,0.710565,86.7783,22.0619,231.068,71.0216,0.0
2020-03-01 17:17:05,0.0814939,0.1292559999999999,1.71838,0.054711,86.6962,22.0614,230.054,72.0,0.0
2020-03-01 17:17:07,0.0813206,0.135482,1.862,0.054711,86.5274,22.0614,231.625,71.9787,0.0
2020-03-01 17:17:08,0.0813373,0.129473,1.74553,0.382638,86.2856,22.0607,215.867,71.9787,0.0
2020-03-01 17:17:09,0.0810506999999999,0.132183,1.76007,0.054711,86.3939,22.0757,231.854,71.0216,0.0
2020-03-01 17:17:10,0.0815159,0.129364,1.93409,0.054711,86.8092,22.0579,209.421,72.0,0.0
2020-03-01 17:17:11,0.0815108,0.13477,1.89558,0.382638,86.4419,22.0708,236.223,71.9787,0.0
2020-03-01 17:17:12,0.0820064,0.131339,1.56691,-0.2732159999999999,86.6638,22.0732,226.074,71.0216,0.0
2020-03-01 17:17:13,0.0816085,0.12974,1.31041,-0.2732159999999999,86.59700000000001,22.0666,224.665,72.0,0.0
2020-03-01 17:17:14,0.0809355,0.13354,1.76465,-0.2732159999999999,86.5271,22.0792,228.379,72.0,0.0
2020-03-01 17:17:15,0.0818466,0.128004,1.69757,0.054711,86.2899,22.0675,230.829,71.9787,0.0
2020-03-01 17:17:16,0.0816988,0.132824,1.57144,0.054711,86.1742,22.0675,227.132,71.0216,0.0
2020-03-01 17:17:17,0.0817236,0.133627,1.04174,0.382638,86.3744,22.0685,226.09,71.9787,0.0
2020-03-01 17:17:18,0.0817113,0.128238,1.24473,-0.601143,86.5094,22.0745,226.526,71.0216,0.0
2020-03-01 17:17:19,0.0812428999999999,0.135065,1.24344,0.054711,86.5968,22.0708,252.146,71.9787,0.0
2020-03-01 17:17:20,0.0814998,0.128955,1.22048,0.382638,86.3641,22.0801,251.253,71.0216,0.0
2020-03-01 17:17:21,0.0816393,0.1315609999999999,0.827356,0.382638,86.462,22.0767,215.013,72.0,0.0
2020-03-01 17:17:22,0.0811651,0.135509,1.02372,0.382638,86.4216,22.0767,233.05900000000003,72.0,0.0
2020-03-01 17:17:23,0.081936,0.128195,1.20891,0.054711,86.4219,22.078000000000003,240.621,72.0,0.0
2020-03-01 17:17:24,0.0817007,0.133077,1.02042,0.054711,86.2217,22.0822,233.784,72.0216,0.0
2020-03-01 17:17:25,0.0815817,0.13021,2.00592,0.054711,86.355,22.0806,252.74400000000003,72.9787,0.0
2020-03-01 17:17:26,0.0821835,0.128781,1.17323,0.054711,86.4274,22.0864,250.538,71.9787,0.0
2020-03-01 17:17:27,0.0810578,0.135975,0.844669,-0.2732159999999999,86.3917,22.0831,216.811,71.0216,0.0
2020-03-01 17:17:29,0.082383,0.129415,1.95088,0.382638,86.266,22.0886,236.003,72.0,0.0
2020-03-01 17:17:30,0.0811075,0.131698,0.8681200000000001,0.054711,86.5479,22.0813,229.205,71.0216,0.0
2020-03-01 17:17:31,0.0820167,0.129407,1.8181,0.054711,86.46700000000001,22.0813,230.406,72.0,0.0
2020-03-01 17:17:32,0.0808227,0.134681,1.86726,0.054711,86.5727,22.0819,235.576,71.9787,0.0
2020-03-01 17:17:33,0.0818679,0.130574,1.79729,0.710565,86.3805,22.0981,230.763,71.0216,0.0
2020-03-01 17:17:34,0.0819411999999999,0.129591,1.6867599999999998,-0.2732159999999999,86.2598,22.0943,224.401,72.0,0.0
2020-03-01 17:17:35,0.080465,0.132113,1.89922,-0.2732159999999999,86.3032,22.0935,214.216,72.0,0.0
2020-03-01 17:17:36,0.0816786999999999,0.129141,1.07154,0.382638,86.3703,22.0947,236.414,72.0,0.0
2020-03-01 17:17:37,0.0810945,0.131989,2.07487,0.382638,86.5165,22.0972,249.377,72.0,0.0
2020-03-01 17:17:38,0.0818712,0.131926,1.7883,0.054711,86.4056,22.0928,235.155,72.0,0.0
2020-03-01 17:17:39,0.0822161,0.128581,0.996583,0.054711,86.3105,22.0947,222.442,72.0,0.0
2020-03-01 17:17:40,0.0817643999999999,0.1328349999999999,1.8279,0.054711,86.50399999999999,22.0947,230.965,72.0,0.0
2020-03-01 17:17:41,0.0821117,0.130648,1.79831,-0.2732159999999999,86.4072,22.103,231.333,72.0,0.0
2020-03-01 17:17:42,0.0823471,0.130885,1.81629,0.054711,86.4214,22.1042,239.986,72.0,0.0
2020-03-01 17:17:43,0.0818996,0.135007,1.94497,0.382638,86.3373,22.1011,244.749,72.0,0.0
2020-03-01 17:17:44,0.0819299999999999,0.12813,1.63231,0.054711,86.5267,22.1058,219.21400000000003,72.0,0.0
2020-03-01 17:17:45,0.0814849,0.134522,2.11786,-0.2732159999999999,86.4328,22.1151,239.326,72.0216,0.0
2020-03-01 17:17:46,0.0812775,0.131856,2.02771,-0.2732159999999999,86.4413,22.1037,251.033,72.9787,0.0
2020-03-01 17:17:47,0.0825677,0.12814,1.8304,0.382638,86.4267,22.1114,231.251,72.0,0.0
2020-03-01 17:17:49,0.080912,0.1362809999999999,1.67775,0.382638,85.8818,22.1114,231.235,72.0,0.0
2020-03-01 17:17:50,0.0815181,0.132403,1.6689599999999998,0.054711,86.4269,22.1045,226.643,72.0,0.0
2020-03-01 17:17:51,0.0809311,0.133215,1.82167,-0.601143,86.6059,22.1024,218.283,72.0,0.0
2020-03-01 17:17:52,0.0823388999999999,0.129047,1.70551,0.382638,86.4072,22.1009,232.012,72.0,0.0
2020-03-01 17:17:53,0.08058,0.1353339999999999,1.85184,0.382638,86.508,22.1021,236.137,72.0,0.0
2020-03-01 17:17:54,0.0819888999999999,0.131883,1.90458,0.054711,86.486,22.0973,227.293,72.0,0.0
2020-03-01 17:17:55,0.0821235,0.130028,1.5393,0.054711,86.5432,22.1059,225.94,71.9787,0.0
2020-03-01 17:17:56,0.080849,0.134169,1.98274,-0.2732159999999999,86.446,22.0909,232.13,71.0216,0.0
2020-03-01 17:17:57,0.0825074,0.130002,1.79795,-0.2732159999999999,86.4209,22.0909,208.601,72.0,0.0
2020-03-01 17:17:58,0.0818553,0.133451,1.86529,0.382638,86.4524,22.0972,225.577,72.0216,0.0
2020-03-01 17:17:59,0.0814167,0.133786,1.94988,0.054711,86.1785,22.1023,241.22,72.9576,0.0
2020-03-01 17:18:00,0.0822217,0.129083,1.94894,0.382638,86.5512,22.0982,235.336,71.0216,0.0
2020-03-01 17:18:01,0.0808514999999999,0.135904,2.01015,-0.2732159999999999,86.0391,22.1117,222.655,72.0,0.0
2020-03-01 17:18:02,0.0820861,0.130394,2.075,0.054711,86.3954,22.0953,235.38,71.9787,0.0
2020-03-01 17:18:03,0.0820687,0.131149,1.83567,0.382638,86.6926,22.0998,224.609,71.0216,0.0
2020-03-01 17:18:04,0.0809406,0.136275,1.5104,0.382638,85.9515,22.1105,204.909,72.0,0.0
2020-03-01 17:18:05,0.0822719,0.129419,1.52832,0.054711,86.5268,22.0961,212.474,72.0,0.0
2020-03-01 17:18:06,0.0815753,0.134044,1.45805,0.054711,86.0635,22.0961,228.699,72.0,0.0
2020-03-01 17:18:08,0.0817447999999999,0.132144,1.82966,0.054711,86.1273,22.1063,216.666,72.0,0.0
2020-03-01 17:18:09,0.0809193,0.136607,1.43723,0.382638,86.2046,22.0921,235.174,72.0,0.0
2020-03-01 17:18:10,0.0819184,0.13071,1.37139,0.054711,86.4872,22.0971,230.162,72.0,0.0
2020-03-01 17:18:11,0.0818134,0.131161,1.42517,0.054711,86.3875,22.0932,221.034,71.9787,0.0
2020-03-01 17:18:12,0.0811091,0.135217,1.07246,0.382638,86.4519,22.0961,223.509,71.0216,0.0
2020-03-01 17:18:13,0.0824843,0.130959,1.65179,0.710565,86.2415,22.1004,219.866,72.0,0.0
2020-03-01 17:18:14,0.0810786,0.1330829999999999,1.62219,0.710565,86.1013,22.1004,235.968,72.0,0.0
2020-03-01 17:18:15,0.0813042,0.134288,1.31894,0.054711,86.0866,22.0938,227.232,72.0,0.0
2020-03-01 17:18:16,0.0821735,0.129959,1.80279,0.054711,86.1572,22.0971,215.949,72.0216,0.0
2020-03-01 17:18:17,0.0806732,0.135617,1.29283,0.382638,86.3483,22.0947,224.256,72.9787,0.0
2020-03-01 17:18:18,0.0821436,0.130735,1.60305,0.054711,86.1742,22.0958,251.386,72.0,0.0
2020-03-01 17:18:19,0.0814057,0.13301,1.9199,0.382638,86.4019,22.108,241.833,72.0,0.0
2020-03-01 17:18:20,0.0810125,0.135344,1.61509,0.054711,86.2633,22.1082,247.306,72.0,0.0
2020-03-01 17:18:21,0.0819698,0.129882,1.27102,0.382638,86.3534,22.0976,225.395,72.0,0.0
2020-03-01 17:18:22,0.0812553,0.133675,1.94207,0.382638,86.1507,22.0976,236.425,72.0,0.0
2020-03-01 17:18:23,0.0814091,0.132866,1.58837,0.054711,86.3356,22.102,247.875,72.0,0.0
2020-03-01 17:18:24,0.0820549999999999,0.130793,1.4032,0.054711,86.2197,22.0975,206.617,72.0,0.0
2020-03-01 17:18:25,0.0811965,0.134841,1.96206,0.054711,86.3538,22.1021,225.122,72.0,0.0
2020-03-01 17:18:26,0.0815073,0.132351,1.56588,0.382638,86.3359,22.0966,228.985,72.0,0.0
2020-03-01 17:18:28,0.081966,0.130581,1.23397,0.054711,86.16799999999999,22.0962,219.109,72.0,0.0
2020-03-01 17:18:29,0.0822767,0.130164,0.744765,0.054711,86.4629,22.0918,221.344,72.0,0.0
2020-03-01 17:18:30,0.0813611,0.133314,0.680755,-0.2732159999999999,86.26100000000001,22.0946,222.354,71.9787,0.0
2020-03-01 17:18:31,0.0808683,0.13576,2.07777,0.382638,86.3927,22.0793,240.769,71.0216,0.0
2020-03-01 17:18:32,0.0818226,0.128307,1.69173,0.382638,86.4934,22.0793,216.009,72.0,0.0
2020-03-01 17:18:33,0.0810429999999999,0.135498,1.38855,0.054711,86.47,22.106,224.886,72.0,0.0
2020-03-01 17:18:34,0.0815034,0.132076,1.74955,0.382638,86.6172,22.0957,231.148,72.0,0.0
2020-03-01 17:18:35,0.0822675,0.1310309999999999,1.31282,-0.2732159999999999,86.4745,22.0946,229.851,72.0,0.0
2020-03-01 17:18:36,0.0810431,0.134043,1.80405,0.054711,86.5885,22.1027,245.183,72.0,0.0
2020-03-01 17:18:37,0.0813362,0.132609,1.44584,0.382638,86.4795,22.0996,215.389,72.0,0.0
2020-03-01 17:18:38,0.081644,0.130497,1.49718,-0.2732159999999999,86.5024,22.0977,222.861,72.0,0.0
2020-03-01 17:18:39,0.0806593999999999,0.134571,0.637391,0.054711,86.42399999999999,22.0971,227.284,72.0,0.0
2020-03-01 17:18:40,0.0819005,0.131696,1.25728,0.382638,86.6312,22.0979,228.392,72.0,0.0
2020-03-01 17:18:41,0.0817802,0.1307859999999999,1.63372,0.382638,86.6173,22.0979,239.73,72.0,0.0
2020-03-01 17:18:42,0.080601,0.136225,1.59769,0.054711,86.5083,22.0983,246.599,72.0,0.0
2020-03-01 17:18:43,0.0811465,0.129887,1.85118,0.054711,86.4972,22.099,239.521,72.0,0.0
2020-03-01 17:18:44,0.0815053,0.131238,0.650501,0.054711,86.4968,22.0944,215.585,72.0,0.0
2020-03-01 17:18:46,0.080723,0.134034,1.66013,0.054711,86.4927,22.0883,236.89,72.0,0.0
2020-03-01 17:18:47,0.0816229,0.132695,1.98353,0.054711,86.6493,22.1059,234.447,72.0,0.0
2020-03-01 17:18:48,0.0804468999999999,0.1355289999999999,2.20277,0.382638,86.5694,22.0883,242.685,72.0,0.0
2020-03-01 17:18:49,0.081466,0.130096,1.64165,-0.601143,86.4855,22.1024,217.615,72.0,0.0
2020-03-01 17:18:50,0.0816033,0.133233,2.01569,-0.601143,86.5647,22.1024,228.165,72.0,0.0
2020-03-01 17:18:51,0.0806347,0.134769,1.61644,0.054711,86.4937,22.1001,229.324,72.0,0.0
2020-03-01 17:18:52,0.082246,0.130686,1.91241,0.382638,86.40899999999999,22.0923,221.141,72.0216,0.0
2020-03-01 17:18:53,0.0809497,0.13379,1.91492,0.054711,86.5546,22.1027,227.644,72.9787,0.0
2020-03-01 17:18:54,0.0811395,0.133656,0.908563,0.054711,86.6833,22.0981,205.467,72.0216,0.0
2020-03-01 17:18:55,0.0812511,0.129959,1.44758,-0.2732159999999999,87.0591,22.0946,226.152,72.9787,0.0
2020-03-01 17:18:56,0.0815006,0.133893,1.90553,-0.2732159999999999,86.6582,22.0996,227.628,72.0,0.0
2020-03-01 17:18:57,0.0808461,0.134854,1.95614,0.382638,86.6794,22.0974,223.085,71.9787,0.0
2020-03-01 17:18:58,0.082395,0.130998,1.94965,0.382638,86.6795,22.0974,242.274,71.0216,0.0
2020-03-01 17:18:59,0.0810335,0.1350569999999999,1.09599,0.054711,87.024,22.0961,233.856,72.0,0.0
2020-03-01 17:19:00,0.0805831,0.133183,2.1952700000000003,-0.2732159999999999,86.6312,22.0927,253.248,72.0,0.0
2020-03-01 17:19:01,0.082073,0.130234,2.2313400000000003,0.054711,86.7034,22.0973,231.477,72.0216,0.0
2020-03-01 17:19:02,0.0805572,0.136154,1.89039,0.054711,86.5649,22.0868,230.865,72.9576,0.0
2020-03-01 17:19:04,0.0821122,0.131144,1.28358,-0.2732159999999999,87.0176,22.0915,226.902,71.0216,0.0
2020-03-01 17:19:05,0.0804375,0.136348,1.88825,0.054711,86.8468,22.0871,233.006,72.0,0.0
2020-03-01 17:19:06,0.081355,0.131187,2.10257,0.054711,86.7979,22.0823,237.06,72.0216,0.0
2020-03-01 17:19:07,0.0818334,0.131632,1.96797,0.054711,86.801,22.0823,242.53,72.9787,0.0
2020-03-01 17:19:08,0.0803706,0.135015,1.57557,0.054711,87.2648,22.0906,205.538,72.0,0.0
2020-03-01 17:19:09,0.0818466,0.132298,1.51643,-0.2732159999999999,86.7231,22.0902,226.22,72.0,0.0
2020-03-01 17:19:10,0.0818123,0.131688,1.87797,0.054711,86.7856,22.0885,228.971,72.0,0.0
2020-03-01 17:19:11,0.0807645,0.135769,1.91921,-0.2732159999999999,87.0271,22.0797,223.057,72.0,0.0
2020-03-01 17:19:12,0.0812196,0.13066,1.24116,-0.2732159999999999,86.7737,22.0852,209.939,72.0,0.0
2020-03-01 17:19:13,0.0822926,0.1310339999999999,1.80421,0.054711,87.2125,22.0765,220.055,71.9787,0.0
2020-03-01 17:19:14,0.0801077999999999,0.136825,2.24376,0.054711,87.2673,22.0765,242.05,71.0216,0.0
2020-03-01 17:19:15,0.0823855,0.131547,1.04776,0.382638,87.36200000000001,22.0768,229.967,72.0,0.0
2020-03-01 17:19:16,0.0812967,0.133482,2.05494,0.054711,87.3206,22.0781,238.206,72.0,0.0
2020-03-01 17:19:17,0.0807435,0.1341359999999999,1.95426,0.054711,87.2851,22.0805,240.525,72.0216,0.0
2020-03-01 17:19:18,0.0818589,0.130691,1.87723,-0.2732159999999999,87.2277,22.0803,238.824,72.9787,0.0
2020-03-01 17:19:19,0.0812036,0.134391,0.857159,0.054711,87.2747,22.0759,218.687,71.9787,0.0
2020-03-01 17:19:20,0.0814126999999999,0.135127,1.86717,-0.601143,87.3148,22.0793,235.88,71.0216,0.0
2020-03-01 17:19:21,0.0821973999999999,0.131932,1.67524,-0.601143,87.3067,22.0793,224.444,72.0,0.0
2020-03-01 17:19:22,0.0810083,0.133203,1.34469,-0.2732159999999999,87.5068,22.0724,230.657,72.0,0.0
2020-03-01 17:19:23,0.0806515,0.132877,1.93575,0.054711,87.2272,22.0696,241.668,71.9787,0.0
2020-03-01 17:19:24,0.0816827,0.131741,1.82673,0.054711,87.3607,22.0721,217.273,71.0216,0.0
2020-03-01 17:19:25,0.0807794,0.1350849999999999,1.5643,0.054711,87.271,22.0673,241.32,72.0,0.0
2020-03-01 17:19:27,0.0815523999999999,0.1331369999999999,1.41713,-0.2732159999999999,87.316,22.0679,237.845,72.0,0.0
2020-03-01 17:19:28,0.0805087,0.134723,1.23031,0.054711,87.38,22.0602,229.451,71.9787,0.0
2020-03-01 17:19:29,0.0811508999999999,0.13139,0.616877,0.054711,87.4868,22.0615,214.499,71.0216,0.0
2020-03-01 17:19:30,0.0818356,0.130248,1.22638,0.054711,87.3855,22.0615,242.226,72.0216,0.0
2020-03-01 17:19:31,0.0803808,0.13573,1.8086,0.710565,87.5197,22.0581,220.493,72.9787,0.0
2020-03-01 17:19:32,0.0816486,0.133125,1.86687,0.054711,87.1094,22.0627,237.8,72.0,0.0
2020-03-01 17:19:33,0.081528,0.131699,1.58493,0.054711,87.4034,22.0562,230.755,72.0,0.0
2020-03-01 17:19:34,0.0809416999999999,0.134668,1.6822700000000002,-0.2732159999999999,87.4362,22.064,221.854,72.0,0.0
2020-03-01 17:19:35,0.0811669999999999,0.131778,0.912078,-0.2732159999999999,87.531,22.0626,207.696,72.0,0.0
2020-03-01 17:19:36,0.0818526999999999,0.130607,1.70541,0.054711,87.4716,22.0485,240.713,71.9787,0.0
2020-03-01 17:19:37,0.0804682,0.1366619999999999,1.59351,0.054711,87.5036,22.0485,218.063,71.0436,0.0
2020-03-01 17:19:38,0.0818266999999999,0.133263,1.5561,0.382638,87.6584,22.0511,228.276,72.9787,0.0
2020-03-01 17:19:39,0.0812257,0.13075,1.7927,0.382638,87.7893,22.0636,252.489,71.9787,0.0
2020-03-01 17:19:40,0.0804756,0.135198,1.14931,0.054711,87.5832,22.06,229.428,71.0216,0.0
2020-03-01 17:19:41,0.0813986,0.1298099999999999,1.25433,0.054711,87.9992,22.0498,237.825,72.0216,0.0
2020-03-01 17:19:42,0.0812151999999999,0.132648,0.635948,0.054711,87.8071,22.0462,211.739,72.9787,0.0
2020-03-01 17:19:43,0.0806822,0.135889,1.20841,0.054711,87.8361,22.0518,221.491,72.0,0.0
2020-03-01 17:19:44,0.0825096,0.131766,2.04566,0.382638,87.8097,22.0461,219.224,71.9787,0.0
2020-03-01 17:19:45,0.0805773,0.131198,1.24361,0.382638,87.8362,22.0461,229.284,71.0216,0.0
2020-03-01 17:19:47,0.0805897,0.134524,1.44249,0.054711,87.9236,22.0361,233.476,72.0,0.0
2020-03-01 17:19:48,0.0815821,0.132699,1.30831,-0.2732159999999999,88.007,22.041,224.303,71.9787,0.0
2020-03-01 17:19:49,0.0806223,0.136865,0.988248,0.054711,87.8255,22.04,219.696,71.0216,0.0
2020-03-01 17:19:50,0.0821872,0.130454,1.95551,0.054711,87.8083,22.0424,231.793,71.9787,0.0
2020-03-01 17:19:51,0.081035,0.132319,1.16033,0.054711,87.4864,22.0431,231.288,71.0216,0.0
2020-03-01 17:19:52,0.0803666999999999,0.1341,1.5126,0.382638,88.0312,22.0342,225.165,71.9787,0.0
2020-03-01 17:19:53,0.0817823,0.129452,1.8595,-0.601143,87.9527,22.0508,233.042,71.0216,1.0
2020-03-01 17:19:54,0.0808739,0.133314,1.46867,-0.2732159999999999,87.9059,22.0338,236.188,72.0,0.0
2020-03-01 17:19:55,0.0810791,0.136221,1.7787099999999998,-0.2732159999999999,87.8826,22.0398,230.509,72.0,0.0
2020-03-01 17:19:56,0.0815567,0.131413,2.12198,-0.2732159999999999,88.0274,22.0398,247.449,72.0,0.0
2020-03-01 17:19:57,0.0813779999999999,0.1307,1.08687,0.054711,87.8606,22.0287,229.987,72.0,0.0
2020-03-01 17:19:58,0.0802398999999999,0.135143,1.93787,-0.2732159999999999,88.07,22.0428,229.412,71.9787,0.0
2020-03-01 17:19:59,0.0822551,0.12934,1.86811,-0.2732159999999999,87.9572,22.0548,231.223,71.0216,0.0
2020-03-01 17:20:00,0.0812851,0.13384,1.74465,0.054711,87.7303,22.0401,229.705,71.9787,0.0
2020-03-01 17:20:01,0.0813383999999999,0.1361619999999999,1.86571,0.054711,87.98,22.0398,226.302,71.0216,0.0
2020-03-01 17:20:02,0.081934,0.131832,1.89825,0.054711,87.4372,22.0491,233.014,72.0,0.0
2020-03-01 17:20:03,0.0812228999999999,0.131319,1.81205,0.054711,87.9157,22.0492,224.289,72.0,0.0
2020-03-01 17:20:04,0.080671,0.135469,1.73741,0.054711,87.926,22.0492,226.962,72.0,0.0
2020-03-01 17:20:05,0.081703,0.13064,1.98381,0.054711,87.3918,22.0489,248.814,72.0,0.0
2020-03-01 17:20:07,0.0812357,0.1358319999999999,1.6809,0.054711,87.823,22.0478,223.973,72.0216,0.0
2020-03-01 17:20:08,0.0818953,0.130643,1.52151,-0.2732159999999999,87.4411,22.0447,222.642,72.0216,0.0
2020-03-01 17:20:09,0.0804276999999999,0.1363319999999999,1.74368,0.054711,87.4728,22.0512,222.762,73.0,0.0
2020-03-01 17:20:10,0.0813675,0.132272,1.84422,0.054711,87.4015,22.0344,245.203,73.0216,0.0
2020-03-01 17:20:11,0.0811903,0.1315079999999999,1.55781,0.054711,87.4593,22.0536,221.389,73.9787,0.0
2020-03-01 17:20:12,0.0809452,0.136036,1.86816,0.054711,87.9551,22.0499,240.429,73.0216,0.0
2020-03-01 17:20:13,0.0817501,0.133077,1.7998900000000002,0.054711,88.0314,22.0499,207.66,74.0216,0.0
2020-03-01 17:20:14,0.0813052,0.132546,1.2678,0.054711,87.5591,22.0499,232.341,74.9576,0.0
2020-03-01 17:20:15,0.0807135,0.1345319999999999,1.60825,0.054711,87.6282,22.0489,224.672,73.0216,0.0
2020-03-01 17:20:16,0.0816089,0.130541,1.80529,0.054711,87.5825,22.0467,216.623,74.0216,0.0
2020-03-01 17:20:17,0.0812437,0.1357539999999999,1.24404,0.054711,87.4881,22.0496,218.802,74.9576,0.0
2020-03-01 17:20:18,0.0811571,0.135458,1.62319,-0.2732159999999999,87.76700000000001,22.0544,232.182,73.0216,0.0
2020-03-01 17:20:19,0.0816819,0.1292579999999999,1.6566599999999998,0.382638,87.7002,22.047,230.933,74.0,0.0
2020-03-01 17:20:20,0.0806536,0.136369,1.86133,0.054711,87.7837,22.0404,221.405,74.0216,0.0
2020-03-01 17:20:21,0.0812718,0.132055,1.9324,-0.2732159999999999,87.42399999999999,22.0405,241.762,75.0,0.0
2020-03-01 17:20:22,0.0815692,0.131038,1.86176,0.054711,87.6055,22.0544,242.772,75.0,0.0
2020-03-01 17:20:23,0.0809281999999999,0.137697,1.71628,-0.2732159999999999,87.6144,22.0414,239.451,74.9787,0.0
2020-03-01 17:20:24,0.0817096,0.131735,1.61234,0.054711,87.4835,22.0447,239.421,74.0216,0.0
2020-03-01 17:20:26,0.0809097,0.1339779999999999,0.7295550000000001,0.710565,87.5423,22.0507,211.55900000000003,75.0,0.0
2020-03-01 17:20:27,0.08106,0.131413,1.70855,0.710565,87.5364,22.0507,226.201,75.0,0.0
2020-03-01 17:20:28,0.0811906,0.13471,1.63701,-0.2732159999999999,87.5697,22.0429,227.668,75.0,0.0
2020-03-01 17:20:29,0.0814358,0.135237,1.2358,0.054711,87.7249,22.0401,249.18,75.0216,0.0
2020-03-01 17:20:30,0.0816407,0.130413,1.6705599999999998,0.382638,87.6466,22.0444,229.553,75.9787,0.0
2020-03-01 17:20:31,0.0808019,0.13649,1.02119,-0.2732159999999999,87.5685,22.0331,230.978,75.0216,0.0
2020-03-01 17:20:32,0.0810462,0.130431,1.75492,0.382638,87.6597,22.047,231.856,75.9787,0.0
2020-03-01 17:20:33,0.0812799,0.132634,1.35412,0.054711,87.6391,22.0299,237.311,75.0216,0.0
2020-03-01 17:20:34,0.0803297,0.1371619999999999,0.959697,0.054711,87.5085,22.0299,224.525,76.0,0.0
2020-03-01 17:20:35,0.0816104,0.131376,1.5496299999999998,0.054711,87.7148,22.0397,228.07,75.9787,0.0
2020-03-01 17:20:36,0.0811998,0.135682,1.6936099999999998,-0.601143,87.7259,22.0342,237.913,75.0435,0.0
2020-03-01 17:20:37,0.0809581,0.132669,0.976554,0.710565,87.6379,22.0333,222.296,76.9571,0.0
2020-03-01 17:20:38,0.0815141,0.13172,0.956056,0.054711,87.68700000000001,22.0401,218.828,75.0219,0.0
2020-03-01 17:20:39,0.0810635,0.136749,1.98997,-0.2732159999999999,87.7421,22.0431,247.179,76.0,0.0
2020-03-01 17:20:40,0.0816944,0.13216,1.78495,0.054711,87.7378,22.0262,227.26,76.0,0.0
2020-03-01 17:20:41,0.08176,0.132099,1.13877,-0.601143,87.5566,22.0358,229.793,76.0,0.0
2020-03-01 17:20:42,0.0803087,0.136049,1.19272,-0.601143,87.3904,22.0358,245.153,76.0,0.0
2020-03-01 17:20:44,0.0818111,0.129961,1.02367,-0.2732159999999999,87.6249,22.0209,234.665,76.0,0.0
2020-03-01 17:20:45,0.0812225,0.133877,0.933787,0.054711,87.4189,22.0303,225.264,76.0,0.0
2020-03-01 17:20:46,0.0818386,0.130513,1.96108,0.054711,87.4094,22.037,216.774,76.0,0.0
2020-03-01 17:20:47,0.0806419999999999,0.135223,1.7435599999999998,0.054711,87.5552,22.0357,213.523,76.0,0.0
2020-03-01 17:20:48,0.0816499,0.132194,1.70252,0.054711,87.4236,22.0413,234.2,76.0219,0.0
2020-03-01 17:20:49,0.0817121,0.131366,1.78394,0.054711,87.62899999999999,22.0368,217.445,76.9784,0.0
2020-03-01 17:20:50,0.0,0.0,1.94649,0.054711,87.5632,22.0368,237.1,0.0,0.0
2020-03-01 17:20:51,0.0,0.0,1.50247,0.054711,87.3484,22.0368,235.062,0.0,0.0
2020-03-01 17:20:52,0.0,0.0,1.0362,0.054711,87.5839,22.0368,220.396,0.0,0.0
2020-03-01 17:20:53,0.0,0.0,1.48591,0.054711,87.8006,22.0368,229.177,0.0,1.0
2020-03-01 17:20:54,0.0,0.0,1.6412099999999998,0.054711,87.5485,22.0368,220.872,0.0,0.0
