Time,X1,Label6,Label8,Label9,Label12,Label13
0,-1.2250415834158823,0.0,0.0,0.0,0.0,0.0
1,-0.9146328488424315,0.0,0.0,0.0,0.0,0.0
2,-0.5910566481586681,0.0,0.0,0.0,0.0,0.0
3,0.29822475342551663,0.0,0.0,0.0,0.0,0.0
4,0.7070898350802566,0.0,0.0,0.0,0.0,0.0
5,0.2192937316120388,0.0,0.0,0.0,0.0,0.0
6,0.5229231093275426,0.0,0.0,0.0,0.0,0.0
7,-0.315004848802414,0.0,0.0,0.0,0.0,0.0
8,0.2067250558145274,0.0,0.0,0.0,0.0,0.0
9,-0.581721449357214,0.0,0.0,0.0,0.0,0.0
10,1.2549303437054324,0.0,0.0,0.0,0.0,0.0
11,0.6174431541284008,0.0,0.0,0.0,0.0,0.0
12,-0.13526217343124258,0.0,0.0,0.0,0.0,0.0
13,0.12732875701359647,0.0,0.0,0.0,0.0,0.0
14,1.0263960031303712,0.0,0.0,0.0,0.0,0.0
15,1.5799604313171394,0.0,0.0,0.0,0.0,0.0
16,0.32215905982410475,0.0,0.0,0.0,0.0,0.0
17,-0.9982460674119176,0.0,0.0,0.0,0.0,0.0
18,0.8962406169791886,0.0,0.0,0.0,0.0,0.0
19,-0.16661324776610145,0.0,0.0,0.0,0.0,0.0
20,0.7079949956857139,0.0,0.0,0.0,0.0,0.0
21,-0.36331951743958746,0.0,0.0,0.0,0.0,0.0
22,0.5698561424695517,0.0,0.0,0.0,0.0,0.0
23,-1.1125571723250176,0.0,0.0,0.0,0.0,0.0
24,-0.15997763212760868,0.0,0.0,0.0,0.0,0.0
25,-0.4838158544495628,0.0,0.0,0.0,0.0,0.0
26,-1.0894358632210766,0.0,0.0,0.0,0.0,0.0
27,0.9145952011134022,0.0,0.0,0.0,0.0,0.0
28,-0.15510392105087512,0.0,0.0,0.0,0.0,0.0
29,-2.2396082316220847,0.0,0.0,0.0,0.0,0.0
30,0.18552085559126646,0.0,0.0,0.0,0.0,0.0
31,0.16732577479039903,0.0,0.0,0.0,0.0,0.0
32,-0.4014180086414445,0.0,0.0,0.0,0.0,0.0
33,-0.3452795195339986,0.0,0.0,0.0,0.0,0.0
34,1.9218214099063244,0.0,0.0,0.0,0.0,0.0
35,-1.160615788021988,0.0,0.0,0.0,0.0,0.0
36,1.6443318529088096,0.0,0.0,0.0,0.0,0.0
37,-2.0137483653063684,0.0,0.0,0.0,0.0,0.0
38,-0.20467264096358162,0.0,0.0,0.0,0.0,0.0
39,0.24472075250594744,0.0,0.0,0.0,0.0,0.0
40,-2.243173593923035,0.0,0.0,0.0,0.0,0.0
41,-1.1930608451132099,0.0,0.0,0.0,0.0,0.0
42,-0.7008988616671794,0.0,0.0,0.0,0.0,0.0
43,0.16228846666872043,0.0,0.0,0.0,0.0,0.0
44,-0.3302296597643836,0.0,0.0,0.0,0.0,0.0
45,-0.28205250168632184,0.0,0.0,0.0,0.0,0.0
46,1.125040127232492,0.0,0.0,0.0,0.0,0.0
47,0.8074539200081281,0.0,0.0,0.0,0.0,0.0
48,0.32609131727819346,0.0,0.0,0.0,0.0,0.0
49,-0.37498085164362066,0.0,0.0,0.0,0.0,0.0
50,0.14785224472223388,0.0,0.0,0.0,0.0,0.0
51,-0.1919518018111228,0.0,0.0,0.0,0.0,0.0
52,-0.9136759891961439,0.0,0.0,0.0,0.0,0.0
53,0.12383199137123366,0.0,0.0,0.0,0.0,0.0
54,-1.1198666327142341,0.0,0.0,0.0,0.0,0.0
55,0.35876698337048246,0.0,0.0,0.0,0.0,0.0
56,-1.5925095836904641,0.0,0.0,0.0,0.0,0.0
57,-1.4595043396893197,0.0,0.0,0.0,0.0,0.0
58,-0.8423229218842441,0.0,0.0,0.0,0.0,0.0
59,-0.4692660728642796,0.0,0.0,0.0,0.0,0.0
60,0.8880433418393338,0.0,0.0,0.0,0.0,0.0
61,0.7566717771455393,0.0,0.0,0.0,0.0,0.0
62,-1.497406619895668,0.0,0.0,0.0,0.0,0.0
63,-1.3827560072956067,0.0,0.0,0.0,0.0,0.0
64,0.6764862133888518,0.0,0.0,0.0,0.0,0.0
65,-0.46832136756043796,0.0,0.0,0.0,0.0,0.0
66,0.8545977558775403,0.0,0.0,0.0,0.0,0.0
67,0.04255903780318497,0.0,0.0,0.0,0.0,0.0
68,0.5280323983933178,0.0,0.0,0.0,0.0,0.0
69,0.30933144671680335,0.0,0.0,0.0,0.0,0.0
70,-0.3132409034040466,0.0,0.0,0.0,0.0,0.0
71,0.3334010059313219,0.0,0.0,0.0,0.0,0.0
72,-0.8198607282257665,0.0,0.0,0.0,0.0,0.0
73,2.7450973967039456,0.0,0.0,0.0,0.0,0.0
74,-0.2874222130364619,0.0,0.0,0.0,0.0,0.0
75,0.05763863930074464,0.0,0.0,0.0,0.0,0.0
76,-1.348788778210535,0.0,0.0,0.0,0.0,0.0
77,0.2950319914354178,0.0,0.0,0.0,0.0,0.0
78,2.3032860586040838,0.0,0.0,0.0,0.0,0.0
79,-0.053575968376197255,0.0,0.0,0.0,0.0,0.0
80,-1.908377173173841,0.0,0.0,0.0,0.0,0.0
81,-0.10107674008676952,0.0,0.0,0.0,0.0,0.0
82,-0.9123876833166216,0.0,0.0,0.0,0.0,0.0
83,1.3179829699177918,0.0,0.0,0.0,0.0,0.0
84,0.4513972973409798,0.0,0.0,0.0,0.0,0.0
85,0.7551201786534543,0.0,0.0,0.0,0.0,0.0
86,1.436354817114053,0.0,0.0,0.0,0.0,0.0
87,-0.19254358626082296,0.0,0.0,0.0,0.0,0.0
88,-0.8864704331471122,0.0,0.0,0.0,0.0,0.0
89,1.026535699912483,0.0,0.0,0.0,0.0,0.0
90,-0.5849974636750817,0.0,0.0,0.0,0.0,0.0
91,1.2300527633215956,0.0,0.0,0.0,0.0,0.0
92,-1.1538824641467635,0.0,0.0,0.0,0.0,0.0
93,-0.018997103623558827,0.0,0.0,0.0,0.0,0.0
94,0.5671782125651345,0.0,0.0,0.0,0.0,0.0
95,0.9997225287669005,0.0,0.0,0.0,0.0,0.0
96,-1.1771865262097496,0.0,0.0,0.0,0.0,0.0
97,0.9368498537522886,0.0,0.0,0.0,1.0,1.0
98,2.4979285204122905,0.0,1.0,0.0,0.0,0.0
99,3.8231440010209052,0.0,0.0,1.0,0.0,0.0
100,3.2029396833970285,0.0,0.0,0.0,0.0,0.0
101,1.1447740941275195,0.0,0.0,0.0,0.0,0.0
102,0.6250292338156762,0.0,0.0,0.0,0.0,0.0
103,2.4800442910469087,0.0,0.0,0.0,0.0,0.0
104,1.2662932785299041,0.0,0.0,0.0,0.0,0.0
105,0.2643811228317958,0.0,0.0,0.0,0.0,0.0
106,3.019257777020548,0.0,0.0,0.0,0.0,0.0
107,2.548588654306246,0.0,0.0,0.0,0.0,0.0
108,1.4664981768763392,0.0,0.0,0.0,0.0,0.0
109,0.45395270990895287,0.0,0.0,0.0,0.0,0.0
110,1.033097144734411,0.0,0.0,0.0,0.0,0.0
111,0.6123859372374174,0.0,0.0,0.0,0.0,0.0
112,2.3476068539653325,0.0,0.0,0.0,0.0,0.0
113,0.031573617382252506,0.0,0.0,0.0,0.0,0.0
114,-0.5271097835796974,0.0,0.0,0.0,0.0,0.0
115,0.8802009417619623,0.0,0.0,0.0,0.0,0.0
116,1.7745943167163665,0.0,0.0,0.0,0.0,0.0
117,-0.37340332213415905,0.0,0.0,0.0,0.0,0.0
118,0.45161605536751837,0.0,0.0,0.0,0.0,0.0
119,1.2170781363485905,0.0,0.0,0.0,0.0,0.0
120,2.860995373112126,0.0,0.0,0.0,0.0,0.0
121,1.3427273121937828,0.0,0.0,0.0,0.0,0.0
122,2.1101603334062595,0.0,0.0,0.0,0.0,0.0
123,1.4018474004480264,0.0,0.0,0.0,0.0,0.0
124,1.0574053365256273,0.0,0.0,0.0,0.0,0.0
125,1.2148642222341381,0.0,0.0,0.0,0.0,0.0
126,4.033650784650574,0.0,0.0,0.0,0.0,0.0
127,1.5369195328725098,0.0,0.0,0.0,0.0,0.0
128,-0.17628819581297828,0.0,0.0,0.0,0.0,0.0
129,2.2313566465980914,0.0,0.0,0.0,0.0,0.0
130,2.405149433624392,0.0,0.0,0.0,0.0,0.0
131,-0.34982887889752146,0.0,0.0,0.0,0.0,0.0
132,-1.0043871087602514,0.0,0.0,0.0,0.0,0.0
133,2.3511903254987074,0.0,0.0,0.0,0.0,0.0
134,3.5498170821605206,0.0,0.0,0.0,0.0,0.0
135,3.0266394121367037,0.0,0.0,0.0,0.0,0.0
136,2.6530241621225326,0.0,0.0,0.0,0.0,0.0
137,2.852598450006578,0.0,0.0,0.0,0.0,0.0
138,1.785667086256835,0.0,0.0,0.0,0.0,0.0
139,0.7101510530929172,0.0,0.0,0.0,0.0,0.0
140,-0.8168305652826335,0.0,0.0,0.0,0.0,0.0
141,0.9730289787883513,0.0,0.0,0.0,0.0,0.0
142,1.6857201586080208,0.0,0.0,0.0,0.0,0.0
143,1.7197233989367833,0.0,0.0,0.0,0.0,0.0
144,1.5062334467914544,0.0,0.0,0.0,0.0,0.0
145,2.354634402987683,0.0,0.0,0.0,0.0,0.0
146,-0.29662841531028517,0.0,0.0,0.0,0.0,0.0
147,1.707905001215161,0.0,0.0,0.0,0.0,0.0
148,1.4119426917232738,0.0,0.0,0.0,0.0,0.0
149,1.4763951506825825,0.0,0.0,0.0,0.0,0.0
150,0.9598281625519466,0.0,0.0,0.0,0.0,0.0
151,1.2445863475934853,0.0,0.0,0.0,0.0,0.0
152,0.3961523734844876,0.0,0.0,0.0,0.0,0.0
153,-0.619315578899462,0.0,0.0,0.0,0.0,0.0
154,0.3703512795369803,0.0,0.0,0.0,0.0,0.0
155,1.79944060337313,0.0,0.0,0.0,0.0,0.0
156,2.6404418199915005,0.0,0.0,0.0,0.0,0.0
157,0.4392138158315788,0.0,0.0,0.0,0.0,0.0
158,1.2387471365966096,0.0,0.0,0.0,0.0,0.0
159,1.2806571259762625,0.0,0.0,0.0,0.0,0.0
160,2.534359924574206,0.0,0.0,0.0,0.0,0.0
161,1.9467675596779386,0.0,0.0,0.0,0.0,0.0
162,1.597824727758468,0.0,0.0,0.0,0.0,0.0
163,1.1423324423743098,0.0,0.0,0.0,0.0,0.0
164,1.962346936568435,0.0,0.0,0.0,0.0,0.0
165,2.450458541796748,0.0,0.0,0.0,0.0,0.0
166,0.13972135521097195,0.0,0.0,0.0,0.0,0.0
167,1.308034355691255,0.0,0.0,0.0,0.0,0.0
168,0.5131437527331941,0.0,0.0,0.0,0.0,0.0
169,4.357255174393051,0.0,0.0,0.0,0.0,0.0
170,-0.4857118438119983,0.0,0.0,0.0,0.0,0.0
171,1.9434923912879154,0.0,0.0,0.0,0.0,0.0
172,1.4704371308853594,0.0,0.0,0.0,0.0,0.0
173,0.6225447833260043,0.0,0.0,0.0,0.0,0.0
174,0.8162092369533394,0.0,0.0,0.0,0.0,0.0
175,2.14631577828609,0.0,0.0,0.0,0.0,0.0
176,-0.3558403179387175,0.0,0.0,0.0,0.0,0.0
177,3.5501556068290157,0.0,0.0,0.0,0.0,0.0
178,2.478861191606171,0.0,0.0,0.0,0.0,0.0
179,2.3358971619946107,0.0,0.0,0.0,0.0,0.0
180,1.253897823574451,0.0,0.0,0.0,0.0,0.0
181,2.1696099201011094,0.0,0.0,0.0,0.0,0.0
182,1.073735454787726,0.0,0.0,0.0,0.0,0.0
183,0.4077137963988511,0.0,0.0,0.0,0.0,0.0
184,2.7049099438648136,0.0,0.0,0.0,0.0,0.0
185,0.5542856233954836,0.0,0.0,0.0,0.0,0.0
186,-0.7232196667378963,0.0,0.0,0.0,0.0,0.0
187,1.3581997678155568,0.0,0.0,0.0,0.0,0.0
188,1.8319630431167289,0.0,0.0,0.0,0.0,0.0
189,0.5860585619187731,0.0,0.0,0.0,0.0,0.0
190,1.8985704957608325,0.0,0.0,0.0,0.0,0.0
191,1.7133368220985155,0.0,0.0,0.0,0.0,0.0
192,0.9656574823254727,0.0,0.0,0.0,0.0,0.0
193,2.7897401859940545,0.0,0.0,0.0,0.0,0.0
194,0.30415499250897526,0.0,0.0,0.0,0.0,0.0
195,1.5412936714136782,0.0,0.0,0.0,0.0,0.0
196,-0.11507849083634603,0.0,0.0,0.0,0.0,0.0
197,1.0396291092492118,0.0,0.0,0.0,0.0,0.0
198,1.8662409949445027,0.0,0.0,0.0,0.0,0.0
199,2.758151283325566,0.0,0.0,0.0,0.0,0.0
200,0.9845340180015977,0.0,0.0,0.0,0.0,0.0
201,0.921861471666658,0.0,0.0,0.0,0.0,0.0
202,0.5580857332053799,0.0,0.0,0.0,0.0,0.0
203,1.3830544908027729,0.0,0.0,0.0,0.0,0.0
204,0.20560516548838348,0.0,0.0,0.0,0.0,0.0
205,1.6050719075996915,0.0,0.0,0.0,0.0,0.0
206,-0.7520482323303939,0.0,0.0,0.0,0.0,0.0
207,2.427466993445388,0.0,0.0,0.0,0.0,0.0
208,0.7709767771121755,0.0,0.0,0.0,0.0,0.0
209,1.4318714572364801,0.0,0.0,0.0,0.0,0.0
210,0.46055565546131727,0.0,0.0,0.0,0.0,0.0
211,2.0199752666672337,0.0,0.0,0.0,0.0,0.0
212,0.8709621703563029,0.0,0.0,0.0,0.0,0.0
213,0.2079734967437019,0.0,0.0,0.0,0.0,0.0
214,1.9802912458184485,0.0,0.0,0.0,0.0,0.0
215,1.2708997319401942,0.0,0.0,0.0,0.0,0.0
216,2.5204324522710015,0.0,0.0,0.0,0.0,0.0
217,1.8811324195948684,0.0,0.0,0.0,0.0,0.0
218,0.6258518546189867,0.0,0.0,0.0,0.0,0.0
219,1.7409261858836802,0.0,0.0,0.0,0.0,0.0
220,2.5516911617554534,0.0,0.0,0.0,0.0,0.0
221,1.9118952041575101,0.0,0.0,0.0,0.0,0.0
222,2.8877212052868506,0.0,0.0,0.0,0.0,0.0
223,1.5297272744417647,0.0,0.0,0.0,0.0,0.0
224,-0.2669138099949344,0.0,0.0,0.0,0.0,0.0
225,2.384360607752158,0.0,0.0,0.0,0.0,0.0
226,3.0059465022504046,0.0,0.0,0.0,0.0,0.0
227,2.2932958468887974,0.0,0.0,0.0,0.0,0.0
228,2.8551796334769666,0.0,0.0,0.0,0.0,0.0
229,0.7216620144621412,0.0,0.0,0.0,0.0,0.0
230,1.5511606093657657,0.0,0.0,0.0,0.0,0.0
231,2.724391173515029,0.0,0.0,0.0,0.0,0.0
232,0.52014822283928,0.0,0.0,0.0,0.0,0.0
233,0.7270783930568702,0.0,0.0,0.0,0.0,0.0
234,2.4687665861772183,0.0,0.0,0.0,0.0,0.0
235,1.9405709231454569,0.0,0.0,0.0,0.0,0.0
236,2.004636207818966,0.0,0.0,0.0,0.0,0.0
237,-0.16339405756819803,0.0,0.0,0.0,0.0,0.0
238,1.9621259940257196,0.0,0.0,0.0,0.0,0.0
239,1.459632066671676,0.0,0.0,0.0,0.0,0.0
240,0.25737523525696915,0.0,0.0,0.0,0.0,0.0
241,0.8983672596034672,0.0,0.0,0.0,0.0,0.0
242,0.46420735337266494,0.0,0.0,0.0,0.0,0.0
243,-0.24242023254671174,0.0,0.0,0.0,0.0,0.0
244,1.1528388375051004,0.0,0.0,0.0,0.0,0.0
245,2.690919311976958,0.0,0.0,0.0,0.0,0.0
246,2.545329208040222,0.0,0.0,0.0,0.0,0.0
247,0.7218786280117971,0.0,0.0,0.0,0.0,0.0
248,1.4356557424012144,0.0,0.0,0.0,0.0,0.0
249,0.8494426542708168,0.0,0.0,0.0,0.0,0.0
250,1.8089851908926387,0.0,0.0,0.0,0.0,0.0
251,3.6139573934338443,0.0,0.0,0.0,0.0,0.0
252,1.3102816347805566,0.0,0.0,0.0,0.0,0.0
253,1.7776948545340565,0.0,0.0,0.0,0.0,0.0
254,1.8181960122290421,0.0,0.0,0.0,0.0,0.0
255,0.6168710179626604,0.0,0.0,0.0,0.0,0.0
256,1.687300725902033,0.0,0.0,0.0,0.0,0.0
257,-0.1949992852514153,0.0,0.0,0.0,0.0,0.0
258,0.5941250479024553,0.0,0.0,0.0,0.0,0.0
259,1.9640314992840497,0.0,0.0,0.0,0.0,0.0
260,2.670975819273311,0.0,0.0,0.0,0.0,0.0
261,0.5766329791354685,0.0,0.0,0.0,0.0,0.0
262,0.8626441876383348,0.0,0.0,0.0,0.0,0.0
263,-0.005817193134608045,0.0,0.0,0.0,0.0,0.0
264,0.9139854691379222,0.0,0.0,0.0,0.0,0.0
265,1.747331557254235,0.0,0.0,0.0,0.0,0.0
266,4.067308270763904,0.0,0.0,0.0,0.0,0.0
267,1.5521819994301373,0.0,0.0,0.0,0.0,0.0
268,3.3817584173707766,0.0,0.0,0.0,0.0,0.0
269,2.5530673717769785,0.0,0.0,0.0,0.0,0.0
270,2.952358646343403,0.0,0.0,0.0,0.0,0.0
271,2.256832813104526,0.0,0.0,0.0,0.0,0.0
272,2.2634778679250958,0.0,0.0,0.0,0.0,0.0
273,1.3790787776269786,0.0,0.0,0.0,0.0,0.0
274,1.3493146139227787,0.0,0.0,0.0,0.0,0.0
275,1.4957693073093346,0.0,0.0,0.0,0.0,0.0
276,0.878135025047058,0.0,0.0,0.0,0.0,0.0
277,2.3390931213572514,0.0,0.0,0.0,0.0,0.0
278,0.9760426851836324,0.0,0.0,0.0,0.0,0.0
279,2.0756819394434185,0.0,0.0,0.0,0.0,0.0
280,1.7330208720254419,0.0,0.0,0.0,0.0,0.0
281,1.5452207116401078,0.0,0.0,0.0,0.0,0.0
282,0.9804850267232275,0.0,0.0,0.0,0.0,0.0
