Time,X1,Label
0,0.04446839986999091,0
1,1.748410796171241,0
2,1.340377658372089,0
3,0.3735459808478916,0
4,-1.4661635370856954,0
5,-1.194412647744728,0
6,0.22742898060210548,0
7,1.1211623283873333,0
8,1.8051950092849594,0
9,0.35748346308414747,0
10,-0.897765445825236,0
11,-0.9703790074676679,0
12,-0.3799776275947332,0
13,0.540059485186363,0
14,1.027467845475643,0
15,0.7532623564807727,0
16,-0.8787926932451655,0
17,-0.5729469163601696,0
18,-0.8464822435164544,0
19,-0.43755598261993267,0
20,1.1381083190157402,0
21,-0.786673643842878,0
22,-0.7835674340901362,0
23,-1.4621357644952928,0
24,-1.0284817267428052,0
25,-0.25827312424506377,0
26,0.3609766607575111,0
27,1.4315694461239734,0
28,0.6989873770715451,0
29,-0.5040563527598989,0
30,-1.2974234716212516,0
31,-1.1335154005474322,0
32,0.355473004060312,0
33,1.2748571317533453,0
34,0.9178233393555222,0
35,-0.13615559864192567,0
36,-1.2746123827983413,0
37,-0.872904599036411,0
38,0.18220560192670868,0
39,0.8470150134031736,0
40,0.7817457218324219,0
41,-0.23880702609684212,0
42,-0.8935102264997388,0
43,-0.49459425493718234,0
44,0.513321462979741,0
45,0.07497860215562391,0
46,1.2700232997135754,0
47,-0.3913663784368655,0
48,-0.424671898402316,0
49,-1.332871551360266,0
50,-0.20236533228184217,0
51,0.3759758585149913,0
52,0.9576831181921651,0
53,-0.4154262141478777,0
54,-0.14327567068551672,0
55,-1.0210684774228524,0
56,-0.6156347564232358,0
57,-0.17412979894257985,0
58,0.865318009935559,0
59,0.704463968512343,0
60,-0.8781893853218489,0
61,-0.3904007043538147,0
62,-0.9861044605279294,0
63,0.755985280083675,0
64,0.5547201963406065,0
65,0.26491762921013173,0
66,0.1477204795167415,0
67,-0.1422448587335633,0
68,-1.2751769982050507,0
69,-0.8714805140798303,0
70,1.3199354539532262,0
71,1.3798487364036442,0
72,0.2551912181589677,0
73,-0.45597184465988655,0
74,-1.0152267781046298,0
75,0.23265690530672778,0
76,0.6780243972644442,0
77,1.001270120942303,0
78,0.46425229390665756,0
79,-0.6174487571025618,0
80,-0.8622156807230714,0
81,-0.705856333032651,0
82,0.652403812997182,0
83,-0.6493158572299926,0
84,-0.1624926370796116,0
85,-0.24692416415619822,0
86,-0.947102016059805,0
87,-1.387365686744138,0
88,-0.09178329224327464,0
89,0.5455781099578926,0
90,0.021403419590720008,0
91,0.22525011998964248,0
92,-1.0186907276213903,0
93,-0.4283908974731704,0
94,-0.1804032715508851,0
95,1.8218301919271176,0
96,0.2263470485439507,0
97,-0.18797713821801482,0
98,-1.7818584485677451,0
99,-1.7712543777595389,0
100,-0.1470280916005598,1
101,0.9187749954459858,0
102,1.025326707573636,0
103,0.15137009968712767,0
104,-0.8086332745635645,0
105,-0.5476940594590922,0
106,0.8225110582245284,0
107,0.561854309901476,0
108,-0.27078650778067326,0
109,-1.6060721882160824,0
110,0.696020825109753,0
111,1.753783191299671,0
112,0.30777009078454065,0
113,-0.2339655747405066,0
114,-1.2199494223691019,0
115,0.8736142370088296,0
116,1.1940255487782274,0
117,0.015684704052224774,0
118,-1.7926739306414046,0
119,-0.09391343913301453,0
120,0.661708567736248,0
121,1.2199009454029115,0
122,-0.17795712296776237,0
123,-0.8607827170932064,0
124,1.0279761658998878,0
125,0.6475900278690943,0
126,0.49752014222630714,0
127,-0.24720025179366356,0
128,-0.4230444756328212,0
129,-0.4746343567426205,0
130,0.37253692198115584,0
131,1.463910558914845,0
132,-1.2852658562408412,0
133,-0.5743084251251513,0
134,-0.5130912167033926,0
135,1.2319785324051424,0
136,0.40444738758604837,0
137,-0.1395908271629126,0
138,-0.9726682519294798,0
139,0.21663851721256644,0
140,1.6439645395716886,0
141,0.31708329522045464,0
142,-1.0697037713858284,0
143,-1.010663669678977,0
144,1.5052858245650487,0
145,0.381599780339987,0
146,-0.681334598119643,0
147,-0.976361795767742,0
148,-1.225706202375096,0
149,1.0063594656071362,0
150,0.41617925299170333,0
151,-0.21520979308277832,0
152,-0.5239817168827838,0
153,0.2912639166026188,0
154,1.3093917278091158,0
155,0.19418696972967192,0
156,-0.19905748750391117,0
157,-2.0366175115292613,0
158,0.657685500570452,0
159,2.1849669134078424,0
160,0.37222495742583633,0
161,-1.2670388748735588,0
162,-1.710644429792067,0
163,0.7912941095853354,0
164,0.9167458051256681,0
165,0.24946357262360108,0
166,-1.0171996100162766,0
167,-0.6119185348877927,0
168,0.45084018815264004,0
169,0.8250847820159686,0
170,0.25432946069186213,0
171,-1.2614149114069,0
172,-0.15545045146386188,0
173,0.8957660753653846,0
174,0.6529723043136252,0
175,-0.23567291642111235,0
176,-0.9350823969161455,0
177,0.029487591371915853,0
178,1.0060612497380848,0
179,0.2549222127178413,0
180,-1.9956488451381509,0
181,-0.6594205547940104,0
182,-0.038529144348306676,0
183,0.7274436995373793,0
184,0.3323976743786373,0
185,-0.6426229749570409,0
186,0.1222700032565035,0
187,0.34688031940383857,0
188,0.6779169779672436,0
189,0.5074019192400175,0
190,-0.5856814033307933,0
191,-0.7809028488646138,0
192,0.04234531449564105,0
193,0.365043622189815,0
194,-0.4108347070666628,0
195,-1.2707888940587464,0
196,-0.5521947423517355,0
197,1.012449328357362,0
198,0.21285326029912083,0
199,-0.001197152462859452,0
200,0.8637662128096503,1
201,0.01736284046699435,0
202,-0.6483600378006842,0
203,0.343893529959657,0
204,1.4876139376354884,0
205,-0.7757594704319287,0
206,-0.9107994054070058,0
207,1.2312129745061429,0
208,-0.2215756452098685,0
209,-1.9317210757402643,0
210,1.2778454063576845,0
211,0.5761834009462541,0
212,-0.822622769564521,0
213,0.7921403153041321,0
214,0.4143387893279141,0
215,-0.9162328653371847,0
216,-0.21854712488271816,0
217,0.6711061202075327,0
218,-0.20228470454036956,0
219,-0.42213013856167714,0
220,0.888062897000186,0
221,0.7305819664601448,0
222,-1.2059214497331872,0
223,0.638403684245497,0
224,0.6338637211465659,0
225,-0.6145499300833437,0
226,-0.5199549854212902,0
227,1.0066391052702837,0
228,-0.931807341242414,0
229,-0.18249172040152373,0
230,0.9884641481630029,0
231,-0.3173091758741375,0
232,-1.5802723237507208,0
233,0.4123621020077758,0
234,0.6526195143753541,0
235,-1.5967498092040868,0
236,0.5478787635553338,0
237,0.5454222397073022,0
238,0.12198337942443327,0
239,-0.4205357657159987,0
240,1.7075314382844726,0
241,0.04400294375657833,0
242,-0.2313227885623641,0
243,0.42710893744625866,0
244,0.13566154250431406,0
245,-1.2347098346525616,0
246,-0.2797899705879036,0
247,0.9515905275922919,0
248,-0.2985456030007225,0
249,0.44875652184206083,0
250,2.081082734745155,0
251,-0.5924805428012802,0
252,-0.6963065023384261,0
253,1.4177289814676726,0
254,0.8214359299890144,0
255,-0.3623344680793952,0
256,-0.03885773332124441,0
257,0.44280788484087685,0
258,-0.5870029761162365,0
259,-0.1851533275194862,0
260,0.642400899945702,0
261,-0.2412467759844714,0
262,-1.0912279644081255,0
263,-0.047476782729166556,0
264,0.7112284631790111,0
265,-0.28738301060335636,0
266,-0.39495101591165926,0
267,1.1405139977387995,0
268,-0.3166005878721927,0
269,-0.49910693187492494,0
270,0.5857910690399704,0
271,0.01699718895403443,0
272,-0.4303649888866031,0
273,0.863415276203767,0
274,0.1674900935798439,0
275,-0.14410891410722182,0
276,-0.3091372532396047,0
277,1.1088819058662231,0
278,-1.1206713999404836,0
279,-0.359867548415982,0
280,1.2468026218145103,0
281,-0.5072897275795325,0
282,-1.6870713327747153,0
283,1.4309381277614697,0
284,-0.3307834887306382,0
285,-1.9802778659485951,0
286,0.697823997614488,0
287,1.2084698666965072,0
288,-0.7732018636238397,0
289,-0.43479780774031607,0
290,0.8564674819163545,0
291,0.17133500070047297,0
292,-0.23149856667226543,0
293,1.086547754269841,0
294,-0.18772675416591056,0
295,-0.7336026206414991,0
296,0.9286358973988084,0
297,0.8188155146605266,0
298,-0.6692150333853046,0
299,-0.6404644788170041,0
300,0.1775884214715954,1
301,-0.18633398628405368,0
302,0.5420840366225537,0
303,0.8612435231432094,0
304,-1.0888142500086306,0
305,1.3112130748041293,0
306,-0.8142956205862134,0
307,1.3016321633598043,0
308,0.050908251332266174,0
309,1.6550822346794103,0
310,-1.6006479004652454,0
311,1.1715365848114954,0
312,-0.2732471002887342,0
313,0.8712327524477497,0
314,0.1398846812461963,0
315,0.9884687263335296,0
316,0.5110265539815373,0
317,-0.17809823493726276,0
318,0.22299269847427716,0
319,-0.813383560230472,0
320,0.25511180495779173,0
321,-1.8339757922372564,0
322,0.33491549349215066,0
323,-1.0251076593988708,0
324,0.6629110827790818,0
325,-0.46084358313723944,0
326,0.7053744126151342,0
327,-1.2396635087058365,0
328,-0.3434153308751313,0
329,0.003474851157489245,0
330,-1.0236228986032567,0
331,0.10495390940113751,0
332,0.41211059164927055,0
333,0.18695011377314527,0
334,-0.6599881816116602,0
335,1.1918232359277476,0
336,-0.536377930478658,0
337,0.6980925419957551,0
338,0.14836862204761825,0
339,1.663641468382509,0
340,-0.5681749568562322,0
341,0.5172564691718866,0
342,-0.9034979043137004,0
343,0.7722897465931653,0
344,-1.0250312017721677,0
345,0.7677895113811509,0
346,-0.36341210550275915,0
347,-0.011911683933661432,0
348,0.3511074350567318,0
349,-1.2292120424016633,0
350,-0.16885083643717946,0
351,-1.5409835853099083,0
352,-0.07164545621710106,0
353,-0.6708562819654622,0
354,0.8474776629957637,0
355,-1.3043842785064252,0
356,1.3785728826782346,0
357,-0.9170380135225586,0
358,1.3154441315717678,0
359,-1.3156406484649223,0
360,0.3302271303611635,0
361,0.1861963237353896,0
362,0.10563975921397162,0
363,0.8870326421150234,0
364,-0.2058880215881802,0
365,0.8289604702071307,0
366,-0.06776569903639584,0
367,1.1209199860354455,0
368,-1.1614208704660032,0
369,1.1977637601136506,0
370,-0.9654537656463223,0
371,1.237688404164566,0
372,0.04815466261700485,0
373,0.6307406712759288,0
374,-0.2520506148182974,0
375,0.5847568568805809,0
376,0.619072236056382,0
377,-0.5594809162416321,0
378,0.06286630002210242,0
379,-0.42226702761764445,0
380,1.685891688611771,0
381,-0.5247190084566797,0
382,0.737992391881983,0
383,-1.5381440895244096,0
384,0.9742754990438458,0
385,-0.6472465842519972,0
386,0.23739208409878954,0
387,-1.3251046724522393,0
388,0.7266310850591211,0
389,-1.2665181036938047,0
390,0.11732202498390135,0
391,0.3845164423994682,0
392,-0.2647981912714267,0
393,0.8093451742257303,0
394,-0.4439939972263855,0
395,0.20379890640780596,0
396,0.09601252688641226,0
397,1.2764707592122748,0
398,-0.9390168427902837,0
399,1.5600106449526856,0
400,-0.10698756158584591,1
401,1.1482320539664035,0
402,0.00511445367766887,0
403,-1.6012467272795383,0
404,-0.4215347772789088,0
405,0.851227072879014,0
406,-0.1293330510093127,0
407,-0.5355547646070322,0
408,0.07760234794075638,0
409,1.1856182515417342,0
410,0.13263509637503412,0
411,-0.8495787851059007,0
412,-1.0742409861710018,0
413,0.2159620367068368,0
414,0.3761301739434113,0
415,-0.05120514136983123,0
416,-0.1490512450737126,0
417,-0.19501757712256917,0
418,0.9971229086479858,0
419,1.8648545618895955,0
420,-0.2537312149193813,0
421,-0.7504072464584485,0
422,-0.42110426628783254,0
423,1.4125076067642237,0
424,-0.45459442425997987,0
425,-0.5690656790378785,0
426,0.21961662285098327,0
427,0.2602931814203714,0
428,0.5481124707650051,0
429,-0.21164565321185758,0
430,-0.9002094482501206,0
431,-0.19494309426226186,0
432,0.40484403373476013,0
433,-0.8135129490236755,0
434,-1.7181534884883356,0
435,0.36656263060424404,0
436,0.7395570761080876,0
437,-0.24707006907700435,0
438,-1.000022509208204,0
439,-0.3194602581190231,0
440,1.174030128012466,0
441,0.41133465185055185,0
442,-0.8836339173285144,0
443,-0.5398837386188946,0
444,0.9575639398767725,0
445,1.6800950107687256,0
446,0.0600442083003247,0
447,-1.7444324438976313,0
448,-0.05952047264173746,0
449,1.0137269129385464,0
450,-0.46470494023515846,0
451,-1.0560587822800558,0
452,-0.7182116352978654,0
453,0.19861961744878298,0
454,0.38318580305562916,0
455,-0.6381647106084474,0
456,-0.885097532291406,0
457,-0.350048230221339,0
458,0.8574357354763227,0
459,-0.9193943161334789,0
460,-1.0923514899358084,0
461,0.2858598581106406,0
462,0.6515509624442755,0
463,0.6934398513376767,0
464,-1.1238026414136768,0
465,-0.5408551253156386,0
466,0.2631405378078662,0
467,0.39390746496619766,0
468,-1.0265459625399707,0
469,-1.136549455359127,0
470,-0.12008109901832048,0
471,1.6998513422922015,0
472,-0.6647893250000728,0
473,-1.1029022497298633,0
474,-0.7404367726556061,0
475,1.3056954559026077,0
476,1.0304723308552222,0
477,-0.2416094957666487,0
478,-1.3411855886927009,0
479,0.531507513359109,0
480,1.1877302510251642,0
481,-0.6563705941600877,0
482,-1.5229712157415198,0
483,-0.35288944971238395,0
484,1.5162600437434528,0
485,0.13424858981780913,0
486,-0.6990210608895207,0
487,0.28506741714115585,0
488,1.0283932627379915,0
489,0.1069827694568769,0
490,-0.4893574051137005,0
491,-1.5222820824354972,0
492,0.5810651492305884,0
493,1.3630867284902404,0
494,-0.20212259222047263,0
495,-0.9250592181030397,0
496,0.9691286976516315,0
497,0.7367873033008159,0
498,0.14366742540130611,0
499,-0.8386801888248178,0
500,1.1503836005793435,1
501,-0.4307453505514319,0
502,0.8036625352122114,0
503,1.0411428485758927,0
504,-2.079478735899104,0
505,1.0568135970423298,0
506,0.4538503887767882,0
507,-1.1788526819493002,0
508,0.6869187288786553,0
509,1.3736574915863258,0
510,-1.4550855101329976,0
511,-0.6822924338473296,0
512,-0.385544760428516,0
513,-1.409755530022523,0
514,0.8911367008460261,0
515,1.1389720163243433,0
516,-1.1847024971740039,0
517,1.4064614395654456,0
518,0.372807989057127,0
519,-1.24148552189911,0
520,0.5552024193706359,0
521,-0.08961343465030414,0
522,-1.0270411208283696,0
523,1.8676692748027999,0
524,-1.1362232724586363,0
525,0.3956841709425305,0
526,1.7000586043286425,0
527,-0.44752971139823566,0
528,0.03717825695201288,0
529,2.0208498666865924,0
530,-0.9423324082259044,0
531,-0.5418965303634162,0
532,0.4727230661748934,0
533,-0.8839198009485654,0
534,0.5128655506097171,0
535,0.4057639637546035,0
536,-0.6067386464968102,0
537,0.7714464283355672,0
538,0.587255512623351,0
539,-1.0766457160805543,0
540,1.1374224132117954,0
541,0.2387788063446375,0
542,-1.4739926387901603,0
543,0.6293542445040414,0
544,-0.33795933604590356,0
545,-0.12946975113236725,0
546,0.9254706927613798,0
547,-0.06108656214875133,0
548,-0.7119870659811348,0
549,0.4394518105088736,0
550,-0.33445794417880137,0
551,-0.7871763865356709,0
552,1.0643078926196072,0
553,0.13895607350061234,0
554,-0.595923896774779,0
555,1.2605775208156367,0
556,-0.9905795008671006,0
557,0.3457121587160773,0
558,1.0365784920491334,0
559,-1.3960177479528855,0
560,0.6108331567378555,0
561,1.0762152819170472,0
562,-0.9295502027580409,0
563,0.7314237851383228,0
564,-0.0615600591947405,0
565,-0.11263332476634769,0
566,0.6003446099671038,0
567,0.55360764445005,0
568,-0.47042061116687084,0
569,0.736604995300642,0
570,0.07863640021928672,0
571,-1.0199590036235973,0
572,0.15710651069702475,0
573,-0.1532885927796228,0
574,-0.9184579772647562,0
575,0.5251342624683712,0
576,-0.4897706060481739,0
577,0.08143691996075175,0
578,1.5016588005253555,0
579,-1.7857744528582384,0
580,-0.015443374990037562,0
581,-1.1108104282769968,0
582,-0.13728922301787216,0
583,-0.9291008008213688,0
584,0.6517518137129084,0
585,-0.24220567345688343,0
586,0.09611970473486178,0
587,1.0368473189289433,0
588,-1.9878488584279874,0
589,0.03783556158689785,0
590,1.1152143390011986,0
591,-1.3871970366509958,0
592,0.3058119519080199,0
593,0.9705357333497513,0
594,-1.6673342023676225,0
595,0.3208539005397765,0
596,0.41527076415662806,0
597,-1.7714072096212927,0
598,0.18382210506597896,0
599,-0.029939031749712686,0
600,-0.330410133164565,1
601,-0.8018142073008535,0
602,0.41634746597908645,0
603,-0.343977825216793,0
604,1.7378365207062956,0
605,-0.39896064515964136,0
606,1.0818864171751266,0
607,-1.191263394842271,0
608,0.5099926345003357,0
609,-0.8917339102715922,0
610,-0.14147048386515695,0
611,-0.3304393630333155,0
612,-0.2843305123683036,0
613,1.1584532949288948,0
614,-1.5621080430373064,0
615,0.9720111562309526,0
616,-0.9557698895301745,0
617,0.9470592003848162,0
618,-0.1740272058633887,0
619,0.9029300125036993,0
620,-0.6477255623923099,0
621,0.36021470338354467,0
622,-0.3023950512299413,0
623,-0.9453039188288044,0
624,0.5782278073465646,0
625,-1.1621125835064086,0
626,1.0322312636528952,0
627,0.0859204315313098,0
628,0.9855337913697597,0
629,-0.26234496834727306,0
630,0.6791996453980236,0
631,-0.8878925888718805,0
632,-0.41879047269286857,0
633,0.7745407252555562,0
634,-0.41996326864367894,0
635,0.22613139949077515,0
636,-0.2709332673666307,0
637,1.3681316699285713,0
638,-0.871284148994714,0
639,1.2259495893672248,0
640,-0.5584105907446905,0
641,0.2462109732511929,0
642,-0.228459568957192,0
643,0.5343953438353772,0
644,-0.6314395435176048,0
645,0.32623679201802913,0
646,1.0298019742821722,0
647,-0.8715414710906795,0
648,1.327168282944052,0
649,-0.5433034942323993,0
650,0.7523316121860129,0
651,-0.42425586825035855,0
652,0.8761086007099546,0
653,-1.3474154723662435,0
654,0.5656439072395127,0
655,-0.4872942745983481,0
656,-0.6698167938605315,0
657,0.9048758976857074,0
658,-0.026561968345372777,0
659,1.0846849450268028,0
660,-1.4183740422949447,0
661,0.626202179065857,0
662,-0.7398701283004954,0
663,-0.08857345175317533,0
664,-0.7945585947837657,0
665,0.922114048703955,0
666,-0.9653015685714584,0
667,0.29404193888318225,0
668,0.5257116796720067,0
669,0.058466246878383574,0
670,1.1408428775239077,0
671,-0.1894307314952437,0
672,0.00947646442858252,0
673,-1.2597796595938313,0
674,1.6815973343367596,0
675,-1.0932609494843382,0
676,1.2541857417099034,0
677,-1.2744188429046721,0
678,0.951142835810383,0
679,-1.1944223485220584,0
680,-1.1969833734425923,0
681,-0.2850230446813431,0
682,-0.5419697040242275,0
683,0.9968687706819457,0
684,-1.5270244251683982,0
685,1.2117889949337812,0
686,-0.9242873935017535,0
687,0.3030931444913313,0
688,-1.0182221129884463,0
689,0.8276645284908418,0
690,-0.8312412128727049,0
691,0.07822416498593168,0
692,-1.0092405831613442,0
693,-0.7794343179807588,0
694,-0.38123355140408643,0
695,-0.6731987603922741,0
696,1.738776233075963,0
697,-1.6573576560708574,0
698,1.1210626441763676,0
699,-0.6969037706594472,0
700,-0.7981370535197427,1
701,2.2212670620269472,0
702,-0.07467887547183166,0
703,0.045304394313472995,0
704,1.1875083725928115,0
705,1.1162396746009862,0
706,-0.833252216085261,0
707,-0.6704376767016458,0
708,-0.0009519148063035776,0
709,-1.408509371808114,0
710,1.336828834378937,0
711,0.4048090689126618,0
712,-0.7193706085909894,0
713,0.5082810767236621,0
714,1.5190174731313961,0
715,-0.540760668784187,0
716,-0.14085553677280965,0
717,0.7464006752886886,0
718,-1.2883355624724928,0
719,-1.6028177218134276,0
720,1.028257386328008,0
721,-1.1278785591908234,0
722,0.14736477311632812,0
723,2.0441241001554262,0
724,0.004329800479831836,0
725,-1.103926055541044,0
726,0.3194077379100062,0
727,0.4038134457769479,0
728,-0.4091070680335218,0
729,0.517434808211818,0
730,0.0823874356902686,0
731,-0.7435448710198609,0
732,0.5872267614471944,0
733,-0.4244268862835102,0
734,-0.43701595439028595,0
735,0.9861099585517865,0
736,0.17467798279553937,0
737,-1.5992315175240137,0
738,0.19089955073072284,0
739,1.0847037352816151,0
740,0.026072273884768182,0
741,0.14699145784797482,0
742,0.8284541578512445,0
743,-0.40595698401998137,0
744,-0.39597971348558975,0
745,1.6166568234405303,0
746,-0.5535891251286715,0
747,-0.8898492274320671,0
748,1.4759037231320185,0
749,0.16560321352288232,0
750,-1.3299637101444857,0
751,0.3183731459807958,0
752,-0.21490652370310773,0
753,-0.8688473642475922,0
754,1.748808565180087,0
755,0.17034250912043436,0
756,-1.2906108094340585,0
757,0.5403416423732756,0
758,0.42588472900826974,0
759,-0.6739164801118038,0
760,0.6929911577069822,0
761,0.8507437339270053,0
762,-1.0042407429874416,0
763,0.29349607864298327,0
764,1.9213720069715505,0
765,-0.10613727297932596,0
766,-1.4153034603756904,0
767,0.9157495042373833,0
768,-0.8931360934391721,0
769,0.08600084375989026,0
770,0.2753354026580258,0
771,0.0149273983117105,0
772,-0.1498886438330096,0
773,1.4834799182680456,0
774,0.33264426206213643,0
775,-1.495356201460372,0
776,0.8075389288513136,0
777,0.37868211736506846,0
778,-0.26830689412736586,0
779,0.3215513094197841,0
780,0.1744323458191575,0
781,-1.0213507142350509,0
782,0.4966050595386484,0
783,1.2812452057757364,0
784,-1.5028929015796706,0
785,0.2828967640482305,0
786,0.4733101486584496,0
787,-0.9748865664692572,0
788,-0.5184174632337771,0
789,0.8327751764615111,0
790,-0.8969105046972928,0
791,0.3780153525530605,0
792,1.6106035371060283,0
793,-0.1765758865184709,0
794,-0.14221172876594124,0
795,0.3279539539875055,0
796,0.3449198612666841,0
797,-0.9260676267270278,0
798,1.4896219098558419,0
799,-0.2570969463590741,0
800,-0.7482251626662135,1
801,0.17282225566747167,0
802,1.0509295779915273,0
803,0.5306554912301498,0
804,-1.2333841809630322,0
805,0.6855774223556133,0
806,0.8303828300032484,0
807,-0.8635274907627573,0
808,-0.4001610859639561,0
809,0.9748827410872896,0
810,1.1034638197681041,0
811,-1.3958022923219375,0
812,-1.3122187405496328,0
813,1.1240470528741882,0
814,1.4178435381818284,0
815,-0.9864195679154125,0
816,-1.1544539341464124,0
817,0.35148730253749727,0
818,0.14811637304656355,0
819,-0.583182491250595,0
820,-0.1013386516427327,0
821,0.6359015107652817,0
822,0.5106844511526745,0
823,0.35059083197112284,0
824,-0.45125074930646136,0
825,1.4467168602827627,0
826,0.4833389101091519,0
827,-0.4548271307748355,0
828,-0.05362107483350559,0
829,1.8112176859599314,0
830,0.7508229825862713,0
831,-1.3065199561828365,0
832,-0.24768878016855353,0
833,1.0431311607494524,0
834,0.03547573011741256,0
835,-0.7416528506463423,0
836,-0.2739957513930766,0
837,0.9334885924369049,0
838,-0.7860387106992721,0
839,-1.5580117259090056,0
840,-1.0939348984367503,0
841,1.6660432406947803,0
842,0.9565067323600378,0
843,-1.1929713545845801,0
844,0.2432970145431069,0
845,1.0204113443280656,0
846,0.6687752429217103,0
847,-1.7780026490293446,0
848,-0.697672819625001,0
849,1.1409633241305557,0
850,0.175731173622826,0
851,-0.8199515938157573,0
852,-0.6307084884311862,0
853,1.002221483294362,0
854,0.148802137816621,0
855,-1.6259093142772703,0
856,0.8820790669406993,0
857,0.47744547279689364,0
858,0.690226043736154,0
859,-1.457713217166355,0
860,0.1269182154485599,0
861,1.5718556114816673,0
862,1.2842585625880298,0
863,-0.6217836892890645,0
864,-0.025973305541470995,0
865,1.1939473609432132,0
866,-0.4609723923597503,0
867,-1.2228862353006316,0
868,-0.43887996152020176,0
869,1.2349811219464095,0
870,-0.2831953114092213,0
871,-0.7970526732679521,0
872,0.46210495608189806,0
873,1.4070741194195995,0
874,0.517963269924449,0
875,-1.1867329214951519,0
876,0.4357055427073282,0
877,0.7554897788197488,0
878,0.28051252667716786,0
879,-1.0477745728296606,0
880,0.5266544680527274,0
881,0.9865317671674291,0
882,-0.03595266112834289,0
883,-1.5250247911859138,0
884,0.15056876207612005,0
885,1.5256544128733056,0
886,0.001306441124099944,0
887,-1.3306963943353325,0
888,-0.5795104899466176,0
889,0.8471759517920214,0
890,-1.2925011458582634,0
891,-1.2997799433296393,0
892,0.4097320526803748,0
893,1.1534551156427075,0
894,-1.1703313664262773,0
895,-0.786703652409228,0
896,1.4629158892753948,0
897,1.6023470822313874,0
898,-0.25637512892227454,0
899,-1.4363220254210267,0
900,0.19436927051180286,1
901,0.1272844040994885,0
902,-0.6472283889385378,0
903,-1.0630885070390914,0
904,-0.6535474342264216,0
905,-1.5079309667685061,0
906,-1.0021745064527117,0
907,0.9131600175845447,0
908,-0.10443364266142313,0
909,0.7525654228153043,0
910,0.8632472897646902,0
911,0.931900410284584,0
912,0.37907785639474106,0
913,0.05890319686076982,0
914,-1.410836911669417,0
915,-0.2631836822831892,0
916,-1.1017535814554054,0
917,-1.2847154164533965,0
918,0.5883108945119271,0
919,0.7672944113521416,0
920,0.4941073241371882,0
921,1.3716808799544475,0
922,0.004279039155069109,0
923,0.7113907567713019,0
924,0.8035610548320645,0
925,-0.5961567887813333,0
926,-0.9781766187288066,0
927,-0.45079957859382397,0
928,-1.258468449534707,0
929,-0.5367154505020346,0
930,0.6035530789279965,0
931,1.7395265533065398,0
932,1.417185118402319,0
933,1.140149421890944,0
934,0.30038923721572647,0
935,-1.003265070384431,0
936,-1.3462888089515328,0
937,-1.664028587947842,0
938,-1.1615052494403446,0
939,-0.4810347269536089,0
940,0.27762067105914834,0
941,0.8116821941744663,0
942,0.41282571433600945,0
943,1.0474420740898676,0
944,1.7442353130168946,0
945,-0.0962160840279715,0
946,-0.15199597268774395,0
947,-1.0775295275297911,0
948,-0.9505521730646337,0
949,-0.5998295087151639,0
950,-0.9826113153260776,0
951,1.0614208019973135,0
952,1.1407505366672397,0
953,-0.046580463768763125,0
954,0.883578376134533,0
955,0.6883607466808757,0
956,0.2815197298705828,0
957,-0.8824778472655583,0
958,-0.8995935312966143,0
959,-0.6622299654034909,0
960,-0.7727402779663829,0
961,-0.05449425374201994,0
962,0.0766924989664841,0
963,0.5108751814380725,0
964,0.7406789834697224,0
965,0.41417346359030005,0
966,0.23262638472214336,0
967,-0.19133617404249934,0
968,-0.2439462791058391,0
969,-0.5902948346133614,0
970,-0.6653172601245685,0
971,-0.3677491174771246,0
972,-0.7801552725509009,0
973,0.8697362828286622,0
974,0.09485049290075909,0
975,1.287830593038409,0
976,0.6324166969581994,0
977,1.1320988532589786,0
978,0.6570721683368727,0
979,-0.3114388212320681,0
980,-0.9048037984448426,0
981,-0.6037772061201867,0
982,0.24219769817281933,0
983,-0.3475613282621599,0
984,0.22322115739626025,0
985,1.0726932780932446,0
986,0.895440026702433,0
987,0.2183408153254205,0
988,0.9582792647627866,0
989,0.04032672192636982,0
990,-0.2435048745901135,0
991,-1.6991337037098666,0
992,0.1375329447217578,0
993,-0.31759358457921205,0
994,-0.7580928804398334,0
995,1.0953879752247737,0
996,0.469540542351354,0
997,0.6396943284692653,0
998,0.3083633918573617,0
999,0.7407492462501395,0
