Time,X1,Label7,Label8,Label10,Label12,Label13
0,1687.0,0.0,0.0,0.0,0.0,0.0
1,1508.0,0.0,0.0,0.0,0.0,0.0
2,1507.0,0.0,0.0,0.0,0.0,0.0
3,1385.0,0.0,0.0,0.0,0.0,0.0
4,1632.0,0.0,0.0,0.0,0.0,0.0
5,1511.0,0.0,0.0,0.0,0.0,0.0
6,1559.0,0.0,0.0,0.0,0.0,0.0
7,1630.0,0.0,0.0,0.0,0.0,0.0
8,1579.0,0.0,0.0,0.0,0.0,0.0
9,1653.0,0.0,0.0,0.0,0.0,0.0
10,2152.0,0.0,0.0,0.0,0.0,0.0
11,2148.0,0.0,0.0,0.0,0.0,0.0
12,1752.0,0.0,0.0,0.0,0.0,0.0
13,1765.0,0.0,0.0,0.0,0.0,0.0
14,1717.0,0.0,0.0,0.0,0.0,0.0
15,1558.0,0.0,0.0,0.0,0.0,0.0
16,1575.0,0.0,0.0,0.0,0.0,0.0
17,1520.0,0.0,0.0,0.0,0.0,0.0
18,1805.0,0.0,0.0,0.0,0.0,0.0
19,1800.0,0.0,0.0,0.0,0.0,0.0
20,1719.0,0.0,0.0,0.0,0.0,0.0
21,2008.0,0.0,0.0,0.0,0.0,0.0
22,2242.0,0.0,0.0,0.0,0.0,0.0
23,2478.0,0.0,0.0,0.0,0.0,0.0
24,2030.0,0.0,0.0,0.0,0.0,0.0
25,1655.0,0.0,0.0,0.0,0.0,0.0
26,1693.0,0.0,0.0,0.0,0.0,0.0
27,1623.0,0.0,0.0,0.0,0.0,0.0
28,1805.0,0.0,0.0,0.0,0.0,0.0
29,1746.0,0.0,0.0,0.0,0.0,0.0
30,1795.0,0.0,0.0,0.0,0.0,0.0
31,1926.0,0.0,0.0,0.0,0.0,0.0
32,1619.0,0.0,0.0,0.0,0.0,0.0
33,1992.0,0.0,0.0,0.0,0.0,0.0
34,2233.0,0.0,0.0,0.0,0.0,0.0
35,2192.0,0.0,0.0,0.0,0.0,0.0
36,2080.0,0.0,0.0,0.0,0.0,0.0
37,1768.0,0.0,0.0,0.0,0.0,0.0
38,1835.0,0.0,0.0,0.0,0.0,0.0
39,1569.0,0.0,0.0,0.0,0.0,0.0
40,1976.0,0.0,0.0,0.0,0.0,0.0
41,1853.0,0.0,0.0,0.0,0.0,0.0
42,1965.0,0.0,0.0,0.0,0.0,0.0
43,1689.0,0.0,0.0,0.0,0.0,0.0
44,1778.0,0.0,0.0,0.0,0.0,0.0
45,1976.0,0.0,0.0,0.0,0.0,0.0
46,2397.0,0.0,0.0,0.0,0.0,0.0
47,2654.0,0.0,0.0,0.0,0.0,0.0
48,2097.0,0.0,0.0,0.0,0.0,0.0
49,1963.0,0.0,0.0,0.0,0.0,0.0
50,1677.0,0.0,0.0,0.0,0.0,0.0
51,1941.0,0.0,0.0,0.0,0.0,0.0
52,2003.0,0.0,0.0,0.0,0.0,0.0
53,1813.0,0.0,0.0,0.0,0.0,0.0
54,2012.0,0.0,0.0,0.0,0.0,0.0
55,1912.0,0.0,0.0,0.0,0.0,0.0
56,2084.0,0.0,0.0,0.0,0.0,0.0
57,2080.0,0.0,0.0,0.0,0.0,0.0
58,2118.0,0.0,0.0,0.0,0.0,0.0
59,2150.0,0.0,0.0,0.0,0.0,0.0
60,1608.0,0.0,1.0,0.0,1.0,1.0
61,1503.0,1.0,0.0,0.0,0.0,0.0
62,1548.0,0.0,0.0,0.0,0.0,0.0
63,1382.0,0.0,0.0,0.0,0.0,0.0
64,1731.0,0.0,0.0,0.0,0.0,0.0
65,1798.0,0.0,0.0,0.0,0.0,0.0
66,1779.0,0.0,0.0,0.0,0.0,0.0
67,1887.0,0.0,0.0,0.0,0.0,0.0
68,2004.0,0.0,0.0,0.0,0.0,0.0
69,2077.0,0.0,0.0,0.0,0.0,0.0
70,2092.0,0.0,0.0,0.0,0.0,0.0
71,2051.0,0.0,0.0,0.0,0.0,0.0
72,1577.0,0.0,0.0,0.0,0.0,0.0
73,1356.0,0.0,0.0,0.0,0.0,0.0
74,1652.0,0.0,0.0,0.0,0.0,0.0
75,1382.0,0.0,0.0,0.0,0.0,0.0
76,1519.0,0.0,0.0,0.0,0.0,0.0
77,1421.0,0.0,0.0,0.0,0.0,0.0
78,1442.0,0.0,0.0,0.0,0.0,0.0
79,1543.0,0.0,0.0,0.0,0.0,1.0
80,1656.0,0.0,0.0,0.0,0.0,0.0
81,1561.0,0.0,0.0,0.0,0.0,0.0
82,1905.0,0.0,0.0,0.0,0.0,0.0
83,2199.0,0.0,0.0,0.0,0.0,0.0
84,1473.0,0.0,0.0,0.0,0.0,0.0
85,1655.0,0.0,0.0,0.0,0.0,0.0
86,1407.0,0.0,0.0,0.0,0.0,0.0
87,1395.0,0.0,0.0,0.0,0.0,0.0
88,1530.0,0.0,0.0,0.0,0.0,0.0
89,1309.0,0.0,0.0,0.0,0.0,0.0
90,1526.0,0.0,0.0,0.0,0.0,0.0
91,1327.0,0.0,0.0,0.0,0.0,0.0
92,1627.0,0.0,0.0,0.0,0.0,0.0
93,1748.0,0.0,0.0,0.0,0.0,0.0
94,1958.0,0.0,0.0,0.0,0.0,0.0
95,2274.0,0.0,0.0,0.0,0.0,0.0
96,1648.0,0.0,0.0,0.0,0.0,0.0
97,1401.0,0.0,0.0,0.0,0.0,0.0
98,1411.0,0.0,0.0,0.0,0.0,0.0
99,1403.0,0.0,0.0,0.0,0.0,0.0
100,1394.0,0.0,0.0,0.0,0.0,0.0
101,1520.0,0.0,0.0,0.0,0.0,0.0
102,1528.0,0.0,0.0,0.0,0.0,0.0
103,1643.0,0.0,0.0,0.0,0.0,0.0
104,1515.0,0.0,0.0,0.0,0.0,0.0
105,1685.0,0.0,0.0,0.0,0.0,0.0
106,2000.0,0.0,0.0,0.0,0.0,0.0
107,2215.0,0.0,0.0,0.0,0.0,0.0
108,1956.0,0.0,0.0,0.0,0.0,0.0
109,1462.0,0.0,0.0,0.0,0.0,0.0
110,1563.0,0.0,0.0,0.0,0.0,0.0
111,1459.0,0.0,0.0,0.0,0.0,0.0
112,1446.0,0.0,0.0,0.0,0.0,0.0
113,1622.0,0.0,0.0,0.0,0.0,0.0
114,1657.0,0.0,0.0,0.0,0.0,0.0
115,1638.0,0.0,0.0,0.0,0.0,0.0
116,1643.0,0.0,0.0,0.0,0.0,0.0
117,1683.0,0.0,0.0,0.0,0.0,0.0
118,2050.0,0.0,0.0,0.0,0.0,0.0
119,2262.0,0.0,0.0,0.0,0.0,0.0
120,1813.0,0.0,0.0,0.0,0.0,0.0
121,1445.0,0.0,0.0,0.0,0.0,0.0
122,1762.0,0.0,0.0,0.0,0.0,0.0
123,1461.0,0.0,0.0,0.0,0.0,0.0
124,1556.0,0.0,0.0,0.0,0.0,0.0
125,1431.0,0.0,0.0,0.0,0.0,0.0
126,1427.0,0.0,0.0,0.0,0.0,0.0
127,1554.0,0.0,0.0,0.0,0.0,0.0
128,1645.0,0.0,0.0,0.0,0.0,0.0
129,1653.0,0.0,0.0,0.0,0.0,0.0
130,2016.0,0.0,0.0,0.0,0.0,0.0
131,2207.0,0.0,0.0,0.0,0.0,0.0
132,1665.0,0.0,0.0,0.0,0.0,0.0
133,1361.0,0.0,0.0,0.0,0.0,0.0
134,1506.0,0.0,0.0,0.0,0.0,0.0
135,1360.0,0.0,0.0,0.0,0.0,0.0
136,1453.0,0.0,0.0,0.0,0.0,0.0
137,1522.0,0.0,0.0,0.0,0.0,0.0
138,1460.0,0.0,0.0,0.0,0.0,0.0
139,1552.0,0.0,0.0,0.0,0.0,0.0
140,1548.0,0.0,0.0,0.0,0.0,0.0
141,1827.0,0.0,0.0,0.0,0.0,0.0
142,1737.0,0.0,0.0,0.0,0.0,0.0
143,1941.0,0.0,0.0,0.0,0.0,0.0
144,1474.0,0.0,0.0,0.0,0.0,0.0
145,1458.0,0.0,0.0,0.0,0.0,0.0
146,1542.0,0.0,0.0,0.0,0.0,0.0
147,1404.0,0.0,0.0,0.0,0.0,0.0
148,1522.0,0.0,0.0,0.0,0.0,0.0
149,1385.0,0.0,0.0,0.0,0.0,0.0
150,1641.0,0.0,0.0,0.0,0.0,0.0
151,1510.0,0.0,0.0,0.0,0.0,0.0
152,1681.0,0.0,0.0,0.0,0.0,0.0
153,1938.0,0.0,0.0,0.0,0.0,0.0
154,1868.0,0.0,0.0,0.0,0.0,0.0
155,1726.0,0.0,0.0,0.0,0.0,0.0
156,1456.0,0.0,0.0,0.0,0.0,0.0
157,1445.0,0.0,0.0,0.0,0.0,0.0
158,1456.0,0.0,0.0,0.0,0.0,0.0
159,1365.0,0.0,0.0,0.0,0.0,0.0
160,1487.0,0.0,0.0,0.0,0.0,0.0
161,1558.0,0.0,0.0,0.0,0.0,0.0
162,1488.0,0.0,0.0,0.0,0.0,0.0
163,1684.0,0.0,0.0,0.0,0.0,0.0
164,1594.0,0.0,0.0,0.0,0.0,0.0
165,1850.0,0.0,0.0,0.0,0.0,0.0
166,1998.0,0.0,0.0,0.0,0.0,0.0
167,2079.0,0.0,0.0,0.0,0.0,0.0
168,1494.0,0.0,0.0,0.0,0.0,0.0
169,1057.0,1.0,1.0,0.0,1.0,1.0
170,1218.0,0.0,0.0,0.0,0.0,0.0
171,1168.0,0.0,0.0,0.0,0.0,0.0
172,1236.0,0.0,0.0,0.0,0.0,0.0
173,1076.0,0.0,0.0,0.0,0.0,0.0
174,1174.0,0.0,0.0,0.0,0.0,0.0
175,1139.0,0.0,0.0,0.0,0.0,0.0
176,1427.0,0.0,0.0,0.0,0.0,0.0
177,1487.0,0.0,0.0,0.0,0.0,0.0
178,1483.0,0.0,0.0,0.0,0.0,0.0
179,1513.0,0.0,0.0,0.0,0.0,0.0
180,1357.0,0.0,0.0,0.0,0.0,0.0
181,1165.0,0.0,0.0,0.0,0.0,0.0
182,1282.0,0.0,0.0,0.0,0.0,0.0
183,1110.0,0.0,0.0,0.0,0.0,0.0
184,1297.0,0.0,0.0,0.0,0.0,0.0
185,1185.0,0.0,0.0,0.0,0.0,0.0
186,1222.0,0.0,0.0,0.0,0.0,0.0
187,1284.0,0.0,0.0,0.0,0.0,0.0
188,1444.0,0.0,0.0,0.0,0.0,0.0
189,1575.0,0.0,0.0,0.0,0.0,0.0
190,1737.0,0.0,0.0,0.0,0.0,0.0
191,1763.0,0.0,0.0,0.0,0.0,0.0
