Time,X1,Label6,Label7,Label8,Label10,Label12
0,90.833336,0.0,0.0,0.0,0.0,0.0
1,86.666664,0.0,0.0,0.0,0.0,0.0
2,85.833336,0.0,0.0,0.0,0.0,0.0
3,85.833336,0.0,0.0,0.0,0.0,0.0
4,86.666664,0.0,0.0,0.0,0.0,0.0
5,86.666664,0.0,0.0,0.0,0.0,0.0
6,83.333336,0.0,0.0,0.0,0.0,0.0
7,81.666664,0.0,0.0,0.0,0.0,0.0
8,80.0,0.0,0.0,0.0,0.0,0.0
9,80.0,0.0,0.0,0.0,0.0,0.0
10,80.833336,0.0,0.0,0.0,0.0,0.0
11,73.333336,0.0,0.0,0.0,0.0,0.0
12,73.333336,0.0,0.0,0.0,0.0,0.0
13,73.333336,0.0,0.0,0.0,0.0,0.0
14,71.666664,0.0,0.0,0.0,0.0,0.0
15,74.166664,0.0,0.0,0.0,0.0,0.0
16,74.166664,0.0,0.0,0.0,0.0,0.0
17,71.666664,0.0,0.0,0.0,0.0,0.0
18,70.0,0.0,0.0,0.0,0.0,0.0
19,70.0,0.0,0.0,0.0,0.0,0.0
20,71.666664,0.0,0.0,0.0,0.0,0.0
21,67.5,0.0,0.0,0.0,0.0,0.0
22,68.333336,0.0,0.0,0.0,0.0,0.0
23,70.833336,0.0,0.0,0.0,0.0,0.0
24,70.0,0.0,0.0,0.0,0.0,0.0
25,69.166664,0.0,0.0,0.0,0.0,0.0
26,70.0,0.0,0.0,0.0,0.0,0.0
27,70.0,0.0,0.0,0.0,0.0,0.0
28,70.0,0.0,0.0,0.0,0.0,0.0
29,70.833336,0.0,0.0,0.0,0.0,0.0
30,73.333336,0.0,0.0,0.0,0.0,0.0
31,75.0,0.0,0.0,0.0,0.0,0.0
32,69.166664,0.0,0.0,0.0,0.0,0.0
33,68.333336,0.0,0.0,0.0,0.0,0.0
34,68.333336,0.0,0.0,0.0,0.0,0.0
35,63.333332,0.0,0.0,0.0,0.0,0.0
36,59.166668,0.0,0.0,0.0,0.0,0.0
37,59.166668,0.0,0.0,0.0,0.0,0.0
38,59.166668,0.0,0.0,0.0,0.0,0.0
39,61.666668,0.0,0.0,0.0,0.0,0.0
40,61.666668,0.0,0.0,0.0,0.0,0.0
41,61.666668,0.0,0.0,0.0,0.0,0.0
42,61.666668,0.0,0.0,0.0,0.0,0.0
43,61.666668,0.0,0.0,0.0,0.0,0.0
44,65.833336,0.0,0.0,0.0,0.0,0.0
45,67.5,0.0,0.0,0.0,0.0,0.0
46,67.5,0.0,0.0,0.0,0.0,0.0
47,74.166664,0.0,0.0,0.0,0.0,0.0
48,74.166664,0.0,0.0,0.0,0.0,0.0
49,74.166664,0.0,0.0,0.0,0.0,0.0
50,73.333336,0.0,0.0,0.0,0.0,0.0
51,71.666664,0.0,0.0,0.0,0.0,0.0
52,71.666664,0.0,0.0,0.0,0.0,0.0
53,71.666664,0.0,0.0,0.0,0.0,0.0
54,70.0,0.0,0.0,0.0,0.0,0.0
55,71.666664,0.0,0.0,0.0,0.0,0.0
56,71.666664,0.0,0.0,0.0,0.0,0.0
57,71.666664,0.0,0.0,0.0,0.0,0.0
58,70.0,0.0,0.0,0.0,0.0,0.0
59,70.0,0.0,0.0,0.0,0.0,0.0
60,70.0,0.0,0.0,0.0,0.0,0.0
61,75.0,0.0,0.0,0.0,0.0,0.0
62,71.666664,0.0,0.0,0.0,0.0,0.0
63,71.666664,0.0,0.0,0.0,0.0,0.0
64,72.5,0.0,0.0,0.0,0.0,0.0
65,74.166664,0.0,0.0,0.0,0.0,0.0
66,73.333336,0.0,0.0,0.0,0.0,0.0
67,73.333336,0.0,0.0,0.0,0.0,0.0
68,73.333336,0.0,0.0,0.0,0.0,0.0
69,78.333336,0.0,0.0,0.0,0.0,0.0
70,80.0,0.0,0.0,0.0,0.0,0.0
71,82.5,0.0,0.0,0.0,0.0,0.0
72,78.333336,0.0,0.0,0.0,0.0,0.0
73,75.833336,0.0,0.0,0.0,0.0,0.0
74,76.666664,0.0,0.0,0.0,0.0,0.0
75,77.5,0.0,0.0,0.0,0.0,0.0
76,78.333336,0.0,0.0,0.0,0.0,0.0
77,76.666664,0.0,0.0,0.0,0.0,0.0
78,74.166664,0.0,0.0,0.0,0.0,0.0
79,77.5,0.0,0.0,0.0,0.0,0.0
80,78.333336,0.0,0.0,0.0,0.0,0.0
81,78.333336,0.0,0.0,0.0,0.0,0.0
82,86.666664,0.0,0.0,0.0,0.0,0.0
83,92.5,0.0,0.0,0.0,0.0,0.0
84,90.833336,0.0,0.0,0.0,0.0,0.0
85,88.333336,0.0,0.0,0.0,0.0,0.0
86,86.666664,0.0,0.0,0.0,0.0,0.0
87,85.833336,0.0,0.0,0.0,0.0,0.0
88,87.5,0.0,0.0,0.0,0.0,0.0
89,87.5,0.0,0.0,0.0,0.0,0.0
90,85.833336,0.0,0.0,0.0,0.0,0.0
91,83.333336,0.0,0.0,0.0,0.0,0.0
92,81.666664,0.0,0.0,0.0,0.0,0.0
93,81.666664,0.0,0.0,0.0,0.0,0.0
94,81.666664,0.0,0.0,0.0,0.0,0.0
95,79.166664,0.0,0.0,0.0,0.0,0.0
96,79.166664,0.0,0.0,0.0,0.0,0.0
97,83.333336,0.0,0.0,0.0,0.0,0.0
98,83.333336,0.0,0.0,0.0,0.0,0.0
99,88.333336,0.0,0.0,0.0,0.0,0.0
100,89.166664,0.0,0.0,0.0,0.0,0.0
101,87.5,0.0,0.0,0.0,0.0,0.0
102,86.666664,0.0,0.0,0.0,0.0,0.0
103,85.0,0.0,0.0,0.0,0.0,0.0
104,80.833336,0.0,0.0,0.0,0.0,0.0
105,76.666664,0.0,0.0,0.0,0.0,0.0
106,79.166664,0.0,0.0,0.0,0.0,0.0
107,77.5,0.0,0.0,0.0,0.0,0.0
108,80.0,0.0,0.0,0.0,0.0,0.0
109,75.0,0.0,0.0,0.0,0.0,0.0
110,81.666664,0.0,0.0,0.0,0.0,0.0
111,81.666664,0.0,0.0,0.0,0.0,0.0
112,85.833336,0.0,0.0,0.0,0.0,0.0
113,85.833336,0.0,0.0,0.0,0.0,0.0
114,85.833336,0.0,0.0,0.0,0.0,0.0
115,85.833336,0.0,0.0,0.0,0.0,0.0
116,85.833336,0.0,0.0,0.0,0.0,0.0
117,85.833336,0.0,0.0,0.0,0.0,0.0
118,80.0,0.0,0.0,0.0,0.0,0.0
119,78.333336,0.0,0.0,0.0,0.0,0.0
120,76.666664,0.0,0.0,0.0,0.0,0.0
121,77.5,0.0,0.0,0.0,0.0,0.0
122,77.5,0.0,0.0,0.0,0.0,0.0
123,81.666664,0.0,0.0,0.0,0.0,0.0
124,84.166664,0.0,0.0,0.0,0.0,0.0
125,90.0,0.0,0.0,0.0,0.0,0.0
126,86.666664,0.0,0.0,0.0,0.0,0.0
127,84.166664,0.0,0.0,0.0,0.0,0.0
128,84.166664,0.0,0.0,0.0,0.0,0.0
129,81.666664,0.0,0.0,0.0,0.0,0.0
130,87.5,0.0,0.0,0.0,0.0,0.0
131,84.166664,0.0,0.0,0.0,0.0,0.0
132,85.833336,0.0,0.0,0.0,0.0,0.0
133,84.166664,0.0,0.0,0.0,0.0,0.0
134,80.0,0.0,0.0,0.0,0.0,0.0
135,79.166664,0.0,0.0,0.0,0.0,0.0
136,76.666664,0.0,0.0,0.0,0.0,0.0
137,77.5,0.0,0.0,0.0,0.0,0.0
138,79.166664,0.0,0.0,0.0,0.0,0.0
139,77.5,0.0,0.0,0.0,0.0,0.0
140,74.166664,0.0,0.0,0.0,0.0,0.0
141,77.5,0.0,0.0,0.0,0.0,0.0
142,74.166664,0.0,0.0,0.0,0.0,0.0
143,74.166664,0.0,0.0,0.0,0.0,0.0
144,76.666664,0.0,0.0,0.0,0.0,0.0
145,75.833336,0.0,0.0,0.0,0.0,0.0
146,77.5,0.0,0.0,0.0,0.0,0.0
147,78.333336,0.0,0.0,0.0,0.0,0.0
148,76.666664,0.0,0.0,0.0,0.0,0.0
149,75.0,0.0,0.0,0.0,0.0,0.0
150,75.833336,0.0,0.0,0.0,0.0,0.0
151,75.833336,0.0,0.0,0.0,0.0,0.0
152,73.333336,0.0,0.0,0.0,0.0,0.0
153,71.666664,0.0,0.0,0.0,0.0,0.0
154,73.333336,0.0,0.0,0.0,0.0,0.0
155,74.166664,0.0,0.0,0.0,0.0,0.0
156,80.0,0.0,0.0,0.0,0.0,0.0
157,86.666664,0.0,0.0,0.0,0.0,0.0
158,91.666664,0.0,0.0,0.0,0.0,0.0
159,93.333336,0.0,0.0,0.0,0.0,0.0
160,95.0,0.0,0.0,0.0,0.0,0.0
161,97.5,0.0,0.0,0.0,0.0,0.0
162,97.5,0.0,0.0,0.0,0.0,0.0
163,94.166664,0.0,0.0,0.0,0.0,0.0
164,97.5,0.0,0.0,0.0,0.0,0.0
165,97.5,0.0,0.0,0.0,0.0,0.0
166,79.166664,0.0,0.0,0.0,0.0,0.0
167,82.5,0.0,0.0,0.0,0.0,0.0
168,82.5,0.0,0.0,0.0,0.0,0.0
169,90.0,0.0,0.0,0.0,0.0,0.0
170,88.333336,0.0,0.0,0.0,0.0,0.0
171,90.0,0.0,0.0,0.0,0.0,0.0
172,94.166664,0.0,0.0,0.0,0.0,0.0
173,89.166664,0.0,0.0,0.0,0.0,0.0
174,86.666664,0.0,0.0,0.0,0.0,0.0
175,84.166664,0.0,0.0,0.0,0.0,0.0
176,85.0,0.0,1.0,0.0,0.0,0.0
177,80.833336,0.0,0.0,0.0,0.0,0.0
178,80.0,0.0,0.0,0.0,0.0,0.0
179,80.0,0.0,0.0,0.0,0.0,0.0
180,80.0,0.0,0.0,0.0,0.0,0.0
181,82.5,0.0,0.0,0.0,0.0,0.0
182,81.666664,0.0,0.0,0.0,0.0,0.0
183,85.0,0.0,0.0,0.0,0.0,0.0
184,83.333336,0.0,0.0,0.0,0.0,0.0
185,76.666664,0.0,0.0,0.0,0.0,0.0
186,78.333336,0.0,0.0,0.0,0.0,0.0
187,75.833336,0.0,0.0,0.0,0.0,0.0
188,85.833336,0.0,0.0,0.0,0.0,0.0
189,85.0,0.0,0.0,0.0,0.0,0.0
190,79.166664,0.0,0.0,0.0,0.0,0.0
191,81.666664,0.0,0.0,0.0,0.0,0.0
192,83.333336,0.0,0.0,0.0,0.0,0.0
193,76.666664,0.0,0.0,0.0,0.0,0.0
194,78.333336,0.0,0.0,0.0,0.0,0.0
195,75.0,0.0,0.0,0.0,0.0,0.0
196,71.666664,0.0,0.0,0.0,0.0,0.0
197,70.833336,0.0,0.0,0.0,0.0,1.0
198,71.666664,0.0,0.0,0.0,0.0,0.0
199,73.333336,0.0,0.0,0.0,0.0,0.0
200,80.0,0.0,0.0,0.0,0.0,0.0
201,76.666664,0.0,0.0,0.0,0.0,0.0
202,78.333336,0.0,0.0,0.0,0.0,0.0
203,78.333336,0.0,0.0,0.0,0.0,0.0
204,74.166664,0.0,0.0,0.0,0.0,0.0
205,66.666664,0.0,0.0,0.0,1.0,0.0
206,66.666664,0.0,0.0,0.0,0.0,0.0
207,65.833336,0.0,0.0,0.0,0.0,0.0
208,63.333332,0.0,0.0,0.0,0.0,0.0
209,63.333332,0.0,0.0,0.0,0.0,0.0
210,64.166664,0.0,0.0,0.0,0.0,0.0
211,60.0,0.0,0.0,0.0,0.0,0.0
212,63.333332,0.0,0.0,0.0,0.0,0.0
213,55.833332,0.0,0.0,0.0,0.0,0.0
214,45.833332,0.0,0.0,0.0,0.0,0.0
215,46.666668,0.0,0.0,0.0,0.0,0.0
216,50.833332,0.0,0.0,0.0,0.0,0.0
217,50.833332,0.0,0.0,0.0,0.0,0.0
218,53.333332,0.0,0.0,0.0,0.0,0.0
219,56.666668,0.0,0.0,0.0,0.0,0.0
220,58.333332,0.0,0.0,0.0,0.0,0.0
221,56.666668,0.0,0.0,0.0,0.0,0.0
222,58.333332,0.0,0.0,0.0,0.0,0.0
223,60.0,0.0,0.0,0.0,0.0,0.0
224,62.5,0.0,0.0,0.0,0.0,0.0
225,67.5,0.0,0.0,0.0,0.0,0.0
226,63.333332,0.0,0.0,0.0,0.0,0.0
227,64.166664,0.0,0.0,0.0,0.0,0.0
228,62.5,0.0,0.0,0.0,0.0,0.0
229,64.166664,0.0,0.0,0.0,0.0,0.0
230,63.333332,0.0,0.0,0.0,0.0,0.0
231,63.333332,0.0,0.0,0.0,0.0,0.0
232,60.833332,0.0,0.0,0.0,0.0,0.0
233,59.166668,0.0,0.0,0.0,0.0,0.0
234,65.833336,0.0,0.0,0.0,0.0,0.0
235,61.666668,0.0,0.0,0.0,0.0,0.0
236,56.666668,0.0,0.0,0.0,0.0,0.0
237,58.333332,0.0,0.0,0.0,0.0,0.0
238,58.333332,0.0,0.0,0.0,0.0,0.0
239,56.666668,0.0,0.0,0.0,0.0,0.0
240,53.333332,0.0,0.0,0.0,0.0,0.0
241,55.0,0.0,0.0,0.0,0.0,0.0
242,53.333332,0.0,0.0,0.0,0.0,0.0
243,54.166668,0.0,0.0,0.0,0.0,0.0
244,54.166668,0.0,0.0,0.0,0.0,0.0
245,52.5,0.0,0.0,0.0,0.0,0.0
246,50.0,0.0,0.0,0.0,0.0,0.0
247,45.0,0.0,0.0,0.0,0.0,0.0
248,46.666668,0.0,0.0,0.0,0.0,0.0
249,46.666668,0.0,0.0,0.0,0.0,0.0
250,45.833332,0.0,0.0,0.0,0.0,0.0
251,48.333332,0.0,0.0,0.0,0.0,0.0
252,45.833332,0.0,0.0,0.0,0.0,0.0
253,50.833332,0.0,0.0,0.0,0.0,0.0
254,50.0,0.0,0.0,0.0,0.0,0.0
255,51.666668,0.0,0.0,0.0,0.0,0.0
256,49.166668,0.0,0.0,0.0,0.0,0.0
257,49.166668,0.0,0.0,0.0,0.0,0.0
258,45.833332,0.0,0.0,0.0,0.0,0.0
259,44.166668,0.0,0.0,0.0,0.0,0.0
260,44.166668,0.0,0.0,0.0,0.0,0.0
261,40.833332,0.0,0.0,0.0,0.0,0.0
262,41.666668,0.0,0.0,0.0,0.0,0.0
263,42.5,0.0,0.0,0.0,0.0,0.0
264,41.666668,0.0,0.0,0.0,0.0,0.0
265,45.0,0.0,0.0,0.0,0.0,0.0
266,45.833332,0.0,0.0,0.0,0.0,0.0
267,49.166668,0.0,0.0,0.0,0.0,0.0
268,47.5,0.0,0.0,0.0,0.0,0.0
269,45.833332,0.0,0.0,0.0,0.0,0.0
270,45.833332,0.0,0.0,0.0,0.0,0.0
271,42.5,0.0,0.0,0.0,0.0,1.0
272,33.333332,0.0,0.0,1.0,1.0,0.0
273,28.333334,0.0,0.0,0.0,0.0,0.0
274,30.833334,0.0,0.0,0.0,0.0,0.0
275,26.666666,0.0,0.0,0.0,0.0,0.0
276,25.833334,0.0,0.0,0.0,0.0,0.0
277,26.666666,0.0,0.0,0.0,0.0,0.0
278,27.5,0.0,0.0,0.0,0.0,0.0
279,29.166666,0.0,0.0,0.0,0.0,0.0
280,28.333334,0.0,0.0,0.0,0.0,0.0
281,20.0,1.0,0.0,0.0,0.0,0.0
282,17.5,0.0,0.0,0.0,0.0,0.0
283,17.5,0.0,0.0,0.0,0.0,0.0
284,20.833334,0.0,0.0,0.0,0.0,0.0
285,19.166666,0.0,0.0,0.0,0.0,0.0
286,15.0,0.0,1.0,0.0,0.0,0.0
287,13.333333,0.0,0.0,0.0,0.0,0.0
288,14.166667,0.0,0.0,0.0,0.0,0.0
289,13.333333,0.0,0.0,0.0,0.0,0.0
290,10.833333,0.0,0.0,0.0,0.0,0.0
291,11.666667,0.0,0.0,0.0,0.0,0.0
292,10.833333,0.0,0.0,0.0,0.0,0.0
293,9.166667,0.0,0.0,0.0,0.0,0.0
294,9.583333,0.0,0.0,0.0,0.0,0.0
295,9.583333,0.0,0.0,0.0,0.0,0.0
296,10.833333,0.0,0.0,0.0,0.0,0.0
297,8.333333,0.0,0.0,0.0,0.0,0.0
298,8.333333,0.0,0.0,0.0,0.0,0.0
299,7.5,0.0,0.0,0.0,0.0,0.0
300,7.916667,0.0,0.0,0.0,0.0,0.0
301,7.916667,0.0,0.0,0.0,0.0,0.0
302,7.5,0.0,0.0,0.0,0.0,0.0
303,6.666667,0.0,0.0,0.0,0.0,0.0
304,7.5,0.0,0.0,0.0,0.0,0.0
305,6.666667,0.0,0.0,0.0,0.0,0.0
306,7.083333,0.0,0.0,0.0,0.0,0.0
307,6.666667,0.0,0.0,0.0,0.0,0.0
308,7.083333,0.0,0.0,0.0,0.0,0.0
309,6.666667,0.0,0.0,0.0,0.0,0.0
310,5.833333,0.0,0.0,0.0,0.0,0.0
311,5.833333,0.0,0.0,0.0,0.0,0.0
312,5.416667,0.0,0.0,0.0,0.0,0.0
313,5.833333,0.0,0.0,0.0,0.0,0.0
314,5.0,0.0,0.0,0.0,0.0,0.0
315,5.0,0.0,0.0,0.0,0.0,0.0
316,6.25,0.0,0.0,0.0,0.0,0.0
317,5.416667,0.0,0.0,0.0,0.0,0.0
318,5.833333,0.0,0.0,0.0,0.0,0.0
319,5.833333,0.0,0.0,0.0,0.0,0.0
320,7.916667,0.0,0.0,0.0,0.0,0.0
321,7.5,0.0,0.0,0.0,0.0,0.0
322,7.083333,0.0,0.0,0.0,0.0,0.0
323,5.833333,0.0,0.0,0.0,0.0,0.0
324,6.25,0.0,0.0,0.0,0.0,0.0
325,6.666667,0.0,0.0,0.0,0.0,0.0
326,6.25,0.0,0.0,0.0,0.0,0.0
327,6.25,0.0,0.0,0.0,0.0,0.0
328,6.25,0.0,0.0,0.0,0.0,0.0
329,5.0,0.0,0.0,0.0,0.0,0.0
330,5.416667,0.0,0.0,0.0,0.0,0.0
331,5.416667,0.0,0.0,0.0,0.0,0.0
332,4.166667,0.0,0.0,0.0,0.0,0.0
333,4.166667,0.0,0.0,0.0,0.0,0.0
334,5.0,0.0,0.0,0.0,0.0,0.0
335,4.166667,0.0,0.0,0.0,0.0,0.0
336,4.583333,0.0,0.0,0.0,0.0,0.0
337,4.166667,0.0,0.0,0.0,0.0,0.0
338,5.0,0.0,0.0,0.0,0.0,0.0
339,4.166667,0.0,0.0,0.0,0.0,0.0
340,4.583333,0.0,0.0,0.0,0.0,0.0
341,4.166667,0.0,0.0,0.0,0.0,0.0
342,3.75,0.0,0.0,0.0,0.0,0.0
343,4.166667,0.0,0.0,0.0,0.0,0.0
344,4.583333,0.0,0.0,0.0,0.0,0.0
345,5.416667,0.0,0.0,0.0,0.0,0.0
346,5.416667,0.0,0.0,0.0,0.0,0.0
347,4.583333,0.0,0.0,0.0,0.0,0.0
348,5.0,0.0,0.0,0.0,0.0,0.0
349,4.166667,0.0,0.0,0.0,0.0,0.0
350,4.166667,0.0,0.0,0.0,0.0,0.0
351,4.166667,0.0,0.0,0.0,0.0,0.0
352,3.75,0.0,0.0,0.0,0.0,0.0
353,3.333333,0.0,0.0,0.0,0.0,0.0
354,4.166667,0.0,0.0,0.0,0.0,0.0
355,3.75,0.0,0.0,0.0,0.0,0.0
356,4.166667,0.0,0.0,0.0,0.0,0.0
357,3.333333,0.0,0.0,0.0,0.0,0.0
358,2.916667,0.0,0.0,0.0,0.0,0.0
359,2.916667,0.0,0.0,0.0,0.0,0.0
360,2.916667,0.0,0.0,0.0,0.0,0.0
361,2.916667,0.0,0.0,0.0,0.0,0.0
362,3.333333,0.0,0.0,0.0,0.0,0.0
363,4.166667,0.0,0.0,0.0,0.0,0.0
364,5.0,0.0,0.0,0.0,0.0,0.0
365,4.583333,0.0,0.0,0.0,0.0,0.0
366,5.416667,0.0,0.0,0.0,0.0,0.0
367,6.25,0.0,0.0,0.0,0.0,0.0
368,6.25,0.0,0.0,0.0,0.0,0.0
369,5.0,0.0,0.0,0.0,0.0,0.0
370,5.0,0.0,0.0,0.0,0.0,0.0
371,5.0,0.0,0.0,0.0,0.0,0.0
372,5.0,0.0,0.0,0.0,0.0,0.0
373,5.0,0.0,0.0,0.0,0.0,0.0
374,4.166667,0.0,0.0,0.0,0.0,0.0
375,5.416667,0.0,0.0,0.0,0.0,0.0
376,4.583333,0.0,0.0,0.0,0.0,0.0
377,4.583333,0.0,0.0,0.0,0.0,0.0
378,4.166667,0.0,0.0,0.0,0.0,0.0
379,4.166667,0.0,0.0,0.0,0.0,0.0
380,4.583333,0.0,0.0,0.0,0.0,0.0
381,4.166667,0.0,0.0,0.0,0.0,0.0
382,5.416667,0.0,0.0,0.0,0.0,0.0
383,5.416667,0.0,0.0,0.0,0.0,0.0
384,4.166667,0.0,0.0,0.0,0.0,0.0
385,5.0,0.0,0.0,0.0,0.0,0.0
386,4.166667,0.0,0.0,0.0,0.0,0.0
387,4.166667,0.0,0.0,0.0,0.0,0.0
388,4.166667,0.0,0.0,0.0,0.0,0.0
389,4.166667,0.0,0.0,0.0,0.0,0.0
390,4.166667,0.0,0.0,0.0,0.0,0.0
391,5.416667,0.0,0.0,0.0,0.0,0.0
392,5.0,0.0,0.0,0.0,0.0,0.0
393,4.583333,0.0,0.0,0.0,0.0,0.0
394,4.583333,0.0,0.0,0.0,0.0,0.0
395,4.583333,0.0,0.0,0.0,0.0,0.0
396,5.0,0.0,0.0,0.0,0.0,0.0
397,5.0,0.0,0.0,0.0,0.0,0.0
398,5.0,0.0,0.0,0.0,0.0,0.0
399,4.583333,0.0,0.0,0.0,0.0,0.0
400,4.583333,0.0,0.0,0.0,0.0,0.0
401,4.583333,0.0,0.0,0.0,0.0,0.0
402,5.0,0.0,0.0,0.0,0.0,0.0
403,6.25,0.0,0.0,0.0,0.0,0.0
404,7.5,0.0,0.0,0.0,0.0,0.0
405,7.916667,0.0,0.0,0.0,0.0,0.0
406,9.166667,0.0,0.0,0.0,0.0,0.0
407,10.416667,0.0,0.0,0.0,0.0,0.0
408,10.416667,0.0,0.0,0.0,0.0,0.0
409,10.833333,0.0,0.0,0.0,0.0,0.0
410,10.208333,0.0,0.0,0.0,0.0,0.0
411,10.416667,0.0,0.0,0.0,0.0,0.0
412,10.0,0.0,0.0,0.0,0.0,0.0
413,9.583333,0.0,0.0,0.0,0.0,0.0
414,9.583333,0.0,0.0,0.0,0.0,0.0
415,9.166667,0.0,0.0,0.0,0.0,0.0
416,11.25,0.0,0.0,0.0,0.0,0.0
417,9.583333,0.0,0.0,0.0,0.0,0.0
418,9.166667,0.0,0.0,0.0,0.0,0.0
419,9.583333,0.0,0.0,0.0,0.0,0.0
420,10.0,0.0,0.0,0.0,0.0,0.0
421,8.75,0.0,0.0,0.0,0.0,0.0
422,8.333333,0.0,0.0,0.0,0.0,0.0
423,8.75,0.0,0.0,0.0,0.0,0.0
424,9.166667,0.0,0.0,0.0,0.0,0.0
425,8.75,0.0,0.0,0.0,0.0,0.0
426,10.0,0.0,0.0,0.0,0.0,0.0
427,10.0,0.0,0.0,0.0,0.0,0.0
428,10.0,0.0,0.0,0.0,0.0,0.0
429,10.833333,0.0,0.0,0.0,0.0,0.0
430,10.833333,0.0,0.0,0.0,0.0,0.0
431,11.25,0.0,0.0,0.0,0.0,0.0
432,10.833333,0.0,0.0,0.0,0.0,0.0
433,10.833333,0.0,0.0,0.0,0.0,0.0
434,10.0,0.0,0.0,0.0,0.0,0.0
435,10.0,0.0,0.0,0.0,0.0,0.0
436,8.333333,0.0,0.0,0.0,0.0,0.0
437,8.75,0.0,0.0,0.0,0.0,0.0
438,9.166667,0.0,0.0,0.0,0.0,0.0
439,8.333333,0.0,0.0,0.0,0.0,0.0
440,8.333333,0.0,0.0,0.0,0.0,0.0
441,8.333333,0.0,0.0,0.0,0.0,0.0
442,8.333333,0.0,0.0,0.0,0.0,0.0
443,9.166667,0.0,0.0,0.0,0.0,0.0
444,8.333333,0.0,0.0,0.0,0.0,0.0
445,8.333333,0.0,0.0,0.0,0.0,0.0
446,8.75,0.0,0.0,0.0,0.0,0.0
447,8.333333,0.0,0.0,0.0,0.0,0.0
448,8.75,0.0,0.0,0.0,0.0,0.0
449,7.916667,0.0,0.0,0.0,0.0,0.0
450,8.333333,0.0,0.0,0.0,0.0,0.0
451,8.75,0.0,0.0,0.0,0.0,0.0
452,7.916667,0.0,0.0,0.0,0.0,0.0
453,7.5,0.0,0.0,0.0,0.0,0.0
454,7.083333,0.0,0.0,0.0,0.0,0.0
455,6.25,0.0,0.0,0.0,0.0,0.0
456,5.0,0.0,0.0,0.0,0.0,0.0
457,5.625,0.0,0.0,0.0,0.0,0.0
458,6.25,0.0,0.0,0.0,0.0,0.0
459,7.083333,0.0,0.0,0.0,0.0,0.0
460,7.5,0.0,0.0,0.0,0.0,0.0
461,7.5,0.0,0.0,0.0,0.0,0.0
462,9.166667,0.0,0.0,0.0,0.0,0.0
463,10.0,0.0,0.0,0.0,0.0,0.0
464,8.333333,0.0,0.0,0.0,0.0,0.0
465,9.166667,0.0,0.0,0.0,0.0,0.0
466,11.25,0.0,0.0,0.0,0.0,0.0
467,9.583333,0.0,0.0,0.0,0.0,0.0
468,10.0,0.0,0.0,0.0,0.0,0.0
469,9.583333,0.0,0.0,0.0,0.0,0.0
470,10.0,0.0,0.0,0.0,0.0,0.0
471,10.416667,0.0,0.0,0.0,0.0,0.0
472,10.416667,0.0,0.0,0.0,0.0,0.0
473,10.0,0.0,0.0,0.0,0.0,0.0
474,10.833333,0.0,0.0,0.0,0.0,0.0
475,10.416667,0.0,0.0,0.0,0.0,0.0
476,10.833333,0.0,0.0,0.0,0.0,0.0
477,11.666667,0.0,0.0,0.0,0.0,0.0
478,12.083333,0.0,0.0,0.0,0.0,0.0
479,12.083333,0.0,0.0,0.0,0.0,0.0
480,11.25,0.0,0.0,0.0,0.0,0.0
481,10.833333,0.0,0.0,0.0,0.0,0.0
482,10.416667,0.0,0.0,0.0,0.0,0.0
483,10.0,0.0,0.0,0.0,0.0,0.0
484,12.083333,0.0,0.0,0.0,0.0,0.0
485,10.833333,0.0,0.0,0.0,0.0,0.0
486,10.833333,0.0,0.0,0.0,0.0,0.0
487,11.666667,0.0,0.0,0.0,0.0,0.0
488,12.5,0.0,0.0,0.0,0.0,0.0
489,11.666667,0.0,0.0,0.0,0.0,0.0
490,12.5,0.0,0.0,0.0,0.0,0.0
491,12.083333,0.0,0.0,0.0,0.0,0.0
492,12.083333,0.0,0.0,0.0,0.0,0.0
493,14.166667,0.0,0.0,0.0,0.0,0.0
494,12.083333,0.0,0.0,0.0,0.0,0.0
495,10.0,0.0,0.0,0.0,0.0,0.0
496,10.0,0.0,0.0,0.0,0.0,0.0
497,10.0,0.0,0.0,0.0,0.0,0.0
498,11.666667,0.0,0.0,0.0,0.0,0.0
499,10.833333,0.0,0.0,0.0,0.0,0.0
500,10.416667,0.0,0.0,0.0,0.0,0.0
501,11.666667,0.0,0.0,0.0,0.0,0.0
502,10.416667,0.0,0.0,0.0,0.0,0.0
503,10.0,0.0,0.0,0.0,0.0,0.0
504,11.25,0.0,0.0,0.0,0.0,0.0
505,11.666667,0.0,0.0,0.0,0.0,0.0
506,10.416667,0.0,0.0,0.0,0.0,0.0
507,10.0,0.0,0.0,0.0,0.0,0.0
508,9.166667,0.0,0.0,0.0,0.0,0.0
509,9.583333,0.0,0.0,0.0,0.0,0.0
510,10.0,0.0,0.0,0.0,0.0,0.0
511,9.166667,0.0,0.0,0.0,0.0,0.0
512,9.166667,0.0,0.0,0.0,0.0,0.0
513,8.333333,0.0,0.0,0.0,0.0,0.0
514,9.583333,0.0,0.0,0.0,0.0,0.0
515,8.333333,0.0,0.0,0.0,0.0,0.0
516,9.166667,0.0,0.0,0.0,0.0,0.0
517,8.75,0.0,0.0,0.0,0.0,0.0
518,8.75,0.0,0.0,0.0,0.0,0.0
519,9.166667,0.0,0.0,0.0,0.0,0.0
520,9.583333,0.0,0.0,0.0,0.0,0.0
521,10.0,0.0,0.0,0.0,0.0,0.0
522,10.416667,0.0,0.0,0.0,0.0,0.0
523,10.0,0.0,0.0,0.0,0.0,0.0
524,8.75,0.0,0.0,0.0,0.0,0.0
525,7.916667,0.0,0.0,0.0,0.0,0.0
526,7.916667,0.0,0.0,0.0,0.0,0.0
527,7.083333,0.0,0.0,0.0,0.0,0.0
528,7.5,0.0,0.0,0.0,0.0,0.0
529,7.5,0.0,0.0,0.0,0.0,0.0
530,7.083333,0.0,0.0,0.0,0.0,0.0
531,7.083333,0.0,0.0,0.0,0.0,0.0
532,7.5,0.0,0.0,0.0,0.0,0.0
533,6.666667,0.0,0.0,0.0,0.0,0.0
534,6.666667,0.0,0.0,0.0,0.0,0.0
535,5.416667,0.0,0.0,0.0,0.0,0.0
536,5.416667,0.0,0.0,0.0,0.0,0.0
537,6.666667,0.0,0.0,0.0,0.0,0.0
538,7.5,0.0,0.0,0.0,0.0,0.0
539,6.666667,0.0,0.0,0.0,0.0,0.0
540,7.5,0.0,0.0,0.0,0.0,0.0
541,6.25,0.0,0.0,0.0,0.0,0.0
542,6.25,0.0,0.0,0.0,0.0,0.0
543,6.666667,0.0,0.0,0.0,0.0,0.0
544,6.666667,0.0,0.0,0.0,0.0,0.0
545,7.083333,0.0,0.0,0.0,0.0,0.0
546,7.5,0.0,0.0,0.0,0.0,0.0
547,6.666667,0.0,0.0,0.0,0.0,0.0
548,6.666667,0.0,0.0,0.0,0.0,0.0
549,6.666667,0.0,0.0,0.0,0.0,0.0
550,6.25,0.0,0.0,0.0,0.0,0.0
551,5.833333,0.0,0.0,0.0,0.0,0.0
552,6.666667,0.0,0.0,0.0,0.0,0.0
553,5.833333,0.0,0.0,0.0,0.0,0.0
554,5.833333,0.0,0.0,0.0,0.0,0.0
555,5.833333,0.0,0.0,0.0,0.0,0.0
556,5.833333,0.0,0.0,0.0,0.0,0.0
557,5.416667,0.0,0.0,0.0,0.0,0.0
558,5.833333,0.0,0.0,0.0,0.0,0.0
559,5.833333,0.0,0.0,0.0,0.0,0.0
560,5.0,0.0,0.0,0.0,0.0,0.0
561,4.583333,0.0,0.0,0.0,0.0,0.0
562,4.583333,0.0,0.0,0.0,0.0,0.0
563,4.166667,0.0,0.0,0.0,0.0,0.0
564,6.25,0.0,0.0,0.0,0.0,0.0
565,5.833333,0.0,0.0,0.0,0.0,0.0
566,5.0,0.0,0.0,0.0,0.0,0.0
567,4.583333,0.0,0.0,0.0,0.0,0.0
568,4.166667,0.0,0.0,0.0,0.0,0.0
569,4.166667,0.0,0.0,0.0,0.0,0.0
570,5.0,0.0,0.0,0.0,0.0,0.0
571,5.208333,0.0,0.0,0.0,0.0,0.0
572,5.208333,0.0,0.0,0.0,0.0,0.0
573,4.583333,0.0,0.0,0.0,0.0,0.0
574,5.208333,0.0,0.0,0.0,0.0,0.0
575,4.166667,0.0,0.0,0.0,0.0,0.0
576,5.0,0.0,0.0,0.0,0.0,0.0
577,3.75,0.0,0.0,0.0,0.0,0.0
578,4.583333,0.0,0.0,0.0,0.0,0.0
579,4.583333,0.0,0.0,0.0,0.0,0.0
580,3.75,0.0,0.0,0.0,0.0,0.0
581,4.166667,0.0,0.0,0.0,0.0,0.0
582,4.166667,0.0,0.0,0.0,0.0,0.0
583,3.75,0.0,0.0,0.0,0.0,0.0
584,3.333333,0.0,0.0,0.0,0.0,0.0
585,3.333333,0.0,0.0,0.0,0.0,0.0
586,3.333333,0.0,0.0,0.0,0.0,0.0
587,3.333333,0.0,0.0,0.0,0.0,0.0
588,3.75,0.0,0.0,0.0,0.0,0.0
589,4.166667,0.0,0.0,0.0,0.0,0.0
590,3.541667,0.0,0.0,0.0,0.0,0.0
591,4.166667,0.0,0.0,0.0,0.0,0.0
592,4.166667,0.0,0.0,0.0,0.0,0.0
593,3.75,0.0,0.0,0.0,0.0,0.0
594,3.333333,0.0,0.0,0.0,0.0,0.0
595,3.333333,0.0,0.0,0.0,0.0,0.0
596,4.583333,0.0,0.0,0.0,0.0,0.0
597,3.333333,0.0,0.0,0.0,0.0,0.0
598,4.583333,0.0,0.0,0.0,0.0,0.0
599,3.333333,0.0,0.0,0.0,0.0,0.0
