Time,X,Label
0,0.538865,0.0
1,-0.236127,0.0
2,-0.773805,0.0
3,0.690791,0.0
4,0.261575,0.0
5,-0.674571,0.0
6,-1.685051,0.0
7,-1.117346,0.0
8,-1.072532,0.0
9,-0.649313,0.0
10,-0.43233,0.0
11,-0.168288,0.0
12,0.085982,0.0
13,0.505904,0.0
14,0.772947,0.0
15,0.97698,0.0
16,1.150274,0.0
17,1.004759,0.0
18,0.599087,0.0
19,-0.418284,0.0
20,-0.125463,0.0
21,-0.103538,0.0
22,-0.194013,0.0
23,-1.215724,0.0
24,1.468592,0.0
25,1.541211,0.0
26,1.613005,0.0
27,2.195649,0.0
28,-0.534089,0.0
29,0.24888,0.0
30,-0.330206,0.0
31,-0.351556,0.0
32,-0.571352,0.0
33,-0.506292,0.0
34,-0.733931,0.0
35,-0.665075,0.0
36,-0.676422,0.0
37,0.0483,0.0
38,0.666913,0.0
39,-1.486614,0.0
40,0.526814,0.0
41,-0.093857,0.0
42,-0.074229,0.0
43,-1.934852,0.0
44,-1.517021,0.0
45,-0.906332,0.0
46,-0.620644,0.0
47,-0.372338,0.0
48,-0.172167,0.0
49,0.12707,0.0
50,0.435121,0.0
51,0.767807,0.0
52,0.92632,0.0
53,1.036585,0.0
54,0.998601,0.0
55,0.975188,0.0
56,0.068442,0.0
57,-0.3139,0.0
58,-0.260799,0.0
59,-1.357104,0.0
60,1.287931,0.0
61,1.350103,0.0
62,1.393731,0.0
63,1.655333,0.0
64,1.270151,0.0
65,-1.032496,0.0
66,-0.557466,0.0
67,-0.498544,0.0
68,-0.481549,0.0
69,-0.508548,0.0
70,-0.536785,0.0
71,-0.470036,0.0
72,-0.369018,0.0
73,-0.220127,0.0
74,-0.169179,0.0
75,-0.436243,0.0
76,0.092143,0.0
77,0.174484,0.0
78,-1.030294,0.0
79,1.597787,0.0
80,1.783953,0.0
81,1.789159,0.0
82,1.542485,0.0
83,-1.272361,0.0
84,-0.248239,0.0
85,-0.246741,0.0
86,-0.239536,0.0
87,-0.231906,0.0
88,-0.476799,0.0
89,-0.566922,0.0
90,-0.55908,0.0
91,-0.571278,0.0
92,-0.647538,0.0
93,-0.762012,0.0
94,-0.896933,0.0
95,-0.013259,0.0
96,-0.529783,0.0
97,0.807085,0.0
98,1.28619,0.0
99,1.189953,0.0
100,1.696658,0.0
101,-0.028242,0.0
102,0.415072,0.0
103,-0.164703,0.0
104,-0.746016,0.0
105,-0.295378,0.0
106,-0.261155,0.0
107,-0.311669,0.0
108,-0.3268,0.0
109,-0.354898,0.0
110,-0.452927,0.0
111,-0.48611,0.0
112,0.292049,0.0
113,0.279254,0.0
114,-0.730615,0.0
115,-0.182173,0.0
116,-0.274634,0.0
117,-0.408982,0.0
118,-1.349923,0.0
119,-1.986424,0.0
120,-0.925675,0.0
121,-0.73121,0.0
122,-0.360497,0.0
123,0.021276,0.0
124,0.299681,0.0
125,0.571316,0.0
126,0.903478,0.0
127,1.076595,0.0
128,0.963047,0.0
129,1.005333,0.0
130,1.05105,0.0
131,0.954644,0.0
132,0.012228,0.0
133,-0.416987,0.0
134,-0.529653,0.0
135,-1.709166,0.0
136,-0.585938,0.0
137,0.407319,0.0
138,0.468099,0.0
139,0.757324,0.0
140,1.55608,0.0
141,-2.145635,0.0
142,-0.114438,0.0
143,-0.003166,0.0
144,-0.020351,0.0
145,0.155948,0.0
146,0.24874,0.0
147,0.363815,0.0
148,0.367136,0.0
149,0.502911,0.0
150,0.778763,0.0
151,-0.16693,0.0
152,-0.599584,0.0
153,-0.201746,0.0
154,-0.744024,0.0
155,-0.647895,0.0
156,-1.91709,0.0
157,-0.906293,0.0
158,-1.049809,0.0
159,-0.57594,0.0
160,-0.448072,0.0
161,-0.078752,0.0
162,0.26106,0.0
163,0.736746,0.0
164,0.980088,0.0
165,1.174085,0.0
166,1.203524,0.0
167,1.272166,0.0
168,1.199707,0.0
169,0.478212,0.0
170,-0.553399,0.0
171,-0.81453,0.0
172,-2.054571,0.0
173,0.288371,0.0
174,0.125009,0.0
175,0.310208,0.0
176,0.934685,0.0
177,-1.617497,0.0
178,-0.400757,0.0
179,-0.504165,0.0
180,-0.481797,0.0
181,-0.085241,0.0
182,0.322778,0.0
183,0.79114,0.0
184,0.781824,0.0
185,0.886474,0.0
186,0.928188,0.0
187,0.793011,0.0
188,-0.235205,0.0
189,-0.950312,0.0
190,-0.806309,0.0
191,-2.799145,0.0
192,-0.384527,0.0
193,0.093057,0.0
194,0.359801,0.0
195,0.989567,0.0
196,0.52994,0.0
197,-0.26349,0.0
198,0.310523,0.0
199,0.18574,0.0
200,0.026763,0.0
201,0.390132,0.0
202,0.272342,0.0
203,0.54413,0.0
204,0.543215,0.0
205,0.642788,0.0
206,-0.487787,0.0
207,-0.478574,0.0
208,-0.73649,0.0
209,-0.717844,0.0
210,1.29997,0.0
211,0.832405,0.0
212,0.905949,0.0
213,1.065838,0.0
214,1.477234,0.0
215,-0.419333,0.0
216,-0.977027,0.0
217,-0.055148,0.0
218,-0.057807,0.0
219,-0.172954,0.0
220,-0.273658,0.0
221,-0.283128,0.0
222,-0.26195,0.0
223,-0.259951,0.0
224,-0.246701,0.0
225,0.707625,0.0
226,-0.092995,0.0
227,-0.771383,0.0
228,-0.691324,0.0
229,0.224036,0.0
230,-0.135646,0.0
231,-2.195967,0.0
232,-0.74532,0.0
233,-1.040737,0.0
234,-0.618868,0.0
235,-0.331682,0.0
236,-0.071456,0.0
237,0.194902,0.0
238,0.598306,0.0
239,0.924076,0.0
240,1.071704,0.0
241,1.116764,0.0
242,1.07212,0.0
243,0.587724,0.0
244,-0.409449,0.0
245,-0.010018,0.0
246,0.083162,0.0
247,-1.389937,0.0
248,1.127623,0.0
249,1.496634,0.0
250,1.553779,0.0
251,1.389607,0.0
252,-0.199255,0.0
253,0.697354,0.0
254,-0.290407,0.0
255,-0.189302,0.0
256,-0.326759,0.0
257,-0.445551,0.0
258,-0.594008,0.0
259,-0.609816,0.0
260,-0.672618,0.0
261,-0.693193,0.0
262,-0.693323,0.0
263,-0.379066,0.0
264,0.13813,0.0
265,-0.345268,0.0
266,1.328625,0.0
267,1.335678,0.0
268,1.38859,0.0
269,1.901378,0.0
270,0.029571,0.0
271,0.631294,0.0
272,0.381493,0.0
273,-0.119204,0.0
274,0.017105,0.0
275,-0.615565,0.0
276,-0.701858,0.0
277,-1.09747,0.0
278,-1.150774,0.0
279,-1.110846,0.0
280,-1.010089,0.0
281,-0.816509,0.0
282,-0.378497,0.0
283,0.256424,0.0
284,-0.976339,0.0
285,1.590528,0.0
286,1.558304,0.0
287,1.663045,0.0
288,1.565973,0.0
289,-0.571516,0.0
290,0.278371,0.0
291,-0.565044,0.0
292,-0.372551,0.0
293,-0.308422,0.0
294,-0.479782,0.0
295,-0.523084,0.0
296,-0.499779,0.0
297,-0.554852,0.0
298,-0.574051,0.0
299,-0.540347,0.0
300,-0.244152,0.0
301,0.10167,0.0
302,-0.61116,0.0
303,-0.157671,0.0
304,1.792887,0.0
305,1.207821,0.0
306,1.305254,0.0
307,1.48136,0.0
308,-0.986611,0.0
309,0.421816,0.0
310,-0.32691,0.0
311,-0.289926,0.0
312,-0.250452,0.0
313,-0.429531,0.0
314,-0.687357,0.0
315,-0.677636,0.0
316,-0.596902,0.0
317,-0.627769,0.0
318,-0.754583,0.0
319,-0.988303,0.0
320,-0.747677,0.0
321,-0.056904,0.0
322,-0.751801,0.0
323,1.128356,0.0
324,1.094456,0.0
325,1.216862,0.0
326,1.455382,0.0
327,1.43087,0.0
328,0.658488,0.0
329,0.148988,0.0
330,-0.805991,0.0
331,-0.404525,0.0
332,-0.450337,0.0
333,-0.554202,0.0
334,-0.5689,0.0
335,-0.626943,0.0
336,-0.57436,0.0
337,0.226099,0.0
338,0.356401,0.0
339,-0.130744,0.0
340,-0.920943,0.0
341,-0.120784,0.0
342,-0.668905,0.0
343,-0.469361,0.0
344,-2.296148,0.0
345,-1.069446,0.0
346,-0.819175,0.0
347,-0.367829,0.0
348,-0.219802,0.0
349,0.175344,0.0
350,0.572634,0.0
351,0.824151,0.0
352,1.026228,0.0
353,1.050801,0.0
354,1.108173,0.0
355,1.181064,0.0
356,0.184799,0.0
357,-0.373775,0.0
358,-0.390476,0.0
359,-0.241351,0.0
360,-0.515294,0.0
361,0.965872,0.0
362,0.882236,0.0
363,1.065713,0.0
364,1.37776,0.0
365,2.080106,0.0
366,-1.97685,0.0
367,0.369403,0.0
368,-0.483659,0.0
369,-0.499326,0.0
370,-0.438389,0.0
371,-0.43895,0.0
372,-0.433217,0.0
373,-0.405931,0.0
374,-0.440035,0.0
375,0.708915,0.0
376,-0.341094,0.0
377,0.059115,0.0
378,-0.300075,0.0
379,-0.321821,0.0
380,-2.050489,0.0
381,-0.866399,0.0
382,-1.101593,0.0
383,-0.755454,0.0
384,-0.460093,0.0
385,-0.331983,0.0
386,-0.047708,0.0
387,0.257911,0.0
388,0.678971,0.0
389,0.942177,0.0
390,0.991837,0.0
391,1.051793,0.0
392,1.112148,0.0
393,0.794246,0.0
394,-0.052733,0.0
395,-0.054437,0.0
396,0.000701,0.0
397,-0.351521,0.0
398,0.598021,0.0
399,1.159888,0.0
400,1.276293,0.0
401,1.428074,0.0
402,1.878918,0.0
403,0.636426,0.0
404,0.3426,0.0
405,-0.41688,0.0
406,-0.858854,0.0
407,-0.916903,0.0
408,-1.052743,0.0
409,-1.040277,0.0
410,-1.066032,0.0
411,-1.044723,0.0
412,-0.577228,0.0
413,-0.080397,0.0
414,0.403501,0.0
415,-0.317956,0.0
416,1.668428,0.0
417,1.186156,0.0
418,1.192481,0.0
419,1.694679,0.0
420,-0.074057,0.0
421,0.221667,0.0
422,-0.25945,0.0
423,-0.514114,0.0
424,-0.451246,0.0
425,-0.585486,0.0
426,-0.709695,0.0
427,-0.802167,0.0
428,-0.822079,0.0
429,-0.767393,0.0
430,-0.710268,0.0
431,-0.580763,0.0
432,0.055528,0.0
433,-0.936154,0.0
434,0.455778,0.0
435,2.118816,0.0
436,1.548854,0.0
437,1.638547,0.0
438,-0.362766,0.0
439,-0.363708,0.0
440,-0.06118,0.0
441,-0.206221,0.0
442,-0.189409,0.0
443,-0.084808,0.0
444,-0.434508,0.0
445,-0.505278,0.0
446,-0.598131,0.0
447,-0.592428,0.0
448,-0.561933,0.0
449,-0.521837,0.0
450,0.573935,0.0
451,-0.077957,0.0
452,-1.550861,0.0
453,-0.63725,0.0
454,0.485699,0.0
455,0.122889,0.0
456,0.303414,0.0
457,1.066393,0.0
458,-1.187768,0.0
459,-1.081031,0.0
460,-0.833781,0.0
461,-0.467164,0.0
462,-0.382428,0.0
463,0.261681,0.0
464,0.522166,0.0
465,0.642617,0.0
466,0.760445,0.0
467,0.862742,0.0
468,0.452648,0.0
469,-0.286301,0.0
470,-0.028509,0.0
471,-0.008501,0.0
472,-0.102073,0.0
473,-1.047262,0.0
474,1.605292,0.0
475,1.604969,0.0
476,1.633875,0.0
477,2.046307,0.0
478,-0.460006,0.0
479,0.18357,0.0
480,-0.338132,0.0
481,-0.422796,0.0
482,-0.621509,0.0
483,-0.733149,0.0
484,-0.846217,0.0
485,-0.812759,0.0
486,-0.818077,0.0
487,0.11702,0.0
488,0.171389,0.0
489,0.078606,0.0
490,-0.961517,0.0
491,-0.039645,0.0
492,-0.567735,0.0
493,-1.058147,0.0
494,-1.833192,0.0
495,-1.069293,0.0
496,-0.753302,0.0
497,-0.37804,0.0
498,-0.230389,0.0
499,0.094697,0.0
500,0.52532,0.0
501,0.894828,0.0
502,1.069256,0.0
503,1.103601,0.0
504,1.099953,0.0
505,1.06687,0.0
506,0.841828,0.0
507,-0.063708,0.0
508,-0.838836,0.0
509,-0.811016,0.0
510,0.321294,0.0
511,0.281743,0.0
512,-1.921163,0.0
513,-1.151316,0.0
514,-0.888434,0.0
515,-0.641413,0.0
516,-0.325111,0.0
517,0.001352,0.0
518,0.118693,0.0
519,0.703818,0.0
520,0.955645,0.0
521,0.852981,0.0
522,0.882981,0.0
523,0.956387,0.0
524,1.008881,0.0
525,0.056248,0.0
526,-0.096753,0.0
527,-0.734195,0.0
528,1.619021,0.0
529,0.952524,0.0
530,0.648996,0.0
531,0.739079,0.0
532,1.234765,0.0
533,-2.203146,0.0
534,0.003757,0.0
535,-0.222431,0.0
536,-0.323936,0.0
537,-0.279406,0.0
538,-0.269217,0.0
539,-0.347576,0.0
540,-0.278735,0.0
541,-0.234624,0.0
542,-0.194453,0.0
543,-0.113153,0.0
544,0.01983,0.0
545,0.320738,0.0
546,-0.099906,0.0
547,1.006286,0.0
548,1.443064,0.0
549,1.417367,0.0
550,1.87665,0.0
551,0.039635,0.0
552,0.268745,0.0
553,-0.061619,0.0
554,-0.449697,0.0
555,-0.366989,0.0
556,-0.512327,0.0
557,-0.721673,0.0
558,-0.872338,0.0
559,-0.922299,0.0
560,-0.973873,0.0
561,-0.926314,0.0
562,-0.82934,0.0
563,-0.508189,0.0
564,0.058367,0.0
565,1.211029,0.0
566,1.171892,0.0
567,0.897689,0.0
568,0.768361,0.0
569,0.972366,0.0
570,1.158306,0.0
571,1.712005,0.0
572,-1.043133,0.0
573,-0.325263,0.0
574,-0.522995,0.0
575,-0.522355,0.0
576,-0.670569,0.0
577,-0.851423,0.0
578,-0.932154,0.0
579,-0.944021,0.0
580,-1.005142,0.0
581,0.524551,0.0
582,0.0426,0.0
583,-0.108693,0.0
584,-1.020872,0.0
585,-0.650718,0.0
586,-0.990361,0.0
587,-1.140776,0.0
588,-1.002004,0.0
589,-0.968407,0.0
590,-1.282628,0.0
591,0.609282,0.0
592,-0.127869,0.0
593,0.019763,0.0
594,0.425534,0.0
595,0.793866,0.0
596,1.083214,0.0
597,1.183266,0.0
598,1.168434,0.0
599,1.204344,0.0
600,2.119262,1.0
601,1.064244,0.0
602,1.220363,0.0
603,-0.503568,0.0
604,-0.64642,0.0
605,-0.903899,0.0
606,-1.07887,0.0
607,-0.5702,0.0
608,-0.35528,0.0
609,0.415223,0.0
610,1.841208,0.0
611,-0.636745,0.0
612,-0.125476,0.0
613,-0.244941,0.0
614,-0.189819,0.0
615,-0.280546,0.0
616,-0.325494,0.0
617,-0.449325,0.0
618,-0.0941,0.0
619,0.754897,0.0
620,0.812352,0.0
621,-1.15291,0.0
622,-0.627289,0.0
623,-1.198218,0.0
624,-1.417738,0.0
625,-0.954032,0.0
626,-1.642326,0.0
627,-1.187004,0.0
628,-0.358481,0.0
629,0.356974,0.0
630,0.67081,0.0
631,0.501832,0.0
632,0.64512,0.0
633,0.96157,0.0
634,1.179265,0.0
635,0.959869,0.0
636,0.92635,0.0
637,1.070304,0.0
638,0.305609,0.0
639,-0.173552,0.0
640,-0.935096,0.0
641,-1.050696,0.0
642,-1.089889,0.0
643,-1.163645,0.0
644,-1.283693,0.0
645,-1.107458,0.0
646,-1.021555,0.0
647,-0.490889,0.0
648,-0.014191,0.0
649,0.299709,0.0
650,0.662719,0.0
651,0.974892,0.0
652,1.238226,0.0
653,1.298717,0.0
654,1.339912,0.0
655,1.338496,0.0
656,0.695483,0.0
657,0.467727,0.0
658,1.563898,0.0
659,-1.37805,0.0
660,-1.021717,0.0
661,-1.31539,0.0
662,-1.151035,0.0
663,-0.822356,0.0
664,-1.328351,0.0
665,0.635025,0.0
666,0.903895,0.0
667,0.011732,0.0
668,0.397129,0.0
669,0.44382,0.0
670,0.546275,0.0
671,0.408084,0.0
672,0.35037,0.0
673,0.511852,0.0
674,0.397034,0.0
675,0.355449,0.0
676,0.493062,0.0
677,0.51523,0.0
678,1.129474,0.0
679,-1.49273,0.0
680,-0.306244,0.0
681,-1.183931,0.0
682,-1.339452,0.0
683,-0.668244,0.0
684,-1.961515,0.0
685,0.629227,0.0
686,1.19722,0.0
687,0.408533,0.0
688,0.537989,0.0
689,0.472334,0.0
690,0.328684,0.0
691,0.472999,0.0
692,0.088413,0.0
693,0.531306,0.0
694,0.594219,0.0
695,0.765931,0.0
696,0.114121,0.0
697,-0.976397,0.0
698,-1.335874,0.0
699,-2.088147,0.0
700,-0.895383,0.0
701,-0.84177,0.0
702,-1.008131,0.0
703,-0.271735,0.0
704,0.995711,0.0
705,0.328443,0.0
706,0.481365,0.0
707,0.10507,0.0
708,0.774723,0.0
709,1.09517,0.0
710,0.868694,0.0
711,0.764496,0.0
712,0.968711,0.0
713,0.769196,0.0
714,0.26069,0.0
715,0.768827,0.0
716,-1.389552,0.0
717,-1.26232,0.0
718,-0.942013,0.0
719,-1.081169,0.0
720,-0.886166,0.0
721,0.091212,0.0
722,1.80069,0.0
723,1.154367,0.0
724,-0.123333,0.0
725,0.046737,0.0
726,-0.011955,0.0
727,0.163725,0.0
728,0.094045,0.0
729,-0.083699,0.0
730,-0.024824,0.0
731,0.424441,0.0
732,0.44889,0.0
733,1.207746,0.0
734,-1.610499,0.0
735,-0.953304,0.0
736,-1.353077,0.0
737,-1.21908,0.0
738,-0.617314,0.0
739,-0.528162,0.0
740,-0.539973,0.0
741,1.421416,0.0
742,0.736579,0.0
743,0.623152,0.0
744,0.464604,0.0
745,0.332454,0.0
746,0.359072,0.0
747,0.439598,0.0
748,0.198803,0.0
749,0.173176,0.0
750,0.939427,0.0
751,0.002722,0.0
752,-0.238181,0.0
753,-0.449121,0.0
754,-0.644855,0.0
755,-1.4945,0.0
756,-1.186156,0.0
757,-1.212436,0.0
758,-0.900973,0.0
759,-0.783249,0.0
760,-0.839979,0.0
761,-0.480133,0.0
762,0.349648,0.0
763,1.069111,0.0
764,1.283087,0.0
765,1.340685,0.0
766,1.348869,0.0
767,1.073882,0.0
768,1.032279,0.0
769,0.610374,0.0
770,0.915056,0.0
771,-1.02689,0.0
772,-0.791746,0.0
773,-1.336073,0.0
774,-1.605277,0.0
775,-1.15479,0.0
776,-1.932003,0.0
777,-0.263228,0.0
778,0.259142,0.0
779,0.863628,0.0
780,0.377606,0.0
781,0.446546,0.0
782,0.610637,0.0
783,0.856438,0.0
784,0.902625,0.0
785,0.875162,0.0
786,0.822849,0.0
787,0.58043,0.0
788,0.527464,0.0
789,0.422993,0.0
790,0.349577,0.0
791,0.080786,0.0
792,0.271273,0.0
793,0.505241,0.0
794,-1.413621,0.0
795,-0.347035,0.0
796,-1.866988,0.0
797,-0.23437,0.0
798,-0.114153,0.0
799,-1.074016,0.0
800,1.412143,0.0
801,0.718288,0.0
802,0.027287,0.0
803,0.309343,0.0
804,0.294041,0.0
805,-0.261717,0.0
806,0.85255,0.0
807,0.041373,0.0
808,-0.391666,0.0
809,-0.535243,0.0
810,-1.027863,0.0
811,-1.239698,0.0
812,-1.109616,0.0
813,-1.177288,0.0
814,-0.882341,0.0
815,-0.712668,0.0
816,-0.789412,0.0
817,-0.518958,0.0
818,0.221374,0.0
819,0.792925,0.0
820,1.409079,0.0
821,1.265548,0.0
822,1.38153,0.0
823,1.34511,0.0
824,1.248114,0.0
825,0.704183,0.0
826,0.453385,0.0
827,0.860561,0.0
828,0.534724,0.0
829,-1.740609,0.0
830,-0.562006,0.0
831,-1.296764,0.0
832,-0.860334,0.0
833,-0.681942,0.0
834,-1.632742,0.0
835,0.262758,0.0
836,1.018221,0.0
837,-0.105676,0.0
838,0.325695,0.0
839,0.513584,0.0
840,0.645469,0.0
841,0.621996,0.0
842,0.440459,0.0
843,0.762693,0.0
844,1.035251,0.0
845,-0.882183,0.0
846,-0.834635,0.0
847,-0.935051,0.0
848,-1.193708,0.0
849,-1.182405,0.0
850,-1.087734,0.0
851,-1.216547,0.0
852,-0.793464,0.0
853,-0.258006,0.0
854,-0.255234,0.0
855,0.281257,0.0
856,0.522304,0.0
857,0.841001,0.0
858,1.162085,0.0
859,1.257898,0.0
860,1.298666,0.0
861,1.314349,0.0
862,0.914297,0.0
863,0.56507,0.0
864,1.22716,0.0
865,0.574481,0.0
866,-1.598001,0.0
867,-0.77109,0.0
868,-1.683441,0.0
869,-0.665518,0.0
870,-1.370739,0.0
871,-0.789569,0.0
872,1.104677,0.0
873,0.526034,0.0
874,0.23598,0.0
875,0.402451,0.0
876,0.368602,0.0
877,0.408737,0.0
878,0.392184,0.0
879,0.294239,0.0
880,0.368568,0.0
881,0.964266,0.0
882,0.194429,0.0
883,-0.226873,0.0
884,-0.265061,0.0
885,-1.338807,0.0
886,-1.226808,0.0
887,-1.167836,0.0
888,-1.094509,0.0
889,-1.10903,0.0
890,-0.899556,0.0
891,-0.858903,0.0
892,-0.210017,0.0
893,0.346775,0.0
894,0.999621,0.0
895,1.094694,0.0
896,1.202266,0.0
897,1.291646,0.0
898,1.210578,0.0
899,1.251501,0.0
900,0.238065,0.0
901,0.421877,0.0
902,0.349349,0.0
903,0.379889,0.0
904,0.604282,0.0
905,-1.992904,0.0
906,-0.080495,0.0
907,-1.496116,0.0
908,-0.788207,0.0
909,-0.849496,0.0
910,-0.56973,0.0
911,1.350674,0.0
912,0.36011,0.0
913,0.234575,0.0
914,0.395081,0.0
915,0.438564,0.0
916,0.366871,0.0
917,0.434476,0.0
918,0.46944,0.0
919,0.752688,0.0
920,0.506264,0.0
921,0.950334,0.0
922,-1.12927,0.0
923,-0.919623,0.0
924,-1.310646,0.0
925,-1.640357,0.0
926,-1.367772,0.0
927,-1.518711,0.0
928,-0.07029,0.0
929,0.859661,0.0
930,1.120487,0.0
931,0.255692,0.0
932,0.315912,0.0
933,0.553727,0.0
934,0.670873,0.0
935,0.681842,0.0
936,0.657843,0.0
937,0.867545,0.0
938,0.261626,0.0
939,-0.391912,0.0
940,-0.470741,0.0
941,-1.212293,0.0
942,-1.394769,0.0
943,-0.916398,0.0
944,-1.0193,0.0
945,-1.065324,0.0
946,-0.706672,0.0
947,-0.820904,0.0
948,0.004598,0.0
949,-0.058939,0.0
950,0.862184,0.0
951,0.878473,0.0
952,1.484526,0.0
953,1.494803,0.0
954,1.140611,0.0
955,1.163216,0.0
956,0.289316,0.0
957,0.246385,0.0
958,1.497013,0.0
959,0.035058,0.0
960,-1.417302,0.0
961,-1.516123,0.0
962,-0.980781,0.0
963,-0.983514,0.0
964,-1.006212,0.0
965,0.810088,0.0
966,1.326835,0.0
967,0.326831,0.0
968,0.345557,0.0
969,0.287215,0.0
970,0.149373,0.0
971,0.151111,0.0
972,0.056759,0.0
973,0.24678,0.0
974,0.400324,0.0
975,-0.180527,0.0
976,0.272309,0.0
977,1.150756,0.0
978,-0.084262,0.0
979,-1.643101,0.0
980,-0.780932,0.0
981,-1.208961,0.0
982,-0.365464,0.0
983,-1.1639,0.0
984,0.118216,0.0
985,1.472564,0.0
986,0.763955,0.0
987,-0.270122,0.0
988,0.125263,0.0
989,0.425289,0.0
990,0.520486,0.0
991,0.311444,0.0
992,0.371071,0.0
993,0.613024,0.0
994,0.849118,0.0
995,0.397512,0.0
996,0.390585,0.0
997,0.230999,0.0
998,-0.470703,0.0
999,-0.320479,0.0
1000,-1.424171,0.0
1001,-1.745424,0.0
1002,-0.807311,0.0
1003,-1.567689,0.0
1004,-1.112082,0.0
1005,-0.186589,0.0
1006,1.019373,0.0
1007,1.351683,0.0
1008,0.701114,0.0
1009,0.523008,0.0
1010,0.563917,0.0
1011,0.78342,0.0
1012,0.668092,0.0
1013,0.414245,0.0
1014,0.532654,0.0
1015,0.312397,0.0
1016,-1.356838,0.0
1017,-1.200118,0.0
1018,-1.838531,0.0
1019,-1.174023,0.0
1020,-0.786441,0.0
1021,-1.065302,0.0
1022,0.477612,0.0
1023,1.545894,0.0
1024,0.898081,0.0
1025,0.306755,0.0
1026,0.413646,0.0
1027,0.47155,0.0
1028,0.476129,0.0
1029,0.606867,0.0
1030,0.528297,0.0
1031,0.196287,0.0
1032,0.365339,0.0
1033,0.44702,0.0
1034,0.377275,0.0
1035,0.298573,0.0
1036,0.143285,0.0
1037,0.510785,0.0
1038,0.122139,0.0
1039,-1.467948,0.0
1040,-0.155381,0.0
1041,-1.17658,0.0
1042,-0.469771,0.0
1043,-0.315453,0.0
1044,-1.034122,0.0
1045,1.09731,0.0
1046,0.466145,0.0
1047,0.233554,0.0
1048,0.311459,0.0
1049,0.195729,0.0
1050,0.839551,0.0
1051,0.377914,0.0
1052,0.371235,0.0
1053,0.4703,0.0
1054,-1.094075,0.0
1055,-0.31556,0.0
1056,-0.705529,0.0
1057,-0.519843,0.0
1058,-0.355199,0.0
1059,-0.525381,0.0
1060,-0.395373,0.0
1061,0.397953,0.0
1062,0.267237,0.0
1063,2.792509,0.0
1064,-0.032488,0.0
1065,-0.401109,0.0
1066,-0.39676,0.0
1067,-0.43303,0.0
1068,-0.378057,0.0
1069,0.356465,0.0
1070,0.304202,0.0
1071,0.777969,0.0
1072,-1.176233,0.0
1073,-1.676099,0.0
1074,-1.584029,0.0
1075,-1.019168,0.0
1076,-0.80754,0.0
1077,-1.319639,0.0
1078,0.569178,0.0
1079,1.003993,0.0
1080,0.631844,0.0
1081,0.625432,0.0
1082,0.690031,0.0
1083,0.63536,0.0
1084,0.658674,0.0
1085,0.552506,0.0
1086,0.590928,0.0
1087,0.637534,0.0
1088,0.678402,0.0
1089,2.395718,0.0
1090,-0.876561,0.0
1091,-0.403905,0.0
1092,-0.476431,0.0
1093,-0.526789,0.0
1094,-0.306331,0.0
1095,-0.409019,0.0
1096,-0.381228,0.0
1097,1.896413,0.0
1098,-0.204636,0.0
1099,0.002106,0.0
1100,-0.137467,0.0
1101,-0.211003,0.0
1102,-0.218511,0.0
1103,-0.342414,0.0
1104,-0.399292,0.0
1105,-0.370467,0.0
1106,-0.5118,1.0
1107,-1.052731,0.0
1108,-0.334051,0.0
1109,0.455485,0.0
1110,0.181279,0.0
1111,0.600792,0.0
1112,0.819857,0.0
1113,-0.521854,0.0
1114,1.250202,0.0
1115,1.727466,0.0
1116,0.622647,0.0
1117,1.332252,0.0
1118,-0.983668,0.0
1119,-0.634667,0.0
1120,-0.677866,0.0
1121,-0.610388,0.0
1122,-0.605338,0.0
1123,-0.612268,0.0
1124,-0.469221,0.0
1125,-0.287555,0.0
1126,0.53484,0.0
1127,0.082652,0.0
1128,-0.943181,0.0
1129,1.030115,0.0
1130,-1.032601,0.0
1131,1.06599,0.0
1132,-0.365077,0.0
1133,-0.887512,0.0
1134,1.511948,0.0
1135,0.476442,0.0
1136,-0.402899,0.0
1137,-0.175899,0.0
1138,-0.175332,0.0
1139,-0.150334,0.0
1140,-0.101611,0.0
1141,-0.042731,0.0
1142,-0.015529,0.0
1143,-0.322055,0.0
1144,-0.562317,0.0
1145,-0.746089,0.0
1146,-0.280863,0.0
1147,-0.49757,0.0
1148,0.10771,0.0
1149,0.114722,0.0
1150,-0.183743,0.0
1151,1.051574,0.0
1152,-0.238632,0.0
1153,1.949914,0.0
1154,0.687924,0.0
1155,1.425768,0.0
1156,1.195602,0.0
1157,-0.76105,0.0
1158,-0.744385,0.0
1159,-0.727953,0.0
1160,-0.731502,0.0
1161,-0.674918,0.0
1162,-0.48719,0.0
1163,-0.177336,0.0
1164,0.822453,0.0
1165,-0.452524,0.0
1166,-0.810007,0.0
1167,1.123219,0.0
1168,-0.374972,0.0
1169,-1.092161,0.0
1170,1.394966,0.0
1171,0.301895,0.0
1172,-1.360506,0.0
1173,1.420111,0.0
1174,0.977534,0.0
1175,0.188113,0.0
1176,-0.095461,0.0
1177,-0.402008,0.0
1178,-0.34912,0.0
1179,-0.297512,0.0
1180,-0.489489,0.0
1181,-0.696985,0.0
1182,-0.798767,0.0
1183,-0.859739,0.0
1184,-0.896081,0.0
1185,-0.794199,0.0
1186,-0.390333,0.0
1187,-0.056214,0.0
1188,-0.135044,0.0
1189,0.628587,0.0
1190,0.397216,0.0
1191,1.253858,0.0
1192,1.696027,0.0
1193,0.10863,0.0
1194,1.326328,0.0
1195,1.327642,0.0
1196,-0.806323,0.0
1197,-0.520808,0.0
1198,-0.458747,0.0
1199,-0.184036,0.0
1200,1.359353,0.0
1201,-0.296001,0.0
1202,-0.520347,0.0
1203,0.316421,0.0
1204,-1.673949,0.0
1205,0.318245,0.0
1206,-1.913292,0.0
1207,0.607112,0.0
1208,-0.993123,0.0
1209,-0.82128,0.0
1210,0.614792,0.0
1211,-0.27213,0.0
1212,0.11171,0.0
1213,0.372067,0.0
1214,0.552882,0.0
1215,0.586772,0.0
1216,0.59812,0.0
1217,0.616488,0.0
1218,0.371971,0.0
1219,-0.165422,0.0
1220,-0.483373,0.0
1221,1.129151,0.0
1222,-0.960049,0.0
1223,-0.461904,0.0
1224,1.301578,0.0
1225,-1.341891,0.0
1226,1.490465,0.0
1227,0.445468,0.0
1228,-0.702253,0.0
1229,-0.28222,0.0
1230,0.439576,0.0
1231,-0.334044,0.0
1232,-0.078322,0.0
1233,-0.076875,0.0
1234,-0.023532,0.0
1235,-0.011937,0.0
1236,0.017844,0.0
1237,-0.083725,0.0
1238,0.32217,0.0
1239,0.816192,0.0
1240,-1.25255,0.0
1241,1.302946,0.0
1242,-1.520347,0.0
1243,0.119431,0.0
1244,0.377582,0.0
1245,-1.013575,0.0
1246,1.067263,0.0
1247,0.631349,0.0
1248,-0.416549,0.0
1249,-0.347977,0.0
1250,-0.235843,0.0
1251,-0.151948,0.0
1252,-0.02998,0.0
1253,0.089445,0.0
1254,0.12654,0.0
1255,0.220493,0.0
1256,0.132199,0.0
1257,-0.376576,0.0
1258,-0.028609,0.0
1259,-0.11038,0.0
1260,-0.153641,0.0
1261,0.388615,0.0
1262,-0.732309,0.0
1263,0.576033,0.0
1264,0.773801,0.0
1265,-0.744923,0.0
1266,1.663432,0.0
1267,-0.384618,0.0
1268,0.679186,0.0
1269,1.78263,0.0
1270,-0.280375,0.0
1271,-0.913133,0.0
1272,-0.900888,0.0
1273,-0.774826,0.0
1274,-0.410165,0.0
1275,1.064754,0.0
1276,0.017189,0.0
1277,-0.87866,0.0
1278,0.451899,0.0
1279,-1.690561,0.0
1280,0.328746,0.0
1281,-1.6302,0.0
1282,0.120741,0.0
1283,-0.746341,0.0
1284,-0.807301,0.0
1285,0.285793,0.0
1286,-0.274203,0.0
1287,0.333711,0.0
1288,0.433725,0.0
1289,0.423174,0.0
1290,0.74473,0.0
1291,0.601268,0.0
1292,0.707028,0.0
1293,0.083123,0.0
1294,-0.278636,0.0
1295,-0.14071,0.0
1296,0.223261,0.0
1297,0.500648,0.0
1298,-0.996367,0.0
1299,1.139878,0.0
1300,0.112859,0.0
1301,-0.9169,0.0
1302,1.314824,0.0
1303,1.006567,0.0
1304,-1.076834,0.0
1305,1.143406,0.0
1306,0.927786,0.0
1307,-0.431193,0.0
1308,-0.637135,0.0
1309,-0.489246,0.0
1310,-0.56527,0.0
1311,-0.470084,0.0
1312,0.192298,0.0
1313,0.819305,0.0
1314,-0.776184,0.0
1315,-0.726288,0.0
1316,0.389297,0.0
1317,-1.482646,0.0
1318,0.444075,0.0
1319,-1.897256,0.0
1320,-0.705726,0.0
1321,-0.188068,0.0
1322,-0.526729,0.0
1323,-0.322209,0.0
1324,-0.003992,0.0
1325,0.371654,0.0
1326,0.726322,0.0
1327,0.840001,0.0
1328,0.921219,0.0
1329,0.948292,0.0
1330,0.85571,0.0
1331,0.135743,0.0
1332,-0.319463,0.0
1333,-0.410251,0.0
1334,0.174354,0.0
1335,-0.902165,0.0
1336,0.190745,0.0
1337,-0.461434,0.0
1338,0.363549,0.0
1339,0.801291,0.0
1340,-1.206498,0.0
1341,1.918388,0.0
1342,0.726438,0.0
1343,-0.343392,0.0
1344,1.181922,0.0
1345,-0.700628,0.0
1346,-0.503817,0.0
1347,-0.388869,0.0
1348,-0.136709,0.0
1349,-0.274508,0.0
1350,-0.464527,0.0
1351,-0.155195,0.0
1352,1.105823,0.0
1353,-0.604171,0.0
1354,-0.412284,0.0
1355,1.369711,0.0
1356,-0.742388,0.0
1357,-0.521091,0.0
1358,1.6973,0.0
1359,-0.050704,0.0
1360,-1.096963,0.0
1361,1.440564,0.0
1362,0.640114,0.0
1363,-0.397609,0.0
1364,-0.263691,0.0
1365,-0.659811,0.0
1366,-0.345843,0.0
1367,-0.269912,0.0
1368,0.03134,0.0
1369,-0.077072,0.0
1370,-0.399594,0.0
1371,0.169911,0.0
1372,-0.2386,0.0
1373,-1.10485,0.0
1374,1.395315,0.0
1375,-1.485231,0.0
1376,1.049744,0.0
1377,0.356916,0.0
1378,-0.58749,0.0
1379,-0.461637,0.0
1380,0.925342,0.0
1381,0.422843,0.0
1382,0.085447,0.0
1383,-0.049418,0.0
1384,-0.094263,0.0
1385,-0.049458,0.0
1386,-0.005482,0.0
1387,-0.192986,0.0
1388,1.080061,0.0
1389,0.141815,0.0
1390,-0.791632,0.0
1391,1.15565,0.0
1392,-0.164223,0.0
1393,-0.951747,0.0
1394,1.531946,0.0
1395,-0.183174,0.0
1396,-1.3033,0.0
1397,1.659194,0.0
1398,-0.081894,0.0
1399,-0.177405,0.0
1400,0.112271,0.0
1401,-0.441365,0.0
1402,-0.22886,0.0
1403,-0.30201,0.0
1404,-0.45571,0.0
1405,-0.404416,0.0
1406,-0.435874,0.0
1407,-0.441181,0.0
1408,-0.475172,0.0
1409,-0.50399,0.0
1410,-0.594825,0.0
1411,-0.619206,0.0
1412,-0.5511,0.0
1413,0.053441,0.0
1414,0.023501,0.0
1415,-0.538847,0.0
1416,1.218189,0.0
1417,-0.847162,0.0
1418,0.623573,0.0
1419,2.280869,0.0
1420,0.170762,0.0
1421,1.242841,0.0
1422,0.061043,0.0
1423,-0.385842,0.0
1424,-0.289798,0.0
1425,-0.165437,0.0
1426,0.259026,0.0
1427,0.83484,0.0
1428,-1.779502,0.0
1429,0.035403,0.0
1430,0.043449,0.0
1431,-1.429167,0.0
1432,1.155732,0.0
1433,-0.634115,0.0
1434,-1.006742,0.0
1435,1.454812,0.0
1436,0.466583,0.0
1437,-0.247637,0.0
1438,0.045288,0.0
1439,0.141926,0.0
1440,0.16535,0.0
1441,0.262152,0.0
1442,0.275541,0.0
1443,0.173803,0.0
1444,-0.21345,0.0
1445,-0.433947,0.0
1446,0.482618,0.0
1447,-0.881333,0.0
1448,0.577919,0.0
1449,-0.022042,0.0
1450,-0.079349,0.0
1451,0.894231,0.0
1452,-0.387623,0.0
1453,1.752466,0.0
1454,-0.082903,0.0
1455,0.389835,0.0
1456,1.998835,0.0
1457,-0.25819,0.0
1458,-0.813337,0.0
1459,-0.885546,0.0
1460,-0.924743,0.0
1461,-0.937054,0.0
1462,-1.436819,0.0
1463,-1.271426,0.0
1464,-0.185521,0.0
1465,0.1023,0.0
1466,-0.337369,0.0
1467,0.173731,0.0
1468,0.408405,0.0
1469,-0.147295,0.0
1470,0.933916,0.0
1471,1.327631,0.0
1472,0.620078,0.0
1473,1.886537,0.0
1474,1.047619,0.0
1475,-0.32225,0.0
1476,-0.743506,0.0
1477,-0.560954,0.0
1478,-0.605071,0.0
1479,-0.57556,0.0
1480,-0.533359,0.0
1481,-0.26703,0.0
1482,-0.504981,0.0
1483,0.548185,0.0
1484,-1.224236,0.0
1485,0.530193,0.0
1486,-0.46869,0.0
1487,0.211775,0.0
1488,0.445398,0.0
1489,-0.188326,0.0
1490,1.46446,0.0
1491,1.246273,0.0
1492,0.488769,0.0
1493,2.12685,0.0
1494,0.12583,0.0
1495,-0.991531,0.0
1496,-0.961398,0.0
1497,-0.931462,0.0
1498,-0.947963,0.0
1499,-0.539871,0.0
1500,0.30507,0.0
1501,1.534375,0.0
1502,0.650145,0.0
1503,-0.356524,0.0
1504,1.119991,0.0
1505,-0.910127,0.0
1506,1.221592,0.0
1507,0.281957,0.0
1508,-0.41871,0.0
1509,0.643392,0.0
1510,-0.777186,0.0
1511,-1.042895,0.0
1512,-1.093193,0.0
1513,-0.66135,0.0
1514,-0.241087,0.0
1515,-0.13559,0.0
1516,-0.132098,0.0
1517,-0.11446,0.0
1518,-0.377402,0.0
1519,-0.132249,0.0
1520,1.562589,0.0
1521,0.489759,0.0
1522,0.815094,0.0
1523,0.405171,0.0
1524,0.426472,0.0
1525,0.725536,0.0
1526,1.287617,0.0
1527,0.385854,0.0
1528,1.409096,0.0
1529,-0.912018,0.0
1530,-1.186641,0.0
1531,-1.032495,0.0
1532,-0.837689,0.0
1533,-0.713256,0.0
1534,-0.702636,0.0
1535,-0.78043,0.0
1536,-0.706759,0.0
1537,-0.1971,0.0
1538,-0.419269,0.0
1539,1.144202,0.0
1540,-1.720396,0.0
1541,0.591024,0.0
1542,-0.25647,0.0
1543,-0.554584,0.0
1544,1.290464,0.0
1545,-1.044728,0.0
1546,-0.916838,0.0
1547,0.970676,0.0
1548,0.831117,0.0
1549,-0.502744,0.0
1550,-0.160331,0.0
1551,0.011475,0.0
1552,0.087192,0.0
1553,0.201106,0.0
1554,0.2201,0.0
1555,0.263946,0.0
1556,0.234469,0.0
1557,-0.265179,0.0
1558,-0.442493,0.0
1559,-0.491438,0.0
1560,-0.181231,0.0
1561,0.619456,0.0
1562,0.053806,0.0
1563,0.988757,0.0
1564,1.644007,0.0
1565,0.766226,0.0
1566,1.431326,0.0
1567,1.233573,0.0
1568,-0.198266,0.0
1569,-1.05727,0.0
1570,-0.956218,0.0
1571,-0.901883,0.0
1572,-0.925027,0.0
1573,-0.89124,0.0
1574,-0.540856,1.0
1575,-0.720533,0.0
1576,-0.825845,0.0
1577,-0.882397,0.0
1578,0.186319,0.0
1579,-0.395084,0.0
1580,-0.670155,0.0
1581,-0.626683,0.0
1582,-0.045727,0.0
1583,1.94927,0.0
1584,0.389475,0.0
1585,-0.126443,0.0
1586,0.042366,0.0
1587,0.184099,0.0
1588,0.340077,0.0
1589,0.444034,0.0
1590,0.474486,0.0
1591,0.462294,0.0
1592,0.343602,0.0
1593,-0.030797,0.0
1594,-0.011264,0.0
1595,1.540651,0.0
1596,0.156046,0.0
1597,1.439754,0.0
1598,1.524766,0.0
1599,0.696994,0.0
1600,1.08513,0.0
1601,-0.323751,0.0
1602,-0.470508,0.0
1603,-0.532201,0.0
1604,-0.384542,0.0
1605,-0.525529,0.0
1606,-0.656978,0.0
1607,-0.782192,0.0
1608,-0.820392,0.0
1609,-0.841052,0.0
1610,-0.721514,0.0
1611,-0.710343,0.0
1612,-0.682504,0.0
1613,1.410192,0.0
1614,0.65956,0.0
1615,-0.372373,0.0
1616,-0.128202,0.0
1617,-0.788206,0.0
1618,1.095748,0.0
1619,0.506962,0.0
1620,-0.427607,0.0
1621,-0.345182,0.0
1622,-0.306493,0.0
1623,-0.171523,0.0
1624,-0.100272,0.0
1625,-0.009934,0.0
1626,0.008967,0.0
1627,-0.0049,0.0
1628,0.031606,0.0
1629,0.025707,0.0
1630,0.30219,0.0
1631,-0.421259,0.0
1632,0.876827,0.0
1633,0.206384,0.0
1634,-1.516334,0.0
1635,-1.084957,0.0
1636,0.083599,0.0
1637,1.055304,0.0
1638,0.101314,0.0
1639,-0.822108,0.0
1640,-1.095944,0.0
1641,-0.979336,0.0
1642,-0.411283,0.0
1643,0.070159,0.0
1644,0.511274,0.0
1645,0.635807,0.0
1646,0.668031,0.0
1647,0.81786,0.0
1648,0.986349,0.0
1649,0.075744,0.0
1650,-0.131355,0.0
1651,1.314354,0.0
1652,-1.044713,0.0
1653,-0.968615,0.0
1654,-0.876875,0.0
1655,-0.539756,0.0
1656,0.768936,0.0
1657,-0.458452,0.0
1658,-1.04629,0.0
1659,-0.829318,0.0
1660,-0.48172,0.0
1661,-0.206208,0.0
1662,0.28025,0.0
1663,0.632277,0.0
1664,0.842264,0.0
1665,0.885393,0.0
1666,1.03999,0.0
1667,0.500327,0.0
1668,-0.743536,0.0
1669,-0.388815,0.0
1670,1.343034,0.0
1671,0.519594,0.0
1672,0.780968,0.0
1673,0.596398,0.0
1674,0.933908,0.0
1675,-0.046627,0.0
1676,1.09429,0.0
1677,0.185588,0.0
1678,-0.574132,0.0
1679,-0.370743,0.0
1680,-0.344064,0.0
1681,-0.471788,0.0
1682,-0.46523,0.0
1683,-0.478284,0.0
1684,-0.593447,0.0
1685,-0.514146,0.0
1686,-0.064821,0.0
1687,-0.291386,0.0
1688,1.163289,0.0
1689,0.682002,0.0
1690,-1.44314,0.0
1691,-1.557,0.0
1692,-0.952158,0.0
1693,-0.570602,0.0
1694,-0.248709,0.0
1695,1.657894,0.0
1696,0.450051,0.0
1697,-0.410624,0.0
1698,-0.491596,0.0
1699,-0.004284,0.0
1700,0.185415,0.0
1701,0.360502,0.0
1702,0.3433,0.0
1703,0.356656,0.0
1704,0.467143,0.0
1705,0.355099,0.0
1706,-0.131437,0.0
1707,0.916841,0.0
1708,1.691153,0.0
1709,-0.134772,0.0
1710,-0.162522,0.0
1711,-0.522594,0.0
1712,0.891843,0.0
1713,1.136248,0.0
1714,-0.258563,0.0
1715,-0.725818,0.0
1716,-0.544599,0.0
1717,-0.466092,0.0
1718,-0.382204,0.0
1719,-0.328813,0.0
1720,-0.309547,0.0
1721,-0.295315,0.0
1722,-0.309967,0.0
1723,-0.270074,0.0
1724,0.203064,0.0
1725,-0.791015,0.0
1726,0.279007,0.0
1727,0.51204,0.0
1728,-1.397551,0.0
1729,-1.011451,0.0
1730,-1.258515,0.0
1731,0.759954,0.0
1732,0.991267,0.0
1733,-0.246939,0.0
1734,-0.988844,0.0
1735,-0.452301,0.0
1736,-0.268154,0.0
1737,0.227965,0.0
1738,0.433231,0.0
1739,0.773045,0.0
1740,0.733935,0.0
1741,0.820263,0.0
1742,0.619887,0.0
1743,-0.237243,0.0
1744,0.208157,0.0
1745,2.359805,0.0
1746,-0.252914,0.0
1747,0.470357,0.0
1748,-0.216082,0.0
1749,1.002331,0.0
1750,1.026522,0.0
1751,-0.40085,0.0
1752,-0.546783,0.0
1753,-0.469664,0.0
1754,-0.403454,0.0
1755,-0.387404,0.0
1756,-0.406131,0.0
1757,-0.347428,0.0
1758,-0.381931,0.0
1759,-0.384478,0.0
1760,-0.387402,0.0
1761,0.140243,0.0
1762,-0.185448,0.0
1763,-0.319237,0.0
1764,0.996573,0.0
1765,-0.242012,0.0
1766,-2.07125,0.0
1767,-0.925911,0.0
1768,-0.918531,0.0
1769,0.139377,0.0
1770,0.710415,0.0
1771,-0.201575,0.0
1772,-0.804061,0.0
1773,-0.221751,0.0
1774,0.15295,0.0
1775,0.406688,0.0
1776,0.772759,0.0
1777,0.762115,0.0
1778,0.770901,0.0
1779,0.718831,0.0
1780,0.569836,0.0
1781,-0.421322,0.0
1782,0.663585,0.0
1783,0.249299,0.0
1784,-1.859977,0.0
1785,-0.207309,0.0
1786,-0.659103,0.0
1787,-0.13741,0.0
1788,0.854161,0.0
1789,0.124456,0.0
1790,-0.960348,0.0
1791,-0.752981,0.0
1792,-0.338858,0.0
1793,0.073924,0.0
1794,0.481044,0.0
1795,0.668234,0.0
1796,0.689697,0.0
1797,0.555397,0.0
1798,0.542305,0.0
1799,0.332781,0.0
1800,0.519135,0.0
1801,1.940032,0.0
1802,0.720023,0.0
1803,0.552608,0.0
1804,0.722916,0.0
1805,0.696284,0.0
1806,1.209607,0.0
1807,0.51073,0.0
1808,-0.177347,0.0
1809,-0.552985,0.0
1810,-0.53955,0.0
1811,-0.567675,0.0
1812,-0.752808,0.0
1813,-0.904517,0.0
1814,-0.954935,0.0
1815,-1.000165,0.0
1816,-0.998504,0.0
1817,-0.876522,0.0
1818,-0.31994,0.0
1819,0.07302,0.0
1820,1.814713,0.0
1821,0.240966,0.0
1822,1.563111,0.0
1823,1.440141,0.0
1824,0.778036,0.0
1825,0.738283,0.0
1826,-0.077554,0.0
1827,-0.404113,0.0
1828,-0.535414,0.0
1829,-0.397512,0.0
1830,-0.489825,0.0
1831,-0.628183,0.0
1832,-0.763487,0.0
1833,-0.806165,0.0
1834,-0.864846,0.0
1835,-0.836558,0.0
1836,-0.841642,0.0
1837,-0.404859,0.0
1838,-0.195922,0.0
1839,1.109133,0.0
1840,0.994767,0.0
1841,0.435102,0.0
1842,0.020199,0.0
1843,0.53707,0.0
1844,1.853776,0.0
1845,0.424977,0.0
1846,-0.207889,0.0
1847,-0.297811,0.0
1848,-0.280556,0.0
1849,-0.401244,0.0
1850,-0.491039,0.0
1851,-0.56869,0.0
1852,-0.615159,0.0
1853,-0.639323,0.0
1854,-0.659992,0.0
1855,0.165276,0.0
1856,-0.172983,0.0
1857,1.427891,0.0
1858,-0.447124,0.0
1859,-1.482291,0.0
1860,-0.731083,0.0
1861,-0.818703,0.0
1862,0.982029,0.0
1863,0.009721,0.0
1864,-0.941642,0.0
1865,-0.890283,0.0
1866,-0.607175,0.0
1867,-0.30167,0.0
1868,0.14953,0.0
1869,0.618133,0.0
1870,0.631506,0.0
1871,0.693622,0.0
1872,0.753299,0.0
1873,0.78727,0.0
1874,0.64618,0.0
1875,-0.553006,0.0
1876,0.477191,0.0
1877,0.472213,0.0
1878,-1.295239,0.0
1879,-0.335518,0.0
1880,-0.792208,0.0
1881,1.1723,0.0
1882,0.125628,0.0
1883,-1.0965,0.0
1884,-1.271095,0.0
1885,-0.801705,0.0
1886,-0.367221,0.0
1887,0.064365,0.0
1888,0.49701,0.0
1889,0.700263,0.0
1890,0.748448,0.0
1891,0.864404,0.0
1892,0.960509,0.0
1893,0.181447,0.0
1894,0.884681,0.0
1895,0.748972,0.0
1896,-1.263767,0.0
1897,-1.135482,0.0
1898,-1.257263,0.0
1899,-0.271227,0.0
1900,1.180295,0.0
1901,-0.654112,0.0
1902,-0.931084,0.0
1903,-0.700606,0.0
1904,-0.380434,0.0
1905,-0.008159,0.0
1906,0.355806,0.0
1907,0.625265,0.0
1908,0.575237,0.0
1909,0.687977,0.0
1910,0.771328,0.0
1911,0.364449,0.0
1912,-0.050476,0.0
1913,-0.122312,0.0
1914,0.751301,0.0
1915,1.320665,0.0
1916,-0.168343,0.0
1917,0.5444,0.0
1918,-0.299158,0.0
1919,1.433858,0.0
1920,0.916822,0.0
1921,-0.24095,0.0
1922,-0.500283,0.0
1923,-0.444678,0.0
1924,-0.48163,0.0
1925,-0.525556,0.0
1926,-0.554651,0.0
1927,-0.522836,0.0
1928,-0.473926,0.0
1929,-0.462074,0.0
1930,0.505334,0.0
1931,1.205101,0.0
1932,0.289552,0.0
1933,-0.78058,0.0
1934,-0.820691,0.0
1935,-0.659869,0.0
1936,-1.261652,0.0
1937,-0.491292,0.0
1938,-1.184618,0.0
1939,-1.093344,0.0
1940,-0.943032,0.0
1941,-0.442017,0.0
1942,-0.181252,0.0
1943,0.380765,0.0
1944,0.785913,0.0
1945,1.058116,0.0
1946,1.16529,0.0
1947,1.212551,0.0
1948,1.146212,0.0
1949,0.16933,0.0
1950,-0.053257,0.0
1951,-0.140889,0.0
1952,1.604737,0.0
1953,0.39721,0.0
1954,0.475507,0.0
1955,0.347159,0.0
1956,0.393652,0.0
1957,1.274107,0.0
1958,0.677215,0.0
1959,-0.934008,0.0
1960,-0.696445,0.0
1961,-0.68744,0.0
1962,-0.676454,0.0
1963,-0.60205,0.0
1964,-0.536465,0.0
1965,-0.428921,0.0
1966,-0.351105,0.0
1967,-0.329634,0.0
1968,-0.285239,0.0
1969,-0.006614,0.0
1970,2.116664,0.0
1971,0.546131,0.0
1972,0.70313,0.0
1973,0.666525,0.0
1974,1.019791,0.0
1975,0.684324,0.0
1976,0.48432,0.0
1977,-0.500848,0.0
1978,-0.547451,0.0
1979,-0.43977,0.0
1980,-0.502947,0.0
1981,-0.589816,0.0
1982,-0.655168,0.0
1983,-0.764963,0.0
1984,-0.817047,0.0
1985,-0.676213,0.0
1986,-0.085972,0.0
1987,0.220457,0.0
1988,0.05989,0.0
1989,1.538703,0.0
1990,0.786591,0.0
1991,-0.020388,0.0
1992,-0.20787,0.0
1993,-0.179704,0.0
1994,1.309876,0.0
1995,0.556368,0.0
1996,-0.391904,0.0
1997,-0.563375,0.0
1998,-0.462138,0.0
1999,-0.451985,0.0
2000,-0.484415,0.0
2001,-0.494855,0.0
2002,-0.476881,0.0
2003,-0.442168,0.0
2004,-0.424656,0.0
2005,0.600833,0.0
2006,1.187869,0.0
2007,0.170646,0.0
2008,-0.977113,0.0
2009,-0.65854,0.0
2010,-0.880521,0.0
2011,-1.199181,0.0
2012,-0.241536,0.0
2013,-0.855865,0.0
2014,-1.252262,0.0
2015,-0.989132,0.0
2016,-0.500311,0.0
2017,-0.131953,0.0
2018,0.360833,0.0
2019,0.911722,0.0
2020,1.039622,0.0
2021,1.068394,0.0
2022,1.114733,0.0
2023,1.109131,0.0
2024,0.579842,0.0
2025,1.139891,0.0
2026,-0.84846,0.0
2027,-0.573028,0.0
2028,-0.660333,0.0
2029,-0.75727,0.0
2030,-1.346025,0.0
2031,-0.223461,0.0
2032,-0.923035,0.0
2033,-1.198656,0.0
2034,-0.845145,0.0
2035,-0.348348,0.0
2036,0.039764,0.0
2037,0.524099,0.0
2038,0.957,0.0
2039,1.174236,0.0
2040,1.181618,0.0
2041,1.210343,0.0
2042,0.965911,0.0
2043,0.060565,0.0
2044,-0.11103,0.0
2045,0.75475,0.0
2046,1.018201,0.0
2047,-0.40258,0.0
2048,0.334497,0.0
2049,-0.4912,0.0
2050,0.472682,0.0
2051,1.725688,0.0
2052,0.228577,0.0
2053,-0.507576,0.0
2054,-0.379846,0.0
2055,-0.378198,0.0
2056,-0.389266,0.0
2057,-0.426364,0.0
2058,-0.420191,0.0
2059,-0.443583,0.0
2060,-0.457103,0.0
2061,-0.487361,0.0
2062,-0.262195,0.0
2063,1.086178,0.0
2064,1.21019,0.0
2065,1.069918,0.0
2066,1.222113,0.0
2067,0.805779,0.0
2068,0.6393,0.0
2069,1.131204,0.0
2070,0.222629,0.0
2071,-0.552912,0.0
2072,-0.457438,0.0
2073,-0.390012,0.0
2074,-0.641664,0.0
2075,-0.829922,0.0
2076,-0.899029,0.0
2077,-0.9547,0.0
2078,-0.946874,0.0
2079,-0.964868,0.0
2080,-0.322427,0.0
2081,-0.121881,0.0
2082,0.213353,0.0
2083,1.623591,0.0
2084,-0.4572,0.0
2085,0.399241,0.0
2086,-0.094053,0.0
2087,0.931865,0.0
2088,0.847422,0.0
2089,-0.300326,0.0
2090,-0.508688,0.0
2091,-0.403885,0.0
2092,-0.287512,0.0
2093,-0.325185,0.0
2094,-0.28678,0.0
2095,-0.250688,0.0
2096,-0.268567,0.0
2097,-0.302071,0.0
2098,-0.323509,0.0
2099,-0.390484,0.0
2100,-0.206952,0.0
2101,1.841219,0.0
2102,0.406042,0.0
2103,0.172809,0.0
2104,-0.007428,0.0
2105,0.28981,0.0
2106,1.791016,0.0
2107,0.418686,0.0
2108,-0.350512,0.0
2109,-0.506671,0.0
2110,-0.461914,0.0
2111,-0.393923,0.0
2112,-0.401777,0.0
2113,-0.440289,0.0
2114,-0.466307,0.0
2115,-0.431788,0.0
2116,-0.471029,0.0
2117,-0.157379,0.0
2118,2.125431,0.0
2119,0.332774,0.0
2120,-0.767312,0.0
2121,-0.536027,0.0
2122,-0.780938,0.0
2123,-1.204098,0.0
2124,-0.286937,0.0
2125,-0.881889,0.0
2126,-1.107527,0.0
2127,-0.83989,0.0
2128,-0.5369,0.0
2129,-0.284405,0.0
2130,0.018144,0.0
2131,0.532318,0.0
2132,0.787857,0.0
2133,0.862991,0.0
2134,0.931761,0.0
2135,0.943093,0.0
2136,0.027336,0.0
2137,-0.582995,0.0
2138,-0.501822,0.0
2139,-0.290496,0.0
2140,1.008309,0.0
2141,0.157112,0.0
2142,0.617094,0.0
2143,0.66428,0.0
2144,1.23463,0.0
2145,0.647604,0.0
2146,1.704339,0.0
2147,-0.022792,0.0
2148,-0.384159,0.0
2149,-0.534417,0.0
2150,-0.546941,0.0
2151,-0.626213,0.0
2152,-0.699528,0.0
2153,-0.636044,0.0
2154,-0.62403,0.0
2155,-0.530707,0.0
2156,-0.22006,0.0
2157,-0.310075,0.0
2158,0.118441,0.0
2159,1.065486,0.0
2160,-0.158204,0.0
2161,0.716163,0.0
2162,0.660919,0.0
2163,1.301044,0.0
2164,0.728475,0.0
2165,1.051708,0.0
2166,-0.091495,0.0
2167,-0.430265,0.0
2168,-0.466529,0.0
2169,-0.678121,0.0
2170,-0.7781,0.0
2171,-0.690686,0.0
2172,-0.686838,0.0
2173,-0.754001,0.0
2174,0.598077,1.0
2175,-0.052968,0.0
2176,0.002092,0.0
2177,0.965016,0.0
2178,0.182048,0.0
2179,-1.04858,0.0
2180,-1.023577,0.0
2181,-1.059533,0.0
2182,-1.102159,0.0
2183,-0.622901,0.0
2184,-0.52237,0.0
2185,-0.229528,0.0
2186,0.035635,0.0
2187,0.330459,0.0
2188,0.613464,0.0
2189,0.759225,0.0
2190,0.784741,0.0
2191,0.808289,0.0
2192,0.685824,0.0
2193,0.076851,0.0
2194,-0.156395,0.0
2195,-0.206721,0.0
2196,0.252191,0.0
2197,0.544348,0.0
2198,-0.026365,0.0
2199,-0.09318,0.0
2200,-0.47913,0.0
2201,-0.591619,0.0
2202,-0.522309,0.0
2203,-0.431813,0.0
2204,-0.227214,0.0
2205,-0.06308,0.0
2206,0.171799,0.0
2207,0.331,0.0
2208,0.349366,0.0
2209,0.398291,0.0
2210,0.358897,0.0
2211,0.559423,0.0
2212,0.2619,0.0
2213,0.083274,0.0
2214,0.964718,0.0
2215,-0.170306,0.0
2216,0.464764,0.0
2217,-0.25739,0.0
2218,-0.795435,0.0
2219,-0.932482,0.0
2220,-0.676191,0.0
2221,-0.559939,0.0
2222,-0.413607,0.0
2223,-0.180532,0.0
2224,0.040881,0.0
2225,0.223424,0.0
2226,0.319991,0.0
2227,0.439603,0.0
2228,0.303455,0.0
2229,0.438641,0.0
2230,-0.222187,0.0
2231,-0.789605,0.0
2232,-0.99298,0.0
2233,-1.037921,0.0
2234,-0.516394,0.0
2235,-0.378498,0.0
2236,0.369959,0.0
2237,0.266778,0.0
2238,0.39498,0.0
2239,0.415942,0.0
2240,-0.519176,0.0
2241,-0.403276,0.0
2242,0.066221,0.0
2243,0.073933,0.0
2244,0.549984,0.0
2245,0.680465,0.0
2246,0.706928,0.0
2247,0.719589,0.0
2248,0.712891,0.0
2249,0.213536,0.0
2250,-0.183675,0.0
2251,-0.024227,0.0
2252,0.540516,0.0
2253,0.57924,0.0
2254,-0.580846,0.0
2255,-0.807231,0.0
2256,-1.015103,0.0
2257,-1.030505,0.0
2258,-0.718072,0.0
2259,-0.533184,0.0
2260,-0.289408,0.0
2261,-0.073324,0.0
2262,0.407729,0.0
2263,0.707492,0.0
2264,0.683999,0.0
2265,0.758002,0.0
2266,0.788382,0.0
2267,0.375019,0.0
2268,-0.372092,0.0
2269,-0.192152,0.0
2270,0.612174,0.0
2271,0.773323,0.0
2272,1.542117,0.0
2273,0.997976,0.0
2274,0.936999,0.0
2275,0.528248,0.0
2276,0.000373,0.0
2277,-0.433576,0.0
2278,-0.305128,0.0
2279,-0.264352,0.0
2280,-0.32901,0.0
2281,-0.493473,0.0
2282,-0.591075,0.0
2283,-0.567642,0.0
2284,-0.601164,0.0
2285,-0.675565,0.0
2286,-0.563097,0.0
2287,-0.226546,0.0
2288,-0.025881,0.0
2289,0.104035,0.0
2290,0.629669,0.0
2291,1.065008,0.0
2292,0.890155,0.0
2293,1.2114,0.0
2294,0.901109,0.0
2295,0.36133,0.0
2296,-0.332391,0.0
2297,-0.220014,0.0
2298,-0.440501,0.0
2299,-0.688475,0.0
2300,-0.588825,0.0
2301,-0.43202,0.0
2302,-0.520489,0.0
2303,-0.585792,0.0
2304,-0.718051,0.0
2305,-0.599249,0.0
2306,-0.080895,0.0
2307,-0.129384,0.0
2308,0.352841,0.0
2309,0.992169,0.0
2310,0.838444,0.0
2311,1.093025,0.0
2312,0.379674,0.0
2313,-0.046187,0.0
2314,-0.545804,0.0
2315,-0.460818,0.0
2316,-0.236785,0.0
2317,-0.201176,0.0
2318,-0.227017,0.0
2319,-0.176882,0.0
2320,-0.299226,0.0
2321,-0.209252,0.0
2322,-0.328564,0.0
2323,-0.299859,0.0
2324,0.104573,0.0
2325,-0.184262,0.0
2326,-0.468417,0.0
2327,0.431463,0.0
2328,0.880462,0.0
2329,0.053169,0.0
2330,-0.13025,0.0
2331,-0.199585,0.0
2332,-0.659212,0.0
2333,-0.618193,0.0
2334,-0.499684,0.0
2335,-0.277357,0.0
2336,-0.128773,0.0
2337,0.124833,0.0
2338,0.341351,0.0
2339,0.287487,0.0
2340,0.358073,0.0
2341,0.39013,0.0
2342,0.431579,0.0
2343,0.291094,0.0
2344,-0.074393,0.0
2345,0.167988,0.0
2346,0.945115,0.0
2347,-0.225008,0.0
2348,-0.823821,0.0
2349,-1.098872,0.0
2350,-1.172119,0.0
2351,-1.213225,0.0
2352,-0.760017,0.0
2353,-0.588021,0.0
2354,-0.272372,0.0
2355,0.075343,0.0
2356,0.497215,0.0
2357,0.76899,0.0
2358,0.864775,0.0
2359,0.947263,0.0
2360,0.969013,0.0
2361,0.838811,0.0
2362,0.17579,0.0
2363,-0.007605,0.0
2364,0.164616,0.0
2365,0.68458,0.0
2366,-0.149774,0.0
2367,0.54559,0.0
2368,-0.310387,0.0
2369,-0.75352,0.0
2370,-0.795955,0.0
2371,-0.423573,0.0
2372,-0.391712,0.0
2373,-0.31342,0.0
2374,-0.13267,0.0
2375,-0.131043,0.0
2376,0.205107,0.0
2377,0.288256,0.0
2378,0.391586,0.0
2379,0.447557,0.0
2380,0.375138,0.0
2381,-0.221465,0.0
2382,-0.090057,0.0
2383,-0.459028,0.0
2384,0.938815,0.0
2385,-0.04585,0.0
2386,-0.246974,0.0
2387,-0.393143,0.0
2388,-0.65282,0.0
2389,-0.489989,0.0
2390,-0.386972,0.0
2391,-0.285286,0.0
2392,-0.075294,0.0
2393,0.111485,0.0
2394,0.332743,0.0
2395,0.448584,0.0
2396,0.443304,0.0
2397,0.42413,0.0
2398,0.40411,0.0
2399,0.517019,0.0
2400,-0.17199,0.0
2401,0.0184,0.0
2402,0.343932,0.0
2403,0.58068,0.0
2404,-0.588648,0.0
2405,-1.066175,0.0
2406,-1.139908,0.0
2407,-1.171266,0.0
2408,-0.777675,0.0
2409,-0.54977,0.0
2410,-0.279746,0.0
2411,-0.045518,0.0
2412,0.481881,0.0
2413,0.847497,0.0
2414,0.785379,0.0
2415,0.720558,0.0
2416,0.82999,0.0
2417,0.509953,0.0
2418,-0.603886,0.0
2419,-0.71774,0.0
2420,-0.887914,0.0
2421,-0.415717,0.0
2422,-0.333815,0.0
2423,0.182686,0.0
2424,0.915231,0.0
2425,0.477299,0.0
2426,0.536931,0.0
2427,-0.19909,0.0
2428,-1.073112,0.0
2429,-0.491333,0.0
2430,0.34274,0.0
2431,0.371193,0.0
2432,0.464079,0.0
2433,0.477247,0.0
2434,0.474859,0.0
2435,0.433118,0.0
2436,0.417016,0.0
2437,-0.043535,0.0
2438,-0.459665,0.0
2439,-0.537047,0.0
2440,-0.508924,0.0
2441,-0.572023,0.0
2442,0.80704,0.0
2443,-0.004717,0.0
2444,-0.019852,0.0
2445,-0.145916,0.0
2446,-0.571769,0.0
2447,-0.418499,0.0
2448,-0.163715,0.0
2449,0.066692,0.0
2450,0.372562,0.0
2451,0.471224,0.0
2452,0.428411,0.0
2453,0.439088,0.0
2454,0.517245,0.0
2455,0.149736,0.0
2456,-0.411342,0.0
2457,-0.087154,0.0
2458,0.418696,0.0
2459,-0.028908,0.0
2460,0.167312,0.0
2461,-0.625718,0.0
2462,-1.179633,0.0
2463,-1.004123,0.0
2464,-0.890944,0.0
2465,-0.316809,0.0
2466,-0.355834,0.0
2467,-0.065726,0.0
2468,0.307532,0.0
2469,0.628031,0.0
2470,0.830619,0.0
2471,0.833172,0.0
2472,0.883918,0.0
2473,0.876187,0.0
2474,-0.17403,0.0
2475,-0.084271,0.0
2476,-0.186045,0.0
2477,-0.184287,0.0
2478,0.169673,0.0
2479,0.457579,0.0
2480,1.858802,0.0
2481,0.551848,0.0
2482,0.28801,0.0
2483,-0.66417,0.0
2484,-0.25131,0.0
2485,-0.103887,0.0
2486,-0.02422,0.0
2487,-0.110495,0.0
2488,-0.248299,0.0
2489,-0.141831,0.0
2490,-0.566627,0.0
2491,-0.400893,0.0
2492,-0.105048,0.0
2493,-0.033726,0.0
2494,-0.341228,0.0
2495,-0.16625,0.0
2496,0.301006,0.0
2497,-0.300931,0.0
2498,0.53889,0.0
2499,-0.224796,0.0
2500,-0.219834,0.0
2501,-0.818181,0.0
2502,-0.69192,0.0
2503,-0.512083,0.0
2504,-0.23459,0.0
2505,0.021428,0.0
2506,0.287427,0.0
2507,0.46671,0.0
2508,0.491289,0.0
2509,0.504457,0.0
2510,0.561219,0.0
2511,0.793278,0.0
2512,0.428749,0.0
2513,0.212337,0.0
2514,0.633607,0.0
2515,0.303104,0.0
2516,-0.821141,0.0
2517,-1.239018,0.0
2518,-1.219611,0.0
2519,-1.410471,0.0
2520,-1.012364,0.0
2521,-0.710401,0.0
2522,-0.564577,0.0
2523,-0.14991,0.0
2524,0.250824,0.0
2525,0.491268,0.0
2526,0.907026,0.0
2527,0.986409,0.0
2528,1.047095,0.0
2529,1.086734,0.0
2530,0.057658,0.0
2531,-0.196626,0.0
2532,-0.219532,0.0
2533,0.524962,0.0
2534,0.850123,0.0
2535,1.613238,0.0
2536,1.395139,0.0
2537,0.211657,0.0
2538,-0.569433,0.0
2539,-0.456241,0.0
2540,-0.253338,0.0
2541,-0.226213,0.0
2542,-0.120014,0.0
2543,-0.226485,0.0
2544,-0.22673,0.0
2545,-0.36699,0.0
2546,-0.438861,0.0
2547,-0.539689,0.0
2548,-0.534949,0.0
2549,-0.151888,0.0
2550,-0.164925,0.0
2551,0.585911,0.0
2552,0.985408,0.0
2553,0.735577,0.0
2554,1.012874,0.0
2555,0.791198,0.0
2556,0.174042,0.0
2557,-0.369082,0.0
2558,-0.316794,0.0
2559,-0.241761,0.0
2560,-0.244089,0.0
2561,-0.253576,0.0
2562,-0.409185,0.0
2563,-0.457312,0.0
2564,-0.40532,0.0
2565,-0.413509,0.0
2566,-0.467754,0.0
2567,-0.437687,0.0
2568,-0.340004,0.0
2569,-0.704738,0.0
2570,-0.499461,0.0
2571,-0.159499,0.0
2572,0.234264,0.0
2573,0.772002,0.0
2574,0.691631,0.0
2575,1.009051,0.0
2576,0.736864,0.0
2577,0.310902,0.0
2578,-0.963688,0.0
2579,-0.605625,0.0
2580,-0.391827,0.0
2581,-0.163776,0.0
2582,0.015386,0.0
2583,0.043026,0.0
2584,0.037734,0.0
2585,0.044413,0.0
2586,-0.199903,0.0
2587,-0.087152,0.0
2588,-0.103139,0.0
2589,-0.110794,0.0
2590,-0.17854,0.0
2591,0.435568,0.0
2592,1.0239,0.0
2593,1.159502,0.0
2594,1.287745,0.0
2595,0.482034,0.0
2596,-0.032107,0.0
2597,-0.566482,0.0
2598,-0.458798,0.0
2599,-0.360722,0.0
2600,-0.37078,0.0
2601,-0.403495,0.0
2602,-0.47555,0.0
2603,-0.4476,0.0
2604,-0.486398,0.0
2605,0.263796,0.0
2606,-0.430908,0.0
2607,-0.554746,0.0
2608,-0.590673,0.0
2609,-0.17504,0.0
2610,0.31261,0.0
2611,-0.216349,0.0
2612,0.485941,0.0
2613,-0.433187,0.0
2614,-0.364469,0.0
2615,-0.389684,0.0
2616,0.093652,0.0
2617,-0.292634,0.0
2618,-0.020586,0.0
2619,0.309645,0.0
2620,0.392184,0.0
2621,0.464333,0.0
2622,0.506562,0.0
2623,0.51348,0.0
2624,0.372182,0.0
2625,-0.362828,0.0
2626,-0.133191,0.0
2627,-0.284038,0.0
2628,1.135464,0.0
2629,-0.345554,0.0
2630,-0.708885,0.0
2631,-0.518286,0.0
2632,-0.62056,0.0
2633,-0.384465,0.0
2634,-0.285217,0.0
2635,-0.145378,0.0
2636,0.092189,0.0
2637,0.221272,0.0
2638,0.029979,0.0
2639,0.362752,0.0
2640,0.614517,0.0
2641,0.581011,0.0
2642,0.292003,0.0
2643,-0.099014,0.0
2644,-0.022891,0.0
2645,0.026217,0.0
2646,0.661967,0.0
2647,1.08822,0.0
2648,1.31876,0.0
2649,0.830708,0.0
2650,0.380769,0.0
2651,-0.121311,0.0
2652,-0.412855,0.0
2653,-0.369513,0.0
2654,-0.290125,0.0
2655,-0.342375,0.0
2656,-0.418876,0.0
2657,-0.503645,0.0
2658,-0.501616,0.0
2659,-0.510712,0.0
2660,-0.427384,0.0
2661,0.115991,0.0
2662,0.057202,0.0
2663,-0.295685,0.0
2664,-0.189666,0.0
2665,-0.473398,0.0
2666,0.516753,0.0
2667,-0.089526,0.0
2668,-0.055524,0.0
2669,-0.248153,0.0
2670,-0.276878,0.0
2671,-0.738986,0.0
2672,-0.430613,0.0
2673,-0.397827,0.0
2674,0.137838,0.0
2675,0.147356,0.0
2676,0.420395,0.0
2677,0.474966,0.0
2678,0.458501,0.0
2679,0.526968,0.0
2680,0.419695,0.0
2681,-0.131808,0.0
2682,-0.06081,0.0
2683,-0.318235,0.0
2684,0.321246,0.0
2685,0.87929,0.0
2686,-0.077558,0.0
2687,0.045549,0.0
2688,-0.579176,0.0
2689,-0.553147,0.0
2690,-0.487338,0.0
2691,-0.338951,0.0
2692,-0.18666,0.0
2693,0.00558,0.0
2694,0.151034,0.0
2695,0.254441,0.0
2696,0.24005,0.0
2697,0.276001,0.0
2698,0.281794,0.0
2699,0.550083,0.0
2700,-0.174454,0.0
2701,-0.0418,0.0
2702,0.315397,0.0
2703,0.480816,0.0
2704,-0.708501,0.0
2705,-0.875799,0.0
2706,-1.136379,0.0
2707,-1.105229,0.0
2708,-0.692095,0.0
2709,-0.553509,0.0
2710,-0.296968,0.0
2711,-0.084855,0.0
2712,0.402,0.0
2713,0.686794,0.0
2714,0.829156,0.0
2715,0.885608,0.0
2716,0.850032,0.0
