Time,X,Label
0,-0.071385,0.0
1,0.117643,0.0
2,0.155448,0.0
3,-0.011526,0.0
4,-0.165899,0.0
5,-0.269864,0.0
6,-0.285616,0.0
7,-0.146996,0.0
8,-2.490937,0.0
9,-2.084528,0.0
10,-1.397728,0.0
11,-0.282466,0.0
12,0.58076,0.0
13,0.791841,0.0
14,1.002922,0.0
15,1.232905,0.0
16,1.362074,0.0
17,1.132091,0.0
18,0.628017,0.0
19,0.205856,0.0
20,-0.152425,0.0
21,-0.205466,0.0
22,0.05818,0.0
23,-0.05795,0.0
24,-0.2651,0.0
25,-0.396923,0.0
26,-0.406339,0.0
27,-0.252545,0.0
28,-1.787339,0.0
29,-2.142005,0.0
30,-1.620991,0.0
31,-0.660568,0.0
32,0.35635,0.0
33,0.802037,0.0
34,1.018603,0.0
35,1.275971,0.0
36,1.454873,0.0
37,1.307357,0.0
38,0.899334,0.0
39,0.463064,0.0
40,0.309271,0.0
41,0.012301,0.0
42,0.047193,0.0
43,0.247031,0.0
44,0.18359,0.0
45,-0.035279,0.0
46,-0.168504,0.0
47,-0.231944,0.0
48,-0.171676,0.0
49,-0.669683,0.0
50,-2.658541,0.0
51,-1.932148,0.0
52,-1.177207,0.0
53,-0.044795,0.0
54,0.570577,0.0
55,0.713318,0.0
56,0.909984,0.0
57,1.154229,0.0
58,1.31283,0.0
59,1.138369,0.0
60,0.65305,0.0
61,-0.022284,0.0
62,-0.350229,0.0
63,-0.210281,0.0
64,0.0512,0.0
65,-0.14399,0.0
66,-0.3134,0.0
67,-0.4423,0.0
68,-0.449665,0.0
69,-0.221329,0.0
70,-2.16955,0.0
71,-1.933848,0.0
72,-1.252523,0.0
73,-0.298669,0.0
74,0.515238,0.0
75,0.79145,0.0
76,1.056615,0.0
77,1.369656,0.0
78,1.561163,0.0
79,1.321779,0.0
80,0.84301,0.0
81,0.445264,0.0
82,0.139658,0.0
83,0.347431,0.0
84,0.225212,0.0
85,0.102992,0.0
86,-0.074226,0.0
87,-0.150613,0.0
88,-0.156724,0.0
89,-1.265867,0.0
90,-2.689725,0.0
91,-1.84641,0.0
92,-0.926707,0.0
93,0.096881,0.0
94,0.588815,0.0
95,0.717146,0.0
96,0.891308,0.0
97,1.092971,0.0
98,1.209079,0.0
99,0.998251,0.0
100,0.570482,0.0
101,0.148825,0.0
102,0.214324,0.0
103,-0.024321,0.0
104,0.048057,0.0
105,0.207893,0.0
106,0.06012,0.0
107,-0.087653,0.0
108,-0.238441,0.0
109,-0.286694,0.0
110,-0.193205,0.0
111,-1.577445,0.0
112,-2.304246,0.0
113,-1.779502,0.0
114,-0.938101,0.0
115,0.150593,0.0
116,0.705496,0.0
117,0.874379,0.0
118,1.097546,0.0
119,1.329761,0.0
120,1.356903,0.0
121,0.946758,0.0
122,0.418997,0.0
123,-0.053598,0.0
124,0.128565,0.0
125,0.186394,0.0
126,-0.007334,0.0
127,-0.151908,0.0
128,-0.25311,0.0
129,-0.284916,0.0
130,-0.261784,0.0
131,-2.314733,0.0
132,-2.164376,0.0
133,-1.513794,0.0
134,-0.44973,0.0
135,0.504457,0.0
136,0.790713,0.0
137,0.955527,0.0
138,1.19552,0.0
139,1.334311,0.0
140,1.207086,0.0
141,0.750232,0.0
142,0.342534,0.0
143,0.11921,0.0
144,0.137737,0.0
145,0.252986,0.0
146,0.365034,0.0
147,0.137737,0.0
148,-0.025533,0.0
149,-0.192004,0.0
150,-0.240024,0.0
151,-0.063949,0.0
152,-2.234476,0.0
153,-2.256885,0.0
154,-1.651827,0.0
155,-0.624188,0.0
156,0.371437,0.0
157,0.765205,0.0
158,0.944481,0.0
159,1.178181,0.0
160,1.299833,0.0
161,1.114154,0.0
162,0.585928,0.0
163,0.076911,0.0
164,0.205524,0.0
165,0.318243,0.0
166,0.388311,0.0
167,0.120223,0.0
168,0.068434,0.0
169,-0.105214,0.0
170,-0.150911,0.0
171,-0.038192,0.0
172,-1.546186,0.0
173,-2.508865,0.0
174,-1.905667,0.0
175,-0.994778,0.0
176,0.077573,0.0
177,0.653353,0.0
178,0.738653,0.0
179,0.92144,0.0
180,1.104228,0.0
181,1.2139,0.0
182,0.985416,0.0
183,0.434008,0.0
184,0.010457,0.0
185,0.159058,0.0
186,0.173988,0.0
187,-0.005171,0.0
188,-0.136554,0.0
189,-0.253007,0.0
190,-0.255993,0.0
191,-0.208218,0.0
192,-2.328265,0.0
193,-2.122232,0.0
194,-1.614615,0.0
195,-0.497858,0.0
196,0.475572,0.0
197,0.726395,0.0
198,0.87868,0.0
199,1.087698,0.0
200,1.290745,0.0
201,1.296717,0.0
202,0.884652,0.0
203,0.394951,0.0
204,0.063507,0.0
205,0.179675,0.0
206,0.390773,0.0
207,0.313163,0.0
208,0.108275,0.0
209,-0.059362,0.0
210,-0.152493,0.0
211,-0.155597,0.0
212,-0.509496,0.0
213,-2.760169,0.0
214,-2.033745,0.0
215,-1.21419,0.0
216,-0.133867,0.0
217,0.598766,0.0
218,0.747776,0.0
219,0.921621,0.0
220,1.132719,0.0
221,1.222746,0.0
222,0.940247,0.0
223,0.462174,0.0
224,0.064813,0.0
225,-0.004324,0.0
226,0.074713,0.0
227,0.17012,0.0
228,0.282565,0.0
229,0.033825,0.0
230,-0.15699,0.0
231,-0.381878,0.0
232,-0.429581,0.0
233,-0.422766,0.0
234,-2.293427,0.0
235,-2.037872,0.0
236,-1.499504,0.0
237,-0.453433,0.0
238,0.459749,0.0
239,0.715304,0.0
240,0.998118,0.0
241,1.274117,0.0
242,1.430857,0.0
243,1.202561,0.0
244,0.691452,0.0
245,0.282565,0.0
246,0.626988,1.0
247,0.710471,0.0
248,0.465987,0.0
249,0.275171,0.0
250,0.23343,0.0
251,0.078392,0.0
252,0.167837,0.0
253,-0.082609,0.0
254,-2.777889,0.0
255,-2.432035,0.0
256,-1.430249,0.0
257,-0.38076,0.0
258,0.41232,0.0
259,0.382505,0.0
260,0.543506,0.0
261,0.626988,0.0
262,0.793953,0.0
263,0.829731,0.0
264,0.597173,0.0
265,0.281134,0.0
266,-0.160304,0.0
267,-0.408175,0.0
268,-0.180361,0.0
269,-0.271487,0.0
270,-0.307937,0.0
271,-0.339831,0.0
272,-0.335274,0.0
273,-0.289712,0.0
274,-1.565466,0.0
275,-2.367369,0.0
276,-1.360434,0.0
277,-0.385393,0.0
278,0.398284,0.0
279,0.812904,0.0
280,1.008824,0.0
281,1.250306,0.0
282,1.441669,0.0
283,1.291312,0.0
284,0.876692,0.0
285,0.544085,0.0
286,0.425622,0.0
287,0.278267,0.0
288,0.445228,0.0
289,0.263089,0.0
290,0.136604,0.0
291,0.045535,0.0
292,-0.040475,0.0
293,-0.045535,0.0
294,-1.613951,0.0
295,-2.762437,0.0
296,-1.573476,0.0
297,-0.531238,0.0
298,0.25803,0.0
299,0.728555,0.0
300,0.844921,0.0
301,1.037179,0.0
302,1.239555,0.0
303,1.052357,0.0
304,0.526178,0.0
305,0.065772,0.0
306,-0.207436,0.0
307,-0.423054,0.0
308,-0.422548,0.0
309,-0.244244,0.0
310,-0.330986,0.0
311,-0.297253,0.0
312,-0.302072,0.0
313,-0.253882,0.0
314,-0.21051,0.0
315,-1.17432,0.0
316,-2.422454,0.0
317,-1.583939,0.0
318,-0.682777,0.0
319,0.237661,0.0
320,0.844862,0.0
321,0.907509,0.0
322,1.032805,0.0
323,1.191833,0.0
324,1.336405,0.0
325,1.244843,0.0
326,0.859319,0.0
327,0.546081,0.0
328,0.110058,0.0
329,0.286547,0.0
330,0.167298,0.0
331,0.033739,0.0
332,-0.033041,0.0
333,-0.12367,0.0
334,-0.16183,0.0
335,-1.139674,0.0
336,-2.980884,0.0
337,-1.616672,0.0
338,-0.600668,0.0
339,0.229308,0.0
340,0.773085,0.0
341,0.887564,0.0
342,1.068823,0.0
343,1.226232,0.0
344,1.106983,0.0
345,0.668145,0.0
346,0.195918,0.0
347,-0.056891,0.0
348,-0.033522,0.0
349,0.095993,0.0
350,0.197654,0.0
351,0.018537,0.0
352,-0.039554,0.0
353,-0.126692,0.0
354,-0.150897,0.0
355,-0.204148,0.0
356,-2.619795,0.0
357,-2.251881,0.0
358,-1.167502,0.0
359,-0.112169,0.0
360,0.6285,0.0
361,0.880231,0.0
362,1.02062,0.0
363,1.223941,0.0
364,1.27235,0.0
365,0.904436,0.0
366,0.420338,0.0
367,0.066947,0.0
368,-0.063759,0.0
369,0.39871,0.0
370,0.559267,0.0
371,0.452229,0.0
372,0.279779,0.0
373,0.196527,0.0
374,0.059756,0.0
375,-0.029443,0.0
376,-0.237573,0.0
377,-2.75297,0.0
378,-2.306978,0.0
379,-1.337687,0.0
380,-0.320825,0.0
381,0.529535,0.0
382,0.684145,0.0
383,0.767397,0.0
384,0.933901,0.0
385,1.046886,0.0
386,0.886329,0.0
387,0.39871,0.0
388,-0.059176,0.0
389,-0.2134,0.0
390,-0.005457,0.0
391,-0.089984,0.0
392,-0.214288,0.0
393,-0.21926,0.0
394,-0.268982,0.0
395,-0.26401,0.0
396,-0.47284,0.0
397,-2.595954,0.0
398,-2.014211,0.0
399,-1.084416,0.0
400,-0.119817,0.0
401,0.690645,0.0
402,0.834838,0.0
403,0.969086,0.0
404,1.192834,0.0
405,1.396692,0.0
406,1.197806,0.0
407,0.730423,0.0
408,0.282928,0.0
409,0.118847,0.0
410,0.179867,0.0
411,0.276901,0.0
412,0.133904,0.0
413,0.03687,0.0
414,-0.044842,0.0
415,-0.080592,0.0
416,-0.106127,0.0
417,-1.219461,0.0
418,-2.904784,0.0
419,-1.70463,0.0
420,-0.683222,0.0
421,0.139011,0.0
422,0.695678,0.0
423,0.782498,0.0
424,0.956137,0.0
425,1.150205,0.0
426,1.196168,0.0
427,0.848889,0.0
428,0.358614,0.0
429,0.041977,0.0
430,0.439066,0.0
431,0.121622,0.0
432,0.191812,0.0
433,0.279549,0.0
434,0.098225,0.0
435,0.016337,0.0
436,-0.030456,0.0
437,-0.094796,0.0
438,-0.06555,0.0
439,-1.656515,0.0
440,-2.645019,0.0
441,-1.703308,0.0
442,-0.714804,0.0
443,0.180113,0.0
444,0.612949,0.0
445,0.67729,0.0
446,0.87616,0.0
447,1.115975,0.0
448,1.121824,0.0
449,0.782574,0.0
450,0.343889,0.0
451,0.231214,0.0
452,0.231214,0.0
453,0.381763,0.0
454,0.284635,0.0
455,0.138942,0.0
456,0.051526,0.0
457,-0.084455,0.0
458,-0.181583,0.0
459,-1.283995,0.0
460,-2.978892,0.0
461,-1.725931,0.0
462,-0.662371,0.0
463,0.192362,0.0
464,0.619729,0.0
465,0.712001,0.0
466,0.915972,0.0
467,1.105373,0.0
468,1.090803,0.0
469,0.716858,0.0
470,0.255496,0.0
