Time,X,Label
0,1.851103,0.0
1,1.750701,0.0
2,1.542724,0.0
3,1.312404,0.0
4,1.078614,0.0
5,0.845145,0.0
6,0.620207,0.0
7,0.395818,0.0
8,0.181224,0.0
9,-0.027194,0.0
10,-0.228125,0.0
11,-0.4195,0.0
12,-0.611875,0.0
13,-0.780157,0.0
14,-0.930801,0.0
15,-1.080579,0.0
16,-1.203035,0.0
17,-1.292486,0.0
18,-1.342972,0.0
19,-1.380918,0.0
20,-1.385023,0.0
21,-1.3306,0.0
22,-1.275554,0.0
23,-1.177032,0.0
24,-1.096578,0.0
25,-0.946306,0.0
26,-0.826186,0.0
27,-0.698031,0.0
28,-0.553562,0.0
29,-0.395295,0.0
30,-0.225482,0.0
31,-0.046002,0.0
32,0.107308,0.0
33,0.272527,0.0
34,0.434005,0.0
35,0.569863,0.0
36,0.690703,0.0
37,0.793986,0.0
38,0.884971,0.0
39,1.046896,0.0
40,1.265528,0.0
41,1.490448,0.0
42,1.660175,0.0
43,1.766129,0.0
44,1.658602,0.0
45,1.447964,0.0
46,1.217395,0.0
47,1.012657,0.0
48,0.901003,0.0
49,0.785876,0.0
50,0.637669,0.0
51,0.513655,0.0
52,0.365891,0.0
53,0.215731,0.0
54,0.065653,0.0
55,-0.078401,0.0
56,-0.227634,0.0
57,-0.365402,0.0
58,-0.517917,0.0
59,-0.656181,0.0
60,-0.778786,0.0
61,-0.949331,0.0
62,-1.035007,0.0
63,-1.147168,0.0
64,-1.209599,0.0
65,-1.280833,0.0
66,-1.315196,0.0
67,-1.306646,0.0
68,-1.288482,0.0
69,-1.2356,0.0
70,-1.151486,0.0
71,-1.039801,0.0
72,-0.906886,0.0
73,-0.766029,0.0
74,-0.589954,0.0
75,-0.396553,0.0
76,-0.20213,0.0
77,-0.002316,0.0
78,0.198585,0.0
79,0.417144,0.0
80,0.636063,0.0
81,0.867413,0.0
82,1.103431,0.0
83,1.335531,0.0
84,1.567639,0.0
85,1.739791,0.0
86,1.865319,0.0
87,1.76598,0.0
88,1.545162,0.0
89,1.316332,0.0
90,1.093911,0.0
91,0.869895,0.0
92,0.653387,0.0
93,0.436943,0.0
94,0.228054,0.0
95,0.01889,0.0
96,-0.178548,0.0
97,-0.368836,0.0
98,-0.548776,0.0
99,-0.726878,0.0
100,-0.891636,0.0
101,-1.029954,0.0
102,-1.158848,0.0
103,-1.249038,0.0
104,-1.325758,0.0
105,-1.367988,0.0
106,-1.377682,0.0
107,-1.349362,0.0
108,-1.280139,0.0
109,-1.188036,0.0
110,-1.108369,0.0
111,-0.964578,0.0
112,-0.852981,0.0
113,-0.674714,0.0
114,-0.535143,0.0
115,-0.382343,0.0
116,-0.218397,0.0
117,-0.045215,0.0
118,0.113776,0.0
119,0.271177,0.0
120,0.427597,0.0
121,0.573101,0.0
122,0.698762,0.0
123,0.778629,0.0
124,0.858664,0.0
125,0.987245,0.0
126,1.198462,0.0
127,1.415742,0.0
128,1.627513,0.0
129,1.747315,0.0
130,1.678736,0.0
131,1.464492,0.0
132,1.244075,0.0
133,1.028385,0.0
134,0.894138,0.0
135,0.77823,0.0
136,0.649895,0.0
137,0.496409,0.0
138,0.345761,0.0
139,0.198563,0.0
140,0.046594,0.0
141,-0.104791,0.0
142,-0.264153,0.0
143,-0.431051,0.0
144,-0.586971,0.0
145,-0.729765,0.0
146,-0.856535,0.0
147,-0.964578,0.0
148,-1.090417,0.0
149,-1.177039,0.0
150,-1.270422,0.0
151,-1.330174,0.0
152,-1.339854,0.0
153,-1.332094,0.0
154,-1.307213,0.0
155,-1.233913,0.0
156,-1.135584,0.0
157,-1.013532,0.0
158,-0.880923,0.0
159,-0.726878,0.0
160,-0.556933,0.0
161,-0.368836,0.0
162,-0.178548,0.0
163,0.02486,0.0
164,0.223401,0.0
165,0.432554,0.0
166,0.646554,0.0
167,0.866862,0.0
168,1.089189,0.0
169,1.316225,0.0
170,1.53991,0.0
171,1.758783,0.0
172,1.824702,0.0
173,1.679428,0.0
174,1.492702,0.0
175,1.302944,0.0
176,1.112728,0.0
177,0.92436,0.0
178,0.734773,0.0
179,0.54754,0.0
180,0.361909,0.0
181,0.17366,0.0
182,-0.008441,0.0
183,-0.187428,0.0
184,-0.365998,0.0
185,-0.535227,0.0
186,-0.704375,0.0
187,-0.860122,0.0
188,-1.003635,0.0
189,-1.131329,0.0
190,-1.242037,0.0
191,-1.32302,0.0
192,-1.387627,0.0
193,-1.409301,0.0
194,-1.392569,0.0
195,-1.336479,0.0
196,-1.239264,0.0
197,-1.132675,0.0
198,-0.990931,0.0
199,-0.851341,0.0
200,-0.70555,0.0
201,-0.550442,0.0
202,-0.388259,0.0
203,-0.220652,0.0
204,-0.059143,0.0
205,0.111081,0.0
206,0.285891,0.0
207,0.457981,0.0
208,0.632668,0.0
209,0.802228,0.0
210,0.953888,0.0
211,1.079477,0.0
212,1.208316,0.0
213,1.395025,0.0
214,1.585849,0.0
215,1.737386,0.0
216,1.672704,0.0
217,1.493276,0.0
218,1.303825,0.0
219,1.12317,0.0
220,0.963326,0.0
221,0.813637,0.0
222,0.650803,0.0
223,0.483112,0.0
224,0.31049,0.0
225,0.143148,0.0
226,-0.028987,0.0
227,-0.201238,0.0
228,-0.351395,0.0
229,-0.510763,0.0
230,-0.664755,0.0
231,-0.809444,0.0
232,-0.941899,0.0
233,-1.085936,0.0
234,-1.187334,0.0
235,-1.265828,0.0
236,-1.334442,0.0
237,-1.375894,0.0
238,-1.376843,0.0
239,-1.336996,0.0
240,-1.265873,0.0
241,-1.164402,0.0
242,-1.035928,0.0
243,-0.89144,0.0
244,-0.731981,0.0
245,-0.567327,0.0
246,-0.39485,0.0
247,-0.215798,0.0
248,-0.03718,0.0
249,0.1454,0.0
250,0.328772,0.0
251,0.515322,0.0
252,0.704865,0.0
253,0.892652,0.0
254,1.082513,0.0
255,1.273984,0.0
256,1.462697,0.0
257,1.650743,0.0
258,1.758724,0.0
259,1.714191,0.0
260,1.56489,0.0
261,1.357631,0.0
262,1.14855,0.0
263,0.940318,0.0
264,0.737029,0.0
265,0.534115,0.0
266,0.333612,0.0
267,0.139134,0.0
268,-0.054306,0.0
269,-0.243206,0.0
270,-0.426419,0.0
271,-0.608333,0.0
272,-0.776109,0.0
273,-0.924257,0.0
274,-1.055107,0.0
275,-1.174268,0.0
276,-1.268484,0.0
277,-1.313081,0.0
278,-1.337817,0.0
279,-1.330497,0.0
280,-1.290483,0.0
281,-1.225234,0.0
282,-1.122327,0.0
283,-1.032811,0.0
284,-0.900917,0.0
285,-0.769797,0.0
286,-0.638012,0.0
287,-0.493241,0.0
288,-0.337894,0.0
289,-0.173943,0.0
290,-0.002958,0.0
291,0.14513,0.0
292,0.309339,0.0
293,0.473378,0.0
294,0.64176,0.0
295,0.7875,0.0
296,0.930761,0.0
297,1.056833,0.0
298,1.202104,0.0
299,1.396879,0.0
300,1.597067,0.0
301,1.771278,0.0
302,1.723286,0.0
303,1.540517,0.0
304,1.3362,0.0
305,1.153716,0.0
306,1.045457,0.0
307,0.915698,0.0
308,0.773701,0.0
309,0.625448,0.0
310,0.463816,0.0
311,0.302241,0.0
312,0.144262,0.0
313,-0.03448,0.0
314,-0.207653,0.0
315,-0.374012,0.0
316,-0.531981,0.0
317,-0.684607,0.0
318,-0.858215,0.0
319,-0.980191,0.0
320,-1.122533,0.0
321,-1.214207,0.0
322,-1.321206,0.0
323,-1.383727,0.0
324,-1.389505,0.0
325,-1.390413,0.0
326,-1.358431,0.0
327,-1.291702,0.0
328,-1.194901,0.0
329,-1.064094,0.0
330,-0.916523,0.0
331,-0.762575,0.0
332,-0.593612,0.0
333,-0.416863,0.0
334,-0.230159,0.0
335,-0.039008,0.0
336,0.155726,0.0
337,0.35031,0.0
338,0.551254,0.0
339,0.754081,0.0
340,0.959489,0.0
341,1.16404,0.0
342,1.37486,0.0
343,1.57742,0.0
344,1.732166,0.0
345,1.73793,0.0
346,1.574579,0.0
347,1.380916,0.0
348,1.186692,0.0
349,0.99342,0.0
350,0.800067,0.0
351,0.609174,0.0
352,0.418756,0.0
353,0.231504,0.0
354,0.044439,0.0
355,-0.14291,0.0
356,-0.321645,0.0
357,-0.499165,0.0
358,-0.665059,0.0
359,-0.829761,0.0
360,-0.985308,0.0
361,-1.122678,0.0
362,-1.232902,0.0
363,-1.317098,0.0
364,-1.366265,0.0
365,-1.376853,0.0
366,-1.356247,0.0
367,-1.298436,0.0
368,-1.21665,0.0
369,-1.116749,0.0
370,-1.006084,0.0
371,-0.858096,0.0
372,-0.722889,0.0
373,-0.57603,0.0
374,-0.420115,0.0
375,-0.259659,0.0
376,-0.109639,0.0
377,0.064857,0.0
378,0.232769,0.0
379,0.39885,0.0
380,0.565418,0.0
381,0.730247,0.0
382,0.882849,0.0
383,1.023338,0.0
384,1.162969,0.0
385,1.350572,0.0
386,1.541706,0.0
387,1.710094,0.0
388,1.720884,0.0
389,1.562208,0.0
390,1.371986,0.0
391,1.182142,0.0
392,1.031045,0.0
393,0.904337,0.0
394,0.753496,0.0
395,0.595553,0.0
396,0.427762,0.0
397,0.256609,0.0
398,0.088389,0.0
399,-0.075357,0.0
400,-0.244298,0.0
401,-0.40777,0.0
402,-0.564294,0.0
403,-0.711918,0.0
404,-0.859982,0.0
405,-1.003983,0.0
406,-1.127514,0.0
407,-1.230679,0.0
408,-1.32693,0.0
409,-1.388479,0.0
410,-1.411462,0.0
411,-1.385405,0.0
412,-1.337293,0.0
413,-1.248245,0.0
414,-1.131935,0.0
415,-1.000828,0.0
416,-0.854768,0.0
417,-0.692146,0.0
418,-0.521789,0.0
419,-0.343046,0.0
420,-0.15771,0.0
421,0.025922,0.0
422,0.213512,0.0
423,0.405224,0.0
424,0.595952,0.0
425,0.788983,0.0
426,0.98152,0.0
427,1.17625,0.0
428,1.371328,0.0
429,1.562615,0.0
430,1.730315,0.0
431,1.792373,0.0
432,1.681406,0.0
433,1.461793,0.0
434,1.241028,0.0
435,1.02277,0.0
436,0.806226,0.0
437,0.594023,0.0
438,0.382369,0.0
439,0.173688,0.0
440,-0.031685,0.0
441,-0.232273,0.0
442,-0.427757,0.0
443,-0.615722,0.0
444,-0.786767,0.0
445,-0.944544,0.0
446,-1.094199,0.0
447,-1.224887,0.0
448,-1.331466,0.0
449,-1.407705,0.0
450,-1.4346,0.0
451,-1.437497,0.0
452,-1.403062,0.0
453,-1.334702,0.0
454,-1.238285,0.0
455,-1.119091,0.0
456,-1.00361,0.0
457,-0.841673,0.0
458,-0.709675,0.0
459,-0.558226,0.0
460,-0.361426,0.0
461,-0.195739,0.0
462,-0.034742,0.0
463,0.123505,0.0
464,0.307493,0.0
465,0.455575,0.0
466,0.600232,0.0
467,0.727871,0.0
468,0.838417,0.0
469,0.933012,0.0
470,1.104785,0.0
471,1.318757,0.0
472,1.532893,0.0
473,1.717025,0.0
474,1.728633,0.0
475,1.610567,0.0
476,1.398506,0.0
477,1.179299,0.0
478,0.981733,0.0
479,0.888911,0.0
480,0.795119,0.0
481,0.669747,0.0
482,0.523051,0.0
483,0.371604,0.0
484,0.222138,0.0
485,0.064118,0.0
486,-0.083629,0.0
487,-0.242287,0.0
488,-0.405413,0.0
489,-0.557966,0.0
490,-0.697862,0.0
491,-0.822182,0.0
492,-0.976733,0.0
493,-1.071213,0.0
494,-1.156212,0.0
495,-1.229407,0.0
496,-1.293999,0.0
497,-1.304159,0.0
498,-1.297019,0.0
499,-1.254313,0.0
500,-1.181581,0.0
501,-1.080357,0.0
502,-0.956845,0.0
503,-0.814433,0.0
504,-0.658651,0.0
505,-0.487988,0.0
506,-0.307615,0.0
507,-0.125037,0.0
508,0.070189,0.0
509,0.27041,0.0
510,0.469447,0.0
511,0.67708,0.0
512,0.885924,0.0
513,1.099863,0.0
514,1.315762,0.0
515,1.533807,0.0
516,1.739548,0.0
517,1.550961,1.0
518,1.457959,0.0
519,1.271666,0.0
520,1.058091,0.0
521,0.831275,0.0
522,0.605503,0.0
523,0.380984,0.0
524,0.181886,0.0
525,-0.025767,0.0
526,-0.21883,0.0
527,-0.406863,0.0
528,-0.568372,0.0
529,-0.720051,0.0
530,-0.865455,0.0
531,-0.977039,0.0
532,-1.1012,0.0
533,-1.177048,0.0
534,-1.233792,0.0
535,-1.303087,0.0
536,-1.341383,0.0
537,-1.346979,0.0
538,-1.319111,0.0
539,-1.259477,0.0
540,-1.171313,0.0
541,-1.058438,0.0
542,-0.991715,0.0
543,-0.855921,0.0
544,-0.74586,0.0
545,-0.581372,0.0
546,-0.425903,0.0
547,-0.26489,0.0
548,-0.055017,0.0
549,0.126718,0.0
550,0.341369,0.0
551,0.563324,0.0
552,0.786371,0.0
553,0.986658,0.0
554,1.192888,0.0
555,1.37827,0.0
556,1.534551,0.0
557,1.619333,0.0
558,1.617685,0.0
559,1.583624,0.0
560,1.485094,0.0
561,1.381195,0.0
562,1.187148,0.0
563,0.987426,0.0
564,0.789526,0.0
565,0.566701,0.0
566,0.344717,0.0
567,0.129689,0.0
568,-0.051786,0.0
569,-0.262153,0.0
570,-0.423283,0.0
571,-0.604743,0.0
572,-0.743432,0.0
573,-0.884658,0.0
574,-0.990919,0.0
575,-1.056553,0.0
576,-1.131838,0.0
577,-1.161137,0.0
578,-1.217978,0.0
579,-1.162022,0.0
580,-1.138034,0.0
581,-1.104286,0.0
582,-1.073444,0.0
583,-1.04746,0.0
584,-0.982508,0.0
585,-0.879748,0.0
586,-0.785689,0.0
587,-0.658071,0.0
588,-0.513514,0.0
589,-0.359675,0.0
590,-0.157986,0.0
591,0.012782,0.0
592,0.227131,0.0
593,0.443785,0.0
594,0.634636,0.0
595,0.856564,0.0
596,1.081258,0.0
597,1.271098,0.0
598,1.455047,0.0
599,1.543126,0.0
600,1.523246,0.0
601,1.51547,0.0
602,1.519971,0.0
603,1.515668,0.0
604,1.46645,0.0
605,1.387972,0.0
606,1.256977,0.0
607,1.04533,0.0
608,0.834683,0.0
609,0.608209,0.0
610,0.377284,0.0
611,0.150614,0.0
612,-0.03682,0.0
613,-0.254484,0.0
614,-0.422336,0.0
615,-0.608955,0.0
616,-0.752518,0.0
617,-0.868341,0.0
618,-1.003058,0.0
619,-1.084854,0.0
620,-1.147331,0.0
621,-1.20071,0.0
622,-1.262727,0.0
623,-1.294548,0.0
624,-1.294238,0.0
625,-1.261872,0.0
626,-1.199291,0.0
627,-1.14739,0.0
628,-1.082485,0.0
629,-1.002044,0.0
630,-0.865975,0.0
631,-0.749872,0.0
632,-0.606625,0.0
633,-0.441428,0.0
634,-0.2505,0.0
635,-0.067637,0.0
636,0.152641,0.0
637,0.355367,0.0
638,0.57976,0.0
639,0.814358,0.0
640,1.027626,0.0
641,1.226858,0.0
642,1.428002,0.0
643,1.54964,0.0
644,1.594744,0.0
645,1.594378,0.0
646,1.596708,0.0
647,1.505472,0.0
648,1.422805,0.0
649,1.250203,0.0
650,1.046564,0.0
651,0.850235,0.0
652,0.623855,0.0
653,0.395709,0.0
654,0.208534,0.0
655,-0.007596,0.0
656,-0.179468,0.0
657,-0.369981,0.0
658,-0.515046,0.0
659,-0.669259,0.0
660,-0.80139,0.0
661,-0.891986,0.0
662,-1.007227,0.0
663,-1.095367,0.0
664,-1.108472,0.0
665,-1.165141,0.0
666,-1.192717,0.0
667,-1.189717,0.0
668,-1.219323,0.0
669,-1.192604,0.0
670,-1.147665,0.0
671,-1.071277,0.0
672,-0.997181,0.0
673,-0.854935,0.0
674,-0.734579,0.0
675,-0.593664,0.0
676,-0.39502,0.0
677,-0.221436,0.0
678,-0.01174,0.0
679,0.185562,0.0
680,0.401132,0.0
681,0.632245,0.0
682,0.855201,0.0
683,1.058097,0.0
684,1.263817,0.0
685,1.422394,0.0
686,1.504008,0.0
687,1.494504,0.0
688,1.489826,0.0
689,1.540913,0.0
690,1.538071,0.0
691,1.408577,0.0
692,1.225209,0.0
693,1.037323,0.0
694,0.84971,0.0
695,0.662419,0.0
696,0.475515,0.0
697,0.297446,0.0
698,0.120362,0.0
699,-0.050015,0.0
700,-0.220487,0.0
701,-0.380493,0.0
702,-0.538696,0.0
703,-0.69927,0.0
704,-0.86058,0.0
705,-1.013503,0.0
706,-1.154295,0.0
707,-1.2409,0.0
708,-1.330374,0.0
709,-1.391002,0.0
710,-1.410568,0.0
711,-1.386732,0.0
712,-1.322875,0.0
713,-1.22634,0.0
714,-1.105426,0.0
715,-0.967348,0.0
716,-0.824759,0.0
717,-0.68386,0.0
718,-0.516075,0.0
719,-0.345403,0.0
720,-0.187122,0.0
721,-0.015081,0.0
722,0.158242,0.0
723,0.330605,0.0
724,0.510947,0.0
725,0.696487,0.0
726,0.88555,0.0
727,1.07215,0.0
728,1.259125,0.0
729,1.441519,0.0
730,1.587838,0.0
731,1.638879,0.0
732,1.633064,0.0
733,1.591658,0.0
734,1.444238,0.0
735,1.266254,0.0
736,1.08587,0.0
737,0.890553,0.0
738,0.70245,0.0
739,0.514868,0.0
740,0.332641,0.0
741,0.153209,0.0
742,-0.02175,0.0
743,-0.192672,0.0
744,-0.357323,0.0
745,-0.515641,0.0
746,-0.678024,0.0
747,-0.81957,0.0
748,-0.967617,0.0
749,-1.083711,0.0
750,-1.207743,0.0
751,-1.308931,0.0
752,-1.37903,0.0
753,-1.409647,0.0
754,-1.396967,0.0
755,-1.342865,0.0
756,-1.253965,0.0
757,-1.138562,0.0
758,-1.004382,0.0
759,-0.880793,0.0
760,-0.726364,0.0
761,-0.559904,0.0
762,-0.406695,0.0
763,-0.233344,0.0
764,-0.070574,0.0
765,0.101936,0.0
766,0.277214,0.0
767,0.454861,0.0
768,0.641032,0.0
769,0.827687,0.0
770,1.017734,0.0
771,1.208464,0.0
772,1.38021,0.0
773,1.542411,0.0
774,1.583865,0.0
775,1.595243,0.0
776,1.611832,0.0
777,1.461588,0.0
778,1.28385,0.0
779,1.088992,0.0
780,0.894517,0.0
781,0.700498,0.0
782,0.49514,0.0
783,0.300149,0.0
784,0.121617,0.0
785,-0.061554,0.0
786,-0.235985,0.0
787,-0.400839,0.0
788,-0.558211,0.0
789,-0.708781,0.0
790,-0.859018,0.0
791,-0.974065,0.0
792,-1.10878,0.0
793,-1.228009,0.0
794,-1.278314,0.0
795,-1.324859,0.0
796,-1.349186,0.0
797,-1.335347,0.0
798,-1.284833,0.0
799,-1.202322,0.0
800,-1.094071,0.0
801,-0.983554,0.0
802,-0.863838,0.0
803,-0.73486,0.0
804,-0.588721,0.0
805,-0.440366,0.0
806,-0.274975,0.0
807,-0.109139,0.0
808,0.063289,0.0
809,0.246277,0.0
810,0.430155,0.0
811,0.628374,0.0
812,0.828682,0.0
813,1.023721,0.0
814,1.21889,0.0
815,1.402851,0.0
816,1.57649,0.0
817,1.6719,0.0
818,1.686603,0.0
819,1.630759,0.0
820,1.482884,0.0
821,1.307793,0.0
822,1.125398,0.0
823,0.931585,0.0
824,0.736928,0.0
825,0.531179,0.0
826,0.338287,0.0
827,0.160623,0.0
828,-0.026828,0.0
829,-0.195257,0.0
830,-0.368984,0.0
831,-0.529437,0.0
832,-0.673969,0.0
833,-0.808358,0.0
834,-0.953311,0.0
835,-1.092527,0.0
836,-1.182094,0.0
837,-1.255097,0.0
838,-1.31916,0.0
839,-1.348202,0.0
840,-1.339153,0.0
841,-1.293035,0.0
842,-1.214218,0.0
843,-1.152957,0.0
844,-1.02863,0.0
845,-0.895769,0.0
846,-0.761975,0.0
847,-0.615473,0.0
848,-0.458923,0.0
849,-0.294778,0.0
850,-0.126378,0.0
851,0.052571,0.0
852,0.236796,0.0
853,0.420502,0.0
854,0.614486,0.0
855,0.816311,0.0
856,1.010612,0.0
857,1.203515,0.0
858,1.383493,0.0
859,1.559326,0.0
860,1.624533,0.0
861,1.622548,0.0
862,1.399697,0.0
863,1.336304,0.0
864,1.251195,0.0
865,1.140623,0.0
866,0.915449,0.0
867,0.700548,0.0
868,0.497492,0.0
869,0.255315,0.0
870,0.064936,0.0
871,-0.167191,0.0
872,-0.358711,0.0
873,-0.541378,0.0
874,-0.695606,0.0
875,-0.835601,0.0
876,-0.918718,0.0
877,-0.988986,0.0
878,-1.078708,0.0
879,-1.178612,0.0
880,-1.145358,0.0
881,-1.161352,0.0
882,-1.172251,0.0
883,-1.152968,0.0
884,-1.104275,0.0
885,-1.090777,0.0
886,-1.046817,0.0
887,-0.92861,0.0
888,-0.872602,0.0
889,-0.715399,0.0
890,-0.60401,0.0
891,-0.45776,0.0
892,-0.26035,0.0
893,-0.08735,0.0
894,0.137497,0.0
895,0.359779,0.0
896,0.57452,0.0
897,0.807128,0.0
898,1.018752,0.0
899,1.237863,0.0
900,1.425581,0.0
901,1.530028,0.0
902,1.66089,0.0
903,1.639053,0.0
904,1.631503,0.0
905,1.638299,0.0
906,1.514233,0.0
907,1.385601,0.0
908,1.190214,0.0
909,0.977663,0.0
910,0.755963,0.0
911,0.541894,0.0
912,0.29475,0.0
913,0.094581,0.0
914,-0.147651,0.0
915,-0.341193,0.0
916,-0.542843,0.0
917,-0.700429,0.0
918,-0.87767,0.0
919,-0.985708,0.0
920,-1.128675,0.0
921,-1.172205,0.0
922,-1.267325,0.0
923,-1.240713,0.0
924,-1.281912,0.0
925,-1.305009,0.0
926,-1.296402,0.0
927,-1.25642,0.0
928,-1.186516,0.0
929,-1.109486,0.0
930,-1.082916,0.0
931,-0.933219,0.0
932,-0.793298,0.0
933,-0.676792,0.0
934,-0.474267,0.0
935,-0.292186,0.0
936,-0.115847,0.0
937,0.113999,0.0
938,0.296594,0.0
939,0.534138,0.0
940,0.732202,0.0
941,0.91315,0.0
942,1.097801,0.0
943,1.279903,0.0
944,1.371888,0.0
945,1.379852,0.0
946,1.365792,0.0
947,1.366821,0.0
948,1.932502,1.0
949,1.792576,0.0
950,1.574611,0.0
951,1.35513,0.0
952,1.150206,0.0
953,0.960154,0.0
954,0.776515,0.0
955,0.590295,0.0
956,0.388992,0.0
957,0.193936,0.0
958,-0.016459,0.0
959,-0.218007,0.0
960,-0.385066,0.0
961,-0.562651,0.0
962,-0.716368,0.0
963,-0.839513,0.0
964,-0.938168,0.0
965,-1.01491,0.0
966,-1.087544,0.0
967,-1.124006,0.0
968,-1.186301,0.0
969,-1.220405,0.0
970,-1.224683,0.0
971,-1.198694,0.0
972,-1.143941,0.0
973,-1.069351,0.0
974,-1.030225,0.0
975,-0.942702,0.0
976,-0.851821,0.0
977,-0.735361,0.0
978,-0.602087,0.0
979,-0.439644,0.0
980,-0.277014,0.0
981,-0.074238,0.0
982,0.135335,0.0
983,0.337523,0.0
984,0.527463,0.0
985,0.711324,0.0
986,0.882818,0.0
987,1.080929,0.0
988,1.289921,0.0
989,1.510089,0.0
990,1.727599,0.0
991,1.907335,0.0
992,1.772004,0.0
993,1.550042,0.0
994,1.328201,0.0
995,1.113519,0.0
996,0.921156,0.0
997,0.735753,0.0
998,0.557312,0.0
999,0.368293,0.0
1000,0.182203,0.0
1001,-0.028041,0.0
1002,-0.235022,0.0
1003,-0.432645,0.0
1004,-0.590347,0.0
1005,-0.743266,0.0
1006,-0.864928,0.0
1007,-0.966399,0.0
1008,-1.043703,0.0
1009,-1.114346,0.0
1010,-1.131918,0.0
1011,-1.188973,0.0
1012,-1.221427,0.0
1013,-1.223963,0.0
1014,-1.196454,0.0
1015,-1.140133,0.0
1016,-1.093631,0.0
1017,-1.028261,0.0
1018,-0.96034,0.0
1019,-0.865694,0.0
1020,-0.749082,0.0
1021,-0.593538,0.0
1022,-0.428763,0.0
1023,-0.254119,0.0
1024,-0.062706,0.0
1025,0.147041,0.0
1026,0.348258,0.0
1027,0.528747,0.0
1028,0.713264,0.0
1029,0.891307,0.0
1030,1.079443,0.0
1031,1.292614,0.0
1032,1.512637,0.0
1033,1.735244,0.0
1034,1.863502,0.0
1035,1.782985,0.0
1036,1.560514,0.0
1037,1.341777,0.0
1038,1.136173,0.0
1039,0.945574,0.0
1040,0.757949,0.0
1041,0.56791,0.0
1042,0.353921,0.0
1043,0.139168,0.0
1044,-0.049807,0.0
1045,-0.252618,0.0
1046,-0.431341,0.0
1047,-0.603484,0.0
1048,-0.74883,0.0
1049,-0.877143,0.0
1050,-0.963084,0.0
1051,-1.041713,0.0
1052,-1.093569,0.0
1053,-1.149727,0.0
1054,-1.212938,0.0
1055,-1.247137,0.0
1056,-1.250593,0.0
1057,-1.223062,0.0
1058,-1.16602,0.0
1059,-1.101207,0.0
1060,-1.055968,0.0
1061,-0.98212,0.0
1062,-0.883648,0.0
1063,-0.762779,0.0
1064,-0.623048,0.0
1065,-0.465032,0.0
1066,-0.276214,0.0
1067,-0.090537,0.0
1068,0.119729,0.0
1069,0.332268,0.0
1070,0.541553,0.0
1071,0.725019,0.0
1072,0.909365,0.0
1073,1.095069,0.0
1074,1.303154,0.0
1075,1.519461,0.0
1076,1.738293,0.0
1077,1.87767,0.0
1078,1.807053,0.0
1079,1.589931,0.0
1080,1.371202,0.0
1081,1.154877,0.0
1082,0.958487,0.0
1083,0.78098,0.0
1084,0.595026,0.0
1085,0.40604,0.0
1086,0.192822,0.0
1087,-0.017697,0.0
1088,-0.195279,0.0
1089,-0.396176,0.0
1090,-0.557141,0.0
1091,-0.715986,0.0
1092,-0.845095,0.0
1093,-0.931239,0.0
1094,-1.006374,0.0
1095,-1.047716,0.0
1096,-1.089815,0.0
1097,-1.130392,0.0
1098,-1.16668,0.0
1099,-1.173646,0.0
1100,-1.150997,0.0
1101,-1.099783,0.0
1102,-1.082579,0.0
1103,-1.018047,0.0
1104,-0.952513,0.0
1105,-0.860839,0.0
1106,-0.746332,0.0
1107,-0.59864,0.0
1108,-0.448171,0.0
1109,-0.253155,0.0
1110,-0.070144,0.0
1111,0.122904,0.0
1112,0.333237,0.0
1113,0.534821,0.0
1114,0.716534,0.0
1115,0.890674,0.0
1116,1.074118,0.0
1117,1.283571,0.0
1118,1.499891,0.0
1119,1.713863,0.0
1120,1.845468,0.0
1121,1.795887,0.0
1122,1.591585,0.0
1123,1.374681,0.0
1124,1.168111,0.0
1125,0.985042,0.0
1126,0.795301,0.0
1127,0.606216,0.0
1128,0.394344,0.0
1129,0.204768,0.0
1130,0.000543,0.0
1131,-0.205389,0.0
1132,-0.395375,0.0
1133,-0.567364,0.0
1134,-0.715704,0.0
1135,-0.844895,0.0
1136,-0.953308,0.0
1137,-1.037773,0.0
1138,-1.142436,0.0
1139,-1.17394,0.0
1140,-1.242815,0.0
1141,-1.282873,0.0
1142,-1.29167,0.0
1143,-1.268569,0.0
1144,-1.223116,0.0
1145,-1.204558,0.0
1146,-1.097776,0.0
1147,-1.024883,0.0
1148,-0.926591,0.0
1149,-0.80606,0.0
1150,-0.666495,0.0
1151,-0.496903,0.0
1152,-0.317226,0.0
1153,-0.134454,0.0
1154,0.06596,0.0
1155,0.277393,0.0
1156,0.490531,0.0
1157,0.686094,0.0
1158,0.874246,0.0
1159,1.05365,0.0
1160,1.258883,0.0
1161,1.471984,0.0
1162,1.688485,0.0
1163,1.904923,0.0
1164,1.871876,0.0
1165,1.658426,0.0
1166,1.444948,0.0
1167,1.231589,0.0
1168,1.038199,0.0
1169,0.854806,0.0
1170,0.677908,0.0
1171,0.483199,0.0
1172,0.296791,0.0
1173,0.093103,0.0
1174,-0.111388,0.0
1175,-0.310325,0.0
1176,-0.469776,0.0
1177,-0.627989,0.0
1178,-0.77599,0.0
1179,-0.888824,0.0
1180,-0.954826,0.0
1181,-1.016372,0.0
1182,-1.070597,0.0
1183,-1.074486,0.0
1184,-1.119113,0.0
1185,-1.135727,0.0
1186,-1.123378,0.0
1187,-1.082559,0.0
1188,-1.075289,0.0
1189,-1.020491,0.0
1190,-0.965122,0.0
1191,-0.882785,0.0
1192,-0.775467,0.0
1193,-0.638407,0.0
1194,-0.491861,0.0
1195,-0.30902,0.0
1196,-0.141544,0.0
1197,0.062489,0.0
1198,0.26933,0.0
1199,0.461789,0.0
1200,0.637765,0.0
1201,0.821928,0.0
1202,0.997338,0.0
1203,1.195757,0.0
1204,1.407259,0.0
1205,1.622865,0.0
1206,1.809453,0.0
1207,1.83257,0.0
1208,1.641875,0.0
1209,1.428923,0.0
1210,1.222126,0.0
1211,1.035017,0.0
1212,0.853198,0.0
1213,0.664241,0.0
1214,0.45767,0.0
1215,0.249825,0.0
1216,0.043438,0.0
1217,-0.15747,0.0
1218,-0.33872,0.0
1219,-0.515923,0.0
1220,-0.670113,0.0
1221,-0.807423,0.0
1222,-0.913346,0.0
1223,-1.007242,0.0
1224,-1.065307,0.0
1225,-1.152531,0.0
1226,-1.186811,0.0
1227,-1.234284,0.0
1228,-1.250491,0.0
1229,-1.234946,0.0
1230,-1.188146,0.0
1231,-1.120206,0.0
1232,-1.067742,0.0
1233,-1.008346,0.0
1234,-0.915093,0.0
1235,-0.798328,0.0
1236,-0.673447,0.0
1237,-0.519521,0.0
1238,-0.345593,0.0
1239,-0.16548,0.0
1240,0.039084,0.0
1241,0.245436,0.0
1242,0.453253,0.0
1243,0.660087,0.0
1244,0.849103,0.0
1245,1.031267,0.0
1246,1.219949,0.0
1247,1.425992,0.0
1248,1.639894,0.0
1249,1.847677,0.0
1250,1.846152,0.0
1251,1.638194,0.0
1252,1.424435,0.0
1253,1.214403,0.0
1254,1.02061,0.0
1255,0.832374,0.0
1256,0.648862,0.0
1257,0.460686,0.0
1258,0.265145,0.0
1259,0.060262,0.0
1260,-0.142615,0.0
1261,-0.342126,0.0
1262,-0.511599,0.0
1263,-0.682674,0.0
1264,-0.820141,0.0
1265,-0.915093,0.0
1266,-0.994689,0.0
1267,-1.043073,0.0
1268,-1.095257,0.0
1269,-1.127195,0.0
1270,-1.172148,0.0
1271,-1.187055,0.0
1272,-1.171513,0.0
1273,-1.12591,0.0
1274,-1.077784,0.0
1275,-1.026221,0.0
1276,-0.979005,0.0
1277,-0.913346,0.0
1278,-0.817846,0.0
1279,-0.67934,0.0
1280,-0.508,0.0
1281,-0.338419,0.0
1282,-0.150839,0.0
1283,0.057267,0.0
1284,0.269506,0.0
1285,0.464757,0.0
1286,0.659674,0.0
1287,0.841598,0.0
1288,1.024958,0.0
1289,1.220785,0.0
1290,1.43048,0.0
1291,1.642637,0.0
1292,1.829123,0.0
