Time,X1,Label6,Label7,Label8,Label9,Label13
0,802948.0,0.0,0.0,0.0,0.0,0.0
1,809329.0,0.0,0.0,0.0,0.0,0.0
2,813301.0,0.0,0.0,0.0,0.0,0.0
3,819247.0,0.0,0.0,0.0,0.0,0.0
4,815688.0,0.0,0.0,0.0,0.0,0.0
5,812610.0,0.0,0.0,0.0,0.0,0.0
6,817899.0,0.0,0.0,0.0,0.0,0.0
7,820061.0,0.0,0.0,0.0,0.0,0.0
8,823912.0,0.0,0.0,0.0,0.0,0.0
9,844117.0,0.0,0.0,0.0,0.0,0.0
10,850772.0,0.0,0.0,0.0,0.0,0.0
11,823633.0,0.0,0.0,0.0,0.0,0.0
12,830472.0,0.0,0.0,0.0,0.0,0.0
13,837696.0,0.0,0.0,0.0,0.0,0.0
14,845466.0,0.0,0.0,0.0,0.0,0.0
15,851007.0,0.0,0.0,0.0,0.0,0.0
16,848150.0,0.0,0.0,0.0,0.0,0.0
17,840682.0,0.0,0.0,0.0,0.0,0.0
18,841820.0,0.0,0.0,0.0,0.0,0.0
19,843790.0,0.0,0.0,0.0,0.0,0.0
20,851014.0,0.0,0.0,0.0,0.0,0.0
21,872794.0,0.0,0.0,0.0,0.0,0.0
22,881832.0,0.0,0.0,0.0,0.0,0.0
23,850662.0,0.0,0.0,0.0,0.0,0.0
24,857823.0,0.0,0.0,0.0,0.0,0.0
25,867791.0,0.0,0.0,0.0,0.0,0.0
26,869132.0,0.0,0.0,0.0,0.0,0.0
27,876216.0,0.0,0.0,0.0,0.0,0.0
28,883463.0,0.0,0.0,0.0,0.0,0.0
29,879098.0,0.0,0.0,0.0,0.0,0.0
30,886582.0,0.0,0.0,0.0,0.0,0.0
31,894296.0,0.0,0.0,0.0,0.0,0.0
32,903536.0,0.0,0.0,0.0,0.0,0.0
33,932673.0,0.0,0.0,0.0,0.0,0.0
34,944083.0,0.0,0.0,0.0,0.0,0.0
35,913178.0,0.0,0.0,0.0,0.0,0.0
36,930073.0,0.0,0.0,0.0,0.0,0.0
37,943250.0,0.0,0.0,0.0,0.0,0.0
38,951783.0,0.0,0.0,0.0,0.0,0.0
39,964551.0,0.0,0.0,0.0,0.0,0.0
40,966416.0,0.0,0.0,0.0,0.0,0.0
41,959054.0,0.0,0.0,0.0,0.0,0.0
42,963639.0,0.0,0.0,0.0,0.0,0.0
43,966512.0,0.0,0.0,0.0,0.0,0.0
44,974748.0,0.0,0.0,0.0,0.0,0.0
45,1005190.0,0.0,0.0,0.0,0.0,0.0
46,1013264.0,0.0,0.0,0.0,0.0,0.0
47,971548.0,0.0,0.0,0.0,0.0,0.0
48,985288.0,0.0,0.0,0.0,0.0,0.0
49,992520.0,0.0,0.0,0.0,0.0,0.0
50,989270.0,0.0,0.0,0.0,0.0,0.0
51,997607.0,0.0,0.0,0.0,0.0,0.0
52,993342.0,0.0,0.0,0.0,0.0,0.0
53,981384.0,0.0,0.0,0.0,0.0,0.0
54,987780.0,0.0,0.0,0.0,0.0,0.0
55,989675.0,0.0,0.0,0.0,0.0,0.0
56,996161.0,0.0,0.0,0.0,0.0,0.0
57,1026552.0,0.0,0.0,0.0,0.0,0.0
58,1032049.0,0.0,0.0,0.0,0.0,0.0
59,990236.0,0.0,0.0,0.0,0.0,0.0
60,1001594.0,0.0,0.0,0.0,0.0,0.0
61,1011593.0,0.0,0.0,0.0,0.0,0.0
62,1010703.0,0.0,0.0,0.0,0.0,0.0
63,1020615.0,0.0,0.0,0.0,0.0,0.0
64,1018096.0,0.0,0.0,0.0,0.0,0.0
65,1012936.0,0.0,0.0,0.0,0.0,0.0
66,1016327.0,0.0,0.0,0.0,0.0,0.0
67,1017650.0,0.0,0.0,0.0,0.0,0.0
68,1029939.0,0.0,0.0,0.0,0.0,0.0
69,1061105.0,0.0,0.0,0.0,0.0,0.0
70,1068905.0,0.0,0.0,0.0,0.0,0.0
71,1031141.0,0.0,0.0,0.0,0.0,0.0
72,1042099.0,0.0,0.0,0.0,0.0,0.0
73,1055958.0,0.0,0.0,0.0,0.0,0.0
74,1060445.0,0.0,0.0,0.0,0.0,0.0
75,1067950.0,0.0,0.0,0.0,0.0,0.0
76,1060760.0,0.0,0.0,0.0,0.0,0.0
77,1049957.0,0.0,0.0,0.0,0.0,0.0
78,1053376.0,0.0,0.0,0.0,0.0,0.0
79,1056507.0,0.0,0.0,0.0,0.0,0.0
80,1067240.0,0.0,0.0,0.0,0.0,0.0
81,1097690.0,0.0,0.0,0.0,0.0,0.0
82,1107522.0,0.0,0.0,0.0,0.0,0.0
83,1062675.0,0.0,0.0,0.0,0.0,0.0
84,1071035.0,0.0,0.0,0.0,0.0,0.0
85,1082979.0,0.0,0.0,0.0,0.0,0.0
86,1090302.0,0.0,0.0,0.0,0.0,0.0
87,1098322.0,0.0,0.0,0.0,0.0,0.0
88,1094943.0,0.0,0.0,0.0,0.0,0.0
89,1086975.0,0.0,0.0,0.0,0.0,0.0
90,1091848.0,0.0,0.0,0.0,0.0,0.0
91,1094423.0,0.0,0.0,0.0,0.0,0.0
92,1107696.0,0.0,0.0,0.0,0.0,0.0
93,1141338.0,0.0,0.0,0.0,0.0,0.0
94,1159390.0,0.0,0.0,0.0,0.0,0.0
95,1121998.0,0.0,0.0,0.0,0.0,0.0
96,1134371.0,0.0,0.0,0.0,0.0,0.0
97,1146568.0,0.0,0.0,0.0,0.0,0.0
98,1150610.0,0.0,0.0,0.0,0.0,0.0
99,1162620.0,0.0,0.0,0.0,0.0,0.0
100,1162809.0,0.0,0.0,0.0,0.0,0.0
101,1162473.0,0.0,0.0,0.0,0.0,0.0
102,1162945.0,0.0,0.0,0.0,0.0,0.0
103,1171166.0,0.0,0.0,0.0,0.0,0.0
104,1178706.0,0.0,0.0,0.0,0.0,0.0
105,1216296.0,0.0,0.0,0.0,0.0,0.0
106,1229002.0,0.0,0.0,0.0,0.0,0.0
107,1180188.0,0.0,0.0,0.0,0.0,0.0
108,1191951.0,0.0,0.0,0.0,0.0,0.0
109,1191439.0,0.0,0.0,0.0,0.0,0.0
110,1186330.0,0.0,0.0,0.0,0.0,0.0
111,1189533.0,0.0,0.0,0.0,0.0,0.0
112,1180738.0,0.0,0.0,0.0,0.0,0.0
113,1161695.0,0.0,0.0,0.0,0.0,0.0
114,1152536.0,0.0,0.0,0.0,0.0,0.0
115,1150828.0,0.0,0.0,0.0,0.0,0.0
116,1152421.0,0.0,0.0,0.0,0.0,0.0
117,1165237.0,0.0,0.0,0.0,0.0,0.0
118,1157597.0,0.0,0.0,0.0,0.0,0.0
119,1103923.0,1.0,0.0,1.0,1.0,0.0
120,1111640.0,0.0,0.0,0.0,0.0,1.0
121,1112071.0,0.0,0.0,0.0,0.0,0.0
122,1109602.0,0.0,0.0,0.0,0.0,0.0
123,1111506.0,0.0,0.0,0.0,0.0,0.0
124,1108397.0,0.0,0.0,0.0,0.0,0.0
125,1102590.0,0.0,0.0,0.0,0.0,0.0
126,1106888.0,0.0,0.0,0.0,0.0,0.0
127,1107788.0,0.0,0.0,0.0,0.0,0.0
128,1123981.0,0.0,0.0,0.0,0.0,0.0
129,1155466.0,0.0,0.0,0.0,0.0,0.0
130,1163421.0,0.0,0.0,0.0,0.0,0.0
131,1124357.0,0.0,0.0,0.0,0.0,0.0
132,1133336.0,0.0,0.0,0.0,0.0,0.0
133,1148853.0,0.0,0.0,0.0,0.0,0.0
134,1152247.0,0.0,0.0,0.0,0.0,0.0
135,1155995.0,0.0,0.0,0.0,0.0,0.0
136,1143502.0,0.0,0.0,0.0,0.0,0.0
137,1132545.0,0.0,0.0,0.0,0.0,0.0
138,1127423.0,0.0,0.0,0.0,0.0,0.0
139,1119164.0,0.0,0.0,0.0,0.0,0.0
140,1132069.0,0.0,0.0,0.0,0.0,0.0
141,1167310.0,0.0,0.0,0.0,0.0,0.0
142,1176290.0,0.0,0.0,0.0,0.0,0.0
143,1133494.0,0.0,0.0,0.0,0.0,0.0
144,1142349.0,0.0,0.0,0.0,0.0,0.0
145,1159588.0,0.0,0.0,0.0,0.0,0.0
146,1172616.0,0.0,0.0,0.0,0.0,0.0
147,1182818.0,0.0,0.0,0.0,0.0,0.0
148,1181878.0,0.0,0.0,0.0,0.0,0.0
149,1186159.0,0.0,0.0,0.0,0.0,0.0
150,1194192.0,0.0,0.0,0.0,0.0,0.0
151,1201482.0,0.0,0.0,0.0,0.0,0.0
152,1211812.0,0.0,0.0,0.0,0.0,0.0
153,1248972.0,0.0,0.0,0.0,0.0,0.0
154,1269840.0,0.0,0.0,0.0,0.0,0.0
155,1225450.0,0.0,0.0,0.0,0.0,0.0
156,1245168.0,0.0,0.0,0.0,0.0,0.0
157,1261228.0,0.0,0.0,0.0,0.0,0.0
158,1272998.0,0.0,0.0,0.0,0.0,0.0
159,1281111.0,0.0,0.0,0.0,0.0,0.0
160,1273841.0,0.0,0.0,0.0,0.0,0.0
161,1266265.0,0.0,0.0,0.0,0.0,0.0
162,1259652.0,0.0,0.0,0.0,0.0,0.0
163,1262073.0,0.0,0.0,0.0,0.0,0.0
164,1279664.0,0.0,0.0,0.0,0.0,0.0
165,1316722.0,0.0,0.0,0.0,0.0,0.0
166,1332567.0,0.0,0.0,0.0,0.0,0.0
167,1296279.0,0.0,0.0,0.0,0.0,0.0
168,1314928.0,0.0,0.0,0.0,0.0,0.0
169,1326292.0,0.0,0.0,0.0,0.0,0.0
170,1342439.0,0.0,0.0,0.0,0.0,0.0
171,1354566.0,0.0,0.0,0.0,0.0,0.0
172,1361158.0,0.0,0.0,0.0,0.0,0.0
173,1366616.0,0.0,0.0,0.0,0.0,0.0
174,1371049.0,0.0,0.0,0.0,0.0,0.0
175,1378410.0,0.0,0.0,0.0,0.0,0.0
176,1394671.0,0.0,0.0,0.0,0.0,0.0
177,1427827.0,0.0,0.0,0.0,0.0,0.0
178,1440290.0,0.0,0.0,0.0,0.0,0.0
179,1389464.0,0.0,0.0,0.0,0.0,0.0
180,1404113.0,0.0,0.0,0.0,0.0,0.0
181,1417759.0,0.0,0.0,0.0,0.0,0.0
182,1421965.0,0.0,0.0,0.0,0.0,0.0
183,1432810.0,0.0,0.0,0.0,0.0,0.0
184,1434501.0,0.0,0.0,0.0,0.0,0.0
185,1435032.0,0.0,0.0,0.0,0.0,0.0
186,1437124.0,0.0,0.0,0.0,0.0,0.0
187,1439626.0,0.0,0.0,0.0,0.0,0.0
188,1460055.0,0.0,0.0,0.0,0.0,0.0
189,1495048.0,0.0,0.0,0.0,0.0,0.0
190,1510232.0,0.0,0.0,0.0,0.0,0.0
191,1467827.0,0.0,0.0,0.0,0.0,0.0
192,1492553.0,0.0,0.0,0.0,0.0,0.0
193,1507517.0,0.0,0.0,0.0,0.0,0.0
194,1508591.0,0.0,0.0,0.0,0.0,0.0
195,1518333.0,0.0,0.0,0.0,0.0,0.0
196,1511801.0,0.0,0.0,0.0,0.0,0.0
197,1514874.0,0.0,0.0,0.0,0.0,0.0
198,1526891.0,0.0,0.0,0.0,0.0,0.0
199,1525085.0,0.0,0.0,0.0,0.0,0.0
200,1528735.0,0.0,0.0,0.0,0.0,0.0
201,1544633.0,0.0,0.0,0.0,0.0,0.0
202,1530156.0,0.0,0.0,0.0,0.0,1.0
203,1446773.0,1.0,0.0,1.0,1.0,0.0
204,1438849.0,0.0,0.0,0.0,0.0,0.0
205,1424726.0,0.0,0.0,0.0,0.0,0.0
206,1405981.0,0.0,0.0,0.0,0.0,0.0
207,1390060.0,0.0,0.0,0.0,0.0,0.0
208,1365638.0,0.0,0.0,0.0,0.0,0.0
209,1343054.0,0.0,0.0,0.0,0.0,0.0
210,1330886.0,0.0,0.0,0.0,0.0,0.0
211,1311971.0,0.0,0.0,0.0,0.0,0.0
212,1318049.0,0.0,0.0,0.0,0.0,1.0
213,1351395.0,0.0,0.0,0.0,1.0,0.0
214,1363479.0,0.0,0.0,0.0,0.0,0.0
215,1314076.0,1.0,0.0,0.0,0.0,0.0
216,1324306.0,0.0,0.0,0.0,0.0,0.0
217,1338832.0,0.0,0.0,0.0,0.0,0.0
218,1349111.0,0.0,0.0,0.0,0.0,0.0
219,1356386.0,0.0,0.0,0.0,0.0,0.0
220,1352300.0,0.0,0.0,0.0,0.0,0.0
221,1355950.0,0.0,0.0,0.0,0.0,0.0
222,1370238.0,0.0,0.0,0.0,0.0,0.0
223,1380277.0,0.0,0.0,0.0,0.0,0.0
224,1407939.0,0.0,0.0,0.0,0.0,0.0
225,1452451.0,0.0,0.0,0.0,0.0,0.0
226,1465147.0,0.0,0.0,0.0,0.0,0.0
227,1431400.0,0.0,0.0,0.0,0.0,0.0
228,1454571.0,0.0,0.0,0.0,0.0,0.0
229,1470119.0,0.0,0.0,0.0,0.0,0.0
230,1491627.0,0.0,0.0,0.0,0.0,0.0
231,1505885.0,0.0,0.0,0.0,0.0,0.0
232,1514569.0,0.0,0.0,0.0,0.0,0.0
233,1510707.0,0.0,0.0,0.0,0.0,0.0
234,1520677.0,0.0,0.0,0.0,0.0,0.0
235,1527745.0,0.0,0.0,0.0,0.0,0.0
236,1536786.0,0.0,0.0,0.0,0.0,0.0
237,1581133.0,0.0,0.0,0.0,0.0,0.0
238,1588939.0,0.0,0.0,0.0,0.0,0.0
239,1543793.0,0.0,0.0,0.0,0.0,0.0
240,1565153.0,0.0,0.0,0.0,0.0,0.0
241,1585928.0,0.0,0.0,0.0,0.0,0.0
242,1595381.0,0.0,0.0,0.0,0.0,0.0
243,1604096.0,0.0,0.0,0.0,0.0,0.0
244,1601632.0,0.0,0.0,0.0,0.0,0.0
245,1592035.0,0.0,0.0,0.0,0.0,0.0
246,1607433.0,0.0,0.0,0.0,0.0,0.0
247,1614009.0,0.0,0.0,0.0,0.0,0.0
248,1638521.0,0.0,0.0,0.0,0.0,0.0
249,1678805.0,0.0,0.0,0.0,0.0,0.0
250,1684987.0,0.0,0.0,0.0,0.0,0.0
251,1632719.0,0.0,0.0,0.0,0.0,0.0
252,1663421.0,0.0,0.0,0.0,0.0,0.0
253,1671417.0,0.0,0.0,0.0,0.0,0.0
254,1672158.0,0.0,0.0,0.0,0.0,0.0
255,1678252.0,0.0,0.0,0.0,0.0,0.0
256,1665101.0,0.0,0.0,0.0,0.0,0.0
257,1651662.0,0.0,0.0,0.0,0.0,0.0
258,1661522.0,0.0,0.0,0.0,0.0,0.0
259,1668012.0,0.0,0.0,0.0,0.0,0.0
260,1690049.0,0.0,0.0,0.0,0.0,0.0
261,1737429.0,0.0,0.0,0.0,0.0,0.0
262,1746383.0,0.0,0.0,0.0,0.0,0.0
263,1695269.0,0.0,0.0,0.0,0.0,0.0
264,1720394.0,0.0,0.0,0.0,0.0,0.0
265,1736025.0,0.0,0.0,0.0,0.0,0.0
266,1744371.0,0.0,0.0,0.0,0.0,0.0
267,1755173.0,0.0,0.0,0.0,0.0,0.0
268,1751052.0,0.0,0.0,0.0,0.0,0.0
269,1739764.0,0.0,0.0,0.0,0.0,0.0
270,1751494.0,0.0,0.0,0.0,0.0,0.0
271,1753540.0,0.0,0.0,0.0,0.0,0.0
272,1770872.0,0.0,0.0,0.0,0.0,0.0
273,1811800.0,0.0,0.0,0.0,0.0,0.0
274,1816048.0,0.0,0.0,0.0,0.0,0.0
275,1755796.0,0.0,0.0,0.0,0.0,0.0
276,1772642.0,0.0,0.0,0.0,0.0,0.0
277,1783795.0,0.0,0.0,0.0,0.0,0.0
278,1787778.0,0.0,0.0,0.0,0.0,0.0
279,1797943.0,0.0,0.0,0.0,0.0,0.0
280,1788608.0,0.0,0.0,0.0,0.0,0.0
281,1787339.0,0.0,0.0,0.0,0.0,0.0
282,1792441.0,0.0,0.0,0.0,0.0,0.0
283,1791257.0,0.0,0.0,0.0,0.0,0.0
284,1811995.0,0.0,0.0,0.0,0.0,0.0
285,1849341.0,0.0,0.0,0.0,0.0,0.0
286,1845830.0,0.0,0.0,0.0,0.0,0.0
287,1785807.0,0.0,0.0,0.0,0.0,0.0
288,1801049.0,0.0,0.0,0.0,0.0,0.0
289,1801448.0,0.0,0.0,0.0,0.0,0.0
290,1811645.0,0.0,0.0,0.0,0.0,0.0
291,1817628.0,0.0,0.0,0.0,0.0,0.0
292,1809055.0,0.0,0.0,0.0,0.0,0.0
293,1801158.0,0.0,0.0,0.0,0.0,0.0
294,1800856.0,0.0,0.0,0.0,0.0,0.0
295,1802629.0,0.0,0.0,0.0,0.0,0.0
296,1821908.0,0.0,0.0,0.0,0.0,0.0
297,1854301.0,0.0,0.0,0.0,0.0,0.0
298,1869758.0,0.0,0.0,0.0,0.0,0.0
299,1816705.0,0.0,0.0,0.0,0.0,0.0
300,1838215.0,0.0,0.0,0.0,0.0,0.0
301,1847425.0,0.0,0.0,0.0,0.0,0.0
302,1854937.0,0.0,0.0,0.0,0.0,0.0
303,1852641.0,0.0,0.0,0.0,0.0,0.0
304,1846202.0,0.0,0.0,0.0,0.0,0.0
305,1845272.0,0.0,0.0,0.0,0.0,0.0
306,1849860.0,0.0,0.0,0.0,0.0,0.0
307,1861978.0,0.0,0.0,0.0,0.0,0.0
308,1881395.0,0.0,0.0,0.0,0.0,0.0
309,1914200.0,0.0,0.0,0.0,0.0,0.0
310,1926768.0,0.0,0.0,0.0,0.0,0.0
311,1877420.0,0.0,0.0,0.0,0.0,0.0
312,1909538.0,0.0,0.0,0.0,0.0,0.0
313,1926779.0,0.0,0.0,0.0,0.0,0.0
314,1926997.0,0.0,0.0,0.0,0.0,0.0
315,1932736.0,0.0,0.0,0.0,0.0,0.0
316,1926582.0,0.0,0.0,0.0,0.0,0.0
317,1917092.0,0.0,0.0,0.0,0.0,0.0
318,1929578.0,0.0,0.0,0.0,0.0,0.0
319,1940308.0,0.0,0.0,0.0,0.0,0.0
320,1964515.0,0.0,0.0,0.0,0.0,0.0
321,2011029.0,0.0,0.0,0.0,0.0,0.0
322,2013838.0,0.0,0.0,0.0,0.0,0.0
323,1971142.0,0.0,0.0,0.0,0.0,0.0
324,2011130.0,0.0,0.0,0.0,0.0,0.0
325,2026848.0,0.0,0.0,0.0,0.0,0.0
326,2024339.0,0.0,0.0,0.0,0.0,0.0
327,2036290.0,0.0,0.0,0.0,0.0,0.0
328,2029098.0,0.0,0.0,0.0,0.0,0.0
329,2017625.0,0.0,0.0,0.0,0.0,0.0
