Time,X1,Label6,Label8,Label10,Label12,Label13
0,3718.0,0.0,0.0,0.0,0.0,0.0
1,4590.0,0.0,0.0,0.0,0.0,0.0
2,5190.0,0.0,0.0,0.0,0.0,0.0
3,4806.0,0.0,0.0,0.0,0.0,0.0
4,4665.0,0.0,0.0,0.0,0.0,0.0
5,4502.0,0.0,0.0,0.0,0.0,0.0
6,3774.0,0.0,0.0,0.0,0.0,0.0
7,4640.0,0.0,0.0,0.0,0.0,0.0
8,4393.0,0.0,0.0,0.0,0.0,0.0
9,4661.0,0.0,0.0,0.0,0.0,0.0
10,4021.0,0.0,0.0,0.0,0.0,0.0
11,3525.0,0.0,0.0,0.0,0.0,0.0
12,9442.0,0.0,0.0,0.0,0.0,0.0
13,12030.0,0.0,0.0,0.0,0.0,0.0
14,11219.0,0.0,0.0,0.0,0.0,0.0
15,8794.0,0.0,0.0,0.0,0.0,0.0
16,14634.0,0.0,0.0,0.0,0.0,0.0
17,15507.0,0.0,0.0,0.0,0.0,0.0
18,11929.0,0.0,0.0,0.0,0.0,0.0
19,9315.0,0.0,0.0,0.0,0.0,0.0
20,8532.0,0.0,0.0,0.0,0.0,0.0
21,9383.0,0.0,0.0,0.0,0.0,0.0
22,9849.0,0.0,0.0,0.0,0.0,0.0
23,10491.0,0.0,0.0,0.0,0.0,0.0
24,8663.0,0.0,0.0,0.0,0.0,0.0
25,10156.0,0.0,0.0,0.0,0.0,0.0
26,9950.0,0.0,0.0,0.0,0.0,0.0
27,8150.0,0.0,0.0,0.0,0.0,0.0
28,8114.0,0.0,0.0,0.0,0.0,0.0
29,19233.0,0.0,0.0,0.0,0.0,0.0
30,14464.0,0.0,0.0,0.0,0.0,0.0
31,15506.0,0.0,0.0,0.0,0.0,0.0
32,10634.0,0.0,0.0,0.0,0.0,0.0
33,9519.0,0.0,0.0,0.0,0.0,0.0
34,9188.0,0.0,0.0,0.0,0.0,0.0
35,9005.0,0.0,0.0,0.0,0.0,0.0
36,6208.0,0.0,0.0,0.0,0.0,0.0
37,8949.0,0.0,0.0,0.0,0.0,0.0
38,9117.0,0.0,0.0,0.0,0.0,0.0
39,8113.0,0.0,0.0,0.0,0.0,0.0
40,9673.0,0.0,0.0,0.0,0.0,0.0
41,8409.0,0.0,0.0,0.0,0.0,0.0
42,8777.0,0.0,0.0,0.0,0.0,0.0
43,7520.0,0.0,0.0,0.0,0.0,0.0
44,10972.0,0.0,0.0,0.0,0.0,0.0
45,11167.0,0.0,0.0,0.0,0.0,0.0
46,13633.0,0.0,0.0,0.0,0.0,0.0
47,8351.0,0.0,0.0,0.0,0.0,0.0
48,5907.0,0.0,0.0,0.0,0.0,0.0
49,12367.0,0.0,0.0,0.0,0.0,0.0
50,8904.0,0.0,0.0,0.0,0.0,0.0
51,7888.0,0.0,0.0,0.0,0.0,0.0
52,8301.0,0.0,0.0,0.0,0.0,0.0
53,8478.0,0.0,0.0,0.0,0.0,0.0
54,8966.0,0.0,0.0,0.0,0.0,0.0
55,9190.0,0.0,0.0,0.0,0.0,0.0
56,7064.0,0.0,0.0,0.0,0.0,0.0
57,11237.0,0.0,0.0,0.0,0.0,0.0
58,110234.0,0.0,0.0,0.0,0.0,0.0
59,9477.0,0.0,0.0,0.0,0.0,0.0
60,6587.0,0.0,0.0,0.0,0.0,0.0
61,5056.0,0.0,0.0,0.0,0.0,0.0
62,10168.0,0.0,0.0,0.0,0.0,0.0
63,10523.0,0.0,0.0,0.0,0.0,0.0
64,10273.0,0.0,0.0,0.0,0.0,0.0
65,11478.0,0.0,0.0,0.0,0.0,0.0
66,10327.0,0.0,0.0,0.0,0.0,0.0
67,12943.0,0.0,0.0,0.0,0.0,0.0
68,10561.0,0.0,0.0,0.0,0.0,0.0
69,10715.0,0.0,0.0,0.0,0.0,0.0
70,10596.0,0.0,0.0,0.0,0.0,0.0
71,10356.0,0.0,0.0,0.0,0.0,0.0
72,10269.5,0.0,0.0,0.0,0.0,0.0
73,10269.5,0.0,0.0,0.0,0.0,0.0
74,63534.0,0.0,0.0,0.0,0.0,0.0
75,37072.0,0.0,0.0,0.0,0.0,0.0
76,26341.0,0.0,0.0,0.0,0.0,0.0
77,21208.0,0.0,0.0,0.0,0.0,0.0
78,16783.0,0.0,0.0,0.0,0.0,0.0
79,13451.0,0.0,0.0,0.0,0.0,0.0
80,11002.0,0.0,0.0,0.0,0.0,0.0
81,11882.0,0.0,0.0,0.0,0.0,0.0
82,10170.0,0.0,0.0,0.0,0.0,0.0
83,16801.0,0.0,0.0,0.0,0.0,0.0
84,16544.0,0.0,0.0,0.0,0.0,0.0
85,16848.0,0.0,0.0,0.0,0.0,0.0
86,18575.0,0.0,0.0,0.0,0.0,0.0
87,17654.0,0.0,0.0,0.0,0.0,0.0
88,16471.0,0.0,0.0,0.0,0.0,0.0
89,17433.0,0.0,0.0,0.0,0.0,0.0
90,17220.0,0.0,0.0,0.0,0.0,0.0
91,18750.0,0.0,0.0,0.0,0.0,0.0
92,14906.0,0.0,0.0,0.0,0.0,0.0
93,22006.0,0.0,0.0,0.0,0.0,0.0
94,21902.0,0.0,0.0,0.0,0.0,0.0
95,18577.0,0.0,0.0,0.0,0.0,0.0
96,18975.0,0.0,0.0,0.0,0.0,0.0
97,18810.0,0.0,0.0,0.0,0.0,0.0
98,17704.0,0.0,0.0,0.0,0.0,0.0
99,17313.0,0.0,0.0,0.0,0.0,0.0
100,16324.0,0.0,0.0,0.0,0.0,0.0
101,16252.0,0.0,0.0,0.0,0.0,0.0
102,13389.0,0.0,0.0,0.0,0.0,0.0
103,16855.0,0.0,0.0,0.0,0.0,0.0
104,15198.0,0.0,0.0,0.0,0.0,0.0
105,14941.0,0.0,0.0,0.0,0.0,0.0
106,13429.0,0.0,0.0,0.0,0.0,0.0
107,11224.0,0.0,0.0,0.0,0.0,0.0
108,30675.0,0.0,0.0,0.0,0.0,1.0
109,25104.0,0.0,0.0,0.0,0.0,0.0
110,25014.0,0.0,0.0,0.0,0.0,0.0
111,22326.0,0.0,0.0,0.0,0.0,0.0
112,25708.0,0.0,0.0,0.0,0.0,0.0
113,22474.0,0.0,0.0,0.0,0.0,0.0
114,21852.0,0.0,0.0,0.0,0.0,0.0
115,21544.0,0.0,0.0,0.0,0.0,0.0
116,22268.0,0.0,0.0,0.0,0.0,0.0
117,19415.0,0.0,0.0,0.0,0.0,0.0
118,20050.0,0.0,0.0,0.0,0.0,0.0
119,26531.0,0.0,0.0,0.0,0.0,0.0
120,24354.0,0.0,0.0,0.0,0.0,0.0
121,23391.0,0.0,0.0,0.0,0.0,0.0
122,24897.0,0.0,0.0,0.0,0.0,0.0
123,22706.0,0.0,0.0,0.0,0.0,0.0
124,24230.0,0.0,0.0,0.0,0.0,0.0
125,24774.0,0.0,0.0,0.0,0.0,0.0
126,26526.0,0.0,0.0,0.0,0.0,0.0
127,21425.0,0.0,0.0,0.0,0.0,0.0
128,19114.0,0.0,0.0,0.0,0.0,0.0
129,19921.0,0.0,0.0,0.0,0.0,0.0
130,19120.0,0.0,0.0,0.0,0.0,0.0
131,18244.0,0.0,0.0,0.0,0.0,0.0
132,20857.0,0.0,0.0,0.0,0.0,0.0
133,24651.0,0.0,0.0,0.0,0.0,0.0
134,23589.0,0.0,0.0,0.0,0.0,0.0
135,26174.0,0.0,0.0,0.0,0.0,0.0
136,22224.0,0.0,0.0,0.0,0.0,0.0
137,21482.0,0.0,0.0,0.0,0.0,0.0
138,21811.0,0.0,0.0,0.0,0.0,0.0
139,22650.0,0.0,0.0,0.0,0.0,0.0
140,35154.0,1.0,0.0,0.0,0.0,1.0
141,28887.0,0.0,0.0,0.0,0.0,0.0
142,38220.0,0.0,0.0,0.0,0.0,0.0
143,39625.0,0.0,0.0,0.0,0.0,0.0
144,41946.0,0.0,0.0,0.0,0.0,0.0
145,45758.0,0.0,0.0,0.0,1.0,0.0
146,61853.0,0.0,1.0,1.0,0.0,0.0
147,94241.0,0.0,0.0,0.0,0.0,0.0
148,114121.0,0.0,0.0,0.0,0.0,0.0
149,135677.0,0.0,0.0,0.0,0.0,0.0
150,136098.0,0.0,0.0,0.0,0.0,0.0
151,121550.0,0.0,0.0,0.0,0.0,0.0
152,122219.0,0.0,0.0,0.0,0.0,0.0
153,105532.0,0.0,0.0,0.0,0.0,0.0
154,95595.0,0.0,0.0,0.0,0.0,0.0
155,96972.0,0.0,0.0,0.0,0.0,0.0
156,98203.0,0.0,0.0,0.0,0.0,0.0
157,103224.0,0.0,0.0,0.0,0.0,0.0
158,132690.0,0.0,0.0,0.0,0.0,0.0
159,152298.0,0.0,0.0,0.0,0.0,0.0
160,156007.0,0.0,0.0,0.0,0.0,0.0
161,172205.0,0.0,0.0,0.0,0.0,0.0
162,166302.0,0.0,0.0,0.0,0.0,0.0
163,166939.0,0.0,0.0,0.0,0.0,0.0
164,165765.0,0.0,0.0,0.0,0.0,0.0
165,170995.0,0.0,0.0,0.0,0.0,0.0
166,169159.0,0.0,0.0,0.0,0.0,0.0
167,179133.0,0.0,0.0,0.0,0.0,0.0
168,187533.0,0.0,0.0,0.0,0.0,0.0
169,196470.0,0.0,0.0,0.0,0.0,0.0
170,221109.0,0.0,0.0,0.0,0.0,0.0
171,256897.0,0.0,0.0,0.0,0.0,0.0
172,277889.0,0.0,0.0,0.0,0.0,0.0
173,275438.0,0.0,0.0,0.0,0.0,0.0
174,240750.0,0.0,0.0,0.0,0.0,0.0
175,251188.0,0.0,0.0,0.0,0.0,0.0
176,229544.0,0.0,0.0,0.0,0.0,0.0
177,213212.0,0.0,0.0,0.0,0.0,0.0
178,215424.0,0.0,0.0,0.0,0.0,0.0
179,219882.0,0.0,0.0,0.0,0.0,0.0
180,232101.0,0.0,0.0,0.0,0.0,0.0
181,251717.0,0.0,0.0,0.0,0.0,0.0
182,262010.0,0.0,0.0,0.0,0.0,0.0
183,252273.0,0.0,0.0,0.0,0.0,0.0
184,270197.0,0.0,0.0,0.0,0.0,0.0
185,244349.0,0.0,0.0,0.0,0.0,0.0
186,269189.0,0.0,0.0,0.0,0.0,0.0
187,256083.0,0.0,0.0,0.0,0.0,0.0
188,250566.0,0.0,0.0,0.0,0.0,0.0
189,244868.0,0.0,0.0,0.0,0.0,0.0
190,226911.0,0.0,0.0,0.0,0.0,0.0
191,228148.0,0.0,0.0,0.0,0.0,0.0
192,226316.0,0.0,0.0,0.0,0.0,0.0
193,220831.0,0.0,0.0,0.0,0.0,0.0
194,217056.0,0.0,0.0,0.0,0.0,0.0
195,204980.0,0.0,0.0,0.0,0.0,0.0
196,198627.0,0.0,0.0,0.0,0.0,0.0
197,209672.0,0.0,0.0,0.0,0.0,0.0
198,202337.0,0.0,0.0,0.0,0.0,0.0
199,192755.0,0.0,0.0,0.0,0.0,0.0
200,189142.0,0.0,0.0,0.0,0.0,0.0
201,181861.0,0.0,0.0,0.0,0.0,0.0
202,177355.0,0.0,0.0,0.0,0.0,0.0
203,165442.0,0.0,0.0,0.0,0.0,0.0
204,168614.0,0.0,0.0,0.0,0.0,0.0
