Time,X,Label
0,0.012882,0.0
1,1.36955,0.0
2,-0.034655,0.0
3,0.157485,0.0
4,1.561957,0.0
5,0.728655,0.0
6,-0.747262,0.0
7,-1.100188,0.0
8,-0.974388,0.0
9,-0.974037,0.0
10,-0.0617,0.0
11,1.305101,0.0
12,0.129895,0.0
13,0.21227,0.0
14,1.516786,0.0
15,0.773625,0.0
16,-0.753609,0.0
17,-1.152408,0.0
18,-1.079716,0.0
19,-0.890244,0.0
20,-0.07612,0.0
21,1.359604,0.0
22,-0.013304,0.0
23,0.135452,0.0
24,1.589268,0.0
25,0.734186,0.0
26,-0.807615,0.0
27,-1.051468,0.0
28,-0.905702,0.0
29,-0.964301,0.0
30,-0.023891,0.0
31,1.409117,0.0
32,0.031299,0.0
33,0.025989,0.0
34,1.525838,0.0
35,0.746616,0.0
36,-0.825447,0.0
37,-1.023002,0.0
38,-0.890489,0.0
39,-0.976031,0.0
40,-0.068772,0.0
41,1.359908,0.0
42,-0.02592,0.0
43,0.132638,0.0
44,1.598304,0.0
45,0.682029,0.0
46,-0.787574,0.0
47,-1.025772,0.0
48,-0.900041,0.0
49,-0.9648,0.0
50,-0.078925,0.0
51,1.315922,0.0
52,-0.221793,0.0
53,0.304932,0.0
54,1.588693,0.0
55,0.71483,0.0
56,-0.768044,0.0
57,-1.041659,0.0
58,-0.97838,0.0
59,-0.835576,0.0
60,-0.054946,0.0
61,1.2911,0.0
62,0.003258,0.0
63,0.263146,0.0
64,1.555437,0.0
65,0.771384,0.0
66,-0.879036,0.0
67,-1.049091,0.0
68,-0.945496,0.0
69,-0.955756,0.0
70,-0.090962,0.0
71,1.378807,0.0
72,0.048573,0.0
73,0.176668,0.0
74,1.550773,0.0
75,0.701676,0.0
76,-0.778065,0.0
77,-1.112946,0.0
78,-0.855594,0.0
79,-1.018931,0.0
80,-0.071253,0.0
81,1.271333,0.0
82,-0.228587,0.0
83,0.451894,0.0
84,1.621932,0.0
85,0.631943,0.0
86,-0.849182,0.0
87,-0.986476,0.0
88,-0.825646,0.0
89,-1.015958,0.0
90,-0.055306,0.0
91,1.313527,0.0
92,-0.07162,0.0
93,0.236424,0.0
94,1.605073,0.0
95,0.690486,0.0
96,-0.798237,0.0
97,-1.073706,0.0
98,-0.856902,0.0
99,-0.989738,0.0
100,-0.06362,0.0
101,1.374562,0.0
102,0.106887,0.0
103,0.112094,0.0
104,1.506114,0.0
105,0.776844,0.0
106,-0.767441,0.0
107,-1.120632,0.0
108,-0.918586,0.0
109,-1.006223,0.0
110,-0.037576,0.0
111,1.28648,0.0
112,-0.134273,0.0
113,0.389209,0.0
114,1.536002,0.0
115,0.730456,0.0
116,-0.75085,0.0
117,-1.163924,0.0
118,-0.826606,0.0
119,-1.028918,0.0
120,-0.03221,0.0
121,1.307898,0.0
122,-0.050253,0.0
123,0.210731,0.0
124,1.562272,0.0
125,0.765122,0.0
126,-0.820257,0.0
127,-1.049287,0.0
128,-0.860863,0.0
129,-1.033154,0.0
130,0.014641,0.0
131,1.317528,0.0
132,-0.019614,0.0
133,0.23483,0.0
134,1.54034,0.0
135,0.765592,0.0
136,-0.882527,0.0
137,-1.052718,0.0
138,-0.984791,0.0
139,-0.93328,0.0
140,-0.07458,0.0
141,1.410974,0.0
142,-0.107668,0.0
143,0.111911,0.0
144,1.583036,0.0
145,0.668738,0.0
146,-0.835285,0.0
147,-1.002468,0.0
148,-0.884804,0.0
149,-0.869855,0.0
150,-0.09942,0.0
151,1.19092,0.0
152,-0.331788,0.0
153,0.526849,0.0
154,1.580167,0.0
155,0.7385,0.0
156,-0.878023,0.0
157,-1.033232,0.0
158,-0.874821,0.0
159,-0.819151,0.0
160,-0.024155,0.0
161,1.293932,0.0
162,-0.170952,0.0
163,0.31552,0.0
164,1.568721,0.0
165,0.770377,0.0
166,-0.791469,0.0
167,-1.080276,0.0
168,-0.88824,0.0
169,-0.993457,0.0
170,-0.010723,0.0
171,1.35717,0.0
172,-0.015747,0.0
173,0.207397,0.0
174,1.532518,0.0
175,0.707521,0.0
176,-0.804544,0.0
177,-1.086059,0.0
178,-0.920632,0.0
179,-0.966901,0.0
180,-0.055192,0.0
181,1.396202,0.0
182,0.15,0.0
183,0.07726,0.0
184,1.545433,0.0
185,0.660208,0.0
186,-0.852292,0.0
187,-1.037752,0.0
188,-0.926742,0.0
189,-0.957126,0.0
190,-0.006498,0.0
191,1.303725,0.0
192,0.080305,0.0
193,0.152324,0.0
194,1.503934,0.0
195,0.818484,0.0
196,-0.816315,0.0
197,-1.130885,0.0
198,-0.903146,0.0
199,-1.001927,0.0
200,-0.080778,0.0
201,1.367699,0.0
202,-0.07337,0.0
203,0.222496,0.0
204,1.616257,0.0
205,0.595853,0.0
206,-0.872226,0.0
207,-0.977649,0.0
208,-0.862415,0.0
209,-0.935867,0.0
210,-0.081855,0.0
211,1.363222,0.0
212,-0.074136,0.0
213,0.175717,0.0
214,1.58579,0.0
215,0.699635,0.0
216,-0.847185,0.0
217,-1.026966,0.0
218,-0.853403,0.0
219,-0.94082,0.0
220,-0.140721,0.0
221,1.310383,0.0
222,-0.135403,0.0
223,0.286411,0.0
224,1.596125,0.0
225,0.747436,0.0
226,-0.809368,0.0
227,-1.066168,0.0
228,-0.890825,0.0
229,-0.89787,0.0
230,-0.068052,0.0
231,1.325373,0.0
232,-0.09545,0.0
233,0.200337,0.0
234,1.571604,0.0
235,0.787863,0.0
236,-0.781758,0.0
237,-1.062066,0.0
238,-0.887158,0.0
239,-0.990692,0.0
240,-0.113791,0.0
241,1.36803,0.0
242,-0.038184,0.0
243,0.123394,0.0
244,1.558253,0.0
245,0.738757,0.0
246,-0.665551,0.0
247,-1.12503,0.0
248,-0.944744,0.0
249,-0.901134,0.0
250,-0.095422,0.0
251,1.368091,0.0
252,-0.094231,0.0
253,0.112154,0.0
254,1.578613,0.0
255,0.769618,0.0
256,-0.844941,0.0
257,-1.002947,0.0
258,-0.854574,0.0
259,-0.936361,0.0
260,-0.06747,0.0
261,1.432543,0.0
262,0.106721,0.0
263,-0.011098,0.0
264,1.538151,0.0
265,0.741935,0.0
266,-0.803324,0.0
267,-1.06748,0.0
268,-0.882906,0.0
269,-0.987071,0.0
270,-0.100242,0.0
271,1.356612,0.0
272,-0.007207,0.0
273,0.135209,0.0
274,1.547144,0.0
275,0.793499,0.0
276,-0.745772,0.0
277,-1.106912,0.0
278,-0.825875,0.0
279,-1.046457,0.0
280,-0.065482,0.0
281,1.303062,0.0
282,-0.188354,0.0
283,0.297087,0.0
284,1.619293,0.0
285,0.71181,0.0
286,-0.798844,0.0
287,-1.045877,0.0
288,-0.915812,0.0
289,-0.916884,0.0
290,-0.053027,0.0
291,1.321679,0.0
292,-0.136417,0.0
293,0.240086,0.0
294,1.639066,0.0
295,0.693716,0.0
296,-0.81058,0.0
297,-1.060923,0.0
298,-0.906145,0.0
299,-0.927454,0.0
300,-0.027231,0.0
301,1.329001,0.0
302,-0.091107,0.0
303,0.183081,0.0
304,1.562913,0.0
305,0.747101,0.0
306,-0.792984,0.0
307,-1.083466,0.0
308,-0.915404,0.0
309,-0.911904,0.0
310,-0.086441,0.0
311,1.388569,0.0
312,0.155469,0.0
313,-0.012688,0.0
314,1.505209,0.0
315,0.815989,0.0
316,-0.788563,0.0
317,-1.098204,0.0
318,-0.905615,0.0
319,-0.973725,0.0
320,0.002212,0.0
321,1.349407,0.0
322,-0.108414,0.0
323,0.098519,0.0
324,1.566662,0.0
325,0.769745,0.0
326,-0.770404,0.0
327,-1.085455,0.0
328,-0.811605,0.0
329,-1.010666,0.0
330,-0.139504,0.0
331,1.354888,0.0
332,-0.084813,0.0
333,0.212399,0.0
334,1.599979,0.0
335,0.681122,0.0
336,-0.844754,0.0
337,-1.004502,0.0
338,-0.834289,0.0
339,-0.940527,0.0
340,-0.087285,0.0
341,1.346109,0.0
342,-0.094928,0.0
343,0.191435,0.0
344,1.628065,0.0
345,0.673118,0.0
346,-0.778956,0.0
347,-1.017515,0.0
348,-0.896175,0.0
349,-0.963868,0.0
350,-0.07858,0.0
351,1.36218,0.0
352,-0.053707,0.0
353,0.225547,0.0
354,1.593532,0.0
355,0.673335,0.0
356,-0.833659,0.0
357,-1.05022,0.0
358,-0.921923,0.0
359,-0.916505,0.0
360,-0.072815,0.0
361,1.439788,0.0
362,0.073964,0.0
363,0.043989,0.0
364,1.495792,0.0
365,0.715312,0.0
366,-0.775884,0.0
367,-1.083579,0.0
368,-0.847895,0.0
369,-0.988671,0.0
370,-0.037013,0.0
371,1.364194,0.0
372,-0.05831,0.0
373,0.068915,0.0
374,1.566617,0.0
375,0.790633,0.0
376,-0.803066,0.0
377,-1.032184,0.0
378,-0.835441,0.0
379,-1.024344,0.0
380,-0.045107,0.0
381,1.380929,0.0
382,0.035518,0.0
383,0.040375,0.0
384,1.569664,0.0
385,0.721934,0.0
386,-0.75299,0.0
387,-1.060583,0.0
388,-0.895966,0.0
389,-0.993774,0.0
390,-0.072987,0.0
391,1.363485,0.0
392,-0.0153,0.0
393,0.229784,0.0
394,1.53646,0.0
395,0.744059,0.0
396,-0.796742,0.0
397,-1.098934,0.0
398,-0.974165,0.0
399,-0.915659,0.0
400,-0.067672,0.0
401,1.183379,0.0
402,-0.276984,0.0
403,0.540052,0.0
404,1.611771,0.0
405,0.705563,0.0
406,-0.790609,0.0
407,-1.073288,0.0
408,-0.961761,0.0
409,-0.87045,0.0
410,-0.114388,0.0
411,1.410476,0.0
412,-0.04014,0.0
413,0.105943,0.0
414,1.584668,0.0
415,0.695214,0.0
416,-0.863415,0.0
417,-0.980722,0.0
418,-0.869299,0.0
419,-0.928336,0.0
420,-0.081353,0.0
421,1.358163,0.0
422,-0.213975,0.0
423,0.260184,0.0
424,1.635242,0.0
425,0.648636,0.0
426,-0.82781,0.0
427,-1.006466,0.0
428,-0.943695,0.0
429,-0.828927,0.0
430,-0.13585,0.0
431,1.344378,0.0
432,-0.256201,0.0
433,0.288826,0.0
434,1.615412,0.0
435,0.689543,0.0
436,-0.813643,0.0
437,-1.005998,0.0
438,-0.823373,0.0
439,-0.903094,0.0
440,-0.110384,0.0
441,1.311658,0.0
442,-0.151785,0.0
443,0.392804,0.0
444,1.539949,0.0
445,0.760475,0.0
446,-0.824094,0.0
447,-1.084226,0.0
448,-0.923928,0.0
449,-0.910467,0.0
450,-0.025066,0.0
451,1.230716,0.0
452,-0.135081,0.0
453,0.319175,0.0
454,1.582999,0.0
455,0.762313,0.0
456,-0.76903,0.0
457,-1.109536,0.0
458,-0.761512,0.0
459,-1.094979,0.0
460,-0.076068,0.0
461,1.41196,0.0
462,0.083633,0.0
463,0.089686,0.0
464,1.532208,0.0
465,0.705783,0.0
466,-0.815859,0.0
467,-1.047237,0.0
468,-0.957099,0.0
469,-0.927007,0.0
470,-0.029567,0.0
471,1.363976,0.0
472,0.08771,0.0
473,0.082157,0.0
474,1.548002,0.0
475,0.755688,0.0
476,-0.752417,0.0
477,-1.110926,0.0
478,-1.009441,0.0
479,-0.935183,0.0
480,0.047255,0.0
481,1.27529,0.0
482,-0.107813,0.0
483,0.281899,0.0
484,1.486432,0.0
485,0.903548,0.0
486,-0.752155,0.0
487,-1.133319,0.0
488,-0.940022,0.0
489,-1.061114,0.0
490,-0.035348,0.0
491,1.348265,0.0
492,-0.013642,0.0
493,0.236133,0.0
494,1.54181,0.0
495,0.732717,0.0
496,-0.796881,0.0
497,-1.084583,0.0
498,-0.944035,0.0
499,-0.984435,0.0
500,-0.065676,0.0
501,1.290254,0.0
502,-0.083869,0.0
503,0.221922,0.0
504,1.615438,0.0
505,0.770178,0.0
506,-0.758031,0.0
507,-1.110579,0.0
508,-0.826315,0.0
509,-1.053322,0.0
510,-0.032162,0.0
511,1.403648,0.0
512,0.004607,0.0
513,0.153657,0.0
514,1.531027,0.0
515,0.710193,0.0
516,-0.761202,0.0
517,-1.08553,0.0
518,-0.929136,0.0
519,-0.995102,0.0
520,-0.038173,0.0
521,1.376994,0.0
522,-0.035353,0.0
523,0.134472,0.0
524,1.565096,0.0
525,0.694886,0.0
526,-0.79807,0.0
527,-1.063899,0.0
528,-0.852864,0.0
529,-0.983088,0.0
530,-0.006506,0.0
531,1.251957,0.0
532,-0.105988,0.0
533,0.301696,0.0
534,1.604512,0.0
535,0.774093,0.0
536,-0.831896,0.0
537,-1.042291,0.0
538,-0.967263,0.0
539,-0.978314,0.0
540,-0.109072,0.0
541,1.322731,0.0
542,-0.035858,0.0
543,0.211247,0.0
544,1.573334,0.0
545,0.754601,0.0
546,-0.784012,0.0
547,-1.074505,0.0
548,-0.810461,0.0
549,-1.048006,0.0
550,-0.049732,0.0
551,1.415256,0.0
552,-0.029541,0.0
553,0.075672,0.0
554,1.556937,0.0
555,0.697199,0.0
556,-0.778732,0.0
557,-1.019619,0.0
558,-0.883019,0.0
559,-0.984422,0.0
560,-0.004223,0.0
561,1.268293,0.0
562,-0.202891,0.0
563,0.340751,0.0
564,1.560273,0.0
565,0.789911,0.0
566,-0.802318,0.0
567,-1.081918,0.0
568,-0.934459,0.0
569,-0.93342,0.0
570,-0.05377,0.0
571,1.350145,0.0
572,-0.083345,0.0
573,0.186201,0.0
574,1.584443,0.0
575,0.734736,0.0
576,-0.800523,0.0
577,-1.063045,0.0
578,-0.89361,0.0
579,-0.961232,0.0
580,-0.065078,0.0
581,1.378886,0.0
582,-0.10066,0.0
583,0.171559,0.0
584,1.589207,0.0
585,0.671193,0.0
586,-0.80568,0.0
587,-1.032138,0.0
588,-0.809867,0.0
589,-0.997422,0.0
590,-0.109653,0.0
591,1.300594,0.0
592,-0.145868,0.0
593,0.377496,0.0
594,1.577131,0.0
595,0.706643,0.0
596,-0.779175,0.0
597,-1.065036,0.0
598,-0.799649,0.0
599,-1.062482,0.0
600,-0.073628,0.0
601,1.338436,0.0
602,-0.097137,0.0
603,0.277282,0.0
604,1.620762,0.0
605,0.678926,0.0
606,-0.832086,0.0
607,-1.025491,0.0
608,-0.93582,0.0
609,-0.951244,0.0
610,-0.071673,0.0
611,1.357082,0.0
612,-0.066305,0.0
613,0.165254,0.0
614,1.562204,0.0
615,0.764797,0.0
616,-0.744301,0.0
617,-1.098162,0.0
618,-0.845459,0.0
619,-1.023438,0.0
620,-0.084887,0.0
621,1.393272,0.0
622,-0.11553,0.0
623,0.163553,0.0
624,1.609317,0.0
625,0.619903,0.0
626,-0.834131,0.0
627,-1.009507,0.0
628,-0.828245,0.0
629,-0.913744,0.0
630,-0.02657,0.0
631,1.359758,0.0
632,0.024448,0.0
633,0.069564,0.0
634,1.559962,0.0
635,0.765735,0.0
636,-0.734069,0.0
637,-1.107932,0.0
638,-1.032937,0.0
639,-0.877959,0.0
640,0.061485,0.0
641,1.35313,0.0
642,0.03553,0.0
643,0.16981,0.0
644,1.481473,0.0
645,0.791456,0.0
646,-0.804097,0.0
647,-1.13773,0.0
648,-0.916973,0.0
649,-1.034084,0.0
650,-0.060885,0.0
651,1.394423,0.0
652,0.042776,0.0
653,0.09299,0.0
654,1.582814,0.0
655,0.646785,0.0
656,-0.786924,0.0
657,-1.067236,0.0
658,-0.903526,0.0
659,-0.941217,0.0
660,-0.004901,0.0
661,1.270396,0.0
662,-0.047332,0.0
663,0.211854,0.0
664,1.57718,0.0
665,0.793667,0.0
666,-0.830689,0.0
667,-1.067654,0.0
668,-0.87827,0.0
669,-1.024252,0.0
670,-0.037086,0.0
671,1.306831,0.0
672,-0.160976,0.0
673,0.215225,0.0
674,1.588707,0.0
675,0.790754,0.0
676,-0.814692,0.0
677,-1.042648,0.0
678,-0.853317,0.0
679,-0.992797,0.0
680,-0.061763,0.0
681,1.290964,0.0
682,-0.093878,0.0
683,0.320793,0.0
684,1.581319,0.0
685,0.759681,0.0
686,-0.822704,0.0
687,-1.067081,0.0
688,-0.931083,0.0
689,-0.976248,0.0
690,-0.04018,0.0
691,1.366491,0.0
692,0.032253,0.0
693,0.154715,0.0
694,1.603644,0.0
695,0.646295,0.0
696,-0.823794,0.0
697,-1.047443,0.0
698,-0.902258,0.0
699,-0.989721,0.0
700,-0.162105,0.0
701,1.284224,0.0
702,-0.1436,0.0
703,0.256515,0.0
704,1.637097,0.0
705,0.735799,0.0
706,-0.692501,0.0
707,-1.083948,0.0
708,-0.856122,0.0
709,-0.975358,0.0
710,0.022892,0.0
711,1.303711,0.0
712,-0.046039,0.0
713,0.255299,0.0
714,1.566578,0.0
715,0.706152,0.0
716,-0.811923,0.0
717,-1.089033,0.0
718,-0.856379,0.0
719,-1.051257,0.0
720,-0.028445,1.0
721,1.309772,0.0
722,-0.120455,0.0
723,0.217044,0.0
724,1.592056,0.0
725,0.737406,0.0
726,-0.794944,0.0
727,-1.042586,0.0
728,-0.90809,0.0
729,-0.961758,0.0
730,-0.023362,0.0
731,1.409023,0.0
732,0.011378,0.0
733,0.132492,0.0
734,1.523572,0.0
735,0.673401,0.0
736,-0.821616,0.0
737,-1.060276,0.0
738,-0.944212,0.0
739,-0.900399,0.0
740,-0.112766,0.0
741,1.419844,0.0
742,-0.12865,0.0
743,0.155154,0.0
744,1.539387,0.0
745,0.749631,0.0
746,-0.800085,0.0
747,-1.039141,0.0
748,-0.846971,0.0
749,-0.936402,0.0
750,-0.081169,0.0
751,1.441502,0.0
752,0.01697,0.0
753,0.026384,0.0
754,1.522965,0.0
755,0.710703,0.0
756,-0.781324,0.0
757,-1.049604,0.0
758,-0.901009,0.0
759,-0.905418,0.0
760,-0.070738,0.0
761,1.424771,0.0
762,-0.059962,0.0
763,0.13803,0.0
764,1.557076,0.0
765,0.629244,0.0
766,-0.815526,0.0
767,-1.05232,0.0
768,-0.955962,0.0
769,-0.794612,0.0
770,-0.096046,0.0
771,1.416925,0.0
772,-0.097702,0.0
773,0.184622,0.0
774,1.555238,0.0
775,0.619666,0.0
776,-0.762695,0.0
777,-1.074957,0.0
778,-0.816649,0.0
779,-0.928402,0.0
780,-0.126989,0.0
781,1.465229,0.0
782,0.023075,0.0
783,-0.050502,0.0
784,1.504177,0.0
785,0.667341,0.0
786,-0.764141,0.0
787,-1.021509,0.0
788,-0.81819,0.0
789,-0.878491,0.0
790,-0.077311,0.0
791,1.439088,0.0
792,0.101289,0.0
793,-0.030308,0.0
794,1.517345,0.0
795,0.68871,0.0
796,-0.779265,0.0
797,-1.080749,0.0
798,-0.831522,0.0
799,-0.947277,0.0
800,-0.191385,0.0
801,1.368595,0.0
802,-0.069839,0.0
803,-0.01758,0.0
804,1.614232,0.0
805,0.704781,0.0
806,-0.695353,0.0
807,-1.046705,0.0
808,-0.820678,0.0
809,-0.846069,0.0
810,-0.161465,0.0
811,1.509692,0.0
812,0.170993,0.0
813,-0.266548,0.0
814,1.430037,0.0
815,0.754131,0.0
816,-0.719965,0.0
817,-1.033692,0.0
818,-0.782278,0.0
819,-0.900905,0.0
820,-0.138879,0.0
821,1.401994,0.0
822,0.03999,0.0
823,-0.003304,0.0
824,1.497613,0.0
825,0.72932,0.0
826,-0.751371,0.0
827,-1.076453,0.0
828,-0.776878,0.0
829,-0.922034,0.0
830,-0.109539,0.0
831,1.449833,0.0
832,-0.003468,0.0
833,0.020428,0.0
834,1.55389,0.0
835,0.653803,0.0
836,-0.814349,0.0
837,-0.98258,0.0
838,-0.853451,0.0
839,-0.914566,0.0
840,-0.105362,0.0
841,1.358607,0.0
842,-0.207599,0.0
843,0.198776,0.0
844,1.552521,0.0
845,0.713848,0.0
846,-0.764092,0.0
847,-1.076107,0.0
848,-0.837692,0.0
849,-0.832901,0.0
850,-0.076343,0.0
851,1.407953,0.0
852,-0.025544,0.0
853,0.076524,0.0
854,1.57209,0.0
855,0.639661,0.0
856,-0.888547,0.0
857,-0.956429,0.0
858,-0.966022,0.0
859,-0.783344,0.0
860,-0.059374,0.0
861,1.38353,0.0
862,-0.227812,0.0
863,0.322799,0.0
864,1.539559,0.0
865,0.702194,0.0
866,-0.803832,0.0
867,-1.034787,0.0
868,-0.889059,0.0
869,-0.933217,0.0
870,-0.110394,0.0
871,1.442661,0.0
872,0.052424,0.0
873,-0.033566,0.0
874,1.533656,0.0
875,0.760652,0.0
876,-0.835903,0.0
877,-0.997599,0.0
878,-0.931526,0.0
879,-0.880407,0.0
880,-0.04424,0.0
881,1.361622,0.0
882,-0.071725,0.0
883,0.16411,0.0
884,1.558848,0.0
885,0.722805,0.0
886,-0.761381,0.0
887,-1.084729,0.0
888,-0.846069,0.0
889,-0.99924,0.0
890,-0.102012,0.0
891,1.42476,0.0
892,-0.104957,0.0
893,0.148041,0.0
894,1.588243,0.0
895,0.636035,0.0
896,-0.797673,0.0
897,-1.007019,0.0
898,-0.853093,0.0
899,-0.932326,0.0
900,-0.042099,0.0
901,1.340042,0.0
902,-0.03904,0.0
903,0.190672,0.0
904,1.58862,0.0
905,0.702176,0.0
906,-0.792814,0.0
907,-1.031631,0.0
908,-0.862016,0.0
909,-1.053909,0.0
910,-0.118994,0.0
911,1.411152,0.0
912,0.037783,0.0
913,0.090652,0.0
914,1.556014,0.0
915,0.668064,0.0
916,-0.79626,0.0
917,-1.036489,0.0
918,-0.934002,0.0
919,-0.877919,0.0
920,-0.049616,0.0
921,1.345583,0.0
922,-0.109815,0.0
923,0.240221,0.0
924,1.544925,0.0
925,0.696901,0.0
926,-0.760863,0.0
927,-1.094602,0.0
928,-0.829305,0.0
929,-0.983429,0.0
930,-0.088032,0.0
931,1.427234,0.0
932,-0.053608,0.0
933,0.046723,0.0
934,1.54726,0.0
935,0.709803,0.0
936,-0.783775,0.0
937,-1.040757,0.0
938,-0.864015,0.0
939,-0.900832,0.0
940,-0.109567,0.0
941,1.441636,0.0
942,0.028341,0.0
943,0.051575,0.0
944,1.523724,0.0
945,0.676756,0.0
946,-0.791516,0.0
947,-1.032288,0.0
948,-0.899,0.0
949,-0.889661,0.0
950,-0.086122,0.0
951,1.497645,0.0
952,0.018007,0.0
953,-0.041183,0.0
954,1.511549,0.0
955,0.639373,0.0
956,-0.816876,0.0
957,-0.979121,0.0
958,-0.897652,0.0
959,-0.84562,0.0
960,-0.099365,0.0
961,1.463119,0.0
962,-0.040106,0.0
963,0.055664,0.0
964,1.563983,0.0
965,0.624925,0.0
966,-0.760049,0.0
967,-1.040583,0.0
968,-0.806832,0.0
969,-0.960757,0.0
970,-0.121488,0.0
971,1.374671,0.0
972,-0.194921,0.0
973,0.154391,0.0
974,1.539367,0.0
975,0.73398,0.0
976,-0.858869,0.0
977,-0.924499,0.0
978,-0.969056,0.0
979,-0.733576,0.0
980,-0.083732,0.0
981,1.418319,0.0
982,-0.063588,0.0
983,0.14953,0.0
984,1.503378,0.0
985,0.71257,0.0
986,-0.799794,0.0
987,-1.077598,0.0
988,-0.784107,0.0
989,-0.974978,0.0
990,-0.103559,0.0
991,1.472125,0.0
992,0.032412,0.0
993,-0.015725,0.0
994,1.485723,0.0
995,0.676578,0.0
996,-0.802493,0.0
997,-1.031478,0.0
998,-0.914751,0.0
999,-0.798832,0.0
1000,-0.107818,0.0
1001,1.3577,0.0
1002,-0.088096,0.0
1003,0.195554,0.0
1004,1.610853,0.0
1005,0.694832,0.0
1006,-0.816223,0.0
1007,-1.020791,0.0
1008,-0.903698,0.0
1009,-0.922315,0.0
1010,-0.066039,0.0
1011,1.420765,0.0
1012,-0.028045,0.0
1013,0.043964,0.0
1014,1.559495,0.0
1015,0.726017,0.0
1016,-0.828925,0.0
1017,-1.000182,0.0
1018,-0.879511,0.0
1019,-0.947539,0.0
1020,-0.073358,0.0
1021,1.390548,0.0
1022,-0.147407,0.0
1023,0.138262,0.0
1024,1.608772,0.0
1025,0.702995,0.0
1026,-0.791745,0.0
1027,-1.013096,0.0
1028,-0.852974,0.0
1029,-0.961999,0.0
1030,-0.06806,0.0
1031,1.369682,0.0
1032,-0.144728,0.0
1033,0.173015,0.0
1034,1.592737,0.0
1035,0.668153,0.0
1036,-0.791231,0.0
1037,-1.051631,0.0
1038,-0.827837,0.0
1039,-0.920102,0.0
1040,-0.109877,0.0
1041,1.463789,0.0
1042,0.08832,0.0
1043,-0.001714,0.0
1044,1.515317,0.0
1045,0.657,0.0
1046,-0.75269,0.0
1047,-1.057477,0.0
1048,-0.836877,0.0
1049,-0.96579,0.0
1050,-0.084016,0.0
1051,1.387331,0.0
1052,-0.097165,0.0
1053,0.18366,0.0
1054,1.612532,0.0
1055,0.622769,0.0
1056,-0.797733,0.0
1057,-1.067525,0.0
1058,-0.834068,0.0
1059,-0.925788,0.0
1060,-0.153894,0.0
1061,1.468383,0.0
1062,0.104671,0.0
1063,-0.169112,0.0
1064,1.510935,0.0
1065,0.721743,0.0
1066,-0.758858,0.0
1067,-1.002511,0.0
1068,-0.840662,0.0
1069,-0.880696,0.0
1070,-0.100361,0.0
1071,1.538246,0.0
1072,0.428514,0.0
1073,-0.357519,0.0
1074,1.375822,0.0
1075,0.623903,0.0
1076,-0.80628,0.0
1077,-0.961345,0.0
1078,-0.789061,0.0
1079,-0.95192,0.0
1080,-0.104384,0.0
1081,1.471897,0.0
1082,0.041213,0.0
1083,-0.035216,0.0
1084,1.558479,0.0
1085,0.611491,0.0
1086,-0.801751,0.0
1087,-1.011853,0.0
1088,-0.925786,0.0
1089,-0.804088,0.0
1090,-0.103407,0.0
1091,1.505463,0.0
1092,0.103777,0.0
1093,-0.115388,0.0
1094,1.48076,0.0
1095,0.649096,0.0
1096,-0.722587,0.0
1097,-1.067148,0.0
1098,-0.777269,0.0
1099,-0.953295,0.0
1100,-0.164045,0.0
1101,1.452739,0.0
1102,-0.032077,0.0
1103,0.016228,0.0
1104,1.571912,0.0
1105,0.643224,0.0
1106,-0.766539,0.0
1107,-0.995015,0.0
1108,-0.788777,0.0
1109,-0.93765,0.0
1110,-0.083036,0.0
1111,1.337496,0.0
1112,-0.16267,0.0
1113,0.158866,0.0
1114,1.598877,0.0
1115,0.751757,0.0
1116,-0.874815,0.0
1117,-0.970135,0.0
1118,-0.825352,0.0
1119,-0.930989,0.0
1120,-0.121864,0.0
1121,1.377845,0.0
1122,-0.237284,0.0
1123,0.223184,0.0
1124,1.587648,0.0
1125,0.630445,0.0
1126,-0.75963,0.0
1127,-1.03815,0.0
1128,-0.856366,0.0
1129,-0.805829,0.0
1130,-0.115578,0.0
1131,1.463152,0.0
1132,-0.021721,0.0
1133,0.011258,0.0
1134,1.550492,0.0
1135,0.618783,0.0
1136,-0.779834,0.0
1137,-1.046342,0.0
1138,-0.768562,0.0
1139,-0.911648,0.0
1140,-0.117326,0.0
1141,1.409299,0.0
1142,-0.106229,0.0
1143,0.029087,0.0
1144,1.563689,0.0
1145,0.655205,0.0
1146,-0.785086,0.0
1147,-0.94251,0.0
1148,-0.879568,0.0
1149,-0.826562,0.0
1150,-0.036951,0.0
1151,1.319567,0.0
1152,-0.011662,0.0
1153,0.265437,0.0
1154,1.533343,0.0
1155,0.730666,0.0
1156,-0.849772,0.0
1157,-1.049558,0.0
1158,-0.98158,0.0
1159,-0.919489,0.0
1160,-0.064528,0.0
1161,1.309755,0.0
1162,0.033243,0.0
1163,0.122653,0.0
1164,1.568625,0.0
1165,0.787074,0.0
1166,-0.841857,0.0
1167,-1.052472,0.0
1168,-0.926916,0.0
1169,-0.935577,0.0
1170,-0.10128,0.0
1171,1.396986,0.0
1172,-0.039176,0.0
1173,0.215152,0.0
1174,1.523264,0.0
1175,0.654634,0.0
1176,-0.817666,0.0
1177,-1.07607,0.0
1178,-0.745393,0.0
1179,-1.010452,0.0
1180,-0.082973,0.0
1181,1.363151,0.0
1182,-0.242688,0.0
1183,0.226487,0.0
1184,1.598908,0.0
1185,0.670909,0.0
1186,-0.774747,0.0
1187,-1.048058,0.0
1188,-0.819789,0.0
1189,-0.8912,0.0
1190,-0.076805,0.0
1191,1.417975,0.0
1192,-0.100995,0.0
1193,0.128595,0.0
1194,1.549523,0.0
1195,0.728378,0.0
1196,-0.74723,0.0
1197,-1.068523,0.0
1198,-0.884275,0.0
1199,-0.946644,0.0
1200,-0.109688,0.0
1201,1.39341,0.0
1202,-0.212116,0.0
1203,0.279186,0.0
1204,1.567809,0.0
1205,0.581553,0.0
1206,-0.837493,0.0
1207,-0.979861,0.0
1208,-0.896752,0.0
1209,-0.786047,0.0
1210,-0.143937,0.0
1211,1.43686,0.0
1212,-0.023831,0.0
1213,0.019077,0.0
1214,1.570603,0.0
1215,0.670051,0.0
1216,-0.806463,0.0
1217,-0.97637,0.0
1218,-0.830042,0.0
1219,-0.915949,0.0
1220,-0.118156,0.0
1221,1.417843,0.0
1222,0.184355,0.0
1223,-0.077499,0.0
1224,1.425572,0.0
1225,0.756397,0.0
1226,-0.766521,0.0
1227,-1.070469,0.0
1228,-0.795531,0.0
1229,-0.955991,0.0
1230,-0.062427,0.0
1231,1.412436,0.0
1232,0.07616,0.0
1233,0.006315,0.0
1234,1.459515,0.0
1235,0.745205,0.0
1236,-0.81743,0.0
1237,-1.066447,0.0
1238,-0.901557,0.0
1239,-0.851769,0.0
1240,-0.12535,0.0
1241,1.342645,0.0
1242,-0.15042,0.0
1243,0.239315,0.0
1244,1.603846,0.0
1245,0.691146,0.0
1246,-0.869324,0.0
1247,-0.982268,0.0
1248,-1.012375,0.0
1249,-0.737215,0.0
1250,-0.124075,0.0
1251,1.36067,0.0
1252,-0.023042,0.0
1253,0.191496,0.0
1254,1.539516,0.0
1255,0.747749,0.0
1256,-0.837062,0.0
1257,-1.038823,0.0
1258,-0.850321,0.0
1259,-0.966108,0.0
1260,-0.023579,0.0
1261,1.248114,0.0
1262,-0.130957,0.0
1263,0.365848,0.0
1264,1.534229,0.0
1265,0.756007,0.0
1266,-0.805125,0.0
1267,-1.063982,0.0
1268,-0.966303,0.0
1269,-0.914252,0.0
1270,-0.1306,0.0
1271,1.429649,0.0
1272,-0.152237,0.0
1273,0.15138,0.0
1274,1.492862,0.0
1275,0.701977,0.0
1276,-0.79608,0.0
1277,-0.981275,0.0
1278,-0.892334,0.0
1279,-0.823343,0.0
1280,-0.153394,0.0
1281,1.459322,0.0
1282,0.196343,0.0
1283,-0.130391,0.0
1284,1.481963,0.0
1285,0.6667,0.0
1286,-0.825505,0.0
1287,-0.992644,0.0
1288,-0.861593,0.0
1289,-0.840801,0.0
1290,-0.093151,0.0
1291,1.336772,0.0
1292,-0.294364,0.0
1293,0.256432,0.0
1294,1.626561,0.0
1295,0.692842,0.0
1296,-0.80334,0.0
1297,-1.009175,0.0
1298,-0.919878,0.0
1299,-0.7927,0.0
1300,-0.158047,0.0
1301,1.486433,0.0
1302,-0.049407,0.0
1303,0.084077,0.0
1304,1.492646,0.0
1305,0.664583,0.0
1306,-0.889562,0.0
1307,-0.97956,0.0
1308,-0.82692,0.0
1309,-0.824243,0.0
1310,-0.093341,0.0
1311,1.454247,0.0
1312,-0.029303,0.0
1313,0.001835,0.0
1314,1.484891,0.0
1315,0.697002,0.0
1316,-0.803514,0.0
1317,-0.995089,0.0
1318,-0.717322,0.0
1319,-0.999405,0.0
1320,-0.185495,0.0
1321,1.492858,0.0
1322,0.274131,0.0
1323,-0.18033,0.0
1324,1.468287,0.0
1325,0.69757,0.0
1326,-0.7885,0.0
1327,-1.017681,0.0
1328,-0.979448,0.0
1329,-0.781393,0.0
1330,-0.215041,0.0
1331,1.480281,0.0
1332,0.13663,0.0
1333,-0.137393,0.0
1334,1.518902,0.0
1335,0.715351,0.0
1336,-0.768457,0.0
1337,-0.981862,0.0
1338,-0.825136,0.0
1339,-0.923274,0.0
1340,-0.06522,0.0
1341,1.507647,0.0
1342,0.147043,0.0
1343,-0.129656,0.0
1344,1.476489,0.0
1345,0.631194,0.0
1346,-0.770721,0.0
1347,-1.074902,0.0
1348,-0.824792,0.0
1349,-0.897081,0.0
1350,-0.10723,0.0
1351,1.454776,0.0
1352,-0.002915,0.0
1353,-0.094807,0.0
1354,1.487167,0.0
1355,0.722713,0.0
1356,-0.764068,0.0
1357,-0.964363,0.0
1358,-0.769354,0.0
1359,-0.961919,0.0
1360,-0.06869,0.0
1361,1.273021,0.0
1362,-0.150212,0.0
1363,0.375938,0.0
1364,1.556958,0.0
1365,0.714854,0.0
1366,-0.785772,0.0
1367,-1.09821,0.0
1368,-0.903063,0.0
1369,-0.914825,0.0
1370,-0.073301,0.0
1371,1.301201,0.0
1372,-0.345245,0.0
1373,0.422392,0.0
1374,1.526604,0.0
1375,0.744263,0.0
1376,-0.840143,0.0
1377,-1.022056,0.0
1378,-0.883588,0.0
1379,-0.830127,0.0
1380,-0.180765,0.0
1381,1.250471,0.0
1382,-0.258418,0.0
1383,0.4982,0.0
1384,1.597244,0.0
1385,0.716318,0.0
1386,-0.870992,0.0
1387,-1.006067,0.0
1388,-0.881453,0.0
1389,-0.864538,0.0
1390,-0.158937,0.0
1391,1.345927,0.0
1392,-0.175683,0.0
1393,0.331066,0.0
1394,1.511708,0.0
1395,0.735777,0.0
1396,-0.811367,0.0
1397,-1.060262,0.0
1398,-0.983228,0.0
1399,-0.735,0.0
1400,-0.097221,0.0
1401,1.409512,0.0
1402,-0.007034,0.0
1403,0.033793,0.0
1404,1.557752,0.0
1405,0.664069,0.0
1406,-0.777858,0.0
1407,-1.035487,0.0
1408,-0.819417,0.0
1409,-0.928108,0.0
1410,-0.089204,0.0
1411,1.343619,0.0
1412,-0.2502,0.0
1413,0.222779,0.0
1414,1.649472,0.0
1415,0.697854,0.0
1416,-0.831928,0.0
1417,-0.995849,0.0
1418,-0.823978,0.0
1419,-0.922566,0.0
1420,-0.086683,0.0
1421,1.472285,0.0
1422,-0.066991,0.0
1423,0.008204,0.0
1424,1.551758,0.0
1425,0.679112,0.0
1426,-0.793298,0.0
1427,-1.039754,0.0
1428,-0.83784,0.0
1429,-0.886792,0.0
1430,-0.083872,0.0
1431,1.475726,0.0
1432,0.157392,0.0
1433,-0.058494,0.0
1434,1.520288,0.0
1435,0.625255,0.0
1436,-0.85173,0.0
1437,-1.004813,0.0
1438,-0.888947,0.0
1439,-0.890805,0.0
1440,-0.152624,0.0
1441,1.349515,0.0
1442,-0.190337,0.0
1443,0.152429,0.0
1444,1.621546,0.0
1445,0.707341,0.0
1446,-0.85963,0.0
1447,-0.93056,0.0
1448,-0.772682,0.0
1449,-0.924998,0.0
1450,-0.106878,0.0
1451,1.314046,0.0
1452,-0.283347,0.0
1453,0.417062,0.0
1454,1.562959,0.0
1455,0.665617,0.0
1456,-0.757914,0.0
1457,-1.034043,0.0
1458,-0.877128,0.0
1459,-0.900373,0.0
1460,-0.075791,0.0
1461,1.379415,0.0
1462,-0.139536,0.0
1463,0.169557,0.0
1464,1.58296,0.0
1465,0.700812,0.0
1466,-0.827919,0.0
1467,-1.015246,0.0
1468,-0.841796,0.0
1469,-0.932455,0.0
1470,-0.097041,0.0
1471,1.452327,0.0
1472,-0.08642,0.0
1473,-0.000411,0.0
1474,1.538713,0.0
1475,0.675274,0.0
1476,-0.730731,0.0
1477,-1.073302,0.0
1478,-0.842203,0.0
1479,-0.836206,0.0
1480,-0.141914,0.0
1481,1.369601,0.0
1482,-0.037411,0.0
1483,0.144899,0.0
1484,1.552032,0.0
1485,0.772854,0.0
1486,-0.810496,0.0
1487,-1.023188,0.0
1488,-0.856124,0.0
1489,-0.970253,0.0
1490,-0.12466,0.0
1491,1.404824,0.0
1492,-0.02676,0.0
1493,0.251133,0.0
1494,1.442936,0.0
1495,0.77658,0.0
1496,-0.812969,0.0
1497,-1.089147,0.0
1498,-0.843167,0.0
1499,-0.97877,0.0
1500,-0.106741,0.0
1501,1.472573,0.0
1502,0.003813,0.0
1503,-0.009481,0.0
1504,1.56414,0.0
1505,0.627113,0.0
1506,-0.848769,0.0
1507,-0.975568,0.0
1508,-0.909218,0.0
1509,-0.817861,0.0
1510,-0.037648,0.0
1511,1.453726,0.0
1512,-0.023437,0.0
1513,0.079805,0.0
1514,1.578915,0.0
1515,0.59962,0.0
1516,-0.806141,0.0
1517,-1.043998,0.0
1518,-0.947464,0.0
1519,-0.853377,0.0
1520,-0.065628,0.0
1521,1.349427,0.0
1522,-0.109431,0.0
1523,0.175433,0.0
1524,1.59964,0.0
1525,0.71476,0.0
1526,-0.843338,0.0
1527,-1.023225,0.0
1528,-0.863253,0.0
1529,-0.934385,0.0
1530,-0.031078,0.0
1531,1.374303,0.0
1532,-0.178383,0.0
1533,0.370602,0.0
1534,1.555406,0.0
1535,0.565379,0.0
1536,-0.808802,0.0
1537,-1.074182,0.0
1538,-0.766375,0.0
1539,-1.006871,0.0
1540,-0.106992,0.0
1541,1.425006,0.0
1542,0.05941,0.0
1543,0.058604,0.0
1544,1.532334,0.0
1545,0.705421,0.0
1546,-0.817693,0.0
1547,-1.039128,0.0
1548,-0.890578,0.0
1549,-0.926385,0.0
1550,-0.116042,0.0
1551,1.325938,0.0
1552,-0.218038,0.0
1553,0.275953,0.0
1554,1.612984,0.0
1555,0.705784,0.0
1556,-0.869806,0.0
1557,-1.009814,0.0
1558,-0.918739,0.0
1559,-0.788219,0.0
1560,-0.150947,0.0
1561,1.398103,0.0
1562,-0.031701,0.0
1563,0.15665,0.0
1564,1.571538,0.0
1565,0.702485,0.0
1566,-0.933268,0.0
1567,-0.912002,0.0
1568,-0.959655,0.0
1569,-0.841205,0.0
1570,-0.089551,0.0
1571,1.390396,0.0
1572,-0.022131,0.0
1573,0.15386,0.0
1574,1.51685,0.0
1575,0.724558,0.0
1576,-0.816125,0.0
1577,-1.044071,0.0
1578,-0.98744,0.0
1579,-0.826345,0.0
1580,-0.142322,0.0
1581,1.397893,0.0
1582,-0.217554,0.0
1583,0.25703,0.0
1584,1.571454,0.0
1585,0.652002,0.0
1586,-0.794593,0.0
1587,-1.041559,0.0
1588,-0.775506,0.0
1589,-0.906844,0.0
1590,-0.073059,0.0
1591,1.4305,0.0
1592,0.2293,0.0
1593,-0.055762,0.0
1594,1.505761,0.0
1595,0.674716,0.0
1596,-0.777649,0.0
1597,-1.054352,0.0
1598,-0.862297,0.0
1599,-1.017159,0.0
1600,-0.099652,0.0
1601,1.353544,0.0
1602,-0.214053,0.0
1603,0.219183,0.0
1604,1.600246,0.0
1605,0.720296,0.0
1606,-0.839217,0.0
1607,-0.989124,0.0
1608,-0.877042,0.0
1609,-0.874181,0.0
1610,-0.063976,0.0
1611,1.425589,0.0
1612,-0.087902,0.0
1613,0.151071,0.0
1614,1.552929,0.0
1615,0.64978,0.0
1616,-0.738126,0.0
1617,-1.133697,0.0
1618,-0.754288,0.0
1619,-1.001379,0.0
1620,-0.105445,0.0
1621,1.366805,0.0
1622,-0.090044,0.0
1623,0.160448,0.0
1624,1.62686,0.0
1625,0.644808,0.0
1626,-0.901858,0.0
1627,-0.934533,0.0
1628,-0.860976,0.0
1629,-0.906064,0.0
1630,-0.031174,0.0
1631,1.331943,0.0
1632,-0.116805,0.0
1633,0.163881,0.0
1634,1.541173,0.0
1635,0.808051,0.0
1636,-0.788332,0.0
1637,-1.072125,0.0
1638,-0.918935,0.0
1639,-0.917678,0.0
1640,-0.103219,0.0
1641,1.380524,0.0
1642,-0.161124,0.0
1643,0.190441,0.0
1644,1.573258,0.0
1645,0.6957,0.0
1646,-0.813072,0.0
1647,-1.008947,0.0
1648,-0.873542,0.0
1649,-0.88002,0.0
1650,-0.190798,0.0
1651,1.450068,0.0
1652,-0.062599,0.0
1653,0.057771,0.0
1654,1.544181,0.0
1655,0.67455,0.0
1656,-0.835426,0.0
1657,-0.958129,0.0
1658,-0.841123,0.0
1659,-0.838496,0.0
1660,-0.085797,0.0
1661,1.270068,0.0
1662,-0.202678,0.0
1663,0.279466,0.0
1664,1.6113,0.0
1665,0.773263,0.0
1666,-0.812384,0.0
1667,-1.040472,0.0
1668,-0.84339,0.0
1669,-0.949376,0.0
1670,-0.136025,0.0
1671,1.36859,0.0
1672,-0.091789,0.0
1673,0.113754,0.0
1674,1.579876,0.0
1675,0.77517,0.0
1676,-0.812818,0.0
1677,-1.002232,0.0
1678,-0.842364,0.0
1679,-0.952162,0.0
1680,-0.039437,0.0
1681,1.318951,0.0
1682,-0.162737,0.0
1683,0.311325,0.0
1684,1.556323,0.0
1685,0.72711,0.0
1686,-0.728979,0.0
1687,-1.103056,0.0
1688,-0.891955,0.0
1689,-0.987545,0.0
1690,-0.079313,0.0
1691,1.405335,0.0
1692,-0.193431,0.0
1693,0.176242,0.0
1694,1.55281,0.0
1695,0.716143,0.0
1696,-0.741301,0.0
1697,-1.060551,0.0
1698,-0.800099,0.0
1699,-0.975835,0.0
1700,-0.175062,0.0
1701,1.352214,0.0
1702,-0.153145,0.0
1703,0.191019,0.0
1704,1.590462,0.0
1705,0.736058,0.0
1706,-0.80884,0.0
1707,-1.008831,0.0
1708,-0.814369,0.0
1709,-0.909506,0.0
1710,-0.071584,0.0
1711,1.33767,0.0
1712,-0.171548,0.0
1713,0.250088,0.0
1714,1.583708,0.0
1715,0.720075,0.0
1716,-0.807549,0.0
1717,-1.023077,0.0
1718,-0.841779,0.0
1719,-0.976004,0.0
1720,-0.101942,0.0
1721,1.285032,0.0
1722,-0.264948,0.0
1723,0.380697,0.0
1724,1.584107,0.0
1725,0.757607,0.0
1726,-0.839948,0.0
1727,-1.039322,0.0
1728,-0.866089,0.0
1729,-0.895193,0.0
1730,-0.05845,0.0
1731,1.435444,0.0
1732,0.018184,0.0
1733,0.006353,0.0
1734,1.549789,0.0
1735,0.674954,0.0
1736,-0.784615,0.0
1737,-1.034426,0.0
1738,-0.852707,0.0
1739,-0.954527,0.0
1740,-0.071454,0.0
1741,1.440117,0.0
1742,-0.011494,0.0
1743,0.078115,0.0
1744,1.457099,0.0
1745,0.739083,0.0
1746,-0.760246,0.0
1747,-1.081404,0.0
1748,-0.927861,0.0
1749,-0.861956,0.0
1750,-0.127318,0.0
1751,1.205707,0.0
1752,-0.443542,0.0
1753,0.685718,0.0
1754,1.490359,0.0
1755,0.689033,0.0
1756,-0.891035,0.0
1757,-0.959362,0.0
1758,-0.852628,0.0
1759,-0.796933,0.0
1760,-0.094717,0.0
1761,1.4207,0.0
1762,-0.097603,0.0
1763,0.06708,0.0
1764,1.540224,0.0
1765,0.735113,0.0
1766,-0.808305,0.0
1767,-1.044961,0.0
1768,-0.813254,0.0
1769,-0.904277,0.0
1770,-0.103947,0.0
1771,1.375965,0.0
1772,-0.073295,0.0
1773,0.160507,0.0
1774,1.562471,0.0
1775,0.690299,0.0
1776,-0.818107,0.0
1777,-1.034737,0.0
1778,-0.857115,0.0
1779,-0.902041,0.0
1780,-0.142459,0.0
1781,1.401689,0.0
1782,-0.034338,0.0
1783,0.093394,0.0
1784,1.545949,0.0
1785,0.692526,0.0
1786,-0.77067,0.0
1787,-1.055189,0.0
1788,-0.840139,0.0
1789,-0.890762,0.0
1790,-0.129253,0.0
1791,1.431166,0.0
1792,-0.201127,0.0
1793,0.077657,0.0
1794,1.55334,0.0
1795,0.685835,0.0
1796,-0.794059,0.0
1797,-0.954943,0.0
1798,-0.778406,0.0
1799,-0.890212,0.0
1800,-0.118414,0.0
1801,1.430865,0.0
1802,-0.128299,0.0
1803,0.163925,0.0
1804,1.599736,0.0
1805,0.57137,0.0
1806,-0.834102,0.0
1807,-0.989855,0.0
1808,-0.931987,0.0
1809,-0.763239,0.0
1810,-0.125019,0.0
1811,1.525502,0.0
1812,0.360049,0.0
1813,-0.21736,0.0
1814,1.422028,0.0
1815,0.637445,0.0
1816,-0.764842,0.0
1817,-1.047892,0.0
1818,-0.801213,0.0
1819,-0.988698,0.0
1820,-0.121786,0.0
1821,1.478279,0.0
1822,-0.004074,0.0
1823,0.010384,0.0
1824,1.543224,0.0
1825,0.650071,0.0
1826,-0.828336,0.0
1827,-0.983385,0.0
1828,-0.87444,0.0
1829,-0.869937,0.0
1830,-0.14086,0.0
1831,1.427591,0.0
1832,0.05242,0.0
1833,-0.014005,0.0
1834,1.470277,0.0
1835,0.760393,0.0
1836,-0.836044,0.0
1837,-1.027449,0.0
1838,-0.94533,0.0
1839,-0.746993,0.0
1840,-0.115458,0.0
1841,1.324841,0.0
1842,-0.217711,0.0
1843,0.258282,0.0
1844,1.585857,0.0
1845,0.764638,0.0
1846,-0.858609,0.0
1847,-1.016601,0.0
1848,-0.909866,0.0
1849,-0.815372,0.0
1850,-0.102041,0.0
1851,1.467842,0.0
1852,-0.117637,0.0
1853,-0.021281,0.0
1854,1.504314,0.0
1855,0.728187,0.0
1856,-0.733083,0.0
1857,-1.013076,0.0
1858,-0.875732,0.0
1859,-0.837493,0.0
1860,-0.046684,0.0
1861,1.420676,0.0
1862,-0.143275,0.0
1863,0.115825,0.0
1864,1.535824,0.0
1865,0.699147,0.0
1866,-0.873038,0.0
1867,-0.967025,0.0
1868,-0.900375,0.0
1869,-0.841075,0.0
1870,-0.130106,0.0
1871,1.429072,0.0
1872,-0.079105,0.0
1873,0.091424,0.0
1874,1.538782,0.0
1875,0.706573,0.0
1876,-0.735691,0.0
1877,-1.089061,0.0
1878,-0.731454,0.0
1879,-1.000435,0.0
1880,-0.103493,0.0
1881,1.350463,0.0
1882,-0.129669,0.0
1883,0.167433,0.0
1884,1.604587,0.0
1885,0.720846,0.0
1886,-0.834563,0.0
1887,-1.01326,0.0
1888,-0.87439,0.0
1889,-0.887953,0.0
1890,-0.105441,0.0
1891,1.443883,0.0
1892,0.006289,0.0
1893,0.050519,0.0
1894,1.560707,0.0
1895,0.64101,0.0
1896,-0.808131,0.0
1897,-1.039388,0.0
1898,-0.786417,0.0
1899,-0.963032,0.0
1900,-0.120318,0.0
1901,1.487455,0.0
1902,0.073146,0.0
1903,-0.106777,0.0
1904,1.505424,0.0
1905,0.66794,0.0
1906,-0.840982,0.0
1907,-0.958676,0.0
1908,-0.895693,0.0
1909,-0.811518,0.0
1910,-0.105541,0.0
1911,1.431776,0.0
1912,-0.1485,0.0
1913,0.215862,0.0
1914,1.596038,0.0
1915,0.58657,0.0
1916,-0.824098,0.0
1917,-1.019653,0.0
1918,-0.872822,0.0
1919,-0.85963,0.0
1920,-0.1107,0.0
1921,1.479383,0.0
1922,-0.004513,0.0
1923,-0.04299,0.0
1924,1.51432,0.0
1925,0.707255,0.0
1926,-0.776951,0.0
1927,-1.032646,0.0
1928,-0.821772,0.0
1929,-0.911387,0.0
1930,-0.11233,0.0
1931,1.448497,0.0
1932,-0.086616,0.0
1933,0.071883,0.0
1934,1.565105,0.0
1935,0.656978,0.0
1936,-0.723347,0.0
1937,-1.059792,0.0
1938,-0.756248,0.0
1939,-1.00413,0.0
1940,-0.080204,0.0
1941,1.424862,0.0
1942,-0.11078,0.0
1943,0.078137,0.0
1944,1.525197,0.0
1945,0.679908,0.0
1946,-0.82939,0.0
1947,-0.9447,0.0
1948,-0.961245,0.0
1949,-0.781785,0.0
1950,-0.100848,0.0
1951,1.511027,0.0
1952,0.094723,0.0
1953,-0.183162,0.0
1954,1.462193,0.0
1955,0.710555,0.0
1956,-0.771815,0.0
1957,-0.998601,0.0
1958,-0.86121,0.0
1959,-0.862861,0.0
1960,-0.15248,0.0
1961,1.407032,0.0
1962,-0.192666,0.0
1963,0.16645,0.0
1964,1.578209,0.0
1965,0.64076,0.0
1966,-0.745452,0.0
1967,-1.038318,0.0
1968,-0.918531,0.0
1969,-0.745004,0.0
1970,-0.132269,0.0
1971,1.537202,0.0
1972,0.17089,0.0
1973,-0.18221,0.0
1974,1.441829,0.0
1975,0.653214,0.0
1976,-0.779369,0.0
1977,-0.985213,0.0
1978,-0.769033,0.0
1979,-0.955041,0.0
1980,-0.138537,0.0
1981,1.465231,0.0
1982,0.009635,0.0
1983,0.058932,0.0
1984,1.54815,0.0
1985,0.64044,0.0
1986,-0.798021,0.0
1987,-0.987697,0.0
1988,-0.924804,0.0
1989,-0.873329,0.0
1990,-0.104193,0.0
1991,1.51879,0.0
1992,0.12401,0.0
1993,-0.146606,0.0
1994,1.460807,0.0
1995,0.651873,0.0
1996,-0.736363,0.0
1997,-1.027272,0.0
1998,-0.75698,0.0
1999,-0.984064,0.0
2000,-0.09288,0.0
2001,1.404395,0.0
2002,-0.20732,0.0
2003,0.23693,0.0
2004,1.622073,0.0
2005,0.561535,0.0
2006,-0.850827,0.0
2007,-0.943025,0.0
2008,-0.991133,0.0
2009,-0.739749,0.0
2010,-0.100726,0.0
2011,1.436313,0.0
2012,-0.072359,0.0
2013,0.115542,0.0
2014,1.551851,0.0
2015,0.645721,0.0
2016,-0.777144,0.0
2017,-1.032947,0.0
2018,-0.946201,0.0
2019,-0.82005,0.0
2020,-0.034813,0.0
2021,1.350201,0.0
2022,-0.085542,0.0
2023,0.165879,0.0
2024,1.587837,0.0
2025,0.725308,0.0
2026,-0.822316,0.0
2027,-1.028881,0.0
2028,-0.884703,0.0
2029,-0.97297,0.0
2030,-0.095161,0.0
2031,1.316535,0.0
2032,-0.062675,0.0
2033,0.26619,0.0
2034,1.584721,0.0
2035,0.698714,0.0
2036,-0.862507,0.0
2037,-1.019746,0.0
2038,-0.894753,0.0
2039,-0.931318,0.0
2040,-0.059223,0.0
2041,1.389905,0.0
2042,-0.144821,0.0
2043,0.264125,0.0
2044,1.5932,0.0
2045,0.63666,0.0
2046,-0.828858,0.0
2047,-1.038306,0.0
2048,-0.85706,0.0
2049,-0.955623,0.0
2050,-0.131613,0.0
2051,1.411844,0.0
2052,-0.196786,0.0
2053,0.172569,0.0
2054,1.543996,0.0
2055,0.669471,0.0
2056,-0.802618,0.0
2057,-0.985199,0.0
2058,-0.945521,0.0
2059,-0.736143,0.0
2060,0.06488,0.0
2061,1.418057,0.0
2062,0.182442,0.0
2063,0.128946,0.0
2064,1.476248,0.0
2065,0.723115,0.0
2066,-0.88298,0.0
2067,-1.036903,0.0
2068,-1.036903,0.0
2069,-1.036903,0.0
2070,0.111361,0.0
2071,1.429268,0.0
2072,0.277783,0.0
2073,0.100943,0.0
2074,1.393034,0.0
2075,0.759582,0.0
2076,-0.88912,0.0
2077,-1.06095,0.0
2078,-1.06095,0.0
2079,-1.06095,0.0
2080,0.075908,0.0
2081,1.373416,0.0
2082,0.063586,0.0
2083,0.283173,0.0
2084,1.518644,0.0
2085,0.692756,0.0
2086,-0.890491,0.0
2087,-1.038997,0.0
2088,-1.038997,0.0
2089,-1.038997,0.0
2090,0.083747,0.0
2091,1.361774,0.0
2092,0.078004,0.0
2093,0.233198,0.0
2094,1.535089,0.0
2095,0.69604,0.0
2096,-0.896728,0.0
2097,-1.030375,0.0
2098,-1.030375,0.0
2099,-1.030375,0.0
2100,0.1006,0.0
2101,1.366015,0.0
2102,0.121723,0.0
2103,0.19999,0.0
2104,1.462005,0.0
2105,0.778,0.0
2106,-0.883561,0.0
2107,-1.048258,0.0
2108,-1.048258,0.0
2109,-1.048258,0.0
2110,-0.160556,1.0
2111,1.476501,0.0
2112,0.159156,0.0
2113,-0.133409,0.0
2114,1.460708,0.0
2115,0.708748,0.0
2116,-0.969579,0.0
2117,-0.86056,0.0
2118,-1.110954,0.0
2119,-0.570057,0.0
2120,-0.10272,0.0
2121,1.439121,0.0
2122,-0.076892,0.0
2123,0.076412,0.0
2124,1.557499,0.0
2125,0.682196,0.0
2126,-0.762596,0.0
2127,-1.034371,0.0
2128,-0.769898,0.0
2129,-1.008751,0.0
2130,-0.075401,0.0
2131,1.449724,0.0
2132,-0.16166,0.0
2133,0.022864,0.0
2134,1.570625,0.0
2135,0.661264,0.0
2136,-0.755407,0.0
2137,-1.006342,0.0
2138,-0.791165,0.0
2139,-0.914501,0.0
2140,-0.129582,0.0
2141,1.457176,0.0
2142,-0.119218,0.0
2143,0.041605,0.0
2144,1.57937,0.0
2145,0.606472,0.0
2146,-0.718315,0.0
2147,-0.984883,0.0
2148,-0.78474,0.0
2149,-0.947885,0.0
2150,-0.105194,0.0
2151,1.507826,0.0
2152,-0.028925,0.0
2153,-0.030807,0.0
2154,1.46589,0.0
2155,0.687728,0.0
2156,-0.76957,0.0
2157,-0.990442,0.0
2158,-0.879969,0.0
2159,-0.856537,0.0
2160,-0.167916,0.0
2161,1.552409,0.0
2162,0.208886,0.0
2163,-0.28487,0.0
2164,1.413749,0.0
2165,0.699876,0.0
2166,-0.769704,0.0
2167,-0.966279,0.0
2168,-0.749927,0.0
2169,-0.936225,0.0
2170,-0.1127,0.0
2171,1.519177,0.0
2172,0.093869,0.0
2173,-0.177583,0.0
2174,1.497917,0.0
2175,0.664749,0.0
2176,-0.784989,0.0
2177,-0.97098,0.0
2178,-0.804108,0.0
2179,-0.925351,0.0
2180,-0.110318,0.0
2181,1.395186,0.0
2182,-0.165971,0.0
2183,0.126293,0.0
2184,1.578946,0.0
2185,0.65112,0.0
2186,-0.806022,0.0
2187,-0.977141,0.0
2188,-0.840822,0.0
2189,-0.85127,0.0
2190,-0.131832,0.0
2191,1.512138,0.0
2192,0.217955,0.0
2193,-0.183457,0.0
2194,1.454427,0.0
2195,0.681007,0.0
2196,-0.785799,0.0
2197,-1.0267,0.0
2198,-0.839324,0.0
2199,-0.898414,0.0
2200,-0.174932,0.0
2201,1.439872,0.0
2202,-0.080324,0.0
2203,0.077611,0.0
2204,1.594365,0.0
2205,0.642102,0.0
2206,-0.802723,0.0
2207,-0.982169,0.0
2208,-0.88153,0.0
2209,-0.832274,0.0
2210,-0.136898,0.0
2211,1.487561,0.0
2212,0.242736,0.0
2213,-0.296718,0.0
2214,1.384172,0.0
2215,0.738868,0.0
2216,-0.785047,0.0
2217,-0.97887,0.0
2218,-0.737132,0.0
2219,-0.918672,0.0
2220,-0.13633,0.0
2221,1.516138,0.0
2222,0.158104,0.0
2223,-0.231971,0.0
2224,1.424979,0.0
2225,0.658118,0.0
2226,-0.754631,0.0
2227,-0.932166,0.0
2228,-0.771949,0.0
2229,-0.930292,0.0
2230,-0.095636,0.0
2231,1.454671,0.0
2232,-0.119442,0.0
2233,0.078248,0.0
2234,1.497996,0.0
2235,0.628555,0.0
2236,-0.776747,0.0
2237,-0.963945,0.0
2238,-0.832669,0.0
2239,-0.871031,0.0
2240,-0.124515,0.0
2241,1.39789,0.0
2242,-0.090401,0.0
2243,0.115009,0.0
2244,1.478079,0.0
2245,0.709412,0.0
2246,-0.995397,0.0
2247,-0.881758,0.0
2248,-0.924368,0.0
2249,-0.683951,0.0
2250,-0.157934,0.0
2251,1.468812,0.0
2252,0.029899,0.0
2253,-0.056489,0.0
2254,1.499531,0.0
2255,0.724318,0.0
2256,-0.772282,0.0
2257,-0.998893,0.0
2258,-0.869164,0.0
2259,-0.867797,0.0
2260,-0.143419,0.0
2261,1.523776,0.0
2262,0.034709,0.0
2263,-0.09626,0.0
2264,1.464234,0.0
2265,0.667493,0.0
2266,-0.783592,0.0
2267,-1.007716,0.0
2268,-0.748719,0.0
2269,-0.910506,0.0
2270,-0.104889,0.0
2271,1.419236,0.0
2272,-0.036382,0.0
2273,0.082661,0.0
2274,1.467779,0.0
2275,0.754284,0.0
2276,-0.735843,0.0
2277,-1.100211,0.0
2278,-0.7222,0.0
2279,-1.024434,0.0
2280,-0.135862,0.0
2281,1.438974,0.0
2282,-0.178538,0.0
2283,0.092122,0.0
2284,1.586257,0.0
2285,0.656826,0.0
2286,-0.742681,0.0
2287,-1.032842,0.0
2288,-0.849095,0.0
2289,-0.83516,0.0
2290,-0.168111,0.0
2291,1.466026,0.0
2292,0.114248,0.0
2293,-0.127708,0.0
2294,1.497043,0.0
2295,0.701456,0.0
2296,-0.798765,0.0
2297,-0.918647,0.0
2298,-0.8595,0.0
2299,-0.906044,0.0
2300,-0.168777,0.0
2301,1.433702,0.0
2302,-0.009973,0.0
2303,-0.033812,0.0
2304,1.471394,0.0
2305,0.752886,0.0
2306,-0.798909,0.0
2307,-0.933454,0.0
2308,-0.732584,0.0
2309,-0.980474,0.0
2310,-0.094215,0.0
2311,1.473156,0.0
2312,0.065254,0.0
2313,-0.106157,0.0
2314,1.47526,0.0
2315,0.698507,0.0
2316,-0.764793,0.0
2317,-1.011252,0.0
2318,-0.806965,0.0
2319,-0.928795,0.0
2320,-0.148027,0.0
2321,1.418019,0.0
2322,-0.113906,0.0
2323,0.129838,0.0
2324,1.539444,0.0
2325,0.708652,0.0
2326,-0.760536,0.0
2327,-1.053143,0.0
2328,-0.860809,0.0
2329,-0.859534,0.0
2330,-0.162813,0.0
2331,1.503946,0.0
2332,0.126752,0.0
2333,-0.213288,0.0
2334,1.455976,0.0
2335,0.717936,0.0
2336,-0.769549,0.0
2337,-1.019374,0.0
2338,-0.755184,0.0
2339,-0.884402,0.0
2340,-0.103296,0.0
2341,1.49455,0.0
2342,0.092975,0.0
2343,-0.061201,0.0
2344,1.451887,0.0
2345,0.68341,0.0
2346,-0.757379,0.0
2347,-1.053068,0.0
2348,-0.772159,0.0
2349,-0.975719,0.0
2350,0.072003,0.0
2351,1.401115,0.0
2352,0.093709,0.0
2353,0.225104,0.0
2354,1.463991,0.0
2355,0.747126,0.0
2356,-0.884463,0.0
2357,-1.039528,0.0
2358,-1.039528,0.0
2359,-1.039528,0.0
2360,0.090997,0.0
2361,1.318812,0.0
2362,0.037567,0.0
2363,0.304727,0.0
2364,1.500078,0.0
2365,0.787615,0.0
2366,-0.882865,0.0
2367,-1.05231,0.0
2368,-1.05231,0.0
2369,-1.05231,0.0
2370,0.09889,0.0
2371,1.371569,0.0
2372,0.170096,0.0
2373,0.196743,0.0
2374,1.482687,0.0
2375,0.707667,0.0
2376,-0.892572,0.0
2377,-1.045027,0.0
2378,-1.045027,0.0
2379,-1.045027,0.0
2380,0.069154,0.0
2381,1.404165,0.0
2382,0.260346,0.0
2383,0.127221,0.0
2384,1.45153,0.0
2385,0.724978,0.0
2386,-0.889313,0.0
2387,-1.04936,0.0
2388,-1.04936,0.0
2389,-1.04936,0.0
2390,0.005684,0.0
2391,1.362333,0.0
2392,0.086794,0.0
2393,0.237822,0.0
2394,1.546333,0.0
2395,0.725107,0.0
2396,-0.885173,0.0
2397,-1.0263,0.0
2398,-1.0263,0.0
2399,-1.0263,0.0
2400,0.097146,0.0
2401,1.336442,0.0
2402,0.065791,0.0
2403,0.340215,0.0
2404,1.449859,0.0
2405,0.769489,0.0
2406,-0.895373,0.0
2407,-1.054523,0.0
2408,-1.054523,0.0
2409,-1.054523,0.0
2410,0.071468,0.0
2411,1.45429,0.0
2412,0.30603,0.0
2413,-0.033704,0.0
2414,1.428244,0.0
2415,0.750246,0.0
2416,-0.88197,0.0
2417,-1.031534,0.0
2418,-1.031534,0.0
2419,-1.031534,0.0
2420,0.064656,0.0
2421,1.419231,0.0
2422,0.090965,0.0
2423,0.144391,0.0
2424,1.511548,0.0
2425,0.705085,0.0
2426,-0.881928,0.0
2427,-1.017982,0.0
2428,-1.017982,0.0
2429,-1.017982,0.0
2430,0.065069,0.0
2431,1.34115,0.0
2432,0.016041,0.0
2433,0.360184,0.0
2434,1.519344,0.0
2435,0.708719,0.0
2436,-0.890289,0.0
2437,-1.040072,0.0
2438,-1.040072,0.0
2439,-1.040072,0.0
2440,0.082906,0.0
2441,1.420541,0.0
2442,0.310068,0.0
2443,0.078942,0.0
2444,1.419251,0.0
2445,0.723048,0.0
2446,-0.895784,0.0
2447,-1.046324,0.0
2448,-1.046324,0.0
2449,-1.046324,0.0
2450,0.034758,0.0
2451,1.338958,0.0
2452,0.231842,0.0
2453,0.214654,0.0
2454,1.445744,0.0
2455,0.798094,0.0
2456,-0.889805,0.0
2457,-1.058081,0.0
2458,-1.058081,0.0
2459,-1.058081,0.0
2460,0.114792,0.0
2461,1.394856,0.0
2462,0.132297,0.0
2463,0.207661,0.0
2464,1.436922,0.0
2465,0.764378,0.0
2466,-0.885929,0.0
2467,-1.054992,0.0
2468,-1.054992,0.0
2469,-1.054992,0.0
2470,0.129478,0.0
2471,1.266654,0.0
2472,-0.042513,0.0
2473,0.481016,0.0
2474,1.456317,0.0
2475,0.788676,0.0
2476,-0.894061,0.0
2477,-1.061856,0.0
2478,-1.061856,0.0
2479,-1.061856,0.0
2480,0.089166,0.0
2481,1.31927,0.0
2482,0.09147,0.0
2483,0.310317,0.0
2484,1.497028,0.0
2485,0.752853,0.0
2486,-0.893078,0.0
2487,-1.055675,0.0
2488,-1.055675,0.0
2489,-1.055675,0.0
2490,0.082217,0.0
2491,1.338299,0.0
2492,0.162233,0.0
2493,0.211255,0.0
2494,1.438944,0.0
2495,0.832759,0.0
2496,-0.891314,0.0
2497,-1.058131,0.0
2498,-1.058131,0.0
2499,-1.058131,0.0
2500,0.102809,0.0
2501,1.361322,0.0
2502,0.170128,0.0
2503,0.23017,0.0
2504,1.457283,0.0
2505,0.745207,0.0
2506,-0.895257,0.0
2507,-1.057221,0.0
2508,-1.057221,0.0
2509,-1.057221,0.0
2510,0.074011,0.0
2511,1.34636,0.0
2512,0.091473,0.0
2513,0.280595,0.0
2514,1.495133,0.0
2515,0.745298,0.0
2516,-0.887737,0.0
2517,-1.048378,0.0
2518,-1.048378,0.0
2519,-1.048378,0.0
2520,0.06153,0.0
2521,1.388771,0.0
2522,0.256634,0.0
2523,0.104204,0.0
2524,1.49698,0.0
2525,0.711071,0.0
2526,-0.884088,0.0
2527,-1.045034,0.0
2528,-1.045034,0.0
2529,-1.045034,0.0
2530,0.037246,0.0
2531,1.301622,0.0
2532,-0.04987,0.0
2533,0.383972,0.0
2534,1.57635,0.0
2535,0.725637,0.0
2536,-0.888538,0.0
2537,-1.028806,0.0
2538,-1.028806,0.0
2539,-1.028806,0.0
2540,0.057342,0.0
2541,1.38789,0.0
2542,0.128236,0.0
2543,0.290559,0.0
2544,1.46719,0.0
2545,0.715192,0.0
2546,-0.892618,0.0
2547,-1.051264,0.0
2548,-1.051264,0.0
2549,-1.051264,0.0
2550,0.101393,0.0
2551,1.345625,0.0
2552,0.082013,0.0
2553,0.267916,0.0
2554,1.455305,0.0
2555,0.81146,0.0
2556,-0.889217,0.0
2557,-1.058164,0.0
2558,-1.058164,0.0
2559,-1.058164,0.0
2560,0.066714,0.0
2561,1.356122,0.0
2562,0.065497,0.0
2563,0.325752,0.0
2564,1.53014,0.0
2565,0.676799,0.0
2566,-0.890627,0.0
2567,-1.043466,0.0
2568,-1.043466,0.0
2569,-1.043466,0.0
2570,0.062991,0.0
2571,1.30632,0.0
2572,0.045287,0.0
2573,0.394186,0.0
2574,1.523875,0.0
2575,0.70715,0.0
2576,-0.889264,0.0
2577,-1.050182,0.0
2578,-1.050182,0.0
2579,-1.050182,0.0
2580,0.085291,0.0
2581,1.343923,0.0
2582,0.036077,0.0
2583,0.326398,0.0
2584,1.517804,0.0
2585,0.703411,0.0
2586,-0.894015,0.0
2587,-1.03963,0.0
2588,-1.03963,0.0
2589,-1.03963,0.0
2590,0.106199,0.0
2591,1.309095,0.0
2592,0.0278,0.0
2593,0.434633,0.0
2594,1.439647,0.0
2595,0.763208,0.0
2596,-0.897028,0.0
2597,-1.061184,0.0
2598,-1.061184,0.0
2599,-1.061184,0.0
2600,0.082427,0.0
2601,1.375987,0.0
2602,0.034211,0.0
2603,0.23064,0.0
2604,1.512014,0.0
2605,0.74358,0.0
2606,-0.885372,0.0
2607,-1.031162,0.0
2608,-1.031162,0.0
2609,-1.031162,0.0
2610,0.096167,0.0
2611,1.388718,0.0
2612,0.213283,0.0
2613,0.146478,0.0
2614,1.473905,0.0
2615,0.730146,0.0
2616,-0.886948,0.0
2617,-1.053916,0.0
2618,-1.053916,0.0
2619,-1.053916,0.0
2620,0.085329,0.0
2621,1.370562,0.0
2622,0.288248,0.0
2623,0.152777,0.0
2624,1.429238,0.0
2625,0.741197,0.0
2626,-0.896681,0.0
2627,-1.05689,0.0
2628,-1.05689,0.0
2629,-1.05689,0.0
2630,0.040791,0.0
2631,1.364752,0.0
2632,0.135683,0.0
2633,0.205129,0.0
2634,1.502862,0.0
2635,0.744301,0.0
2636,-0.886958,0.0
2637,-1.03552,0.0
2638,-1.03552,0.0
2639,-1.03552,0.0
2640,0.06734,0.0
2641,1.336372,0.0
2642,-0.017387,0.0
2643,0.346742,0.0
2644,1.568459,0.0
2645,0.665393,0.0
2646,-0.887669,0.0
2647,-1.026417,0.0
2648,-1.026417,0.0
2649,-1.026417,0.0
2650,0.093447,0.0
2651,1.396005,0.0
2652,0.289081,0.0
2653,0.124524,0.0
2654,1.434968,0.0
2655,0.730565,0.0
2656,-0.894508,0.0
2657,-1.058028,0.0
2658,-1.058028,0.0
2659,-1.058028,0.0
2660,0.051688,0.0
2661,1.403582,0.0
2662,0.103014,0.0
2663,0.189741,0.0
2664,1.53409,0.0
2665,0.671297,0.0
2666,-0.891064,0.0
2667,-1.020782,0.0
2668,-1.020782,0.0
2669,-1.020782,0.0
2670,0.055015,0.0
2671,1.345553,0.0
2672,0.043466,0.0
2673,0.335795,0.0
2674,1.51926,0.0
2675,0.709084,0.0
2676,-0.88609,0.0
2677,-1.040694,0.0
2678,-1.040694,0.0
2679,-1.040694,0.0
2680,0.106374,0.0
2681,1.266146,0.0
2682,-0.111132,0.0
2683,0.518096,0.0
2684,1.534408,0.0
2685,0.704427,0.0
2686,-0.892195,0.0
2687,-1.042042,0.0
2688,-1.042042,0.0
2689,-1.042042,0.0
2690,0.123587,0.0
2691,1.340773,0.0
2692,0.076298,0.0
2693,0.289481,0.0
2694,1.480835,0.0
2695,0.761415,0.0
2696,-0.889348,0.0
2697,-1.061014,0.0
2698,-1.061014,0.0
2699,-1.061014,0.0
2700,0.101734,0.0
2701,1.391807,0.0
2702,0.149833,0.0
2703,0.179446,0.0
2704,1.483764,0.0
2705,0.712759,0.0
2706,-0.886848,0.0
2707,-1.044165,0.0
2708,-1.044165,0.0
2709,-1.044165,0.0
2710,0.087218,0.0
2711,1.354995,0.0
2712,0.144874,0.0
2713,0.227134,0.0
2714,1.479697,0.0
2715,0.740293,0.0
2716,-0.889832,0.0
2717,-1.048126,0.0
2718,-1.048126,0.0
2719,-1.048126,0.0
2720,0.070488,0.0
2721,1.31722,0.0
2722,0.085921,0.0
2723,0.326283,0.0
2724,1.49664,0.0
2725,0.7503,0.0
2726,-0.892594,0.0
2727,-1.051419,0.0
2728,-1.051419,0.0
2729,-1.051419,0.0
2730,0.116139,0.0
2731,1.330723,0.0
2732,0.109125,0.0
2733,0.290715,0.0
2734,1.459673,0.0
2735,0.778809,0.0
2736,-0.894583,0.0
2737,-1.063534,0.0
2738,-1.063534,0.0
2739,-1.063534,0.0
2740,0.073974,0.0
2741,1.331705,0.0
2742,0.036127,0.0
2743,0.313025,0.0
2744,1.529064,0.0
2745,0.705021,0.0
2746,-0.892001,0.0
2747,-1.032305,0.0
2748,-1.032305,0.0
2749,-1.032305,0.0
2750,0.109211,0.0
2751,1.39085,0.0
2752,0.207174,0.0
2753,0.162643,0.0
2754,1.463225,0.0
2755,0.707057,0.0
2756,-0.895284,0.0
2757,-1.048292,0.0
2758,-1.048292,0.0
2759,-1.048292,0.0
2760,0.069524,0.0
2761,1.344557,0.0
2762,0.095665,0.0
2763,0.280063,0.0
2764,1.483612,0.0
2765,0.76011,0.0
2766,-0.89129,0.0
2767,-1.047414,0.0
2768,-1.047414,0.0
2769,-1.047414,0.0
2770,0.096262,0.0
2771,1.446648,0.0
2772,0.419913,0.0
2773,-0.035836,0.0
2774,1.364149,0.0
2775,0.743121,0.0
2776,-0.890184,0.0
2777,-1.048025,0.0
2778,-1.048025,0.0
2779,-1.048025,0.0
2780,0.073666,0.0
2781,1.370883,0.0
2782,0.131042,0.0
2783,0.248157,0.0
2784,1.494398,0.0
2785,0.703512,0.0
2786,-0.900008,0.0
2787,-1.04055,0.0
2788,-1.04055,0.0
2789,-1.04055,0.0
2790,0.077792,0.0
2791,1.371537,0.0
2792,0.119628,0.0
2793,0.196688,0.0
2794,1.496735,0.0
2795,0.73841,0.0
2796,-0.892418,0.0
2797,-1.036124,0.0
2798,-1.036124,0.0
2799,-1.036124,0.0
2800,0.062525,0.0
2801,1.34676,0.0
2802,0.084978,0.0
2803,0.269747,0.0
2804,1.493981,0.0
2805,0.753767,0.0
2806,-0.893621,0.0
2807,-1.039379,0.0
2808,-1.039379,0.0
2809,-1.039379,0.0
2810,0.061672,0.0
2811,1.319979,0.0
2812,0.070876,0.0
2813,0.292392,0.0
2814,1.501213,0.0
2815,0.775496,0.0
2816,-0.888239,0.0
2817,-1.044463,0.0
2818,-1.044463,0.0
2819,-1.044463,0.0
2820,0.078493,0.0
2821,1.383995,0.0
2822,0.185256,0.0
2823,0.181862,0.0
2824,1.42595,0.0
2825,0.791542,0.0
2826,-0.885749,0.0
2827,-1.053783,0.0
2828,-1.053783,0.0
2829,-1.053783,0.0
2830,0.086418,0.0
2831,1.381454,0.0
2832,0.207983,0.0
2833,0.22982,0.0
2834,1.438422,0.0
2835,0.72568,0.0
2836,-0.895503,0.0
2837,-1.058091,0.0
2838,-1.058091,0.0
2839,-1.058091,0.0
2840,0.087925,0.0
2841,1.343139,0.0
2842,0.066031,0.0
2843,0.355687,0.0
2844,1.523289,0.0
2845,0.669922,0.0
2846,-0.901824,0.0
2847,-1.048057,0.0
2848,-1.048057,0.0
2849,-1.048057,0.0
2850,0.076777,0.0
2851,1.35368,0.0
2852,0.111264,0.0
2853,0.188689,0.0
2854,1.446405,0.0
2855,0.835201,0.0
2856,-0.891117,0.0
2857,-1.0403,0.0
2858,-1.0403,0.0
2859,-1.0403,0.0
2860,0.117359,0.0
2861,1.302966,0.0
2862,0.089333,0.0
2863,0.375396,0.0
2864,1.448479,0.0
2865,0.78486,0.0
2866,-0.887526,0.0
2867,-1.076955,0.0
2868,-1.076955,0.0
2869,-1.076955,0.0
2870,0.090779,0.0
2871,1.331572,0.0
2872,0.044201,0.0
2873,0.355546,0.0
2874,1.497711,0.0
2875,0.716711,0.0
2876,-0.896856,0.0
2877,-1.046555,0.0
2878,-1.046555,0.0
2879,-1.046555,0.0
2880,0.108911,0.0
2881,1.413894,0.0
2882,0.255456,0.0
2883,0.109528,0.0
2884,1.424632,0.0
2885,0.729096,0.0
2886,-0.892881,0.0
2887,-1.049545,0.0
2888,-1.049545,0.0
2889,-1.049545,0.0
2890,0.057764,0.0
2891,1.288886,0.0
2892,0.022111,0.0
2893,0.412095,0.0
2894,1.521415,0.0
2895,0.735896,0.0
2896,-0.886848,0.0
2897,-1.05044,0.0
2898,-1.05044,0.0
2899,-1.05044,0.0
2900,0.10499,0.0
2901,1.400032,0.0
2902,0.258058,0.0
2903,0.109379,0.0
2904,1.405027,0.0
2905,0.76945,0.0
2906,-0.893812,0.0
2907,-1.051041,0.0
2908,-1.051041,0.0
2909,-1.051041,0.0
2910,0.049396,0.0
2911,1.392688,0.0
2912,0.124636,0.0
2913,0.170439,0.0
2914,1.525093,0.0
2915,0.693992,0.0
2916,-0.885004,0.0
2917,-1.023747,0.0
2918,-1.023747,0.0
2919,-1.023747,0.0
2920,0.035546,0.0
2921,1.361846,0.0
2922,0.177078,0.0
2923,0.193172,0.0
2924,1.486985,0.0
2925,0.778536,0.0
2926,-0.880327,0.0
2927,-1.050946,0.0
2928,-1.050946,0.0
2929,-1.050946,0.0
2930,0.107247,0.0
2931,1.253654,0.0
2932,-0.033951,0.0
2933,0.546913,0.0
2934,1.430515,0.0
2935,0.812778,0.0
2936,-0.893723,0.0
2937,-1.074478,0.0
2938,-1.074478,0.0
2939,-1.074478,0.0
2940,0.129101,0.0
2941,1.286693,0.0
2942,0.002819,0.0
2943,0.442798,0.0
2944,1.465878,0.0
2945,0.77898,0.0
2946,-0.891783,0.0
2947,-1.071496,0.0
2948,-1.071496,0.0
2949,-1.071496,0.0
2950,0.057207,0.0
2951,1.352908,0.0
2952,0.111106,0.0
2953,0.243903,0.0
2954,1.510066,0.0
2955,0.735302,0.0
2956,-0.887036,0.0
2957,-1.041152,0.0
2958,-1.041152,0.0
2959,-1.041152,0.0
2960,0.09274,0.0
2961,1.347478,0.0
2962,0.088366,0.0
2963,0.263021,0.0
2964,1.476253,0.0
2965,0.768241,0.0
2966,-0.887066,0.0
2967,-1.049678,0.0
2968,-1.049678,0.0
2969,-1.049678,0.0
2970,0.090532,0.0
2971,1.296038,0.0
2972,0.119265,0.0
2973,0.361208,0.0
2974,1.435855,0.0
2975,0.802387,0.0
2976,-0.892277,0.0
2977,-1.071003,0.0
2978,-1.071003,0.0
2979,-1.071003,0.0
2980,0.007235,0.0
2981,1.366267,0.0
2982,0.097877,0.0
2983,0.286884,0.0
2984,1.508611,0.0
2985,0.713918,0.0
2986,-0.889364,0.0
2987,-1.030476,0.0
2988,-1.030476,0.0
2989,-1.030476,0.0
2990,0.076421,0.0
2991,1.412415,0.0
2992,0.141872,0.0
2993,0.159512,0.0
2994,1.455466,0.0
2995,0.757798,0.0
2996,-0.883146,0.0
2997,-1.040113,0.0
2998,-1.040113,0.0
2999,-1.040113,0.0
3000,0.06161,0.0
3001,1.323806,0.0
3002,0.046236,0.0
3003,0.264751,0.0
3004,1.557717,0.0
3005,0.711591,0.0
3006,-0.887236,0.0
3007,-1.026158,0.0
3008,-1.026158,0.0
3009,-1.026158,0.0
3010,0.074107,0.0
3011,1.408292,0.0
3012,0.097043,0.0
3013,0.215187,0.0
3014,1.510965,0.0
3015,0.68078,0.0
3016,-0.888029,0.0
3017,-1.032782,0.0
3018,-1.032782,0.0
3019,-1.032782,0.0
3020,0.115174,0.0
3021,1.337256,0.0
3022,0.132384,0.0
3023,0.265106,0.0
3024,1.511731,0.0
3025,0.698292,0.0
3026,-0.892928,0.0
3027,-1.055671,0.0
3028,-1.055671,0.0
3029,-1.055671,0.0
3030,0.09473,0.0
3031,1.362627,0.0
3032,0.190423,0.0
3033,0.181431,0.0
3034,1.453754,0.0
3035,0.781814,0.0
3036,-0.893194,0.0
3037,-1.057195,0.0
3038,-1.057195,0.0
3039,-1.057195,0.0
3040,0.032487,0.0
3041,1.44358,0.0
3042,0.242479,0.0
3043,0.021997,0.0
3044,1.51187,0.0
3045,0.664285,0.0
3046,-0.880999,0.0
3047,-1.0119,0.0
3048,-1.0119,0.0
3049,-1.0119,0.0
3050,0.063712,0.0
3051,1.421872,0.0
3052,0.380634,0.0
3053,0.003941,0.0
3054,1.400063,0.0
3055,0.760739,0.0
3056,-0.891676,0.0
3057,-1.046428,0.0
3058,-1.046428,0.0
3059,-1.046428,0.0
3060,0.112327,0.0
3061,1.357664,0.0
3062,0.178889,0.0
3063,0.204025,0.0
3064,1.434347,0.0
3065,0.7769,0.0
3066,-0.894409,0.0
3067,-1.056581,0.0
3068,-1.056581,0.0
3069,-1.056581,0.0
3070,0.076941,0.0
3071,1.379701,0.0
3072,0.14345,0.0
3073,0.147752,0.0
3074,1.460022,0.0
3075,0.795448,0.0
3076,-0.88938,0.0
3077,-1.037978,0.0
3078,-1.037978,0.0
3079,-1.037978,0.0
3080,0.054617,0.0
3081,1.404684,0.0
3082,0.181494,0.0
3083,0.17426,0.0
3084,1.477395,0.0
3085,0.697639,0.0
3086,-0.892525,0.0
3087,-1.032521,0.0
3088,-1.032521,0.0
3089,-1.032521,0.0
3090,0.092261,0.0
3091,1.362734,0.0
3092,0.133194,0.0
3093,0.182937,0.0
3094,1.484151,0.0
3095,0.757504,0.0
3096,-0.891466,0.0
3097,-1.040438,0.0
3098,-1.040438,0.0
3099,-1.040438,0.0
3100,0.048414,0.0
3101,1.331812,0.0
3102,-0.001482,0.0
3103,0.345314,0.0
3104,1.531307,0.0
3105,0.742076,0.0
3106,-0.883713,0.0
3107,-1.037909,0.0
3108,-1.037909,0.0
3109,-1.037909,0.0
3110,0.069933,0.0
3111,1.39858,0.0
3112,0.236882,0.0
3113,0.13995,0.0
3114,1.429275,0.0
3115,0.763004,0.0
3116,-0.89024,0.0
3117,-1.049128,0.0
3118,-1.049128,0.0
3119,-1.049128,0.0
3120,0.07603,0.0
3121,1.44721,0.0
3122,0.249647,0.0
3123,0.080225,0.0
3124,1.449061,0.0
3125,0.699462,0.0
3126,-0.886215,0.0
3127,-1.038473,0.0
3128,-1.038473,0.0
3129,-1.038473,0.0
3130,0.098745,0.0
3131,1.248787,0.0
3132,-0.046007,0.0
3133,0.469268,0.0
3134,1.524985,0.0
3135,0.767582,0.0
3136,-0.891997,0.0
3137,-1.057121,0.0
3138,-1.057121,0.0
3139,-1.057121,0.0
3140,0.048091,0.0
3141,1.365621,0.0
3142,0.110439,0.0
3143,0.184769,0.0
3144,1.538964,0.0
3145,0.708234,0.0
3146,-0.882982,0.0
3147,-1.024378,0.0
3148,-1.024378,0.0
3149,-1.024378,0.0
3150,0.113864,0.0
3151,1.307262,0.0
3152,0.084493,0.0
3153,0.320639,0.0
3154,1.467791,0.0
3155,0.801467,0.0
3156,-0.888219,0.0
3157,-1.069099,0.0
3158,-1.069099,0.0
3159,-1.069099,0.0
3160,0.059474,0.0
3161,1.368682,0.0
3162,0.158849,0.0
3163,0.288813,0.0
3164,1.464933,0.0
3165,0.733632,0.0
3166,-0.887728,0.0
3167,-1.062218,0.0
3168,-1.062218,0.0
3169,-1.062218,0.0
3170,0.106268,0.0
3171,1.324276,0.0
3172,0.091019,0.0
3173,0.315978,0.0
3174,1.471353,0.0
3175,0.763356,0.0
3176,-0.892429,0.0
3177,-1.05994,0.0
3178,-1.05994,0.0
3179,-1.05994,0.0
3180,0.092196,0.0
3181,1.345716,0.0
3182,0.178197,0.0
3183,0.190389,0.0
3184,1.472111,0.0
3185,0.763452,0.0
3186,-0.893481,0.0
3187,-1.049527,0.0
3188,-1.049527,0.0
3189,-1.049527,0.0
3190,0.094283,0.0
3191,1.349034,0.0
3192,0.086262,0.0
3193,0.260378,0.0
3194,1.505026,0.0
3195,0.720081,0.0
3196,-0.893899,0.0
3197,-1.040388,0.0
3198,-1.040388,0.0
3199,-1.040388,0.0
3200,0.05595,0.0
3201,1.447165,0.0
3202,0.245147,0.0
3203,-0.011276,0.0
3204,1.450266,0.0
3205,0.757838,0.0
3206,-0.878128,0.0
3207,-1.022321,0.0
3208,-1.022321,0.0
3209,-1.022321,0.0
3210,0.069411,0.0
3211,1.325624,0.0
3212,0.041877,0.0
3213,0.301104,0.0
3214,1.51493,0.0
3215,0.752885,0.0
3216,-0.88971,0.0
3217,-1.038707,0.0
3218,-1.038707,0.0
3219,-1.038707,0.0
3220,0.045343,0.0
3221,1.378325,0.0
3222,0.096124,0.0
3223,0.247497,0.0
3224,1.469434,0.0
3225,0.763858,0.0
3226,-0.887651,0.0
3227,-1.037643,0.0
3228,-1.037643,0.0
3229,-1.037643,0.0
3230,0.069327,0.0
3231,1.315172,0.0
3232,0.06888,0.0
3233,0.298356,0.0
3234,1.517248,0.0
3235,0.75014,0.0
3236,-0.894553,0.0
3237,-1.041523,0.0
3238,-1.041523,0.0
3239,-1.041523,0.0
3240,0.108588,0.0
3241,1.337665,0.0
3242,0.052269,0.0
3243,0.34421,0.0
3244,1.434005,0.0
3245,0.783457,0.0
3246,-0.897878,0.0
3247,-1.054106,0.0
3248,-1.054106,0.0
3249,-1.054106,0.0
3250,0.044749,0.0
3251,1.401416,0.0
3252,0.296035,0.0
3253,0.046599,0.0
3254,1.43722,0.0
3255,0.796874,0.0
3256,-0.889862,0.0
3257,-1.044344,0.0
3258,-1.044344,0.0
3259,-1.044344,0.0
3260,-0.056768,0.0
3261,1.41391,0.0
3262,0.329694,0.0
3263,0.041347,0.0
3264,1.489469,0.0
3265,0.715304,0.0
3266,-0.885424,0.0
3267,-1.015844,0.0
3268,-1.015844,0.0
3269,-1.015844,0.0
3270,0.047522,0.0
3271,1.416547,0.0
3272,0.130875,0.0
3273,0.126162,0.0
3274,1.459107,0.0
3275,0.793983,0.0
3276,-0.881024,0.0
3277,-1.031057,0.0
3278,-1.031057,0.0
3279,-1.031057,0.0
3280,0.096473,0.0
3281,1.330408,0.0
3282,0.031622,0.0
3283,0.360806,0.0
3284,1.482747,0.0
3285,0.733347,0.0
3286,-0.894068,0.0
3287,-1.047112,0.0
3288,-1.047112,0.0
3289,-1.047112,0.0
3290,0.087586,0.0
3291,1.394362,0.0
3292,0.154872,0.0
3293,0.179817,0.0
3294,1.475894,0.0
3295,0.714014,0.0
3296,-0.896764,0.0
3297,-1.036594,0.0
3298,-1.036594,0.0
3299,-1.036594,0.0
3300,0.099663,0.0
3301,1.273295,0.0
3302,0.004237,0.0
3303,0.426791,0.0
3304,1.50055,0.0
3305,0.755818,0.0
3306,-0.89423,0.0
3307,-1.055375,0.0
3308,-1.055375,0.0
3309,-1.055375,0.0
3310,0.076625,0.0
3311,1.333906,0.0
3312,-0.036734,0.0
3313,0.317371,0.0
3314,1.55999,0.0
3315,0.699717,0.0
3316,-0.886439,0.0
3317,-1.021479,0.0
3318,-1.021479,0.0
3319,-1.021479,0.0
3320,0.086169,0.0
3321,1.329796,0.0
3322,0.069265,0.0
3323,0.27657,0.0
3324,1.495112,0.0
3325,0.768731,0.0
3326,-0.887799,0.0
3327,-1.045948,0.0
3328,-1.045948,0.0
3329,-1.045948,0.0
3330,0.034331,0.0
3331,1.318215,0.0
3332,0.004459,0.0
3333,0.343829,0.0
3334,1.52586,0.0
3335,0.760737,0.0
3336,-0.88732,0.0
3337,-1.03337,0.0
3338,-1.03337,0.0
3339,-1.03337,0.0
3340,0.108222,0.0
3341,1.409945,0.0
3342,0.357822,0.0
3343,0.004365,0.0
3344,1.367359,0.0
3345,0.796091,0.0
3346,-0.894497,0.0
3347,-1.049768,0.0
3348,-1.049768,0.0
3349,-1.049768,0.0
3350,0.093408,0.0
3351,1.403249,0.0
3352,0.363228,0.0
3353,0.01377,0.0
3354,1.386996,0.0
3355,0.782485,0.0
3356,-0.893931,0.0
3357,-1.049735,0.0
3358,-1.049735,0.0
3359,-1.049735,0.0
3360,0.056484,0.0
3361,1.390762,0.0
3362,0.184936,0.0
3363,0.150775,0.0
3364,1.501059,0.0
3365,0.725865,0.0
3366,-0.888557,0.0
3367,-1.040441,0.0
3368,-1.040441,0.0
3369,-1.040441,0.0
3370,0.071231,0.0
3371,1.400802,0.0
3372,0.124087,0.0
3373,0.21027,0.0
3374,1.492116,0.0
3375,0.702406,0.0
3376,-0.892028,0.0
3377,-1.036295,0.0
3378,-1.036295,0.0
3379,-1.036295,0.0
3380,0.041205,0.0
3381,1.422951,0.0
3382,0.153338,0.0
3383,0.165353,0.0
3384,1.515315,0.0
3385,0.666933,0.0
3386,-0.887199,0.0
3387,-1.025965,0.0
3388,-1.025965,0.0
3389,-1.025965,0.0
3390,0.084743,0.0
3391,1.366034,0.0
3392,0.127417,0.0
3393,0.224265,0.0
3394,1.532589,0.0
3395,0.656706,0.0
3396,-0.899864,0.0
3397,-1.03063,0.0
3398,-1.03063,0.0
3399,-1.03063,0.0
3400,0.066776,0.0
3401,1.378073,0.0
3402,0.149094,0.0
3403,0.157134,0.0
3404,1.465889,0.0
3405,0.788625,0.0
3406,-0.886816,0.0
3407,-1.039592,0.0
3408,-1.039592,0.0
3409,-1.039592,0.0
3410,0.092967,0.0
3411,1.373268,0.0
3412,0.175422,0.0
3413,0.165238,0.0
3414,1.474002,0.0
3415,0.749742,0.0
3416,-0.895381,0.0
3417,-1.045086,0.0
3418,-1.045086,0.0
3419,-1.045086,0.0
3420,0.051011,0.0
3421,1.347662,0.0
3422,0.052562,0.0
3423,0.333454,0.0
3424,1.497919,0.0
3425,0.732516,0.0
3426,-0.891099,0.0
3427,-1.041341,0.0
3428,-1.041341,0.0
3429,-1.041341,0.0
3430,0.060312,0.0
3431,1.366676,0.0
3432,0.05059,0.0
3433,0.322875,0.0
3434,1.508078,0.0
3435,0.703221,0.0
3436,-0.891766,0.0
3437,-1.039995,0.0
3438,-1.039995,0.0
3439,-1.039995,0.0
3440,0.104952,0.0
3441,1.36619,0.0
3442,0.113572,0.0
3443,0.226716,0.0
3444,1.464562,0.0
3445,0.768079,0.0
3446,-0.891868,0.0
3447,-1.050735,0.0
3448,-1.050735,0.0
3449,-1.050735,0.0
3450,0.099798,0.0
3451,1.372308,0.0
3452,0.181993,0.0
3453,0.148434,0.0
3454,1.458542,0.0
3455,0.764362,0.0
3456,-0.892071,0.0
3457,-1.044455,0.0
3458,-1.044455,0.0
3459,-1.044455,0.0
3460,0.069625,0.0
3461,1.30962,0.0
3462,0.011062,0.0
3463,0.330893,0.0
3464,1.500992,0.0
3465,0.807067,0.0
3466,-0.887063,0.0
3467,-1.047399,0.0
3468,-1.047399,0.0
3469,-1.047399,0.0
3470,0.088898,0.0
3471,1.245789,0.0
3472,-0.056985,0.0
3473,0.543021,0.0
3474,1.491532,0.0
3475,0.74895,0.0
3476,-0.8902,0.0
3477,-1.057002,0.0
3478,-1.057002,0.0
3479,-1.057002,0.0
3480,0.043931,0.0
3481,1.379153,0.0
3482,0.282797,0.0
3483,0.092236,0.0
3484,1.470763,0.0
3485,0.752876,0.0
3486,-0.884981,0.0
3487,-1.045592,0.0
3488,-1.045592,0.0
3489,-1.045592,0.0
3490,0.08305,0.0
3491,1.428472,0.0
3492,0.261144,0.0
3493,0.053075,0.0
3494,1.451679,0.0
3495,0.718664,0.0
3496,-0.888516,0.0
3497,-1.035856,0.0
3498,-1.035856,0.0
3499,-1.035856,0.0
3500,0.098205,0.0
3501,1.43947,0.0
3502,0.291729,0.0
3503,0.005425,0.0
3504,1.40455,0.0
3505,0.764144,0.0
3506,-0.886969,0.0
3507,-1.038852,0.0
3508,-1.038852,0.0
3509,-1.038852,0.0
3510,0.048652,0.0
3511,1.306754,0.0
3512,-0.056767,0.0
3513,0.423519,0.0
3514,1.549805,0.0
3515,0.71106,0.0
3516,-0.886373,0.0
3517,-1.032216,0.0
3518,-1.032216,0.0
3519,-1.032216,0.0
3520,0.09469,0.0
3521,1.327927,0.0
3522,0.012147,0.0
3523,0.343425,0.0
3524,1.493772,0.0
3525,0.746268,0.0
3526,-0.892004,0.0
3527,-1.042075,0.0
3528,-1.042075,0.0
3529,-1.042075,0.0
3530,0.072872,0.0
3531,1.349023,0.0
3532,-0.041088,0.0
3533,0.290112,0.0
3534,1.534497,0.0
3535,0.756982,0.0
3536,-0.880202,0.0
3537,-1.027399,0.0
3538,-1.027399,0.0
3539,-1.027399,0.0
3540,0.080914,0.0
3541,1.294565,0.0
3542,0.021069,0.0
3543,0.456883,0.0
3544,1.478716,0.0
3545,0.749658,0.0
3546,-0.900427,0.0
3547,-1.060459,0.0
3548,-1.060459,0.0
3549,-1.060459,0.0
3550,0.077545,0.0
3551,1.397896,0.0
3552,0.176631,0.0
3553,0.200649,0.0
3554,1.459925,0.0
3555,0.735293,0.0
3556,-0.890188,0.0
3557,-1.052583,0.0
3558,-1.052583,0.0
3559,-1.052583,0.0
3560,0.03256,0.0
3561,1.394625,0.0
3562,0.142683,0.0
3563,0.190361,0.0
3564,1.491058,0.0
3565,0.745136,0.0
3566,-0.878063,0.0
3567,-1.039453,0.0
3568,-1.039453,0.0
3569,-1.039453,0.0
3570,0.062402,0.0
3571,1.341784,0.0
3572,0.116018,0.0
3573,0.248437,0.0
3574,1.488226,0.0
3575,0.770771,0.0
3576,-0.89176,0.0
3577,-1.045293,0.0
3578,-1.045293,0.0
3579,-1.045293,0.0
3580,0.082528,0.0
3581,1.422398,0.0
3582,0.24362,0.0
3583,0.106434,0.0
3584,1.444644,0.0
3585,0.711318,0.0
3586,-0.896084,0.0
3587,-1.038286,0.0
3588,-1.038286,0.0
3589,-1.038286,0.0
3590,0.042525,0.0
3591,1.429507,0.0
3592,0.272958,0.0
3593,0.012377,0.0
3594,1.442124,0.0
3595,0.766106,0.0
3596,-0.885964,0.0
3597,-1.026544,0.0
3598,-1.026544,0.0
3599,-1.026544,0.0
3600,0.087729,0.0
3601,1.41102,0.0
3602,0.177609,0.0
3603,0.099654,0.0
3604,1.42696,0.0
3605,0.807279,0.0
3606,-0.880947,0.0
3607,-1.043101,0.0
3608,-1.043101,0.0
3609,-1.043101,0.0
3610,0.0564,0.0
3611,1.295153,0.0
3612,-0.026453,0.0
3613,0.341106,0.0
3614,1.548947,0.0
3615,0.772329,0.0
3616,-0.886186,0.0
3617,-1.033765,0.0
3618,-1.033765,0.0
3619,-1.033765,0.0
3620,0.06554,0.0
3621,1.329603,0.0
3622,0.138272,0.0
3623,0.268908,0.0
3624,1.428495,0.0
3625,0.838133,0.0
3626,-0.881877,0.0
3627,-1.062358,0.0
3628,-1.062358,0.0
3629,-1.062358,0.0
3630,0.058626,0.0
3631,1.473267,0.0
3632,0.384444,0.0
3633,-0.067512,0.0
3634,1.358516,0.0
3635,0.78073,0.0
3636,-0.881976,0.0
3637,-1.035365,0.0
3638,-1.035365,0.0
3639,-1.035365,0.0
3640,0.067668,0.0
3641,1.392583,0.0
3642,0.156229,0.0
3643,0.153291,0.0
3644,1.478822,0.0
3645,0.751333,0.0
3646,-0.880733,0.0
3647,-1.039731,0.0
3648,-1.039731,0.0
3649,-1.039731,0.0
3650,0.08942,0.0
3651,1.388625,0.0
3652,0.100517,0.0
3653,0.242275,0.0
3654,1.491563,0.0
3655,0.707764,0.0
3656,-0.894636,0.0
3657,-1.041843,0.0
3658,-1.041843,0.0
3659,-1.041843,0.0
3660,0.093104,0.0
3661,1.324246,0.0
3662,0.13865,0.0
3663,0.240012,0.0
3664,1.474162,0.0
3665,0.783042,0.0
3666,-0.890463,0.0
3667,-1.054251,0.0
3668,-1.054251,0.0
3669,-1.054251,0.0
3670,0.100721,0.0
3671,1.31294,0.0
3672,-0.009594,0.0
3673,0.356929,0.0
3674,1.554073,0.0
3675,0.687802,0.0
3676,-0.891636,0.0
3677,-1.037079,0.0
3678,-1.037079,0.0
3679,-1.037079,0.0
3680,0.040901,0.0
3681,1.39213,0.0
3682,0.173779,0.0
3683,0.157313,0.0
3684,1.503118,0.0
3685,0.719597,0.0
3686,-0.88972,0.0
3687,-1.032373,0.0
3688,-1.032373,0.0
3689,-1.032373,0.0
3690,0.063374,0.0
3691,1.370466,0.0
3692,0.105803,0.0
3693,0.241581,0.0
3694,1.516258,0.0
3695,0.710185,0.0
3696,-0.886729,0.0
3697,-1.040312,0.0
3698,-1.040312,0.0
3699,-1.040312,0.0
3700,0.103858,0.0
3701,1.332601,0.0
3702,0.030578,0.0
3703,0.35707,0.0
3704,1.479228,0.0
3705,0.75997,0.0
3706,-0.885751,0.0
3707,-1.059185,0.0
3708,-1.059185,0.0
3709,-1.059185,0.0
3710,0.083987,0.0
3711,1.31512,0.0
3712,-0.033949,0.0
3713,0.407129,0.0
3714,1.523511,0.0
3715,0.712833,0.0
3716,-0.887737,0.0
3717,-1.040298,0.0
3718,-1.040298,0.0
3719,-1.040298,0.0
3720,0.087221,0.0
3721,1.447063,0.0
3722,0.333685,0.0
3723,0.049832,0.0
3724,1.414673,0.0
3725,0.709298,0.0
3726,-0.887689,0.0
3727,-1.051361,0.0
3728,-1.051361,0.0
3729,-1.051361,0.0
3730,0.017856,0.0
3731,1.395085,0.0
3732,0.156923,0.0
3733,0.162181,0.0
3734,1.497733,0.0
3735,0.742747,0.0
3736,-0.88243,0.0
3737,-1.030031,0.0
3738,-1.030031,0.0
3739,-1.030031,0.0
3740,0.058096,0.0
3741,1.39587,0.0
3742,0.090349,0.0
3743,0.181723,0.0
3744,1.489742,0.0
3745,0.76074,0.0
3746,-0.879991,0.0
3747,-1.032176,0.0
3748,-1.032176,0.0
3749,-1.032176,0.0
3750,0.086391,0.0
3751,1.397134,0.0
3752,0.160782,0.0
3753,0.176495,0.0
3754,1.441694,0.0
3755,0.753286,0.0
3756,-0.892707,0.0
3757,-1.041025,0.0
3758,-1.041025,0.0
3759,-1.041025,0.0
3760,0.092207,0.0
3761,1.369746,0.0
3762,-0.00728,0.0
3763,0.334215,0.0
3764,1.494097,0.0
3765,0.718347,0.0
3766,-0.888803,0.0
3767,-1.037509,0.0
3768,-1.037509,0.0
3769,-1.037509,0.0
3770,0.090159,0.0
3771,1.373357,0.0
3772,0.190507,0.0
3773,0.144491,0.0
3774,1.478672,0.0
3775,0.742976,0.0
3776,-0.893432,0.0
3777,-1.042244,0.0
3778,-1.042244,0.0
3779,-1.042244,0.0
3780,0.097301,0.0
3781,1.367811,0.0
3782,0.251065,0.0
3783,0.144928,0.0
3784,1.420167,0.0
3785,0.777923,0.0
3786,-0.894119,0.0
3787,-1.055025,0.0
3788,-1.055025,0.0
3789,-1.055025,0.0
3790,0.110073,0.0
3791,1.35125,0.0
3792,0.118223,0.0
3793,0.283443,0.0
3794,1.465178,0.0
3795,0.731323,0.0
3796,-0.899269,0.0
3797,-1.053407,0.0
3798,-1.053407,0.0
3799,-1.053407,0.0
3800,0.104295,0.0
3801,1.39195,0.0
3802,0.123869,0.0
3803,0.19648,0.0
3804,1.461246,0.0
3805,0.760145,0.0
3806,-0.885271,0.0
3807,-1.050905,0.0
3808,-1.050905,0.0
3809,-1.050905,0.0
3810,0.081881,0.0
3811,1.326011,0.0
3812,-0.046362,0.0
3813,0.378266,0.0
3814,1.565918,0.0
3815,0.665221,0.0
3816,-0.889776,0.0
3817,-1.027053,0.0
3818,-1.027053,0.0
3819,-1.027053,0.0
3820,0.064007,0.0
3821,1.420586,0.0
3822,0.212994,0.0
3823,0.12211,0.0
3824,1.465034,0.0
3825,0.717264,0.0
3826,-0.886603,0.0
3827,-1.038464,0.0
3828,-1.038464,0.0
3829,-1.038464,0.0
3830,0.095841,0.0
3831,1.357122,0.0
3832,0.029394,0.0
3833,0.281272,0.0
3834,1.488824,0.0
3835,0.747929,0.0
3836,-0.887044,0.0
3837,-1.037779,0.0
3838,-1.037779,0.0
3839,-1.037779,0.0
3840,0.048593,0.0
3841,1.345021,0.0
3842,0.069333,0.0
3843,0.267222,0.0
3844,1.504195,0.0
3845,0.767952,0.0
3846,-0.882292,0.0
3847,-1.040008,0.0
3848,-1.040008,0.0
3849,-1.040008,0.0
3850,0.043217,0.0
3851,1.376048,0.0
3852,0.089759,0.0
3853,0.202577,0.0
3854,1.530725,0.0
3855,0.712752,0.0
3856,-0.889113,0.0
3857,-1.021989,0.0
3858,-1.021989,0.0
3859,-1.021989,0.0
3860,0.082591,0.0
3861,1.327299,0.0
3862,0.06678,0.0
3863,0.26662,0.0
3864,1.498607,0.0
3865,0.765489,0.0
3866,-0.887023,0.0
3867,-1.040121,0.0
3868,-1.040121,0.0
3869,-1.040121,0.0
3870,0.071328,0.0
3871,1.446298,0.0
3872,0.28643,0.0
3873,0.006588,0.0
3874,1.423315,0.0
3875,0.741976,0.0
3876,-0.881951,0.0
3877,-1.031328,0.0
3878,-1.031328,0.0
3879,-1.031328,0.0
3880,0.086696,0.0
3881,1.449771,0.0
3882,0.358569,0.0
3883,-0.025298,0.0
3884,1.402618,0.0
3885,0.734399,0.0
3886,-0.884549,0.0
3887,-1.040735,0.0
3888,-1.040735,0.0
3889,-1.040735,0.0
3890,0.122715,0.0
3891,1.409202,0.0
3892,0.175757,0.0
3893,0.139183,0.0
3894,1.439341,0.0
3895,0.746172,0.0
3896,-0.889644,0.0
3897,-1.047575,0.0
3898,-1.047575,0.0
3899,-1.047575,0.0
3900,0.117054,0.0
3901,1.431784,0.0
3902,0.269179,0.0
3903,0.025324,0.0
3904,1.409275,0.0
3905,0.762286,0.0
3906,-0.884166,0.0
3907,-1.043578,0.0
3908,-1.043578,0.0
3909,-1.043578,0.0
3910,0.090456,0.0
3911,1.342449,0.0
3912,-0.001273,0.0
3913,0.261354,0.0
3914,1.525524,0.0
3915,0.748703,0.0
3916,-0.883808,0.0
3917,-1.027802,0.0
3918,-1.027802,0.0
3919,-1.027802,0.0
3920,0.074954,0.0
3921,1.372347,0.0
3922,0.055325,0.0
3923,0.252599,0.0
3924,1.520994,0.0
3925,0.711931,0.0
3926,-0.887483,0.0
3927,-1.033556,0.0
3928,-1.033556,0.0
3929,-1.033556,0.0
3930,0.090717,0.0
3931,1.382799,0.0
3932,0.124745,0.0
3933,0.169611,0.0
3934,1.455422,0.0
3935,0.783361,0.0
3936,-0.884097,0.0
3937,-1.040853,0.0
3938,-1.040853,0.0
3939,-1.040853,0.0
3940,0.071575,0.0
3941,1.435666,0.0
3942,0.247872,0.0
3943,0.069742,0.0
3944,1.44569,0.0
3945,0.728539,0.0
3946,-0.888773,0.0
3947,-1.03677,0.0
3948,-1.03677,0.0
3949,-1.03677,0.0
3950,0.085794,0.0
3951,1.459373,0.0
3952,0.215169,0.0
3953,0.131377,0.0
3954,1.437322,0.0
3955,0.687303,0.0
3956,-0.891467,0.0
3957,-1.041623,0.0
3958,-1.041623,0.0
3959,-1.041623,0.0
3960,0.103275,0.0
3961,1.277976,0.0
3962,-0.062498,0.0
3963,0.469839,0.0
3964,1.499448,0.0
3965,0.752592,0.0
3966,-0.892768,0.0
3967,-1.049288,0.0
3968,-1.049288,0.0
3969,-1.049288,0.0
3970,0.066301,0.0
3971,1.418943,0.0
3972,0.219226,0.0
3973,0.07226,0.0
3974,1.434458,0.0
3975,0.7883,0.0
3976,-0.883266,0.0
3977,-1.038741,0.0
3978,-1.038741,0.0
3979,-1.038741,0.0
3980,0.011807,0.0
3981,1.384825,0.0
3982,0.117122,0.0
3983,0.155683,0.0
3984,1.521757,0.0
3985,0.741516,0.0
3986,-0.880162,0.0
3987,-1.017516,0.0
3988,-1.017516,0.0
3989,-1.017516,0.0
3990,0.089091,0.0
3991,1.458256,0.0
3992,0.366599,0.0
3993,0.012302,0.0
3994,1.381857,0.0
3995,0.715613,0.0
3996,-0.897268,0.0
3997,-1.04215,0.0
3998,-1.04215,0.0
3999,-1.04215,0.0
