Time,X1,Label
0,0.2917761399622822,0.0
1,0.39848842935856876,0.0
2,0.301588139124492,0.0
3,-0.13550577394918806,0.0
4,0.10302588093752739,0.0
5,-0.0917832869139049,0.0
6,-0.17441572843544817,0.0
7,0.13448964874252695,0.0
8,0.32511497509721426,0.0
9,-0.074375138771037,0.0
10,-0.3095550597035368,0.0
11,-0.1903048942500844,0.0
12,-0.38255757761036513,0.0
13,-0.10885011424356661,0.0
14,0.04456485925991959,0.0
15,-0.038688799438791145,0.0
16,-0.14624316169607074,0.0
17,-0.3812084100793071,0.0
18,-0.16226087172313094,0.0
19,-0.08616334153951904,0.0
20,-0.10160164419238796,0.0
21,0.3615351345994245,0.0
22,-0.2439314064472492,0.0
23,0.06610466034698145,0.0
24,0.048731361041074735,0.0
25,-0.042370600505049226,0.0
26,0.12357101882236583,0.0
27,-0.004124650060102755,0.0
28,-0.09212283653963439,0.0
29,-0.001191620483364019,0.0
30,0.1762885477690167,0.0
31,0.0016955951062161253,0.0
32,-0.07140077614651895,0.0
33,0.07530832331427106,0.0
34,-0.0553108274191682,0.0
35,-0.02250063698181108,0.0
36,-0.03545243814056516,0.0
37,-0.2973757708438411,0.0
38,0.3921529427767959,0.0
39,-0.04857376451874679,0.0
40,-0.05461442369786074,0.0
41,-0.4772712309016002,0.0
42,0.057295438478769556,0.0
43,0.12915241400568794,0.0
44,0.25972414316620074,0.0
45,0.22602705685105906,0.0
46,-0.0062283713981142,0.0
47,-0.19632751240642515,0.0
48,0.30914667900005416,0.0
49,0.26622003108994874,0.0
50,0.035800997782055775,0.0
51,0.07731870988866377,0.0
52,-0.03219066369900789,0.0
53,-0.1824891107964598,0.0
54,0.16398880063324894,0.0
55,-0.21262135013849914,0.0
56,-0.1358579434682354,0.0
57,-0.12712515970966257,0.0
58,0.23469003059185242,0.0
59,-0.077176635052845,0.0
60,-0.09833013292638589,0.0
61,0.2668914349440451,0.0
62,0.035285482389818955,0.0
63,0.0230513494634501,0.0
64,0.18752398959589855,0.0
65,-0.36301731131134374,0.0
66,0.07577826670546871,0.0
67,0.09142179227320801,0.0
68,-0.10859167104245954,0.0
69,0.22693457982890253,0.0
70,0.23770567553219954,0.0
71,0.47531082111142214,0.0
72,0.19744255953837933,0.0
73,-0.17616183549850872,0.0
74,-0.0818184807854564,0.0
75,0.06934288927181634,0.0
76,-0.23602666802589628,0.0
77,0.1588491079268987,0.0
78,-0.22997736638804578,0.0
79,0.22457136188400756,0.0
80,0.07905669067912968,0.0
81,0.009280970926485494,0.0
82,-0.08879264433865316,0.0
83,0.23237493488992567,0.0
84,0.04748129930492106,0.0
85,-0.08697885110312066,0.0
86,0.0344506571098358,0.0
87,0.27919510450086554,0.0
88,-0.1753584655734438,0.0
89,0.21988138891479603,0.0
90,-0.267092594035612,0.0
91,-0.16417531331291713,0.0
92,0.15694377040370067,0.0
93,0.05960997464974106,0.0
94,0.10235305050847127,0.0
95,0.03298036330740542,0.0
96,-0.21615069264206627,0.0
97,0.08983915858191667,0.0
98,0.10418468870865785,0.0
99,0.10666244862449703,0.0
100,0.0857843089510973,0.0
101,-0.1516225320070108,0.0
102,0.1137702535070253,0.0
103,-0.1024813989537752,0.0
104,0.18301318029915817,0.0
105,0.13364770612799612,0.0
106,0.14897568152099203,0.0
107,-0.32585495650173035,0.0
108,-0.11761872665382662,0.0
109,0.10454208481959387,0.0
110,-0.25893149824230605,0.0
111,0.467618366515869,0.0
112,0.07893867057713681,0.0
113,0.18738361687723618,0.0
114,0.15144412270259106,0.0
115,-0.2593402303459919,0.0
116,0.030332514314842914,0.0
117,-0.10965844580383187,0.0
118,0.09101801558430303,0.0
119,-0.3522665111103613,0.0
120,0.20224146911811217,0.0
121,-0.14206466641420343,0.0
122,-0.1366239384790936,0.0
123,0.2973627511507002,0.0
124,0.2761324690628982,0.0
125,-0.05705176049571156,0.0
126,-0.15807081779363777,0.0
127,-0.04119135124994808,0.0
128,0.37420476455599844,0.0
129,0.21211357519596186,0.0
130,0.09792570665629244,0.0
131,0.06607782158384125,0.0
132,0.095028373498022,0.0
133,0.10292384830145454,0.0
134,0.5130648693767265,0.0
135,0.3363051554087669,0.0
136,0.1467191382464483,0.0
137,-0.05211058640923329,0.0
138,0.08660068142634161,0.0
139,0.3146412851533533,0.0
140,0.240871715509006,0.0
141,0.09065219463516279,0.0
142,0.20710311731811515,0.0
143,0.03399499962570115,0.0
144,-0.07354279119931201,0.0
145,0.07124232080919617,0.0
146,-0.045986472582351265,0.0
147,0.0014123695608867168,0.0
148,-0.33376674886452545,0.0
149,0.038691617569121296,0.0
150,0.09791953093387379,0.0
151,-0.005132146002165515,0.0
152,0.00997812963455799,0.0
153,0.16601079461765228,0.0
154,0.045656268228221025,0.0
155,-0.13007185753500894,0.0
156,-0.03543014414580611,0.0
157,-0.12439357252470672,0.0
158,0.24487954565282438,0.0
159,-0.3577810394809918,0.0
160,-0.15090034008581432,0.0
161,0.09184781151008602,0.0
162,0.18596325777999162,0.0
163,0.2789884391418916,0.0
164,-0.32595948293204535,0.0
165,-0.21016916623061027,0.0
166,0.2540841030740265,0.0
167,-0.1132192103392198,0.0
168,-0.10190477992184613,0.0
169,-0.056670821193924095,0.0
170,-0.24274968044885148,0.0
171,-0.17400708177500612,0.0
172,-0.023234735271464184,0.0
173,-0.12150227658743368,0.0
174,-0.28672429182594583,0.0
175,0.34393664218161357,0.0
176,0.11657461078099779,0.0
177,-0.05546433083556216,0.0
178,-0.10504016841431794,0.0
179,-0.11479288663300452,0.0
180,-0.13277612595930222,0.0
181,0.0730229122427384,0.0
182,0.38472458215704786,0.0
183,-0.05919872404473702,0.0
184,-0.21362875759698033,0.0
185,-0.17558830952275797,0.0
186,-0.16228028371934208,0.0
187,0.3247078123625172,0.0
188,0.14575075468329876,0.0
189,-0.05379582037444182,0.0
190,-0.0049849996512189776,0.0
191,-0.0663713031042215,0.0
192,-0.1161177882916032,0.0
193,0.22853442918208824,0.0
194,0.08779800949629264,0.0
195,0.010578525129639617,0.0
196,0.24934262144381591,0.0
197,0.44267282499431043,0.0
198,0.20938726873655092,0.0
199,-0.07921297894691598,0.0
200,-0.2155293827451352,0.0
201,0.09687234098872559,0.0
202,0.3738120181215977,0.0
203,-0.20754018884387332,0.0
204,-0.22396826374650783,0.0
205,-0.04534219619317343,0.0
206,-0.1151298212074877,0.0
207,0.014985403781019695,0.0
208,0.06070044044227235,0.0
209,0.29833252246123754,0.0
210,-0.11506507156148241,0.0
211,-0.11265098329280401,0.0
212,0.0859967869960786,0.0
213,0.060316887275135136,0.0
214,0.33084580677698106,0.0
215,0.13107813410898667,0.0
216,-0.10764654082837294,0.0
217,0.059939487105571135,0.0
218,-0.2615486942876623,0.0
219,0.21024622536918122,0.0
220,-0.3413778077283101,0.0
221,-0.03239303718263606,0.0
222,-0.2915633435742221,0.0
223,-0.23650279119335665,0.0
224,0.2504600096447078,0.0
225,0.028099930835491633,0.0
226,-0.1239026627090814,0.0
227,-0.1600899798899156,0.0
228,0.22939881666535555,0.0
229,-0.279506991443099,0.0
230,-0.011068729804721109,0.0
231,-0.507853647934405,0.0
232,-0.16786259555688796,0.0
233,-0.06000786583989942,0.0
234,-0.039217818905960385,0.0
235,-0.2442786621013253,0.0
236,-0.308622244251551,0.0
237,-0.08766346717670172,0.0
238,-0.12191841096381476,0.0
239,-0.1949462934338255,0.0
240,-0.20025547142359237,0.0
241,-0.0024337212342365948,0.0
242,0.09690062473245381,0.0
243,0.19127689044395746,0.0
244,0.17813076310908038,0.0
245,-0.05653050819318896,0.0
246,-0.18401975690712657,0.0
247,0.4055270548820234,0.0
248,-0.10726688234414908,0.0
249,0.19940197120485748,0.0
250,0.03817226259224918,1.0
251,0.22318585898901033,0.0
252,0.13415677119701327,0.0
253,0.1568372049171543,0.0
254,0.5004013319064876,0.0
255,0.15505370318221,0.0
256,0.22302028105600555,0.0
257,0.2966020864276037,0.0
258,0.2738593394882973,0.0
259,0.6519007906908626,0.0
260,0.43194296536312815,0.0
261,0.6936435574599017,0.0
262,0.7356273361043492,0.0
263,0.26209855646979285,0.0
264,0.6543897758545928,0.0
265,0.5221213556443102,0.0
266,0.9827642306260183,0.0
267,0.4937813969273967,0.0
268,0.6773241370934139,0.0
269,0.5744238146093773,0.0
270,0.6362696965838375,0.0
271,0.8303364368781444,0.0
272,0.7277513740421193,0.0
273,1.0203383018502346,0.0
274,0.94893610514342,0.0
275,1.0359728037772746,0.0
276,1.2974905543972706,0.0
277,1.216332703720934,0.0
278,1.056552825396589,0.0
279,1.2449042766780052,0.0
280,1.3998641756582828,0.0
281,1.230717146725981,0.0
282,1.33274777327898,0.0
283,1.7504332801981797,0.0
284,1.3384946457983542,0.0
285,1.601809179971826,0.0
286,1.4284651923800677,0.0
287,1.285964619407363,0.0
288,1.3734129123316625,0.0
289,1.6646477807012883,0.0
290,1.709739051293919,0.0
291,1.8545101799680266,0.0
292,1.8052330771795693,0.0
293,1.5264015835025224,0.0
294,1.692103226302507,0.0
295,2.1067988420810693,0.0
296,1.9743712708763446,0.0
297,2.234893353088168,0.0
298,2.0272167948315425,0.0
299,2.2180411938582365,0.0
300,1.8048541206321183,0.0
301,2.106787649034966,0.0
302,2.059935614990601,0.0
303,2.2298890010750028,0.0
304,2.1265522619060047,0.0
305,2.2162338201993914,0.0
306,2.592528109752288,0.0
307,2.520685204847931,0.0
308,2.2768285037448073,0.0
309,2.759259649296519,0.0
310,2.032403211040486,0.0
311,2.8224262939947558,0.0
312,2.4900385976821227,0.0
313,2.4855199541061315,0.0
314,2.2144210623790404,0.0
315,2.7273457948995303,0.0
316,2.557177350973195,0.0
317,2.254792235351494,0.0
318,2.9190926006544338,0.0
319,2.616896888975202,0.0
320,2.697454636737076,0.0
321,2.6475010834058414,0.0
322,2.7603785173450834,0.0
323,2.8934202132690654,0.0
324,2.629809438135666,0.0
325,3.0442474524678595,0.0
326,3.027151140544389,0.0
327,3.1709461938353822,0.0
328,3.274746344572005,0.0
329,3.680591485489049,0.0
330,3.283334389168634,0.0
331,3.0095535306608925,0.0
332,3.4522584787039516,0.0
333,3.4462186180803744,0.0
334,3.426962649742928,0.0
335,3.5360370746122327,0.0
336,3.1756476671602183,0.0
337,3.269444532206858,0.0
338,3.625424237173661,0.0
339,3.6231135780329016,0.0
340,3.8260069095832914,0.0
341,4.025941595696293,0.0
342,3.790516159088487,0.0
343,3.6492548976591945,0.0
344,3.341556228451097,0.0
345,3.9916788123313127,0.0
346,3.695606089753212,0.0
347,3.7728135070404347,0.0
348,4.093320203575292,0.0
349,4.267134488694349,0.0
350,3.6598542268098444,0.0
351,4.265534917269682,0.0
352,3.877845382209212,0.0
353,4.4593226722002095,0.0
354,4.338727652683216,0.0
355,3.9829802038891553,0.0
356,4.285947308895287,0.0
357,4.172014688094685,0.0
358,4.089274507368581,0.0
359,4.09832403484152,0.0
360,4.314866996145534,0.0
361,4.020839521876798,0.0
362,4.622228894473465,0.0
363,4.44078941205861,0.0
364,4.607183419876238,0.0
365,4.591075832292081,0.0
366,4.8726268021285115,0.0
367,4.927434835602991,0.0
368,4.106026993416809,0.0
369,4.608350678724905,0.0
370,4.796694829269334,0.0
371,4.868787189873045,0.0
372,4.90782479323226,0.0
373,4.987011102849153,0.0
374,5.462971071156505,0.0
375,5.333944813548041,0.0
376,5.2327666074839465,0.0
377,5.359042756233108,0.0
378,5.718077433668919,0.0
379,5.363761039155433,0.0
380,5.199727648310542,0.0
381,5.303239585135624,0.0
382,5.207202140151511,0.0
383,5.196075634923046,0.0
384,5.366823825472388,0.0
385,5.50745272842321,0.0
386,5.750821359044142,0.0
387,5.5169447259463436,0.0
388,5.520574243600994,0.0
389,5.649773195839775,0.0
390,5.373334180627361,0.0
391,5.628494628052028,0.0
392,5.881056955327879,0.0
393,5.913087791250331,0.0
394,5.741901212931044,0.0
395,5.725633424755911,0.0
396,5.943785590435308,0.0
397,6.179142749511589,0.0
398,5.72974233834636,0.0
399,5.746540242972928,0.0
400,5.842054677236755,0.0
401,6.252943854034742,0.0
402,6.634433294208046,0.0
403,5.879548352142774,0.0
404,6.162954643973316,0.0
405,6.4830256670950055,0.0
406,6.62089598106504,0.0
407,6.365162137193303,0.0
408,6.0847030058227976,0.0
409,6.380250576574502,0.0
410,6.356060747969009,0.0
411,6.344977203401591,0.0
412,6.589983312930793,0.0
413,6.709913515428587,0.0
414,6.6773750058144286,0.0
415,6.695976636323709,0.0
416,6.763052964994444,0.0
417,7.039314141943108,0.0
418,6.994515381054735,0.0
419,6.527506669769863,0.0
420,7.186077281930677,0.0
421,6.970538884307756,0.0
422,6.620227163031165,0.0
423,7.1151245232013585,0.0
424,6.768712052014805,0.0
425,7.099962442064383,0.0
426,6.903642189999304,0.0
427,7.364517626522403,0.0
428,7.249714019417691,0.0
429,7.134933843276639,0.0
430,7.300664157762494,0.0
431,7.451483570743277,0.0
432,7.5090863239109575,0.0
433,7.228078032955498,0.0
434,7.234379591319516,0.0
435,7.173425975030905,0.0
436,7.643652051858451,0.0
437,7.62455594065855,0.0
438,7.419678720615129,0.0
439,7.371042069541997,0.0
440,7.232878710206402,0.0
441,7.860019628384706,0.0
442,7.662701635164163,0.0
443,7.753077853960952,0.0
444,7.715992259495481,0.0
445,7.702346015285705,0.0
446,7.771033907510031,0.0
447,8.082362005853746,0.0
448,7.622991890151982,0.0
449,7.622875142882336,0.0
450,7.772646611718952,0.0
451,7.9668519951966115,0.0
452,7.96781652081667,0.0
453,8.272922492964042,0.0
454,8.019578901913818,0.0
455,8.176718402900608,0.0
456,7.875125125162944,0.0
457,8.557691693015624,0.0
458,8.24026228355884,0.0
459,8.191571338941971,0.0
460,8.592658296021249,0.0
461,8.52558584578635,0.0
462,8.608778531433666,0.0
463,8.395925426606503,0.0
464,8.656032795057614,0.0
465,8.62342143714923,0.0
466,8.603650699758298,0.0
467,8.490410064983799,0.0
468,9.031719217974192,0.0
469,8.90866599130924,0.0
470,8.625918425907539,0.0
471,9.002670277027145,0.0
472,8.85594484110095,0.0
473,9.155397633294408,0.0
474,9.095197576296034,0.0
475,8.601053650096988,0.0
476,9.068460826047323,0.0
477,9.232317518061533,0.0
478,8.641908969775898,0.0
479,9.491286307898656,0.0
480,9.48459598564537,0.0
481,9.511544736472544,0.0
482,9.635146548371338,0.0
483,9.159727085580165,0.0
484,9.445796054031959,0.0
485,9.443712939807174,0.0
486,9.36670486258165,0.0
487,9.582943949819168,0.0
488,9.31242304767115,0.0
489,9.460936092008906,0.0
490,9.750495957182908,0.0
491,9.399307605240395,0.0
492,9.874342199396168,0.0
493,9.60063200243416,0.0
494,9.89891138122885,0.0
495,10.112087400784036,0.0
496,9.948391263723257,0.0
497,10.405696486184347,0.0
498,9.593020428488064,0.0
499,9.988116654955755,0.0
