{
	"id": "c3270d4b-2f6c-43c2-a821-e3d069def42c",
	"name": "Production",
	"values": [
		{
			"key": "baseUrl",
			"value": "http://Production-env.eba-m5wpyp44.ap-south-1.elasticbeanstalk.com",
			"enabled": true
		}
	],
	"_postman_variable_scope": "environment",
	"_postman_exported_at": "2020-05-14T09:52:32.835Z",
	"_postman_exported_using": "Postman/7.24.0"
}