EESchema Schematic File Version 4
EELAYER 30 0
EELAYER END
$Descr A4 11693 8268
encoding utf-8
Sheet 1 6
Title "Pulsoximiter"
Date ""
Rev "A"
Comp "Alban Petit"
Comment1 ""
Comment2 ""
Comment3 ""
Comment4 ""
$EndDescr
$Comp
L MCU_Module:Arduino_UNO_R3 A1
U 1 1 5EC93C76
P 9350 2050
F 0 "A1" H 9350 3231 50  0000 C CNN
F 1 "Arduino_UNO_R3" H 9350 3140 50  0000 C CNN
F 2 "Module:Arduino_UNO_R3" H 9350 2050 50  0001 C CIN
F 3 "https://www.arduino.cc/en/Main/arduinoBoardUno" H 9350 2050 50  0001 C CNN
	1    9350 2050
	1    0    0    -1  
$EndComp
Text Label 7000 2350 2    50   ~ 0
ARD_DIAG_END
Wire Wire Line
	6400 2350 7000 2350
Wire Wire Line
	6400 2250 7000 2250
Wire Wire Line
	6400 2150 7000 2150
Wire Wire Line
	6400 2050 7000 2050
Wire Wire Line
	6400 1950 7000 1950
Wire Wire Line
	6400 1850 7000 1850
Wire Wire Line
	6400 1750 7000 1750
Wire Wire Line
	6400 1650 7000 1650
Text Label 7000 1650 2    50   ~ 0
ARD_DRDY
Text Label 7000 1750 2    50   ~ 0
ARD_MISO
Text Label 7000 1850 2    50   ~ 0
ARD_SCK
Text Label 7000 1950 2    50   ~ 0
ARD_MOSI
Text Label 7000 2050 2    50   ~ 0
ARD_CS0
Text Label 7000 2150 2    50   ~ 0
ARD_START
Text Label 7000 2250 2    50   ~ 0
ARD_PWDN
Text Label 4200 1650 0    50   ~ 0
ADC_RDY
Text Label 4200 1750 0    50   ~ 0
SPI_MISO
Text Label 4200 1850 0    50   ~ 0
SPI_SCK
Text Label 4200 1950 0    50   ~ 0
SPI_MOSI
Text Label 4200 2050 0    50   ~ 0
SPI_CS0
Text Label 4200 2150 0    50   ~ 0
ADC_RESET
Text Label 4200 2250 0    50   ~ 0
AFE_PDN
Text Label 4200 2350 0    50   ~ 0
DIAG_END
Wire Wire Line
	4200 1650 4800 1650
Wire Wire Line
	4200 1750 4800 1750
Wire Wire Line
	4200 1850 4800 1850
Wire Wire Line
	4200 1950 4800 1950
Wire Wire Line
	4200 2050 4800 2050
Wire Wire Line
	4200 2150 4800 2150
Wire Wire Line
	4200 2250 4800 2250
Wire Wire Line
	4200 2350 4800 2350
Wire Wire Line
	6400 2550 7000 2550
Wire Wire Line
	6400 2650 7000 2650
Wire Wire Line
	4800 2550 4200 2550
Wire Wire Line
	4800 2650 4200 2650
Text Label 4200 2650 0    50   ~ 0
PD_ALM
Text Label 4200 2550 0    50   ~ 0
LED_ALM
Text Label 7000 2550 2    50   ~ 0
ARD_LED_ALM
Text Label 7000 2650 2    50   ~ 0
ARD_PD_ALM
Text Label 3350 3900 2    50   ~ 0
TXN
Text Label 3350 4100 2    50   ~ 0
INN
Wire Wire Line
	8850 1650 8250 1650
Wire Wire Line
	8850 2150 8250 2150
Wire Wire Line
	8850 2250 8250 2250
Wire Wire Line
	8850 2350 8250 2350
Wire Wire Line
	8850 2450 8250 2450
Wire Wire Line
	8850 2550 8250 2550
Wire Wire Line
	8850 2650 8250 2650
Wire Wire Line
	8850 2750 8250 2750
$Comp
L power:GND #PWR0101
U 1 1 5EED3F9B
P 9350 3600
F 0 "#PWR0101" H 9350 3350 50  0001 C CNN
F 1 "GND" H 9355 3427 50  0000 C CNN
F 2 "" H 9350 3600 50  0001 C CNN
F 3 "" H 9350 3600 50  0001 C CNN
	1    9350 3600
	1    0    0    -1  
$EndComp
Wire Wire Line
	9350 3150 9350 3350
Wire Wire Line
	9450 3150 9450 3350
Wire Wire Line
	9450 3350 9350 3350
Connection ~ 9350 3350
Wire Wire Line
	9350 3350 9350 3600
Wire Wire Line
	9250 3150 9250 3350
Wire Wire Line
	9250 3350 9350 3350
$Comp
L power:+5V #PWR0102
U 1 1 5EED763A
P 10050 950
F 0 "#PWR0102" H 10050 800 50  0001 C CNN
F 1 "+5V" H 10065 1123 50  0000 C CNN
F 2 "" H 10050 950 50  0001 C CNN
F 3 "" H 10050 950 50  0001 C CNN
	1    10050 950 
	1    0    0    -1  
$EndComp
Text Label 8250 1650 0    50   ~ 0
ARD_DRDY
Wire Wire Line
	8850 1850 8250 1850
Wire Wire Line
	8850 1950 8250 1950
Text Label 8250 1850 0    50   ~ 0
ARD_PWDN
Text Label 8250 1950 0    50   ~ 0
ARD_START
Text Label 8250 2150 0    50   ~ 0
ARD_CS0
Text Label 8250 2250 0    50   ~ 0
ARD_PD_ALM
Text Label 8250 2350 0    50   ~ 0
ARD_LED_ALM
Text Label 8250 2450 0    50   ~ 0
ARD_DIAG_END
Text Label 8250 2550 0    50   ~ 0
ARD_MOSI
Text Label 8250 2650 0    50   ~ 0
ARD_MISO
Text Label 8250 2750 0    50   ~ 0
ARD_SCK
Wire Wire Line
	10450 2450 9850 2450
Wire Wire Line
	10450 2550 9850 2550
Entry Wire Line
	10450 2450 10550 2550
Entry Wire Line
	10450 2550 10550 2650
Text Label 10450 2450 2    50   ~ 0
SDA
Text Label 10450 2550 2    50   ~ 0
SCL
$Sheet
S 4800 1250 1600 1800
U 5EDB0964
F0 "LogicLevelConverter" 50
F1 "LogicLevelConverter.sch" 50
F2 "ARD_DRDY" I R 6400 1650 50 
F3 "ARD_MISO" I R 6400 1750 50 
F4 "ARD_SCK" I R 6400 1850 50 
F5 "ARD_MOSI" I R 6400 1950 50 
F6 "ARD_CS0" I R 6400 2050 50 
F7 "ARD_START" I R 6400 2150 50 
F8 "ARD_PWDN" I R 6400 2250 50 
F9 "ARD_DIAG_END" I R 6400 2350 50 
F10 "ADC_RDY" I L 4800 1650 50 
F11 "SPI_MISO" I L 4800 1750 50 
F12 "SPI_SCK" I L 4800 1850 50 
F13 "SPI_MOSI" I L 4800 1950 50 
F14 "SPI_CS0" I L 4800 2050 50 
F15 "ADC_RESET" I L 4800 2150 50 
F16 "AFE_PDN" I L 4800 2250 50 
F17 "DIAG_END" I L 4800 2350 50 
F18 "ARD_LED_ALM" I R 6400 2550 50 
F19 "ARD_PD_ALM" I R 6400 2650 50 
F20 "PD_ALM" I L 4800 2650 50 
F21 "LED_ALM" I L 4800 2550 50 
$EndSheet
Entry Wire Line
	7000 1650 7100 1750
Entry Wire Line
	7000 1750 7100 1850
Entry Wire Line
	7000 1850 7100 1950
Entry Wire Line
	7000 1950 7100 2050
Entry Wire Line
	7000 2050 7100 2150
Entry Wire Line
	7000 2150 7100 2250
Entry Wire Line
	7000 2250 7100 2350
Entry Wire Line
	7000 2350 7100 2450
Entry Wire Line
	7000 2550 7100 2650
Entry Wire Line
	7000 2650 7100 2750
Entry Wire Line
	8150 1750 8250 1650
Entry Wire Line
	8150 1950 8250 1850
Entry Wire Line
	8150 2050 8250 1950
Entry Wire Line
	8150 2250 8250 2150
Entry Wire Line
	8150 2350 8250 2250
Entry Wire Line
	8150 2450 8250 2350
Entry Wire Line
	8150 2550 8250 2450
Entry Wire Line
	8150 2650 8250 2550
Entry Wire Line
	8150 2750 8250 2650
Entry Wire Line
	8150 2850 8250 2750
Text Label 3350 4500 2    50   ~ 0
RX_ANA_SUP
Text Label 3350 4200 2    50   ~ 0
INP
Text Label 3350 4000 2    50   ~ 0
TXP
Text Label 3350 4400 2    50   ~ 0
LED_DRV_SUP
Wire Wire Line
	3350 4500 2750 4500
Wire Wire Line
	3350 4200 2750 4200
Wire Wire Line
	3350 4000 2750 4000
Wire Wire Line
	2750 4400 3350 4400
Wire Wire Line
	2750 4100 3350 4100
Wire Wire Line
	2750 3900 3350 3900
Wire Bus Line
	7100 3200 8150 3200
Wire Wire Line
	3350 3150 2750 3150
Wire Wire Line
	3350 3000 2750 3000
Wire Wire Line
	3350 2600 2750 2600
Wire Wire Line
	3350 2500 2750 2500
Wire Wire Line
	3350 2400 2750 2400
Wire Wire Line
	3350 2300 2750 2300
Entry Wire Line
	3350 2300 3450 2400
Entry Wire Line
	3350 2400 3450 2500
Entry Wire Line
	3350 2500 3450 2600
Entry Wire Line
	3350 2600 3450 2700
Entry Wire Line
	3350 3000 3450 3100
Entry Wire Line
	3350 3150 3450 3250
Entry Wire Line
	3450 4000 3350 3900
Entry Wire Line
	3450 4100 3350 4000
Entry Wire Line
	3450 4200 3350 4100
Entry Wire Line
	3450 4300 3350 4200
Entry Wire Line
	3450 4500 3350 4400
Entry Wire Line
	3450 4600 3350 4500
$Sheet
S 1100 3700 1650 1000
U 5EE82CA9
F0 "ProtectionCircuit" 50
F1 "ProtectionCircuit.sch" 50
F2 "TXP" I R 2750 4000 50 
F3 "TXN" I R 2750 3900 50 
F4 "INP" I R 2750 4200 50 
F5 "INN" I R 2750 4100 50 
F6 "RX_ANA_SUP" I R 2750 4500 50 
F7 "LED_DRV_SUP" I R 2750 4400 50 
$EndSheet
Wire Wire Line
	3350 2850 2750 2850
Wire Wire Line
	3350 2750 2750 2750
Entry Wire Line
	3350 2750 3450 2850
Entry Wire Line
	3350 2850 3450 2950
Wire Wire Line
	2750 5250 3350 5250
Entry Wire Line
	3350 5250 3450 5350
Wire Wire Line
	2750 5400 3350 5400
Entry Wire Line
	3350 5400 3450 5500
Wire Wire Line
	2750 5550 3350 5550
Entry Wire Line
	3350 5550 3450 5650
Wire Wire Line
	2750 5650 3350 5650
Entry Wire Line
	3350 5650 3450 5750
Text Label 3350 5250 2    50   ~ 0
LED_DRV_SUP
Text Label 3350 5400 2    50   ~ 0
TX_CTRL_SUP
Text Label 3350 5550 2    50   ~ 0
RX_DIG_SUP
Text Label 3350 5650 2    50   ~ 0
RX_ANA_SUP
Text Label 3350 3150 2    50   ~ 0
TX_CTRL_SUP
Text Label 3350 3000 2    50   ~ 0
LED_DRV_SUP
Text Label 3350 2850 2    50   ~ 0
RX_DIG_SUP
Text Label 3350 2750 2    50   ~ 0
RX_ANA_SUP
Text Label 3350 2600 2    50   ~ 0
INP
Text Label 3350 2500 2    50   ~ 0
INN
Text Label 3350 2400 2    50   ~ 0
TXP
Text Label 3350 2300 2    50   ~ 0
TXN
Entry Wire Line
	4100 1750 4200 1650
Entry Wire Line
	4100 1850 4200 1750
Entry Wire Line
	4100 1950 4200 1850
Entry Wire Line
	4100 2050 4200 1950
Entry Wire Line
	4100 2150 4200 2050
Entry Wire Line
	4100 2250 4200 2150
Entry Wire Line
	4100 2350 4200 2250
Entry Wire Line
	4100 2450 4200 2350
Entry Wire Line
	4100 2650 4200 2550
Entry Wire Line
	4100 2750 4200 2650
Wire Wire Line
	3350 2150 2750 2150
Entry Wire Line
	3350 2150 3450 2250
Wire Wire Line
	3350 2050 2750 2050
Entry Wire Line
	3350 2050 3450 2150
Wire Wire Line
	3350 1950 2750 1950
Entry Wire Line
	3350 1950 3450 2050
Wire Wire Line
	3350 1850 2750 1850
Entry Wire Line
	3350 1850 3450 1950
Wire Wire Line
	3350 1750 2750 1750
Entry Wire Line
	3350 1750 3450 1850
Wire Wire Line
	3350 1650 2750 1650
Entry Wire Line
	3350 1650 3450 1750
Wire Wire Line
	3350 1550 2750 1550
Entry Wire Line
	3350 1550 3450 1650
Wire Wire Line
	3350 1450 2750 1450
Entry Wire Line
	3350 1450 3450 1550
Wire Wire Line
	3350 1350 2750 1350
Entry Wire Line
	3350 1350 3450 1450
Wire Wire Line
	3350 1250 2750 1250
Entry Wire Line
	3350 1250 3450 1350
Wire Wire Line
	10050 950  10050 1050
Wire Wire Line
	9550 1050 10050 1050
$Sheet
S 1100 1050 1650 2300
U 5F38BF74
F0 "AnalogFrontEnd" 50
F1 "AnalogFrontEnd.sch" 50
F2 "TXN" I R 2750 2300 50 
F3 "TXP" I R 2750 2400 50 
F4 "INP" I R 2750 2600 50 
F5 "INN" I R 2750 2500 50 
F6 "LED_DRV_SUP" I R 2750 3000 50 
F7 "RX_ANA_SUP" I R 2750 2750 50 
F8 "TX_CTRL_SUP" I R 2750 3150 50 
F9 "RX_DIG_SUP" I R 2750 2850 50 
F10 "ADC_RESET" I R 2750 1250 50 
F11 "SPI_SCK" I R 2750 1350 50 
F12 "SPI_CS0" I R 2750 1450 50 
F13 "PD_ALM" I R 2750 1550 50 
F14 "LED_ALM" I R 2750 1650 50 
F15 "ADC_RDY" I R 2750 1750 50 
F16 "AFE_PDN" I R 2750 1850 50 
F17 "DIAG_END" I R 2750 1950 50 
F18 "SPI_MISO" I R 2750 2050 50 
F19 "SPI_MOSI" I R 2750 2150 50 
$EndSheet
Text Label 3350 1250 2    50   ~ 0
ADC_RESET
Text Label 3350 1350 2    50   ~ 0
SPI_SCK
Text Label 3350 1450 2    50   ~ 0
SPI_CS0
Text Label 3350 1550 2    50   ~ 0
PD_ALM
Text Label 3350 1650 2    50   ~ 0
LED_ALM
Text Label 3350 1750 2    50   ~ 0
ADC_RDY
Text Label 3350 1850 2    50   ~ 0
AFE_PDN
Text Label 3350 1950 2    50   ~ 0
DIAG_END
Text Label 3350 2050 2    50   ~ 0
SPI_MISO
Text Label 3350 2150 2    50   ~ 0
SPI_MOSI
$Sheet
S 1100 5050 1650 800 
U 5EEB327A
F0 "PowerSupply" 50
F1 "PowerSupply.sch" 50
F2 "LED_DRV_SUP" I R 2750 5250 50 
F3 "TX_CTRL_SUP" I R 2750 5400 50 
F4 "RX_DIG_SUP" I R 2750 5550 50 
F5 "RX_ANA_SUP" I R 2750 5650 50 
$EndSheet
Wire Bus Line
	3450 1300 4100 1300
$Sheet
S 8950 4200 900  700 
U 5F64A49E
F0 "I2CBusExtender" 50
F1 "I2CBusExtender.sch" 50
F2 "LED_SENSOR" I R 9850 4350 50 
F3 "SDA" I R 9850 4500 50 
F4 "SCL" I R 9850 4600 50 
F5 "INT" I R 9850 4750 50 
$EndSheet
Wire Wire Line
	10450 4500 9850 4500
Wire Wire Line
	10450 4600 9850 4600
Entry Wire Line
	10450 4500 10550 4600
Entry Wire Line
	10450 4600 10550 4700
Text Label 10450 4500 2    50   ~ 0
SDA
Text Label 10450 4600 2    50   ~ 0
SCL
Wire Wire Line
	9850 2350 10450 2350
Entry Wire Line
	10450 2350 10550 2450
Text Label 10450 2350 2    50   ~ 0
LED_SENSOR
Wire Wire Line
	9850 4350 10450 4350
Entry Wire Line
	10450 4350 10550 4450
Text Label 10450 4350 2    50   ~ 0
LED_SENSOR
Wire Wire Line
	9850 4750 10450 4750
Entry Wire Line
	10450 4750 10550 4850
Text Label 10450 4750 2    50   ~ 0
INT
Wire Wire Line
	9850 2250 10450 2250
Text Label 10450 2250 2    50   ~ 0
INT
Entry Wire Line
	10450 2250 10550 2350
Wire Bus Line
	10550 2350 10550 4850
Wire Bus Line
	4100 1300 4100 2750
Wire Bus Line
	8150 1750 8150 3200
Wire Bus Line
	7100 1750 7100 3200
Wire Bus Line
	3450 2400 3450 5750
Wire Bus Line
	3450 1300 3450 2250
$EndSCHEMATC
