EESchema Schematic File Version 4
EELAYER 30 0
EELAYER END
$Descr A4 11693 8268
encoding utf-8
Sheet 2 6
Title "Pulsoximiter"
Date ""
Rev "A"
Comp "Alban Petit"
Comment1 ""
Comment2 ""
Comment3 ""
Comment4 ""
$EndDescr
$Comp
L Logic_LevelTranslator:TXB0108DQSR U?
U 1 1 5EDBB014
P 3650 3250
AR Path="/5EDBB014" Ref="U?"  Part="1" 
AR Path="/5EDB0964/5EDBB014" Ref="U1"  Part="1" 
F 0 "U1" H 3650 2461 50  0000 C CNN
F 1 "TXB0108DQSR" H 3650 2370 50  0000 C CNN
F 2 "Package_SON:USON-20_2x4mm_P0.4mm" H 3650 2279 50  0001 C CNN
F 3 "http://www.ti.com/lit/ds/symlink/txb0108.pdf" H 3650 3150 50  0001 C CNN
	1    3650 3250
	1    0    0    -1  
$EndComp
$Comp
L power:VCC #PWR?
U 1 1 5EDBB01A
P 3750 2300
AR Path="/5EDBB01A" Ref="#PWR?"  Part="1" 
AR Path="/5EDB0964/5EDBB01A" Ref="#PWR0103"  Part="1" 
F 0 "#PWR0103" H 3750 2150 50  0001 C CNN
F 1 "VCC" H 3767 2473 50  0000 C CNN
F 2 "" H 3750 2300 50  0001 C CNN
F 3 "" H 3750 2300 50  0001 C CNN
	1    3750 2300
	1    0    0    -1  
$EndComp
$Comp
L power:+3.3V #PWR?
U 1 1 5EDBB020
P 3550 2300
AR Path="/5EDBB020" Ref="#PWR?"  Part="1" 
AR Path="/5EDB0964/5EDBB020" Ref="#PWR0104"  Part="1" 
F 0 "#PWR0104" H 3550 2150 50  0001 C CNN
F 1 "+3.3V" H 3565 2473 50  0000 C CNN
F 2 "" H 3550 2300 50  0001 C CNN
F 3 "" H 3550 2300 50  0001 C CNN
	1    3550 2300
	1    0    0    -1  
$EndComp
Wire Wire Line
	3750 2300 3750 2550
Wire Wire Line
	3550 2300 3550 2550
Wire Wire Line
	4550 3950 4550 4150
$Comp
L power:GND #PWR?
U 1 1 5EDBB032
P 4550 4150
AR Path="/5EDBB032" Ref="#PWR?"  Part="1" 
AR Path="/5EDB0964/5EDBB032" Ref="#PWR0105"  Part="1" 
F 0 "#PWR0105" H 4550 3900 50  0001 C CNN
F 1 "GND" H 4555 3977 50  0000 C CNN
F 2 "" H 4550 4150 50  0001 C CNN
F 3 "" H 4550 4150 50  0001 C CNN
	1    4550 4150
	1    0    0    -1  
$EndComp
$Comp
L Device:R R?
U 1 1 5EDBB050
P 2450 2850
AR Path="/5EDBB050" Ref="R?"  Part="1" 
AR Path="/5EDB0964/5EDBB050" Ref="R1"  Part="1" 
F 0 "R1" V 2243 2850 50  0000 C CNN
F 1 "10K" V 2334 2850 50  0000 C CNN
F 2 "Resistor_SMD:R_1206_3216Metric_Pad1.42x1.75mm_HandSolder" V 2380 2850 50  0001 C CNN
F 3 "~" H 2450 2850 50  0001 C CNN
	1    2450 2850
	0    1    1    0   
$EndComp
$Comp
L power:+3.3V #PWR?
U 1 1 5EDBB060
P 2950 2600
AR Path="/5EDBB060" Ref="#PWR?"  Part="1" 
AR Path="/5EDB0964/5EDBB060" Ref="#PWR0106"  Part="1" 
F 0 "#PWR0106" H 2950 2450 50  0001 C CNN
F 1 "+3.3V" H 2965 2773 50  0000 C CNN
F 2 "" H 2950 2600 50  0001 C CNN
F 3 "" H 2950 2600 50  0001 C CNN
	1    2950 2600
	1    0    0    -1  
$EndComp
Wire Wire Line
	2950 2600 2950 2850
$Comp
L power:GND #PWR?
U 1 1 5EDBB067
P 2100 3000
AR Path="/5EDBB067" Ref="#PWR?"  Part="1" 
AR Path="/5EDB0964/5EDBB067" Ref="#PWR0107"  Part="1" 
F 0 "#PWR0107" H 2100 2750 50  0001 C CNN
F 1 "GND" H 2105 2827 50  0000 C CNN
F 2 "" H 2100 3000 50  0001 C CNN
F 3 "" H 2100 3000 50  0001 C CNN
	1    2100 3000
	1    0    0    -1  
$EndComp
Wire Wire Line
	2100 3000 2100 2850
Wire Wire Line
	2100 2850 2300 2850
$Comp
L power:+3.3V #PWR?
U 1 1 5EDBB06F
P 5400 2750
AR Path="/5EDBB06F" Ref="#PWR?"  Part="1" 
AR Path="/5EDB0964/5EDBB06F" Ref="#PWR0108"  Part="1" 
F 0 "#PWR0108" H 5400 2600 50  0001 C CNN
F 1 "+3.3V" H 5415 2923 50  0000 C CNN
F 2 "" H 5400 2750 50  0001 C CNN
F 3 "" H 5400 2750 50  0001 C CNN
	1    5400 2750
	1    0    0    -1  
$EndComp
$Comp
L power:VCC #PWR?
U 1 1 5EDBB075
P 5950 2750
AR Path="/5EDBB075" Ref="#PWR?"  Part="1" 
AR Path="/5EDB0964/5EDBB075" Ref="#PWR0109"  Part="1" 
F 0 "#PWR0109" H 5950 2600 50  0001 C CNN
F 1 "VCC" H 5967 2923 50  0000 C CNN
F 2 "" H 5950 2750 50  0001 C CNN
F 3 "" H 5950 2750 50  0001 C CNN
	1    5950 2750
	1    0    0    -1  
$EndComp
$Comp
L Device:C C?
U 1 1 5EDBB07B
P 5400 3200
AR Path="/5EDBB07B" Ref="C?"  Part="1" 
AR Path="/5EDB0964/5EDBB07B" Ref="C1"  Part="1" 
F 0 "C1" H 5515 3246 50  0000 L CNN
F 1 "100nF" H 5515 3155 50  0000 L CNN
F 2 "Capacitor_SMD:C_1206_3216Metric_Pad1.42x1.75mm_HandSolder" H 5438 3050 50  0001 C CNN
F 3 "~" H 5400 3200 50  0001 C CNN
	1    5400 3200
	1    0    0    -1  
$EndComp
$Comp
L Device:C C?
U 1 1 5EDBB081
P 5950 3200
AR Path="/5EDBB081" Ref="C?"  Part="1" 
AR Path="/5EDB0964/5EDBB081" Ref="C2"  Part="1" 
F 0 "C2" H 6065 3246 50  0000 L CNN
F 1 "100nF" H 6065 3155 50  0000 L CNN
F 2 "Capacitor_SMD:C_1206_3216Metric_Pad1.42x1.75mm_HandSolder" H 5988 3050 50  0001 C CNN
F 3 "~" H 5950 3200 50  0001 C CNN
	1    5950 3200
	1    0    0    -1  
$EndComp
$Comp
L power:GND #PWR?
U 1 1 5EDBB087
P 5400 3650
AR Path="/5EDBB087" Ref="#PWR?"  Part="1" 
AR Path="/5EDB0964/5EDBB087" Ref="#PWR0110"  Part="1" 
F 0 "#PWR0110" H 5400 3400 50  0001 C CNN
F 1 "GND" H 5405 3477 50  0000 C CNN
F 2 "" H 5400 3650 50  0001 C CNN
F 3 "" H 5400 3650 50  0001 C CNN
	1    5400 3650
	1    0    0    -1  
$EndComp
$Comp
L power:GND #PWR?
U 1 1 5EDBB08D
P 5950 3650
AR Path="/5EDBB08D" Ref="#PWR?"  Part="1" 
AR Path="/5EDB0964/5EDBB08D" Ref="#PWR0111"  Part="1" 
F 0 "#PWR0111" H 5950 3400 50  0001 C CNN
F 1 "GND" H 5955 3477 50  0000 C CNN
F 2 "" H 5950 3650 50  0001 C CNN
F 3 "" H 5950 3650 50  0001 C CNN
	1    5950 3650
	1    0    0    -1  
$EndComp
Wire Wire Line
	5400 3350 5400 3650
Wire Wire Line
	5950 3050 5950 2750
Wire Wire Line
	5950 3350 5950 3650
Wire Wire Line
	5400 2750 5400 3050
$Comp
L power:+3.3V #PWR?
U 1 1 5EDBF909
P 7650 1850
AR Path="/5EDBF909" Ref="#PWR?"  Part="1" 
AR Path="/5EDB0964/5EDBF909" Ref="#PWR0112"  Part="1" 
F 0 "#PWR0112" H 7650 1700 50  0001 C CNN
F 1 "+3.3V" H 7665 2023 50  0000 C CNN
F 2 "" H 7650 1850 50  0001 C CNN
F 3 "" H 7650 1850 50  0001 C CNN
	1    7650 1850
	1    0    0    -1  
$EndComp
Wire Wire Line
	7650 1850 7650 1950
Wire Wire Line
	7650 1950 8050 1950
$Comp
L Device:R R?
U 1 1 5EDBF911
P 7650 2250
AR Path="/5EDBF911" Ref="R?"  Part="1" 
AR Path="/5EDB0964/5EDBF911" Ref="R2"  Part="1" 
F 0 "R2" H 7720 2296 50  0000 L CNN
F 1 "10K" H 7720 2205 50  0000 L CNN
F 2 "Resistor_SMD:R_1206_3216Metric_Pad1.42x1.75mm_HandSolder" V 7580 2250 50  0001 C CNN
F 3 "~" H 7650 2250 50  0001 C CNN
	1    7650 2250
	1    0    0    -1  
$EndComp
Wire Wire Line
	8050 1950 8050 2250
Wire Wire Line
	7850 2550 7650 2550
Wire Wire Line
	7650 1950 7650 2100
Connection ~ 7650 1950
Wire Wire Line
	7650 2400 7650 2550
$Comp
L Transistor_FET:BSS138 Q?
U 1 1 5EDC3916
P 8050 3950
AR Path="/5EDC3916" Ref="Q?"  Part="1" 
AR Path="/5EDB0964/5EDC3916" Ref="Q2"  Part="1" 
F 0 "Q2" V 8299 3950 50  0000 C CNN
F 1 "BSS138" V 8390 3950 50  0000 C CNN
F 2 "Package_TO_SOT_SMD:SOT-23" H 8250 3875 50  0001 L CIN
F 3 "https://www.fairchildsemi.com/datasheets/BS/BSS138.pdf" H 8050 3950 50  0001 L CNN
	1    8050 3950
	0    1    1    0   
$EndComp
$Comp
L power:+3.3V #PWR?
U 1 1 5EDC391C
P 7650 3350
AR Path="/5EDC391C" Ref="#PWR?"  Part="1" 
AR Path="/5EDB0964/5EDC391C" Ref="#PWR0113"  Part="1" 
F 0 "#PWR0113" H 7650 3200 50  0001 C CNN
F 1 "+3.3V" H 7665 3523 50  0000 C CNN
F 2 "" H 7650 3350 50  0001 C CNN
F 3 "" H 7650 3350 50  0001 C CNN
	1    7650 3350
	1    0    0    -1  
$EndComp
Wire Wire Line
	7650 3350 7650 3450
Wire Wire Line
	7650 3450 8050 3450
$Comp
L Device:R R?
U 1 1 5EDC3924
P 7650 3750
AR Path="/5EDC3924" Ref="R?"  Part="1" 
AR Path="/5EDB0964/5EDC3924" Ref="R3"  Part="1" 
F 0 "R3" H 7720 3796 50  0000 L CNN
F 1 "10K" H 7720 3705 50  0000 L CNN
F 2 "Resistor_SMD:R_1206_3216Metric_Pad1.42x1.75mm_HandSolder" V 7580 3750 50  0001 C CNN
F 3 "~" H 7650 3750 50  0001 C CNN
	1    7650 3750
	1    0    0    -1  
$EndComp
Wire Wire Line
	8050 3450 8050 3750
Wire Wire Line
	7850 4050 7650 4050
Wire Wire Line
	7650 3450 7650 3600
Connection ~ 7650 3450
Wire Wire Line
	7650 3900 7650 4050
$Comp
L power:VCC #PWR?
U 1 1 5EDC3932
P 8400 3400
AR Path="/5EDC3932" Ref="#PWR?"  Part="1" 
AR Path="/5EDB0964/5EDC3932" Ref="#PWR0114"  Part="1" 
F 0 "#PWR0114" H 8400 3250 50  0001 C CNN
F 1 "VCC" H 8417 3573 50  0000 C CNN
F 2 "" H 8400 3400 50  0001 C CNN
F 3 "" H 8400 3400 50  0001 C CNN
	1    8400 3400
	1    0    0    -1  
$EndComp
$Comp
L Device:R R?
U 1 1 5EDC3938
P 8400 3750
AR Path="/5EDC3938" Ref="R?"  Part="1" 
AR Path="/5EDB0964/5EDC3938" Ref="R5"  Part="1" 
F 0 "R5" H 8330 3704 50  0000 R CNN
F 1 "10K" H 8330 3795 50  0000 R CNN
F 2 "Resistor_SMD:R_1206_3216Metric_Pad1.42x1.75mm_HandSolder" V 8330 3750 50  0001 C CNN
F 3 "~" H 8400 3750 50  0001 C CNN
	1    8400 3750
	-1   0    0    1   
$EndComp
Wire Wire Line
	8400 3400 8400 3600
Wire Wire Line
	8250 4050 8400 4050
Wire Wire Line
	8400 3900 8400 4050
Wire Wire Line
	8250 2550 8400 2550
Wire Wire Line
	8400 1900 8400 2100
$Comp
L Device:R R?
U 1 1 5EDBF925
P 8400 2250
AR Path="/5EDBF925" Ref="R?"  Part="1" 
AR Path="/5EDB0964/5EDBF925" Ref="R4"  Part="1" 
F 0 "R4" H 8330 2204 50  0000 R CNN
F 1 "10K" H 8330 2295 50  0000 R CNN
F 2 "Resistor_SMD:R_1206_3216Metric_Pad1.42x1.75mm_HandSolder" V 8330 2250 50  0001 C CNN
F 3 "~" H 8400 2250 50  0001 C CNN
	1    8400 2250
	-1   0    0    1   
$EndComp
$Comp
L power:VCC #PWR?
U 1 1 5EDBF91F
P 8400 1900
AR Path="/5EDBF91F" Ref="#PWR?"  Part="1" 
AR Path="/5EDB0964/5EDBF91F" Ref="#PWR0115"  Part="1" 
F 0 "#PWR0115" H 8400 1750 50  0001 C CNN
F 1 "VCC" H 8417 2073 50  0000 C CNN
F 2 "" H 8400 1900 50  0001 C CNN
F 3 "" H 8400 1900 50  0001 C CNN
	1    8400 1900
	1    0    0    -1  
$EndComp
$Comp
L Transistor_FET:BSS138 Q?
U 1 1 5EDBF903
P 8050 2450
AR Path="/5EDBF903" Ref="Q?"  Part="1" 
AR Path="/5EDB0964/5EDBF903" Ref="Q1"  Part="1" 
F 0 "Q1" V 8299 2450 50  0000 C CNN
F 1 "BSS138" V 8390 2450 50  0000 C CNN
F 2 "Package_TO_SOT_SMD:SOT-23" H 8250 2375 50  0001 L CIN
F 3 "https://www.fairchildsemi.com/datasheets/BS/BSS138.pdf" H 8050 2450 50  0001 L CNN
	1    8050 2450
	0    1    1    0   
$EndComp
Wire Wire Line
	8400 2400 8400 2550
Wire Wire Line
	2600 2850 2950 2850
Connection ~ 2950 2850
Wire Wire Line
	2950 2850 3250 2850
Text HLabel 4150 2950 2    50   Input ~ 0
ARD_DRDY
Text HLabel 4150 3050 2    50   Input ~ 0
ARD_MISO
Text HLabel 4150 3150 2    50   Input ~ 0
ARD_SCK
Text HLabel 4150 3250 2    50   Input ~ 0
ARD_MOSI
Text HLabel 4150 3350 2    50   Input ~ 0
ARD_CS0
Text HLabel 4150 3450 2    50   Input ~ 0
ARD_START
Text HLabel 4150 3550 2    50   Input ~ 0
ARD_PWDN
Text HLabel 4150 3650 2    50   Input ~ 0
ARD_DIAG_END
Text HLabel 3150 2950 0    50   Input ~ 0
ADC_RDY
Text HLabel 3150 3050 0    50   Input ~ 0
SPI_MISO
Text HLabel 3150 3150 0    50   Input ~ 0
SPI_SCK
Text HLabel 3150 3250 0    50   Input ~ 0
SPI_MOSI
Text HLabel 3150 3350 0    50   Input ~ 0
SPI_CS0
Text HLabel 3150 3450 0    50   Input ~ 0
ADC_RESET
Text HLabel 3150 3550 0    50   Input ~ 0
AFE_PDN
Text HLabel 3150 3650 0    50   Input ~ 0
DIAG_END
Wire Wire Line
	4150 2950 4050 2950
Wire Wire Line
	4050 3050 4150 3050
Wire Wire Line
	4050 3150 4150 3150
Wire Wire Line
	4150 3250 4050 3250
Wire Wire Line
	4050 3350 4150 3350
Wire Wire Line
	4150 3450 4050 3450
Wire Wire Line
	4050 3550 4150 3550
Wire Wire Line
	4150 3650 4050 3650
Wire Wire Line
	3250 3650 3150 3650
Wire Wire Line
	3150 3550 3250 3550
Wire Wire Line
	3250 3450 3150 3450
Wire Wire Line
	3150 3350 3250 3350
Wire Wire Line
	3250 3250 3150 3250
Wire Wire Line
	3150 3150 3250 3150
Wire Wire Line
	3250 3050 3150 3050
Wire Wire Line
	3150 2950 3250 2950
Text HLabel 8750 2550 2    50   Input ~ 0
ARD_LED_ALM
Text HLabel 8750 4050 2    50   Input ~ 0
ARD_PD_ALM
Text HLabel 7250 4050 0    50   Input ~ 0
PD_ALM
Text HLabel 7250 2550 0    50   Input ~ 0
LED_ALM
Wire Wire Line
	8750 2550 8400 2550
Connection ~ 8400 2550
Wire Wire Line
	7650 2550 7250 2550
Connection ~ 7650 2550
Wire Wire Line
	7250 4050 7650 4050
Connection ~ 7650 4050
Wire Wire Line
	8400 4050 8750 4050
Connection ~ 8400 4050
Wire Notes Line
	600  7700 6850 7700
Wire Notes Line
	6850 7700 6850 5600
Wire Notes Line
	6850 5600 600  5600
Wire Notes Line
	600  5600 600  7700
Text Notes 3450 5800 0    50   ~ 10
Informations\n
Wire Wire Line
	3650 3950 4550 3950
$EndSCHEMATC
