EESchema Schematic File Version 4
EELAYER 30 0
EELAYER END
$Descr A4 11693 8268
encoding utf-8
Sheet 6 6
Title "Pulsoximiter"
Date ""
Rev "A"
Comp "Alban Petit"
Comment1 ""
Comment2 ""
Comment3 ""
Comment4 ""
$EndDescr
Wire Notes Line
	600  7650 6850 7650
Wire Notes Line
	6850 7650 6850 5550
Wire Notes Line
	6850 5550 600  5550
Wire Notes Line
	600  5550 600  7650
Text Notes 3450 5750 0    50   ~ 10
Informations\n
$Comp
L P82B715DR:P82B715DR IC1
U 1 1 5F64CC2D
P 6150 3350
F 0 "IC1" H 6700 3615 50  0000 C CNN
F 1 "P82B715DR" H 6700 3524 50  0000 C CNN
F 2 "SOIC127P600X175-8N" H 7100 3450 50  0001 L CNN
F 3 "https://www.ti.com/lit/gpn/P82B715" H 7100 3350 50  0001 L CNN
F 4 "I2C Bus Extender" H 7100 3250 50  0001 L CNN "Description"
F 5 "1.75" H 7100 3150 50  0001 L CNN "Height"
F 6 "P82B715DR" H 7100 3050 50  0001 L CNN "Texas Instruments Part Number"
F 7 "https://www.ti.com/store/ti/en/p/product/?p=P82B715DR" H 7100 2950 50  0001 L CNN "Texas Instruments Price/Stock"
F 8 "Texas Instruments" H 7100 2850 50  0001 L CNN "Manufacturer_Name"
F 9 "P82B715DR" H 7100 2750 50  0001 L CNN "Manufacturer_Part_Number"
	1    6150 3350
	1    0    0    -1  
$EndComp
$Comp
L Connector:RJ12_Shielded J?
U 1 1 5F65210E
P 4200 3350
AR Path="/5F65210E" Ref="J?"  Part="1" 
AR Path="/5F64A49E/5F65210E" Ref="J2"  Part="1" 
F 0 "J2" H 4257 3917 50  0000 C CNN
F 1 "RJ12_Shielded" H 4257 3826 50  0000 C CNN
F 2 "" V 4200 3375 50  0001 C CNN
F 3 "~" V 4200 3375 50  0001 C CNN
	1    4200 3350
	-1   0    0    1   
$EndComp
Wire Wire Line
	3800 3350 3200 3350
$Comp
L power:+5V #PWR0137
U 1 1 5F66125E
P 7400 2650
F 0 "#PWR0137" H 7400 2500 50  0001 C CNN
F 1 "+5V" H 7415 2823 50  0000 C CNN
F 2 "" H 7400 2650 50  0001 C CNN
F 3 "" H 7400 2650 50  0001 C CNN
	1    7400 2650
	1    0    0    -1  
$EndComp
Wire Wire Line
	7250 3350 7400 3350
Wire Wire Line
	3800 3150 3200 3150
Text Label 3200 3150 0    50   ~ 0
LX
$Comp
L power:+5V #PWR0138
U 1 1 5F67548F
P 3050 3150
F 0 "#PWR0138" H 3050 3000 50  0001 C CNN
F 1 "+5V" H 3065 3323 50  0000 C CNN
F 2 "" H 3050 3150 50  0001 C CNN
F 3 "" H 3050 3150 50  0001 C CNN
	1    3050 3150
	1    0    0    -1  
$EndComp
Wire Wire Line
	3050 3150 3050 3250
Wire Wire Line
	3050 3250 3800 3250
Text Label 3200 3350 0    50   ~ 0
LY
$Comp
L power:GND #PWR0139
U 1 1 5F676638
P 3050 3550
F 0 "#PWR0139" H 3050 3300 50  0001 C CNN
F 1 "GND" H 3055 3377 50  0000 C CNN
F 2 "" H 3050 3550 50  0001 C CNN
F 3 "" H 3050 3550 50  0001 C CNN
	1    3050 3550
	1    0    0    -1  
$EndComp
Wire Wire Line
	3050 3450 3050 3550
Wire Wire Line
	3050 3450 3800 3450
Text HLabel 3700 3650 0    50   Input ~ 0
LED_SENSOR
Wire Wire Line
	3700 3650 3800 3650
Wire Wire Line
	6150 3650 6000 3650
Wire Wire Line
	6000 3650 6000 3900
$Comp
L power:GND #PWR0140
U 1 1 5F67BE6B
P 6000 3900
F 0 "#PWR0140" H 6000 3650 50  0001 C CNN
F 1 "GND" H 6005 3727 50  0000 C CNN
F 2 "" H 6000 3900 50  0001 C CNN
F 3 "" H 6000 3900 50  0001 C CNN
	1    6000 3900
	1    0    0    -1  
$EndComp
$Comp
L Device:R R9
U 1 1 5F67C79D
P 7700 3150
F 0 "R9" H 7770 3196 50  0000 L CNN
F 1 "430R" H 7770 3105 50  0000 L CNN
F 2 "Resistor_SMD:R_1206_3216Metric_Pad1.42x1.75mm_HandSolder" V 7630 3150 50  0001 C CNN
F 3 "~" H 7700 3150 50  0001 C CNN
	1    7700 3150
	1    0    0    -1  
$EndComp
$Comp
L Device:R R10
U 1 1 5F67D524
P 8050 3150
F 0 "R10" H 8120 3196 50  0000 L CNN
F 1 "4K7" H 8120 3105 50  0000 L CNN
F 2 "Resistor_SMD:R_1206_3216Metric_Pad1.42x1.75mm_HandSolder" V 7980 3150 50  0001 C CNN
F 3 "~" H 8050 3150 50  0001 C CNN
	1    8050 3150
	1    0    0    -1  
$EndComp
Wire Wire Line
	7250 3450 7700 3450
Wire Wire Line
	7400 2650 7400 2800
Wire Wire Line
	7400 2800 7700 2800
Connection ~ 7400 2800
Connection ~ 7700 2800
Wire Wire Line
	8050 3300 8050 3550
Wire Wire Line
	7700 3300 7700 3450
Connection ~ 7700 3450
Connection ~ 8050 3550
Wire Wire Line
	7250 3550 8050 3550
Wire Wire Line
	7700 2800 8050 2800
Wire Wire Line
	6150 3450 6050 3450
Wire Wire Line
	6150 3550 5700 3550
Wire Wire Line
	8050 3550 8250 3550
Text HLabel 5550 3550 0    50   Input ~ 0
SDA
Text HLabel 8250 3550 2    50   Input ~ 0
SCL
Wire Wire Line
	6050 3300 6050 3450
Connection ~ 6050 3450
Wire Wire Line
	5700 3300 5700 3550
Connection ~ 5700 3550
Wire Wire Line
	5700 3550 5550 3550
Wire Wire Line
	7700 3450 8450 3450
Wire Wire Line
	5350 3450 6050 3450
Text Label 5350 3450 0    50   ~ 0
LX
Text Label 8450 3450 2    50   ~ 0
LY
Text HLabel 3700 3550 0    50   Input ~ 0
INT
Wire Wire Line
	3700 3550 3800 3550
Wire Wire Line
	6050 2800 7400 2800
Wire Wire Line
	6050 2800 5700 2800
Connection ~ 6050 2800
$Comp
L Device:R R7
U 1 1 5F684BE6
P 5700 3150
F 0 "R7" H 5630 3196 50  0000 R CNN
F 1 "4K7" H 5630 3105 50  0000 R CNN
F 2 "Resistor_SMD:R_1206_3216Metric_Pad1.42x1.75mm_HandSolder" V 5630 3150 50  0001 C CNN
F 3 "~" H 5700 3150 50  0001 C CNN
	1    5700 3150
	-1   0    0    -1  
$EndComp
$Comp
L Device:R R8
U 1 1 5F684BE0
P 6050 3150
F 0 "R8" H 5980 3196 50  0000 R CNN
F 1 "430R" H 5980 3105 50  0000 R CNN
F 2 "Resistor_SMD:R_1206_3216Metric_Pad1.42x1.75mm_HandSolder" V 5980 3150 50  0001 C CNN
F 3 "~" H 6050 3150 50  0001 C CNN
	1    6050 3150
	-1   0    0    -1  
$EndComp
Wire Wire Line
	7400 2800 7400 3350
Wire Wire Line
	7700 2800 7700 3000
Wire Wire Line
	8050 2800 8050 3000
Wire Wire Line
	5700 2800 5700 3000
Wire Wire Line
	6050 2800 6050 3000
$EndSCHEMATC
