EESchema Schematic File Version 4
EELAYER 30 0
EELAYER END
$Descr A4 11693 8268
encoding utf-8
Sheet 2 2
Title "Pulsoximiter"
Date ""
Rev "A"
Comp "Alban Petit"
Comment1 ""
Comment2 ""
Comment3 ""
Comment4 ""
$EndDescr
Text HLabel 5500 6400 2    50   Input ~ 0
GND
$Comp
L power:GND #PWR?
U 1 1 5E9911A1
P 5250 6400
F 0 "#PWR?" H 5250 6150 50  0001 C CNN
F 1 "GND" H 5255 6227 50  0000 C CNN
F 2 "" H 5250 6400 50  0001 C CNN
F 3 "" H 5250 6400 50  0001 C CNN
	1    5250 6400
	0    1    1    0   
$EndComp
Wire Wire Line
	5500 6400 5250 6400
$Comp
L power:VCC #PWR?
U 1 1 5E991CF4
P 3550 1800
F 0 "#PWR?" H 3550 1650 50  0001 C CNN
F 1 "VCC" H 3567 1973 50  0000 C CNN
F 2 "" H 3550 1800 50  0001 C CNN
F 3 "" H 3550 1800 50  0001 C CNN
	1    3550 1800
	1    0    0    -1  
$EndComp
$Comp
L Device:C C?
U 1 1 5E99218F
P 3500 2100
F 0 "C?" H 3615 2146 50  0000 L CNN
F 1 "100nF" H 3615 2055 50  0000 L CNN
F 2 "" H 3538 1950 50  0001 C CNN
F 3 "~" H 3500 2100 50  0001 C CNN
	1    3500 2100
	1    0    0    -1  
$EndComp
$Comp
L power:GND #PWR?
U 1 1 5EA2539F
P 3500 2500
F 0 "#PWR?" H 3500 2250 50  0001 C CNN
F 1 "GND" H 3505 2327 50  0000 C CNN
F 2 "" H 3500 2500 50  0001 C CNN
F 3 "" H 3500 2500 50  0001 C CNN
	1    3500 2500
	1    0    0    -1  
$EndComp
Wire Wire Line
	3500 2500 3500 2250
Wire Wire Line
	3500 1950 3500 1850
$Comp
L Transistor_BJT:BC807 Q?
U 1 1 5EA25E04
P 4200 2500
F 0 "Q?" H 4391 2454 50  0000 L CNN
F 1 "BC807" H 4391 2545 50  0000 L CNN
F 2 "Package_TO_SOT_SMD:SOT-23" H 4400 2425 50  0001 L CIN
F 3 "http://www.fairchildsemi.com/ds/BC/BC807.pdf" H 4200 2500 50  0001 L CNN
	1    4200 2500
	-1   0    0    1   
$EndComp
Wire Wire Line
	3500 1850 4100 1850
Connection ~ 3500 1850
Wire Wire Line
	3500 1850 3500 1700
Wire Wire Line
	4400 2500 4650 2500
$Comp
L Transistor_BJT:BC817 Q?
U 1 1 5EA28130
P 4200 3500
F 0 "Q?" H 4391 3546 50  0000 L CNN
F 1 "BC817" H 4391 3455 50  0000 L CNN
F 2 "Package_TO_SOT_SMD:SOT-23" H 4400 3425 50  0001 L CIN
F 3 "http://www.fairchildsemi.com/ds/BC/BC817.pdf" H 4200 3500 50  0001 L CNN
	1    4200 3500
	-1   0    0    -1  
$EndComp
$Comp
L Device:R R?
U 1 1 5EA298C4
P 4100 4100
F 0 "R?" H 4170 4146 50  0000 L CNN
F 1 "20R" H 4170 4055 50  0000 L CNN
F 2 "" V 4030 4100 50  0001 C CNN
F 3 "~" H 4100 4100 50  0001 C CNN
	1    4100 4100
	1    0    0    -1  
$EndComp
$Comp
L power:GND #PWR?
U 1 1 5EA2A5AB
P 4100 4500
F 0 "#PWR?" H 4100 4250 50  0001 C CNN
F 1 "GND" H 4105 4327 50  0000 C CNN
F 2 "" H 4100 4500 50  0001 C CNN
F 3 "" H 4100 4500 50  0001 C CNN
	1    4100 4500
	1    0    0    -1  
$EndComp
Wire Wire Line
	4100 4250 4100 4500
$Comp
L Transistor_BJT:BC807 Q?
U 1 1 5EA27EA2
P 2800 2500
F 0 "Q?" H 2991 2546 50  0000 L CNN
F 1 "BC807" H 2991 2455 50  0000 L CNN
F 2 "Package_TO_SOT_SMD:SOT-23" H 3000 2425 50  0001 L CIN
F 3 "http://www.fairchildsemi.com/ds/BC/BC807.pdf" H 2800 2500 50  0001 L CNN
	1    2800 2500
	1    0    0    1   
$EndComp
Wire Wire Line
	2900 1850 3500 1850
$Comp
L Transistor_BJT:BC817 Q?
U 1 1 5EA402C0
P 2800 3500
F 0 "Q?" H 2991 3546 50  0000 L CNN
F 1 "BC817" H 2991 3455 50  0000 L CNN
F 2 "Package_TO_SOT_SMD:SOT-23" H 3000 3425 50  0001 L CIN
F 3 "http://www.fairchildsemi.com/ds/BC/BC817.pdf" H 2800 3500 50  0001 L CNN
	1    2800 3500
	1    0    0    -1  
$EndComp
Wire Wire Line
	2600 2500 2350 2500
$Comp
L Device:R R?
U 1 1 5EA43E89
P 2900 4100
F 0 "R?" H 2970 4146 50  0000 L CNN
F 1 "20R" H 2970 4055 50  0000 L CNN
F 2 "" V 2830 4100 50  0001 C CNN
F 3 "~" H 2900 4100 50  0001 C CNN
	1    2900 4100
	1    0    0    -1  
$EndComp
$Comp
L power:GND #PWR?
U 1 1 5EA43E90
P 2900 4500
F 0 "#PWR?" H 2900 4250 50  0001 C CNN
F 1 "GND" H 2905 4327 50  0000 C CNN
F 2 "" H 2900 4500 50  0001 C CNN
F 3 "" H 2900 4500 50  0001 C CNN
	1    2900 4500
	1    0    0    -1  
$EndComp
Wire Wire Line
	2900 4250 2900 4500
Wire Wire Line
	4100 1850 4100 2300
Wire Wire Line
	2900 1850 2900 2300
Wire Notes Line
	11100 5400 11100 600 
Wire Notes Line
	11100 600  6500 600 
Text Notes 3000 850  0    50   ~ 10
Nellcor Sensor LED driver
Text Label 1600 3100 0    50   ~ 0
LED_IR
Text Label 1600 3200 0    50   ~ 0
LED_RED
Wire Notes Line
	6500 5400 11100 5400
Wire Notes Line
	6500 5400 6500 600 
Wire Notes Line
	600  5500 600  7700
Wire Notes Line
	6400 5400 6400 600 
Wire Notes Line
	6400 600  600  600 
Wire Notes Line
	600  600  600  5400
Wire Notes Line
	600  5400 6400 5400
Text Notes 1650 5750 0    50   ~ 10
DB9 Nellcor Connector
$Comp
L Connector:DB9_Male J?
U 1 1 5EA8144E
P 1750 6850
AR Path="/5EA8144E" Ref="J?"  Part="1" 
AR Path="/5E98A423/5EA8144E" Ref="J?"  Part="1" 
F 0 "J?" H 1668 6158 50  0000 C CNN
F 1 "DB9_Male" H 1668 6249 50  0000 C CNN
F 2 "" H 1750 6850 50  0001 C CNN
F 3 " ~" H 1750 6850 50  0001 C CNN
	1    1750 6850
	-1   0    0    1   
$EndComp
Wire Wire Line
	4100 3700 4100 3950
Wire Wire Line
	2900 3700 2900 3950
Text Label 2700 6650 2    50   ~ 0
LED_IR
Text Label 2700 6850 2    50   ~ 0
LED_RED
Wire Wire Line
	2600 3500 2350 3500
Wire Wire Line
	4400 3500 4650 3500
Text HLabel 5500 6650 2    50   Input ~ 0
IN0
Text HLabel 5500 6550 2    50   Input ~ 0
IN1
Wire Wire Line
	1600 3100 2900 3100
Connection ~ 2900 3100
Wire Wire Line
	2900 3100 2900 3300
Wire Wire Line
	1600 3200 4100 3200
Connection ~ 4100 3200
Wire Wire Line
	4100 3200 4100 3300
Wire Wire Line
	4650 2500 4650 2950
Text Label 1600 2850 0    50   ~ 0
LED_CONTROL0
Text Label 1600 2950 0    50   ~ 0
LED_CONTROL1
Wire Notes Line
	600  7700 3850 7700
Wire Notes Line
	3850 7700 3850 5500
Wire Notes Line
	3850 5500 600  5500
Wire Notes Line
	3950 5500 3950 7700
Wire Notes Line
	3950 7700 6850 7700
Wire Notes Line
	6850 7700 6850 5500
Wire Notes Line
	6850 5500 3950 5500
Text Notes 5200 5750 0    50   ~ 10
Sheet pinout
$Comp
L power:GND #PWR?
U 1 1 5EB48CCD
P 2900 6950
F 0 "#PWR?" H 2900 6700 50  0001 C CNN
F 1 "GND" H 2905 6777 50  0000 C CNN
F 2 "" H 2900 6950 50  0001 C CNN
F 3 "" H 2900 6950 50  0001 C CNN
	1    2900 6950
	1    0    0    -1  
$EndComp
Text Label 2700 7150 2    50   ~ 0
PHOTODIODE_C
Wire Wire Line
	2050 6650 2700 6650
Wire Wire Line
	2050 6750 2900 6750
Wire Wire Line
	2050 6850 2700 6850
Wire Wire Line
	2050 7150 2700 7150
Wire Wire Line
	2050 7250 2700 7250
Wire Wire Line
	2900 6750 2900 6950
Text Label 2700 7250 2    50   ~ 0
PHOTODIODE_A
Wire Wire Line
	2900 2700 2900 3100
Wire Wire Line
	2350 2500 2350 2850
Wire Wire Line
	1600 2850 2350 2850
Connection ~ 2350 2850
Wire Wire Line
	2350 2850 2350 3500
Wire Wire Line
	4100 2700 4100 3200
Wire Wire Line
	1600 2950 4650 2950
Connection ~ 4650 2950
Wire Wire Line
	4650 2950 4650 3500
Text HLabel 5500 6800 2    50   Input ~ 0
OUT0
Text HLabel 5500 6900 2    50   Input ~ 0
OUT1
Text HLabel 5500 7000 2    50   Input ~ 0
OUT2
Text HLabel 5500 7100 2    50   Input ~ 0
OUT3
$EndSCHEMATC
