EESchema Schematic File Version 4
EELAYER 30 0
EELAYER END
$Descr A4 11693 8268
encoding utf-8
Sheet 5 6
Title "Pulsoximiter"
Date ""
Rev "A"
Comp "Alban Petit"
Comment1 ""
Comment2 ""
Comment3 ""
Comment4 ""
$EndDescr
$Comp
L Regulator_Linear:AP2112K-3.3 U2
U 1 1 5EEB3708
P 3850 2600
F 0 "U2" H 3850 2942 50  0000 C CNN
F 1 "AP2112K-3.3" H 3850 2851 50  0000 C CNN
F 2 "Package_TO_SOT_SMD:SOT-23-5" H 3850 2925 50  0001 C CNN
F 3 "https://www.diodes.com/assets/Datasheets/AP2112.pdf" H 3850 2700 50  0001 C CNN
	1    3850 2600
	1    0    0    -1  
$EndComp
$Comp
L power:+5V #PWR0117
U 1 1 5EEB3FEB
P 3100 2300
F 0 "#PWR0117" H 3100 2150 50  0001 C CNN
F 1 "+5V" H 3115 2473 50  0000 C CNN
F 2 "" H 3100 2300 50  0001 C CNN
F 3 "" H 3100 2300 50  0001 C CNN
	1    3100 2300
	1    0    0    -1  
$EndComp
Wire Wire Line
	3100 2300 3100 2500
Wire Wire Line
	3100 2500 3250 2500
Wire Wire Line
	3550 2600 3450 2600
Wire Wire Line
	3450 2600 3450 2500
Connection ~ 3450 2500
Wire Wire Line
	3450 2500 3550 2500
$Comp
L Device:C C3
U 1 1 5EEB4981
P 3250 2950
F 0 "C3" H 3365 2996 50  0000 L CNN
F 1 "1uF" H 3365 2905 50  0000 L CNN
F 2 "Capacitor_SMD:C_1206_3216Metric_Pad1.42x1.75mm_HandSolder" H 3288 2800 50  0001 C CNN
F 3 "~" H 3250 2950 50  0001 C CNN
	1    3250 2950
	1    0    0    -1  
$EndComp
$Comp
L power:GND #PWR0118
U 1 1 5EEB4DF2
P 3850 3350
F 0 "#PWR0118" H 3850 3100 50  0001 C CNN
F 1 "GND" H 3855 3177 50  0000 C CNN
F 2 "" H 3850 3350 50  0001 C CNN
F 3 "" H 3850 3350 50  0001 C CNN
	1    3850 3350
	1    0    0    -1  
$EndComp
$Comp
L power:GND #PWR0119
U 1 1 5EEB5412
P 3250 3350
F 0 "#PWR0119" H 3250 3100 50  0001 C CNN
F 1 "GND" H 3255 3177 50  0000 C CNN
F 2 "" H 3250 3350 50  0001 C CNN
F 3 "" H 3250 3350 50  0001 C CNN
	1    3250 3350
	1    0    0    -1  
$EndComp
Wire Wire Line
	3850 2900 3850 3350
Wire Wire Line
	3250 3100 3250 3350
Wire Wire Line
	3250 2800 3250 2500
Connection ~ 3250 2500
Wire Wire Line
	3250 2500 3450 2500
Wire Wire Line
	4600 2300 4600 2500
Wire Wire Line
	4600 2500 4450 2500
Wire Wire Line
	4450 2800 4450 2500
Connection ~ 4450 2500
Wire Wire Line
	4150 2500 4450 2500
$Comp
L Device:C C4
U 1 1 5EEB893C
P 4450 2950
F 0 "C4" H 4565 2996 50  0000 L CNN
F 1 "1uF" H 4565 2905 50  0000 L CNN
F 2 "Capacitor_SMD:C_1206_3216Metric_Pad1.42x1.75mm_HandSolder" H 4488 2800 50  0001 C CNN
F 3 "~" H 4450 2950 50  0001 C CNN
	1    4450 2950
	1    0    0    -1  
$EndComp
$Comp
L power:GND #PWR0121
U 1 1 5EEB9667
P 4450 3350
F 0 "#PWR0121" H 4450 3100 50  0001 C CNN
F 1 "GND" H 4455 3177 50  0000 C CNN
F 2 "" H 4450 3350 50  0001 C CNN
F 3 "" H 4450 3350 50  0001 C CNN
	1    4450 3350
	1    0    0    -1  
$EndComp
Wire Wire Line
	4450 3100 4450 3350
$Comp
L Device:LED D5
U 1 1 5EEB98E8
P 4900 2850
F 0 "D5" V 4939 2733 50  0000 R CNN
F 1 "LED" V 4848 2733 50  0000 R CNN
F 2 "" H 4900 2850 50  0001 C CNN
F 3 "~" H 4900 2850 50  0001 C CNN
	1    4900 2850
	0    -1   -1   0   
$EndComp
$Comp
L Device:R R6
U 1 1 5EEBA5A8
P 4900 3350
F 0 "R6" H 4970 3396 50  0000 L CNN
F 1 "330R" H 4970 3305 50  0000 L CNN
F 2 "Resistor_SMD:R_1206_3216Metric_Pad1.42x1.75mm_HandSolder" V 4830 3350 50  0001 C CNN
F 3 "~" H 4900 3350 50  0001 C CNN
	1    4900 3350
	1    0    0    -1  
$EndComp
$Comp
L power:GND #PWR0122
U 1 1 5EEBB9CF
P 4900 3750
F 0 "#PWR0122" H 4900 3500 50  0001 C CNN
F 1 "GND" H 4905 3577 50  0000 C CNN
F 2 "" H 4900 3750 50  0001 C CNN
F 3 "" H 4900 3750 50  0001 C CNN
	1    4900 3750
	1    0    0    -1  
$EndComp
Wire Wire Line
	4900 3500 4900 3750
Wire Wire Line
	4600 2500 4900 2500
Connection ~ 4600 2500
Wire Wire Line
	4900 3000 4900 3200
Wire Wire Line
	4900 2500 4900 2700
Wire Notes Line
	600  7700 6850 7700
Wire Notes Line
	6850 7700 6850 5600
Wire Notes Line
	6850 5600 600  5600
Wire Notes Line
	600  5600 600  7700
Text Notes 3450 5800 0    50   ~ 10
Informations\n
$Comp
L power:+3.3V #PWR0132
U 1 1 5F46EC83
P 6600 1850
F 0 "#PWR0132" H 6600 1700 50  0001 C CNN
F 1 "+3.3V" H 6615 2023 50  0000 C CNN
F 2 "" H 6600 1850 50  0001 C CNN
F 3 "" H 6600 1850 50  0001 C CNN
	1    6600 1850
	1    0    0    -1  
$EndComp
$Comp
L Device:L L1
U 1 1 5F47260D
P 7200 2250
F 0 "L1" V 7390 2250 50  0000 C CNN
F 1 "L" V 7299 2250 50  0000 C CNN
F 2 "" H 7200 2250 50  0001 C CNN
F 3 "~" H 7200 2250 50  0001 C CNN
	1    7200 2250
	0    -1   -1   0   
$EndComp
$Comp
L Device:L L2
U 1 1 5F4736B3
P 7200 2900
F 0 "L2" V 7390 2900 50  0000 C CNN
F 1 "L" V 7299 2900 50  0000 C CNN
F 2 "" H 7200 2900 50  0001 C CNN
F 3 "~" H 7200 2900 50  0001 C CNN
	1    7200 2900
	0    -1   -1   0   
$EndComp
$Comp
L Device:L L3
U 1 1 5F473AD1
P 7200 3500
F 0 "L3" V 7390 3500 50  0000 C CNN
F 1 "L" V 7299 3500 50  0000 C CNN
F 2 "" H 7200 3500 50  0001 C CNN
F 3 "~" H 7200 3500 50  0001 C CNN
	1    7200 3500
	0    -1   -1   0   
$EndComp
$Comp
L Device:L L4
U 1 1 5F473DC7
P 7200 4100
F 0 "L4" V 7390 4100 50  0000 C CNN
F 1 "L" V 7299 4100 50  0000 C CNN
F 2 "" H 7200 4100 50  0001 C CNN
F 3 "~" H 7200 4100 50  0001 C CNN
	1    7200 4100
	0    -1   -1   0   
$EndComp
Wire Wire Line
	6600 1850 6600 2250
Wire Wire Line
	6600 4100 7050 4100
Wire Wire Line
	7050 3500 6600 3500
Wire Wire Line
	7050 2900 6600 2900
Wire Wire Line
	7050 2250 6600 2250
Connection ~ 6600 2250
$Comp
L Device:C_Small C13
U 1 1 5F47CFA2
P 7600 2600
F 0 "C13" V 7371 2600 50  0000 C CNN
F 1 "10uF" V 7462 2600 50  0000 C CNN
F 2 "Capacitor_SMD:C_1206_3216Metric_Pad1.42x1.75mm_HandSolder" H 7600 2600 50  0001 C CNN
F 3 "~" H 7600 2600 50  0001 C CNN
	1    7600 2600
	0    1    1    0   
$EndComp
Connection ~ 6600 2900
Wire Wire Line
	6600 2250 6600 2900
Wire Wire Line
	6600 2900 6600 3500
$Comp
L Device:C_Small C14
U 1 1 5F48818C
P 7600 3250
F 0 "C14" V 7371 3250 50  0000 C CNN
F 1 "10uF" V 7462 3250 50  0000 C CNN
F 2 "Capacitor_SMD:C_1206_3216Metric_Pad1.42x1.75mm_HandSolder" H 7600 3250 50  0001 C CNN
F 3 "~" H 7600 3250 50  0001 C CNN
	1    7600 3250
	0    1    1    0   
$EndComp
$Comp
L Device:C_Small C15
U 1 1 5F4885C9
P 7600 3850
F 0 "C15" V 7371 3850 50  0000 C CNN
F 1 "10uF" V 7462 3850 50  0000 C CNN
F 2 "Capacitor_SMD:C_1206_3216Metric_Pad1.42x1.75mm_HandSolder" H 7600 3850 50  0001 C CNN
F 3 "~" H 7600 3850 50  0001 C CNN
	1    7600 3850
	0    1    1    0   
$EndComp
$Comp
L Device:C_Small C16
U 1 1 5F488AFA
P 7600 4450
F 0 "C16" V 7371 4450 50  0000 C CNN
F 1 "10uF" V 7462 4450 50  0000 C CNN
F 2 "Capacitor_SMD:C_1206_3216Metric_Pad1.42x1.75mm_HandSolder" H 7600 4450 50  0001 C CNN
F 3 "~" H 7600 4450 50  0001 C CNN
	1    7600 4450
	0    1    1    0   
$EndComp
Wire Wire Line
	6600 3500 6600 4100
Connection ~ 6600 3500
Wire Wire Line
	7350 2600 7500 2600
Wire Wire Line
	7350 2250 7350 2600
Wire Wire Line
	7350 2900 7350 3250
Wire Wire Line
	7350 3250 7500 3250
Wire Wire Line
	7350 3500 7350 3850
Wire Wire Line
	7350 3850 7500 3850
Wire Wire Line
	7350 4100 7350 4450
Wire Wire Line
	7350 4450 7500 4450
Wire Wire Line
	7350 2900 7550 2900
Connection ~ 7350 2900
Wire Wire Line
	7350 2250 7550 2250
Connection ~ 7350 2250
Wire Wire Line
	7350 3500 7550 3500
Connection ~ 7350 3500
Wire Wire Line
	7350 4100 7550 4100
Connection ~ 7350 4100
$Comp
L power:GND #PWR0133
U 1 1 5F490AF6
P 8300 2700
F 0 "#PWR0133" H 8300 2450 50  0001 C CNN
F 1 "GND" H 8305 2527 50  0000 C CNN
F 2 "" H 8300 2700 50  0001 C CNN
F 3 "" H 8300 2700 50  0001 C CNN
	1    8300 2700
	1    0    0    -1  
$EndComp
$Comp
L power:GND #PWR0134
U 1 1 5F4910DA
P 8300 3350
F 0 "#PWR0134" H 8300 3100 50  0001 C CNN
F 1 "GND" H 8305 3177 50  0000 C CNN
F 2 "" H 8300 3350 50  0001 C CNN
F 3 "" H 8300 3350 50  0001 C CNN
	1    8300 3350
	1    0    0    -1  
$EndComp
Wire Wire Line
	8300 2600 8300 2700
Wire Wire Line
	8300 3250 8300 3350
$Comp
L power:GND #PWR0135
U 1 1 5F492E57
P 8300 3950
F 0 "#PWR0135" H 8300 3700 50  0001 C CNN
F 1 "GND" H 8305 3777 50  0000 C CNN
F 2 "" H 8300 3950 50  0001 C CNN
F 3 "" H 8300 3950 50  0001 C CNN
	1    8300 3950
	1    0    0    -1  
$EndComp
Wire Wire Line
	8300 3850 8300 3950
$Comp
L power:GND #PWR0136
U 1 1 5F494BFE
P 8300 4550
F 0 "#PWR0136" H 8300 4300 50  0001 C CNN
F 1 "GND" H 8305 4377 50  0000 C CNN
F 2 "" H 8300 4550 50  0001 C CNN
F 3 "" H 8300 4550 50  0001 C CNN
	1    8300 4550
	1    0    0    -1  
$EndComp
Wire Wire Line
	8300 4450 8300 4550
Text HLabel 7550 2250 2    50   Input ~ 0
LED_DRV_SUP
Text HLabel 7550 2900 2    50   Input ~ 0
TX_CTRL_SUP
Wire Wire Line
	7700 4450 8300 4450
Wire Wire Line
	7700 3850 8300 3850
Wire Wire Line
	7700 3250 8300 3250
Text HLabel 7550 3500 2    50   Input ~ 0
RX_DIG_SUP
Text HLabel 7550 4100 2    50   Input ~ 0
RX_ANA_SUP
Wire Wire Line
	7700 2600 8300 2600
$Comp
L power:+3.3V #PWR0120
U 1 1 5F65B461
P 4600 2300
F 0 "#PWR0120" H 4600 2150 50  0001 C CNN
F 1 "+3.3V" H 4615 2473 50  0000 C CNN
F 2 "" H 4600 2300 50  0001 C CNN
F 3 "" H 4600 2300 50  0001 C CNN
	1    4600 2300
	1    0    0    -1  
$EndComp
$EndSCHEMATC
