EESchema Schematic File Version 4
EELAYER 30 0
EELAYER END
$Descr A4 11693 8268
encoding utf-8
Sheet 4 6
Title "Pulsoximiter"
Date ""
Rev "A"
Comp "Alban Petit"
Comment1 ""
Comment2 ""
Comment3 ""
Comment4 ""
$EndDescr
$Comp
L Connector:DB9_Male J?
U 1 1 5F396239
P 2100 1700
AR Path="/5F396239" Ref="J?"  Part="1" 
AR Path="/5F38BF74/5F396239" Ref="J1"  Part="1" 
F 0 "J1" H 2018 1008 50  0000 C CNN
F 1 "DB9_Male" H 2018 1099 50  0000 C CNN
F 2 "Connector_Dsub:DSUB-9_Male_EdgeMount_P2.77mm" H 2100 1700 50  0001 C CNN
F 3 " ~" H 2100 1700 50  0001 C CNN
	1    2100 1700
	-1   0    0    1   
$EndComp
Wire Wire Line
	8350 1400 8950 1400
$Comp
L power:GND #PWR?
U 1 1 5F396240
P 8950 2050
AR Path="/5F396240" Ref="#PWR?"  Part="1" 
AR Path="/5F38BF74/5F396240" Ref="#PWR0123"  Part="1" 
F 0 "#PWR0123" H 8950 1800 50  0001 C CNN
F 1 "GND" H 8955 1877 50  0000 C CNN
F 2 "" H 8950 2050 50  0001 C CNN
F 3 "" H 8950 2050 50  0001 C CNN
	1    8950 2050
	1    0    0    -1  
$EndComp
Wire Wire Line
	8350 1500 8950 1500
Wire Wire Line
	8350 1600 8950 1600
Wire Wire Line
	8350 1700 8950 1700
Wire Wire Line
	8350 1800 8950 1800
Wire Wire Line
	8350 1900 8950 1900
Wire Wire Line
	8950 1400 8950 1500
Connection ~ 8950 1500
Wire Wire Line
	8950 1500 8950 1600
Connection ~ 8950 1600
Wire Wire Line
	8950 1600 8950 1700
Connection ~ 8950 1700
Wire Wire Line
	8950 1700 8950 1800
Connection ~ 8950 1800
Wire Wire Line
	8950 1800 8950 1900
Connection ~ 8950 1900
Wire Wire Line
	8950 1900 8950 2050
Wire Wire Line
	8350 3600 8500 3600
Wire Wire Line
	8350 3500 8500 3500
Wire Wire Line
	8500 3500 8500 3600
Text Label 5250 1900 0    50   ~ 0
ADC_RESET
Wire Wire Line
	5850 3600 5250 3600
$Comp
L power:GND #PWR?
U 1 1 5F39625B
P 5250 4100
AR Path="/5F39625B" Ref="#PWR?"  Part="1" 
AR Path="/5F38BF74/5F39625B" Ref="#PWR0124"  Part="1" 
F 0 "#PWR0124" H 5250 3850 50  0001 C CNN
F 1 "GND" H 5255 3927 50  0000 C CNN
F 2 "" H 5250 4100 50  0001 C CNN
F 3 "" H 5250 4100 50  0001 C CNN
	1    5250 4100
	-1   0    0    -1  
$EndComp
Wire Wire Line
	5850 3700 5250 3700
Wire Wire Line
	5850 3800 5250 3800
Wire Wire Line
	5850 3900 5250 3900
Wire Wire Line
	5250 3600 5250 3700
Connection ~ 5250 3700
Wire Wire Line
	5250 3700 5250 3800
Connection ~ 5250 3800
Wire Wire Line
	5250 3800 5250 3900
Wire Wire Line
	5250 4100 5250 3900
Connection ~ 5250 3900
$Comp
L AFE4400:AFE4400RHAT U?
U 1 1 5F39626C
P 5850 1400
AR Path="/5F39626C" Ref="U?"  Part="1" 
AR Path="/5F38BF74/5F39626C" Ref="U4"  Part="1" 
F 0 "U4" H 7100 1787 60  0000 C CNN
F 1 "AFE4400RHAT" H 7100 1681 60  0000 C CNN
F 2 "RHA40_4P15X4P15" H 7100 1690 60  0001 C CNN
F 3 "" H 5850 1400 60  0000 C CNN
	1    5850 1400
	1    0    0    -1  
$EndComp
Wire Wire Line
	8350 3100 8400 3100
Wire Wire Line
	8400 3100 8400 3150
Wire Wire Line
	8400 3200 8350 3200
Connection ~ 8400 3150
Wire Wire Line
	8400 3150 8400 3200
$Comp
L Device:C_Small C?
U 1 1 5F396277
P 9150 3450
AR Path="/5F396277" Ref="C?"  Part="1" 
AR Path="/5F38BF74/5F396277" Ref="C8"  Part="1" 
F 0 "C8" V 8921 3450 50  0000 C CNN
F 1 "1uF" V 9012 3450 50  0000 C CNN
F 2 "Capacitor_SMD:C_1206_3216Metric_Pad1.42x1.75mm_HandSolder" H 9150 3450 50  0001 C CNN
F 3 "~" H 9150 3450 50  0001 C CNN
	1    9150 3450
	0    1    1    0   
$EndComp
$Comp
L power:GND #PWR?
U 1 1 5F39627D
P 9650 3500
AR Path="/5F39627D" Ref="#PWR?"  Part="1" 
AR Path="/5F38BF74/5F39627D" Ref="#PWR0125"  Part="1" 
F 0 "#PWR0125" H 9650 3250 50  0001 C CNN
F 1 "GND" H 9655 3327 50  0000 C CNN
F 2 "" H 9650 3500 50  0001 C CNN
F 3 "" H 9650 3500 50  0001 C CNN
	1    9650 3500
	1    0    0    -1  
$EndComp
Wire Wire Line
	9650 3450 9650 3500
Wire Wire Line
	9250 3450 9650 3450
Wire Wire Line
	9650 4700 9650 4650
$Comp
L Device:C_Small C?
U 1 1 5F396286
P 9150 4650
AR Path="/5F396286" Ref="C?"  Part="1" 
AR Path="/5F38BF74/5F396286" Ref="C10"  Part="1" 
F 0 "C10" V 8921 4650 50  0000 C CNN
F 1 "0.1uF" V 9012 4650 50  0000 C CNN
F 2 "Capacitor_SMD:C_1206_3216Metric_Pad1.42x1.75mm_HandSolder" H 9150 4650 50  0001 C CNN
F 3 "~" H 9150 4650 50  0001 C CNN
	1    9150 4650
	0    1    1    0   
$EndComp
Wire Wire Line
	9650 4000 9650 4050
$Comp
L power:GND #PWR?
U 1 1 5F39628E
P 9650 4050
AR Path="/5F39628E" Ref="#PWR?"  Part="1" 
AR Path="/5F38BF74/5F39628E" Ref="#PWR0126"  Part="1" 
F 0 "#PWR0126" H 9650 3800 50  0001 C CNN
F 1 "GND" H 9655 3877 50  0000 C CNN
F 2 "" H 9650 4050 50  0001 C CNN
F 3 "" H 9650 4050 50  0001 C CNN
	1    9650 4050
	1    0    0    -1  
$EndComp
$Comp
L Device:C_Small C?
U 1 1 5F396294
P 9150 4000
AR Path="/5F396294" Ref="C?"  Part="1" 
AR Path="/5F38BF74/5F396294" Ref="C9"  Part="1" 
F 0 "C9" V 8921 4000 50  0000 C CNN
F 1 "0.1uF" V 9012 4000 50  0000 C CNN
F 2 "Capacitor_SMD:C_1206_3216Metric_Pad1.42x1.75mm_HandSolder" H 9150 4000 50  0001 C CNN
F 3 "~" H 9150 4000 50  0001 C CNN
	1    9150 4000
	0    1    1    0   
$EndComp
$Comp
L power:GND #PWR?
U 1 1 5F39629A
P 9650 4700
AR Path="/5F39629A" Ref="#PWR?"  Part="1" 
AR Path="/5F38BF74/5F39629A" Ref="#PWR0127"  Part="1" 
F 0 "#PWR0127" H 9650 4450 50  0001 C CNN
F 1 "GND" H 9655 4527 50  0000 C CNN
F 2 "" H 9650 4700 50  0001 C CNN
F 3 "" H 9650 4700 50  0001 C CNN
	1    9650 4700
	1    0    0    -1  
$EndComp
Wire Wire Line
	9250 4650 9650 4650
Wire Wire Line
	9650 4000 9250 4000
$Comp
L Device:C_Small C?
U 1 1 5F3962A4
P 9150 2900
AR Path="/5F3962A4" Ref="C?"  Part="1" 
AR Path="/5F38BF74/5F3962A4" Ref="C7"  Part="1" 
F 0 "C7" V 8921 2900 50  0000 C CNN
F 1 "0.1uF" V 9012 2900 50  0000 C CNN
F 2 "Capacitor_SMD:C_1206_3216Metric_Pad1.42x1.75mm_HandSolder" H 9150 2900 50  0001 C CNN
F 3 "~" H 9150 2900 50  0001 C CNN
	1    9150 2900
	0    1    1    0   
$EndComp
$Comp
L power:GND #PWR?
U 1 1 5F3962AA
P 9650 2950
AR Path="/5F3962AA" Ref="#PWR?"  Part="1" 
AR Path="/5F38BF74/5F3962AA" Ref="#PWR0128"  Part="1" 
F 0 "#PWR0128" H 9650 2700 50  0001 C CNN
F 1 "GND" H 9655 2777 50  0000 C CNN
F 2 "" H 9650 2950 50  0001 C CNN
F 3 "" H 9650 2950 50  0001 C CNN
	1    9650 2950
	1    0    0    -1  
$EndComp
Wire Wire Line
	9650 2900 9650 2950
Wire Wire Line
	9250 2900 9650 2900
Wire Wire Line
	8900 2900 9050 2900
Wire Wire Line
	8800 3150 8800 3450
Wire Wire Line
	8700 3400 8700 4000
Wire Wire Line
	8600 3600 8500 3600
Connection ~ 8500 3600
Wire Wire Line
	8350 3400 8700 3400
Wire Wire Line
	8800 3650 8800 3450
Connection ~ 8800 3450
Wire Wire Line
	8400 3150 8800 3150
Connection ~ 8700 4000
Wire Wire Line
	8900 2900 8900 3100
Wire Wire Line
	8350 2900 8900 2900
Connection ~ 8900 2900
Wire Wire Line
	8800 3450 9050 3450
Wire Wire Line
	8700 4000 9050 4000
Wire Wire Line
	8600 4650 9050 4650
Wire Wire Line
	8350 2700 8950 2700
Wire Wire Line
	8350 2500 8950 2500
Text Label 8950 2700 2    50   ~ 0
XOUT
Text Label 8950 2500 2    50   ~ 0
SPI_MOSI
$Comp
L Connector:TestPoint TP?
U 1 1 5F3962CA
P 9300 2600
AR Path="/5F3962CA" Ref="TP?"  Part="1" 
AR Path="/5F38BF74/5F3962CA" Ref="TP1"  Part="1" 
F 0 "TP1" V 9254 2788 50  0000 L CNN
F 1 "TestPoint" V 9345 2788 50  0000 L CNN
F 2 "TestPoint:TestPoint_Pad_D1.5mm" H 9500 2600 50  0001 C CNN
F 3 "~" H 9500 2600 50  0001 C CNN
	1    9300 2600
	0    1    1    0   
$EndComp
Wire Wire Line
	8350 2600 9300 2600
Wire Wire Line
	5250 3100 5850 3100
Wire Wire Line
	5250 3000 5850 3000
Wire Wire Line
	5250 2900 5850 2900
Wire Wire Line
	5250 2800 5850 2800
Wire Wire Line
	2400 1500 3000 1500
Wire Wire Line
	2400 1700 3000 1700
Wire Wire Line
	2400 2100 3000 2100
Wire Wire Line
	2400 2000 3000 2000
Text Label 3000 1500 2    50   ~ 0
TXP
Text Label 3000 1700 2    50   ~ 0
TXN
Text Label 3000 2100 2    50   ~ 0
INN
Text Label 3000 2000 2    50   ~ 0
INP
Text Label 5250 2800 0    50   ~ 0
INN
Text Label 5250 2900 0    50   ~ 0
INP
Text Label 5250 3000 0    50   ~ 0
XIN
Text Label 5250 3100 0    50   ~ 0
SPI_MISO
Wire Wire Line
	5250 2600 5850 2600
Wire Wire Line
	5250 2500 5850 2500
Wire Wire Line
	5250 2400 5850 2400
Wire Wire Line
	5250 2300 5850 2300
Wire Wire Line
	5250 2200 5850 2200
Wire Wire Line
	5250 2100 5850 2100
Text Label 5250 2100 0    50   ~ 0
SPI_CS0
Text Label 5250 2200 0    50   ~ 0
PD_ALM
Text Label 5250 2300 0    50   ~ 0
LED_ALM
Text Label 5250 2400 0    50   ~ 0
ADC_RDY
Text Label 5250 2500 0    50   ~ 0
AFE_PDN
Text Label 5250 2600 0    50   ~ 0
DIAG_END
Wire Wire Line
	5250 1800 5850 1800
Wire Wire Line
	5250 1600 5850 1600
Wire Wire Line
	5250 1500 5850 1500
Text Label 5250 1800 0    50   ~ 0
SPI_SCK
Text Label 5250 1600 0    50   ~ 0
TXP
Text Label 5250 1500 0    50   ~ 0
TXN
Wire Wire Line
	5250 1900 5850 1900
Wire Wire Line
	3900 1400 3900 1850
$Comp
L Device:C_Small C?
U 1 1 5F3962F8
P 3900 1950
AR Path="/5F3962F8" Ref="C?"  Part="1" 
AR Path="/5F38BF74/5F3962F8" Ref="C5"  Part="1" 
F 0 "C5" H 3992 1996 50  0000 L CNN
F 1 "2.2uF" H 3992 1905 50  0000 L CNN
F 2 "Capacitor_SMD:C_1206_3216Metric_Pad1.42x1.75mm_HandSolder" H 3900 1950 50  0001 C CNN
F 3 "~" H 3900 1950 50  0001 C CNN
	1    3900 1950
	1    0    0    -1  
$EndComp
$Comp
L power:GND #PWR?
U 1 1 5F3962FE
P 3900 2300
AR Path="/5F3962FE" Ref="#PWR?"  Part="1" 
AR Path="/5F38BF74/5F3962FE" Ref="#PWR0129"  Part="1" 
F 0 "#PWR0129" H 3900 2050 50  0001 C CNN
F 1 "GND" H 3905 2127 50  0000 C CNN
F 2 "" H 3900 2300 50  0001 C CNN
F 3 "" H 3900 2300 50  0001 C CNN
	1    3900 2300
	1    0    0    -1  
$EndComp
Wire Wire Line
	4400 2050 4400 2300
Wire Wire Line
	4400 1700 4400 1850
$Comp
L power:GND #PWR?
U 1 1 5F396306
P 4400 2300
AR Path="/5F396306" Ref="#PWR?"  Part="1" 
AR Path="/5F38BF74/5F396306" Ref="#PWR0130"  Part="1" 
F 0 "#PWR0130" H 4400 2050 50  0001 C CNN
F 1 "GND" H 4405 2127 50  0000 C CNN
F 2 "" H 4400 2300 50  0001 C CNN
F 3 "" H 4400 2300 50  0001 C CNN
	1    4400 2300
	1    0    0    -1  
$EndComp
$Comp
L Device:C_Small C?
U 1 1 5F39630C
P 4400 1950
AR Path="/5F39630C" Ref="C?"  Part="1" 
AR Path="/5F38BF74/5F39630C" Ref="C6"  Part="1" 
F 0 "C6" H 4492 1996 50  0000 L CNN
F 1 "2.2uF" H 4492 1905 50  0000 L CNN
F 2 "Capacitor_SMD:C_1206_3216Metric_Pad1.42x1.75mm_HandSolder" H 4400 1950 50  0001 C CNN
F 3 "~" H 4400 1950 50  0001 C CNN
	1    4400 1950
	1    0    0    -1  
$EndComp
Wire Wire Line
	3900 2050 3900 2300
Wire Wire Line
	8600 3600 8600 4650
Wire Wire Line
	8700 4300 9500 4300
Connection ~ 8600 4650
Wire Wire Line
	8600 4650 8600 4850
Text Label 9500 4300 2    50   ~ 0
ADC_RESET
Wire Notes Line
	600  7650 6850 7650
Wire Notes Line
	6850 7650 6850 5550
Wire Notes Line
	6850 5550 600  5550
Wire Notes Line
	600  5550 600  7650
Text Notes 3450 5750 0    50   ~ 10
Informations\n
Text HLabel 5250 1500 0    50   Input ~ 0
TXN
Text HLabel 5250 1600 0    50   Input ~ 0
TXP
Text HLabel 5250 2900 0    50   Input ~ 0
INP
Text HLabel 5250 2800 0    50   Input ~ 0
INN
Text HLabel 8900 3650 2    50   Input ~ 0
LED_DRV_SUP
Wire Wire Line
	8900 3650 8800 3650
Text HLabel 8900 4850 2    50   Input ~ 0
RX_ANA_SUP
Wire Wire Line
	8900 4850 8600 4850
Wire Wire Line
	8700 4000 8700 4150
Text HLabel 8900 3100 2    50   Input ~ 0
TX_CTRL_SUP
Text HLabel 8900 4150 2    50   Input ~ 0
RX_DIG_SUP
Wire Wire Line
	8900 4150 8700 4150
Connection ~ 8700 4150
Wire Wire Line
	8700 4150 8700 4300
$Comp
L Device:Crystal Y1
U 1 1 5F4D861D
P 2500 3300
F 0 "Y1" H 2500 3568 50  0000 C CNN
F 1 "Crystal" H 2500 3477 50  0000 C CNN
F 2 "Crystal:Crystal_SMD_5032-2Pin_5.0x3.2mm" H 2500 3300 50  0001 C CNN
F 3 "~" H 2500 3300 50  0001 C CNN
	1    2500 3300
	1    0    0    -1  
$EndComp
Wire Wire Line
	2650 3300 2900 3300
Wire Wire Line
	2900 3300 2900 3050
Wire Wire Line
	2900 3050 3250 3050
Text Label 3250 3050 2    50   ~ 0
XIN
Wire Wire Line
	2350 3300 2100 3300
Wire Wire Line
	2100 3300 2100 3050
Wire Wire Line
	2100 3050 1750 3050
Text Label 1750 3050 0    50   ~ 0
XOUT
$Comp
L Device:C_Small C12
U 1 1 5F4DEEF3
P 2900 3650
F 0 "C12" H 2808 3604 50  0000 R CNN
F 1 "22pF" H 2808 3695 50  0000 R CNN
F 2 "Capacitor_SMD:C_1206_3216Metric_Pad1.42x1.75mm_HandSolder" H 2900 3650 50  0001 C CNN
F 3 "~" H 2900 3650 50  0001 C CNN
	1    2900 3650
	-1   0    0    1   
$EndComp
$Comp
L Device:C_Small C11
U 1 1 5F4DF71A
P 2100 3650
F 0 "C11" H 2008 3604 50  0000 R CNN
F 1 "22pF" H 2008 3695 50  0000 R CNN
F 2 "Capacitor_SMD:C_1206_3216Metric_Pad1.42x1.75mm_HandSolder" H 2100 3650 50  0001 C CNN
F 3 "~" H 2100 3650 50  0001 C CNN
	1    2100 3650
	-1   0    0    1   
$EndComp
$Comp
L power:GND #PWR0131
U 1 1 5F4E02B1
P 2500 4200
F 0 "#PWR0131" H 2500 3950 50  0001 C CNN
F 1 "GND" H 2505 4027 50  0000 C CNN
F 2 "" H 2500 4200 50  0001 C CNN
F 3 "" H 2500 4200 50  0001 C CNN
	1    2500 4200
	1    0    0    -1  
$EndComp
Wire Wire Line
	2900 3750 2900 4000
Wire Wire Line
	2900 4000 2500 4000
Wire Wire Line
	2100 4000 2100 3750
Wire Wire Line
	2500 4200 2500 4000
Connection ~ 2500 4000
Wire Wire Line
	2500 4000 2100 4000
Wire Wire Line
	2100 3550 2100 3300
Connection ~ 2100 3300
Wire Wire Line
	2900 3300 2900 3550
Connection ~ 2900 3300
Text HLabel 5250 1900 0    50   Input ~ 0
ADC_RESET
Wire Wire Line
	4400 1700 5850 1700
Wire Wire Line
	3900 1400 5850 1400
Text HLabel 5250 1800 0    50   Input ~ 0
SPI_SCK
Text HLabel 5250 2100 0    50   Input ~ 0
SPI_CS0
Text HLabel 5250 2200 0    50   Input ~ 0
PD_ALM
Text HLabel 5250 2300 0    50   Input ~ 0
LED_ALM
Text HLabel 5250 2400 0    50   Input ~ 0
ADC_RDY
Text HLabel 5250 2500 0    50   Input ~ 0
AFE_PDN
Text HLabel 5250 2600 0    50   Input ~ 0
DIAG_END
Text HLabel 5250 3100 0    50   Input ~ 0
SPI_MISO
Text HLabel 8950 2500 2    50   Input ~ 0
SPI_MOSI
$EndSCHEMATC
