<?xml version="1.0" encoding="utf-8"?>
<!DOCTYPE eagle SYSTEM "eagle.dtd">
<eagle version="9.5.2">
<drawing>
<settings>
<setting alwaysvectorfont="no"/>
<setting verticaltext="up"/>
</settings>
<grid distance="0.1" unitdist="inch" unit="inch" style="lines" multiple="1" display="no" altdistance="0.01" altunitdist="inch" altunit="inch"/>
<layers>
<layer number="1" name="Top" color="4" fill="1" visible="no" active="no"/>
<layer number="2" name="Route2" color="16" fill="1" visible="no" active="no"/>
<layer number="3" name="Route3" color="17" fill="1" visible="no" active="no"/>
<layer number="4" name="Route4" color="18" fill="1" visible="no" active="no"/>
<layer number="5" name="Route5" color="19" fill="1" visible="no" active="no"/>
<layer number="6" name="Route6" color="25" fill="1" visible="no" active="no"/>
<layer number="7" name="Route7" color="26" fill="1" visible="no" active="no"/>
<layer number="8" name="Route8" color="27" fill="1" visible="no" active="no"/>
<layer number="9" name="Route9" color="28" fill="1" visible="no" active="no"/>
<layer number="10" name="Route10" color="29" fill="1" visible="no" active="no"/>
<layer number="11" name="Route11" color="30" fill="1" visible="no" active="no"/>
<layer number="12" name="Route12" color="20" fill="1" visible="no" active="no"/>
<layer number="13" name="Route13" color="21" fill="1" visible="no" active="no"/>
<layer number="14" name="Route14" color="22" fill="1" visible="no" active="no"/>
<layer number="15" name="Route15" color="23" fill="1" visible="no" active="no"/>
<layer number="16" name="Bottom" color="1" fill="1" visible="no" active="no"/>
<layer number="17" name="Pads" color="2" fill="1" visible="no" active="no"/>
<layer number="18" name="Vias" color="2" fill="1" visible="no" active="no"/>
<layer number="19" name="Unrouted" color="6" fill="1" visible="no" active="no"/>
<layer number="20" name="Dimension" color="24" fill="1" visible="no" active="no"/>
<layer number="21" name="tPlace" color="7" fill="1" visible="no" active="no"/>
<layer number="22" name="bPlace" color="7" fill="1" visible="no" active="no"/>
<layer number="23" name="tOrigins" color="15" fill="1" visible="no" active="no"/>
<layer number="24" name="bOrigins" color="15" fill="1" visible="no" active="no"/>
<layer number="25" name="tNames" color="7" fill="1" visible="no" active="no"/>
<layer number="26" name="bNames" color="7" fill="1" visible="no" active="no"/>
<layer number="27" name="tValues" color="7" fill="1" visible="no" active="no"/>
<layer number="28" name="bValues" color="7" fill="1" visible="no" active="no"/>
<layer number="29" name="tStop" color="7" fill="3" visible="no" active="no"/>
<layer number="30" name="bStop" color="7" fill="6" visible="no" active="no"/>
<layer number="31" name="tCream" color="7" fill="4" visible="no" active="no"/>
<layer number="32" name="bCream" color="7" fill="5" visible="no" active="no"/>
<layer number="33" name="tFinish" color="6" fill="3" visible="no" active="no"/>
<layer number="34" name="bFinish" color="6" fill="6" visible="no" active="no"/>
<layer number="35" name="tGlue" color="7" fill="4" visible="no" active="no"/>
<layer number="36" name="bGlue" color="7" fill="5" visible="no" active="no"/>
<layer number="37" name="tTest" color="7" fill="1" visible="no" active="no"/>
<layer number="38" name="bTest" color="7" fill="1" visible="no" active="no"/>
<layer number="39" name="tKeepout" color="4" fill="11" visible="no" active="no"/>
<layer number="40" name="bKeepout" color="1" fill="11" visible="no" active="no"/>
<layer number="41" name="tRestrict" color="4" fill="10" visible="no" active="no"/>
<layer number="42" name="bRestrict" color="1" fill="10" visible="no" active="no"/>
<layer number="43" name="vRestrict" color="2" fill="10" visible="no" active="no"/>
<layer number="44" name="Drills" color="7" fill="1" visible="no" active="no"/>
<layer number="45" name="Holes" color="7" fill="1" visible="no" active="no"/>
<layer number="46" name="Milling" color="3" fill="1" visible="no" active="no"/>
<layer number="47" name="Measures" color="7" fill="1" visible="no" active="no"/>
<layer number="48" name="Document" color="7" fill="1" visible="no" active="no"/>
<layer number="49" name="Reference" color="7" fill="1" visible="no" active="no"/>
<layer number="50" name="dxf" color="7" fill="1" visible="no" active="no"/>
<layer number="51" name="tDocu" color="7" fill="1" visible="no" active="no"/>
<layer number="52" name="bDocu" color="7" fill="1" visible="no" active="no"/>
<layer number="53" name="tGND_GNDA" color="7" fill="9" visible="no" active="no"/>
<layer number="54" name="bGND_GNDA" color="1" fill="9" visible="no" active="no"/>
<layer number="56" name="wert" color="7" fill="1" visible="no" active="no"/>
<layer number="57" name="tCAD" color="7" fill="1" visible="no" active="no"/>
<layer number="59" name="tCarbon" color="7" fill="1" visible="no" active="no"/>
<layer number="60" name="bCarbon" color="7" fill="1" visible="no" active="no"/>
<layer number="88" name="SimResults" color="9" fill="1" visible="yes" active="yes"/>
<layer number="89" name="SimProbes" color="9" fill="1" visible="yes" active="yes"/>
<layer number="90" name="Modules" color="5" fill="1" visible="yes" active="yes"/>
<layer number="91" name="Nets" color="2" fill="1" visible="yes" active="yes"/>
<layer number="92" name="Busses" color="1" fill="1" visible="yes" active="yes"/>
<layer number="93" name="Pins" color="2" fill="1" visible="no" active="yes"/>
<layer number="94" name="Symbols" color="4" fill="1" visible="yes" active="yes"/>
<layer number="95" name="Names" color="7" fill="1" visible="yes" active="yes"/>
<layer number="96" name="Values" color="7" fill="1" visible="yes" active="yes"/>
<layer number="97" name="Info" color="7" fill="1" visible="yes" active="yes"/>
<layer number="98" name="Guide" color="6" fill="1" visible="yes" active="yes"/>
<layer number="99" name="SpiceOrder" color="7" fill="1" visible="yes" active="yes"/>
<layer number="100" name="Muster" color="7" fill="1" visible="no" active="no"/>
<layer number="101" name="Patch_Top" color="12" fill="4" visible="no" active="yes"/>
<layer number="102" name="Vscore" color="7" fill="1" visible="no" active="yes"/>
<layer number="103" name="tMap" color="7" fill="1" visible="no" active="yes"/>
<layer number="104" name="Name" color="7" fill="1" visible="no" active="yes"/>
<layer number="105" name="tPlate" color="7" fill="1" visible="no" active="yes"/>
<layer number="106" name="bPlate" color="7" fill="1" visible="no" active="yes"/>
<layer number="107" name="Crop" color="7" fill="1" visible="no" active="yes"/>
<layer number="108" name="tplace-old" color="10" fill="1" visible="no" active="yes"/>
<layer number="109" name="ref-old" color="11" fill="1" visible="no" active="yes"/>
<layer number="110" name="fp0" color="7" fill="1" visible="no" active="yes"/>
<layer number="111" name="LPC17xx" color="7" fill="1" visible="no" active="yes"/>
<layer number="112" name="tSilk" color="7" fill="1" visible="no" active="yes"/>
<layer number="113" name="IDFDebug" color="7" fill="1" visible="no" active="yes"/>
<layer number="114" name="Badge_Outline" color="7" fill="1" visible="no" active="yes"/>
<layer number="115" name="ReferenceISLANDS" color="7" fill="1" visible="no" active="yes"/>
<layer number="116" name="Patch_BOT" color="9" fill="4" visible="no" active="yes"/>
<layer number="118" name="Rect_Pads" color="7" fill="1" visible="no" active="yes"/>
<layer number="121" name="_tsilk" color="7" fill="1" visible="no" active="yes"/>
<layer number="122" name="_bsilk" color="7" fill="1" visible="no" active="yes"/>
<layer number="123" name="tTestmark" color="7" fill="1" visible="no" active="yes"/>
<layer number="124" name="bTestmark" color="7" fill="1" visible="no" active="yes"/>
<layer number="125" name="_tNames" color="7" fill="1" visible="no" active="yes"/>
<layer number="126" name="_bNames" color="7" fill="1" visible="no" active="yes"/>
<layer number="127" name="_tValues" color="7" fill="1" visible="no" active="yes"/>
<layer number="128" name="_bValues" color="7" fill="1" visible="no" active="yes"/>
<layer number="129" name="Mask" color="7" fill="1" visible="no" active="yes"/>
<layer number="131" name="tAdjust" color="7" fill="1" visible="no" active="yes"/>
<layer number="132" name="bAdjust" color="7" fill="1" visible="no" active="yes"/>
<layer number="144" name="Drill_legend" color="7" fill="1" visible="no" active="yes"/>
<layer number="150" name="Notes" color="7" fill="1" visible="no" active="yes"/>
<layer number="151" name="HeatSink" color="7" fill="1" visible="no" active="yes"/>
<layer number="152" name="_bDocu" color="7" fill="1" visible="no" active="yes"/>
<layer number="153" name="FabDoc1" color="7" fill="1" visible="no" active="yes"/>
<layer number="154" name="FabDoc2" color="7" fill="1" visible="no" active="yes"/>
<layer number="155" name="FabDoc3" color="7" fill="1" visible="no" active="yes"/>
<layer number="199" name="Contour" color="7" fill="1" visible="no" active="yes"/>
<layer number="200" name="200bmp" color="1" fill="10" visible="no" active="yes"/>
<layer number="201" name="201bmp" color="2" fill="10" visible="no" active="yes"/>
<layer number="202" name="202bmp" color="3" fill="10" visible="no" active="yes"/>
<layer number="203" name="203bmp" color="4" fill="10" visible="no" active="yes"/>
<layer number="204" name="204bmp" color="5" fill="10" visible="no" active="yes"/>
<layer number="205" name="205bmp" color="6" fill="10" visible="no" active="yes"/>
<layer number="206" name="206bmp" color="7" fill="10" visible="no" active="yes"/>
<layer number="207" name="207bmp" color="8" fill="10" visible="no" active="yes"/>
<layer number="208" name="208bmp" color="9" fill="10" visible="no" active="yes"/>
<layer number="209" name="209bmp" color="7" fill="1" visible="no" active="yes"/>
<layer number="210" name="210bmp" color="7" fill="1" visible="no" active="yes"/>
<layer number="211" name="211bmp" color="7" fill="1" visible="no" active="yes"/>
<layer number="212" name="212bmp" color="7" fill="1" visible="no" active="yes"/>
<layer number="213" name="213bmp" color="7" fill="1" visible="no" active="yes"/>
<layer number="214" name="214bmp" color="7" fill="1" visible="no" active="yes"/>
<layer number="215" name="215bmp" color="7" fill="1" visible="no" active="yes"/>
<layer number="216" name="216bmp" color="7" fill="1" visible="no" active="yes"/>
<layer number="217" name="217bmp" color="18" fill="1" visible="no" active="no"/>
<layer number="218" name="218bmp" color="19" fill="1" visible="no" active="no"/>
<layer number="219" name="219bmp" color="20" fill="1" visible="no" active="no"/>
<layer number="220" name="220bmp" color="21" fill="1" visible="no" active="no"/>
<layer number="221" name="221bmp" color="22" fill="1" visible="no" active="no"/>
<layer number="222" name="222bmp" color="23" fill="1" visible="no" active="no"/>
<layer number="223" name="223bmp" color="24" fill="1" visible="no" active="no"/>
<layer number="224" name="224bmp" color="25" fill="1" visible="no" active="no"/>
<layer number="225" name="225bmp" color="7" fill="1" visible="no" active="yes"/>
<layer number="226" name="226bmp" color="7" fill="1" visible="no" active="yes"/>
<layer number="227" name="227bmp" color="7" fill="1" visible="no" active="yes"/>
<layer number="228" name="228bmp" color="7" fill="1" visible="no" active="yes"/>
<layer number="229" name="229bmp" color="7" fill="1" visible="no" active="yes"/>
<layer number="230" name="230bmp" color="7" fill="1" visible="no" active="yes"/>
<layer number="231" name="231bmp" color="7" fill="1" visible="no" active="yes"/>
<layer number="232" name="Eagle3D_PG2" color="7" fill="1" visible="no" active="yes"/>
<layer number="233" name="Eagle3D_PG3" color="7" fill="1" visible="no" active="yes"/>
<layer number="248" name="Housing" color="7" fill="1" visible="no" active="yes"/>
<layer number="249" name="Edge" color="7" fill="1" visible="no" active="yes"/>
<layer number="250" name="Descript" color="3" fill="1" visible="no" active="no"/>
<layer number="251" name="SMDround" color="12" fill="11" visible="no" active="no"/>
<layer number="254" name="cooling" color="7" fill="1" visible="no" active="yes"/>
<layer number="255" name="routoute" color="7" fill="1" visible="no" active="yes"/>
</layers>
<schematic xreflabel="%F%N/%S.%C%R" xrefpart="/%S.%C%R">
<libraries>
<library name="OXYMETRE_COVID19" urn="urn:adsk.eagle:library:19284696">
<packages>
<package name="SOIC127P600X175-8N" urn="urn:adsk.eagle:footprint:19285019/1" library_version="6">
<wire x1="-2.0066" y1="1.651" x2="-2.0066" y2="2.159" width="0.1524" layer="51"/>
<wire x1="-2.0066" y1="2.159" x2="-3.0988" y2="2.159" width="0.1524" layer="51"/>
<wire x1="-3.0988" y1="2.159" x2="-3.0988" y2="1.651" width="0.1524" layer="51"/>
<wire x1="-3.0988" y1="1.651" x2="-2.0066" y2="1.651" width="0.1524" layer="51"/>
<wire x1="-2.0066" y1="0.381" x2="-2.0066" y2="0.889" width="0.1524" layer="51"/>
<wire x1="-2.0066" y1="0.889" x2="-3.0988" y2="0.889" width="0.1524" layer="51"/>
<wire x1="-3.0988" y1="0.889" x2="-3.0988" y2="0.381" width="0.1524" layer="51"/>
<wire x1="-3.0988" y1="0.381" x2="-2.0066" y2="0.381" width="0.1524" layer="51"/>
<wire x1="-2.0066" y1="-0.889" x2="-2.0066" y2="-0.381" width="0.1524" layer="51"/>
<wire x1="-2.0066" y1="-0.381" x2="-3.0988" y2="-0.381" width="0.1524" layer="51"/>
<wire x1="-3.0988" y1="-0.381" x2="-3.0988" y2="-0.889" width="0.1524" layer="51"/>
<wire x1="-3.0988" y1="-0.889" x2="-2.0066" y2="-0.889" width="0.1524" layer="51"/>
<wire x1="-2.0066" y1="-2.159" x2="-2.0066" y2="-1.651" width="0.1524" layer="51"/>
<wire x1="-2.0066" y1="-1.651" x2="-3.0988" y2="-1.651" width="0.1524" layer="51"/>
<wire x1="-3.0988" y1="-1.651" x2="-3.0988" y2="-2.159" width="0.1524" layer="51"/>
<wire x1="-3.0988" y1="-2.159" x2="-2.0066" y2="-2.159" width="0.1524" layer="51"/>
<wire x1="2.0066" y1="-1.651" x2="2.0066" y2="-2.159" width="0.1524" layer="51"/>
<wire x1="2.0066" y1="-2.159" x2="3.0988" y2="-2.159" width="0.1524" layer="51"/>
<wire x1="3.0988" y1="-2.159" x2="3.0988" y2="-1.651" width="0.1524" layer="51"/>
<wire x1="3.0988" y1="-1.651" x2="2.0066" y2="-1.651" width="0.1524" layer="51"/>
<wire x1="2.0066" y1="-0.381" x2="2.0066" y2="-0.889" width="0.1524" layer="51"/>
<wire x1="2.0066" y1="-0.889" x2="3.0988" y2="-0.889" width="0.1524" layer="51"/>
<wire x1="3.0988" y1="-0.889" x2="3.0988" y2="-0.381" width="0.1524" layer="51"/>
<wire x1="3.0988" y1="-0.381" x2="2.0066" y2="-0.381" width="0.1524" layer="51"/>
<wire x1="2.0066" y1="0.889" x2="2.0066" y2="0.381" width="0.1524" layer="51"/>
<wire x1="2.0066" y1="0.381" x2="3.0988" y2="0.381" width="0.1524" layer="51"/>
<wire x1="3.0988" y1="0.381" x2="3.0988" y2="0.889" width="0.1524" layer="51"/>
<wire x1="3.0988" y1="0.889" x2="2.0066" y2="0.889" width="0.1524" layer="51"/>
<wire x1="2.0066" y1="2.159" x2="2.0066" y2="1.651" width="0.1524" layer="51"/>
<wire x1="2.0066" y1="1.651" x2="3.0988" y2="1.651" width="0.1524" layer="51"/>
<wire x1="3.0988" y1="1.651" x2="3.0988" y2="2.159" width="0.1524" layer="51"/>
<wire x1="3.0988" y1="2.159" x2="2.0066" y2="2.159" width="0.1524" layer="51"/>
<wire x1="-2.0066" y1="-2.4892" x2="2.0066" y2="-2.4892" width="0.1524" layer="51"/>
<wire x1="2.0066" y1="-2.4892" x2="2.0066" y2="2.4892" width="0.1524" layer="51"/>
<wire x1="2.0066" y1="2.4892" x2="0.3048" y2="2.4892" width="0.1524" layer="51"/>
<wire x1="0.3048" y1="2.4892" x2="-0.3048" y2="2.4892" width="0.1524" layer="51"/>
<wire x1="-0.3048" y1="2.4892" x2="-2.0066" y2="2.4892" width="0.1524" layer="51"/>
<wire x1="-2.0066" y1="2.4892" x2="-2.0066" y2="-2.4892" width="0.1524" layer="51"/>
<wire x1="0.3048" y1="2.4892" x2="-0.3048" y2="2.4892" width="0" layer="51" curve="-180"/>
<wire x1="-1.3716" y1="-2.4892" x2="1.3716" y2="-2.4892" width="0.1524" layer="21"/>
<wire x1="1.3716" y1="2.4892" x2="0.3048" y2="2.4892" width="0.1524" layer="21"/>
<wire x1="0.3048" y1="2.4892" x2="-0.3048" y2="2.4892" width="0.1524" layer="21"/>
<wire x1="-0.3048" y1="2.4892" x2="-1.3716" y2="2.4892" width="0.1524" layer="21"/>
<wire x1="0.3048" y1="2.4892" x2="-0.3048" y2="2.4892" width="0" layer="21" curve="-180"/>
<text x="-4.68116875" y="3.38366875" size="2.08616875" layer="25" ratio="10" rot="SR0">&gt;NAME</text>
<text x="-5.740909375" y="-5.232859375" size="2.08298125" layer="27" ratio="10" rot="SR0">&gt;VALUE</text>
<smd name="1" x="-2.4638" y="1.905" dx="1.9812" dy="0.5588" layer="1"/>
<smd name="2" x="-2.4638" y="0.635" dx="1.9812" dy="0.5588" layer="1"/>
<smd name="3" x="-2.4638" y="-0.635" dx="1.9812" dy="0.5588" layer="1"/>
<smd name="4" x="-2.4638" y="-1.905" dx="1.9812" dy="0.5588" layer="1"/>
<smd name="5" x="2.4638" y="-1.905" dx="1.9812" dy="0.5588" layer="1"/>
<smd name="6" x="2.4638" y="-0.635" dx="1.9812" dy="0.5588" layer="1"/>
<smd name="7" x="2.4638" y="0.635" dx="1.9812" dy="0.5588" layer="1"/>
<smd name="8" x="2.4638" y="1.905" dx="1.9812" dy="0.5588" layer="1"/>
</package>
<package name="MAXREFDES117" urn="urn:adsk.eagle:footprint:19284697/2" library_version="9">
<pad name="SCL$2" x="0" y="-5.08" locked="yes" drill="1" diameter="1.9304"/>
<pad name="SDA$2" x="2.54" y="-5.08" locked="yes" drill="1" diameter="1.9304"/>
<pad name="INT$2" x="-2.54" y="-5.08" locked="yes" drill="1" diameter="1.9304"/>
<pad name="GND" x="-5.08" y="0" locked="yes" drill="1" diameter="1.9304"/>
<pad name="VIN" x="5.08" y="0" locked="yes" drill="1" diameter="1.9304"/>
<pad name="SCL$1" x="0" y="5.08" locked="yes" drill="1" diameter="1.9304"/>
<pad name="INT$1" x="-2.54" y="5.08" locked="yes" drill="1" diameter="1.9304"/>
<pad name="SDA$1" x="2.54" y="5.08" locked="yes" drill="1" diameter="1.9304"/>
<wire x1="4.56" y1="-6.08" x2="-4.56" y2="-6.08" width="0.127" layer="21"/>
<wire x1="-4.56" y1="-6.08" x2="-6.08" y2="-4.56" width="0.127" layer="21" curve="-90"/>
<wire x1="-6.08" y1="-4.56" x2="-6.08" y2="4.56" width="0.127" layer="21"/>
<wire x1="-6.08" y1="4.56" x2="-4.56" y2="6.08" width="0.127" layer="21" curve="-90"/>
<wire x1="-4.56" y1="6.08" x2="4.56" y2="6.08" width="0.127" layer="21"/>
<wire x1="4.56" y1="6.08" x2="6.08" y2="4.56" width="0.127" layer="21" curve="-90"/>
<wire x1="6.08" y1="4.56" x2="6.08" y2="-4.56" width="0.127" layer="21"/>
<wire x1="6.08" y1="-4.56" x2="4.56" y2="-6.08" width="0.127" layer="21" curve="-90"/>
<wire x1="-1.524" y1="2.794" x2="1.524" y2="2.794" width="0.127" layer="21"/>
<wire x1="1.524" y1="2.794" x2="1.524" y2="-2.794" width="0.127" layer="21" locked="yes"/>
<wire x1="1.524" y1="-2.794" x2="-1.524" y2="-2.794" width="0.127" layer="21"/>
<wire x1="-1.524" y1="-2.794" x2="-1.524" y2="2.794" width="0.127" layer="21" locked="yes"/>
</package>
</packages>
<packages3d>
<package3d name="SOIC127P600X175-8N" urn="urn:adsk.eagle:package:19285021/1" type="box" library_version="6">
<packageinstances>
<packageinstance name="SOIC127P600X175-8N"/>
</packageinstances>
</package3d>
<package3d name="MAXREFDES117" urn="urn:adsk.eagle:package:19284699/3" type="model" library_version="9">
<packageinstances>
<packageinstance name="MAXREFDES117"/>
</packageinstances>
</package3d>
</packages3d>
<symbols>
<symbol name="P82B715D" urn="urn:adsk.eagle:symbol:19285024/1" library_version="6">
<wire x1="-12.7" y1="12.7" x2="-12.7" y2="-17.78" width="0.4064" layer="94"/>
<wire x1="-12.7" y1="-17.78" x2="12.7" y2="-17.78" width="0.4064" layer="94"/>
<wire x1="12.7" y1="-17.78" x2="12.7" y2="12.7" width="0.4064" layer="94"/>
<wire x1="12.7" y1="12.7" x2="-12.7" y2="12.7" width="0.4064" layer="94"/>
<text x="-4.8085" y="15.0615" size="2.08623125" layer="95" ratio="10" rot="SR0">&gt;NAME</text>
<text x="-4.27283125" y="-22.5595" size="2.08555" layer="96" ratio="10" rot="SR0">&gt;VALUE</text>
<pin name="VCC" x="-17.78" y="7.62" length="middle" direction="pwr"/>
<pin name="SX" x="-17.78" y="2.54" length="middle" direction="in"/>
<pin name="SY" x="-17.78" y="0" length="middle" direction="in"/>
<pin name="NC_2" x="-17.78" y="-5.08" length="middle" direction="nc"/>
<pin name="NC" x="-17.78" y="-7.62" length="middle" direction="nc"/>
<pin name="GND" x="-17.78" y="-12.7" length="middle" direction="pas"/>
<pin name="LX" x="17.78" y="7.62" length="middle" direction="out" rot="R180"/>
<pin name="LY" x="17.78" y="5.08" length="middle" direction="out" rot="R180"/>
</symbol>
<symbol name="MAXREFDES117" urn="urn:adsk.eagle:symbol:19284698/3" library_version="7">
<pin name="SDA" x="12.7" y="0" visible="pin" length="short" rot="R180"/>
<pin name="INT" x="12.7" y="2.54" visible="pin" length="short" rot="R180"/>
<pin name="SCL" x="12.7" y="-2.54" visible="pin" length="short" rot="R180"/>
<pin name="VIN" x="12.7" y="5.08" visible="pin" length="short" rot="R180"/>
<pin name="GND" x="12.7" y="-5.08" visible="pin" length="short" rot="R180"/>
<wire x1="0" y1="7.62" x2="10.16" y2="7.62" width="0.254" layer="94"/>
<wire x1="10.16" y1="7.62" x2="10.16" y2="-7.62" width="0.254" layer="94"/>
<wire x1="10.16" y1="-7.62" x2="0" y2="-7.62" width="0.254" layer="94"/>
<wire x1="0" y1="-7.62" x2="0" y2="7.62" width="0.254" layer="94"/>
<text x="0.15878125" y="8.5281" size="2.090490625" layer="95" ratio="10" rot="SR0">&gt;NAME</text>
<text x="-0.09521875" y="-10.5219" size="2.090490625" layer="95" ratio="10" rot="SR0">&gt;VALUE</text>
</symbol>
</symbols>
<devicesets>
<deviceset name="P82B715D" urn="urn:adsk.eagle:component:19285025/1" prefix="U" library_version="6">
<description>I2C BUS EXTENDER</description>
<gates>
<gate name="A" symbol="P82B715D" x="0" y="0"/>
</gates>
<devices>
<device name="" package="SOIC127P600X175-8N">
<connects>
<connect gate="A" pin="GND" pad="4"/>
<connect gate="A" pin="LX" pad="2"/>
<connect gate="A" pin="LY" pad="7"/>
<connect gate="A" pin="NC" pad="5"/>
<connect gate="A" pin="NC_2" pad="1"/>
<connect gate="A" pin="SX" pad="3"/>
<connect gate="A" pin="SY" pad="6"/>
<connect gate="A" pin="VCC" pad="8"/>
</connects>
<package3dinstances>
<package3dinstance package3d_urn="urn:adsk.eagle:package:19285021/1"/>
</package3dinstances>
<technologies>
<technology name="">
<attribute name="AVAILABILITY" value="Unavailable"/>
<attribute name="DESCRIPTION" value=" Buffer, ReDriver 1 Channel 8-SOIC "/>
<attribute name="MF" value="Texas Instruments"/>
<attribute name="MP" value="P82B715D"/>
<attribute name="PACKAGE" value="SOIC-8 Texas Instruments"/>
<attribute name="PRICE" value="None"/>
</technology>
</technologies>
</device>
</devices>
</deviceset>
<deviceset name="MAXREFDES117" urn="urn:adsk.eagle:component:19284700/5" library_version="9">
<gates>
<gate name="A" symbol="MAXREFDES117" x="2.54" y="0"/>
</gates>
<devices>
<device name="" package="MAXREFDES117">
<connects>
<connect gate="A" pin="GND" pad="GND"/>
<connect gate="A" pin="INT" pad="INT$1 INT$2"/>
<connect gate="A" pin="SCL" pad="SCL$1 SCL$2"/>
<connect gate="A" pin="SDA" pad="SDA$1 SDA$2"/>
<connect gate="A" pin="VIN" pad="VIN"/>
</connects>
<package3dinstances>
<package3dinstance package3d_urn="urn:adsk.eagle:package:19284699/3"/>
</package3dinstances>
<technologies>
<technology name=""/>
</technologies>
</device>
</devices>
</deviceset>
</devicesets>
</library>
<library name="fab" urn="urn:adsk.eagle:library:9340542">
<packages>
<package name="R1206" urn="urn:adsk.eagle:footprint:9340631/1" library_version="2">
<description>&lt;b&gt;RESISTOR&lt;/b&gt;</description>
<wire x1="0.9525" y1="-0.8128" x2="-0.9652" y2="-0.8128" width="0.1524" layer="51"/>
<wire x1="0.9525" y1="0.8128" x2="-0.9652" y2="0.8128" width="0.1524" layer="51"/>
<wire x1="-2.473" y1="0.983" x2="2.473" y2="0.983" width="0.0508" layer="39"/>
<wire x1="2.473" y1="0.983" x2="2.473" y2="-0.983" width="0.0508" layer="39"/>
<wire x1="2.473" y1="-0.983" x2="-2.473" y2="-0.983" width="0.0508" layer="39"/>
<wire x1="-2.473" y1="-0.983" x2="-2.473" y2="0.983" width="0.0508" layer="39"/>
<smd name="2" x="1.422" y="0" dx="1.6" dy="1.803" layer="1"/>
<smd name="1" x="-1.422" y="0" dx="1.6" dy="1.803" layer="1"/>
<text x="-1.27" y="1.27" size="1.27" layer="25">&gt;NAME</text>
<text x="-1.27" y="-2.54" size="1.27" layer="27">&gt;VALUE</text>
<rectangle x1="-1.6891" y1="-0.8763" x2="-0.9525" y2="0.8763" layer="51"/>
<rectangle x1="0.9525" y1="-0.8763" x2="1.6891" y2="0.8763" layer="51"/>
<rectangle x1="-0.3" y1="-0.7" x2="0.3" y2="0.7" layer="35"/>
</package>
<package name="R1206W" urn="urn:adsk.eagle:footprint:23048/1" library_version="2">
<description>&lt;b&gt;RESISTOR&lt;/b&gt;&lt;p&gt;
wave soldering</description>
<wire x1="-0.913" y1="0.8" x2="0.888" y2="0.8" width="0.1524" layer="51"/>
<wire x1="-0.913" y1="-0.8" x2="0.888" y2="-0.8" width="0.1524" layer="51"/>
<wire x1="-2.473" y1="0.983" x2="2.473" y2="0.983" width="0.0508" layer="39"/>
<wire x1="2.473" y1="0.983" x2="2.473" y2="-0.983" width="0.0508" layer="39"/>
<wire x1="2.473" y1="-0.983" x2="-2.473" y2="-0.983" width="0.0508" layer="39"/>
<wire x1="-2.473" y1="-0.983" x2="-2.473" y2="0.983" width="0.0508" layer="39"/>
<smd name="1" x="-1.499" y="0" dx="1.8" dy="1.2" layer="1"/>
<smd name="2" x="1.499" y="0" dx="1.8" dy="1.2" layer="1"/>
<text x="-1.905" y="1.27" size="1.27" layer="25">&gt;NAME</text>
<text x="-1.905" y="-2.54" size="1.27" layer="27">&gt;VALUE</text>
<rectangle x1="-1.651" y1="-0.8763" x2="-0.9009" y2="0.8738" layer="51"/>
<rectangle x1="0.889" y1="-0.8763" x2="1.6391" y2="0.8738" layer="51"/>
<rectangle x1="-0.3" y1="-0.7" x2="0.3" y2="0.7" layer="35"/>
</package>
<package name="R1206FAB" urn="urn:adsk.eagle:footprint:9340634/1" library_version="2">
<wire x1="-2.032" y1="1.016" x2="2.032" y2="1.016" width="0.127" layer="21"/>
<wire x1="2.032" y1="1.016" x2="2.032" y2="-1.016" width="0.127" layer="21"/>
<wire x1="2.032" y1="-1.016" x2="-2.032" y2="-1.016" width="0.127" layer="21"/>
<wire x1="-2.032" y1="-1.016" x2="-2.032" y2="1.016" width="0.127" layer="21"/>
<smd name="1" x="-1.651" y="0" dx="1.27" dy="1.905" layer="1"/>
<smd name="2" x="1.651" y="0" dx="1.27" dy="1.905" layer="1"/>
<text x="-1.778" y="1.27" size="1.016" layer="25" ratio="15">&gt;NAME</text>
<text x="-1.778" y="-2.286" size="1.016" layer="27" ratio="15">&gt;VALUE</text>
</package>
<package name="LED1206" urn="urn:adsk.eagle:footprint:9340640/1" library_version="2">
<description>LED 1206 pads (standard pattern)</description>
<wire x1="0.9525" y1="-0.8128" x2="-0.9652" y2="-0.8128" width="0.1524" layer="51"/>
<wire x1="0.9525" y1="0.8128" x2="-0.9652" y2="0.8128" width="0.1524" layer="51"/>
<wire x1="-2.473" y1="0.983" x2="2.473" y2="0.983" width="0.0508" layer="39"/>
<wire x1="2.473" y1="0.983" x2="2.473" y2="-0.983" width="0.0508" layer="39"/>
<wire x1="2.473" y1="-0.983" x2="-2.473" y2="-0.983" width="0.0508" layer="39"/>
<wire x1="-2.473" y1="-0.983" x2="-2.473" y2="0.983" width="0.0508" layer="39"/>
<smd name="2" x="1.422" y="0" dx="1.6" dy="1.803" layer="1"/>
<smd name="1" x="-1.422" y="0" dx="1.6" dy="1.803" layer="1"/>
<text x="-1.27" y="1.27" size="1.27" layer="25">&gt;NAME</text>
<text x="-1.27" y="-2.54" size="1.27" layer="27">&gt;VALUE</text>
<rectangle x1="-1.6891" y1="-0.8763" x2="-0.9525" y2="0.8763" layer="51"/>
<rectangle x1="0.9525" y1="-0.8763" x2="1.6891" y2="0.8763" layer="51"/>
</package>
<package name="LED1206FAB" urn="urn:adsk.eagle:footprint:9340639/1" library_version="2">
<description>LED1206 FAB style (smaller pads to allow trace between)</description>
<wire x1="-2.032" y1="1.016" x2="2.032" y2="1.016" width="0.127" layer="21"/>
<wire x1="2.032" y1="1.016" x2="2.032" y2="-1.016" width="0.127" layer="21"/>
<wire x1="2.032" y1="-1.016" x2="-2.032" y2="-1.016" width="0.127" layer="21"/>
<wire x1="-2.032" y1="-1.016" x2="-2.032" y2="1.016" width="0.127" layer="21"/>
<smd name="1" x="-1.651" y="0" dx="1.27" dy="1.905" layer="1"/>
<smd name="2" x="1.651" y="0" dx="1.27" dy="1.905" layer="1"/>
<text x="-1.778" y="1.27" size="1.016" layer="25" ratio="15">&gt;NAME</text>
<text x="-1.778" y="-2.286" size="1.016" layer="27" ratio="15">&gt;VALUE</text>
</package>
<package name="5MM" urn="urn:adsk.eagle:footprint:9340641/1" library_version="2">
<description>5mm round through hole part.</description>
<wire x1="2.54" y1="-1.905" x2="2.54" y2="1.905" width="0.2032" layer="21"/>
<wire x1="2.54" y1="-1.905" x2="2.54" y2="1.905" width="0.254" layer="21" curve="-286.260205" cap="flat"/>
<wire x1="-1.143" y1="0" x2="0" y2="1.143" width="0.1524" layer="51" curve="-90" cap="flat"/>
<wire x1="0" y1="-1.143" x2="1.143" y2="0" width="0.1524" layer="51" curve="90" cap="flat"/>
<wire x1="-1.651" y1="0" x2="0" y2="1.651" width="0.1524" layer="51" curve="-90" cap="flat"/>
<wire x1="0" y1="-1.651" x2="1.651" y2="0" width="0.1524" layer="51" curve="90" cap="flat"/>
<wire x1="-2.159" y1="0" x2="0" y2="2.159" width="0.1524" layer="51" curve="-90" cap="flat"/>
<wire x1="0" y1="-2.159" x2="2.159" y2="0" width="0.1524" layer="51" curve="90" cap="flat"/>
<circle x="0" y="0" radius="2.54" width="0.1524" layer="21"/>
<pad name="IN" x="-1.27" y="0" drill="0.8128" diameter="1.4224"/>
<pad name="OUT" x="1.27" y="0" drill="0.8128" diameter="1.4224"/>
<text x="3.175" y="0.5334" size="1.27" layer="25" ratio="10">&gt;NAME</text>
<text x="3.2004" y="-1.8034" size="1.27" layer="27" ratio="10">&gt;VALUE</text>
</package>
<package name="2X3-SHROUDED" urn="urn:adsk.eagle:footprint:9340671/1" library_version="2">
<description>&lt;h3&gt;Plated Through Hole - 2x3 Shrouded Header&lt;/h3&gt;
&lt;p&gt;Specifications:
&lt;ul&gt;&lt;li&gt;Pin count:6&lt;/li&gt;
&lt;li&gt;Pin pitch:0.1"&lt;/li&gt;
&lt;/ul&gt;&lt;/p&gt;
&lt;p&gt;&lt;a href=”https://www.sparkfun.com/datasheets/Prototyping/Shrouded-10pin.pdf”&gt;Datasheet referenced for footprint&lt;/a&gt;&lt;/p&gt;
&lt;p&gt;Example device(s):
&lt;ul&gt;&lt;li&gt;CONN_03x2&lt;/li&gt;
&lt;/ul&gt;&lt;/p&gt;</description>
<wire x1="4.5" y1="7.56" x2="4.5" y2="-7.56" width="0.2032" layer="21"/>
<wire x1="-4.5" y1="-7.56" x2="-4.5" y2="-2.2" width="0.2032" layer="21"/>
<wire x1="-4.5" y1="-2.2" x2="-4.5" y2="2.2" width="0.2032" layer="21"/>
<wire x1="-4.5" y1="2.2" x2="-4.5" y2="7.56" width="0.2032" layer="21"/>
<wire x1="-4.5" y1="7.56" x2="4.4" y2="7.56" width="0.2032" layer="21"/>
<wire x1="4.5" y1="-7.56" x2="-4.5" y2="-7.56" width="0.2032" layer="21"/>
<wire x1="-3.4" y1="6.46" x2="3.4" y2="6.46" width="0.2032" layer="51"/>
<wire x1="3.4" y1="6.46" x2="3.4" y2="-6.46" width="0.2032" layer="51"/>
<wire x1="-3.4" y1="-6.46" x2="3.4" y2="-6.46" width="0.2032" layer="51"/>
<wire x1="-4.5" y1="2.2" x2="-3" y2="2.2" width="0.2032" layer="21"/>
<wire x1="-3" y1="2.2" x2="-3" y2="-2.2" width="0.2032" layer="21"/>
<wire x1="-3" y1="-2.2" x2="-4.5" y2="-2.2" width="0.2032" layer="21"/>
<wire x1="-3.4" y1="6.46" x2="-3.4" y2="2.2" width="0.2032" layer="51"/>
<wire x1="-3.4" y1="-6.46" x2="-3.4" y2="-2.2" width="0.2032" layer="51"/>
<wire x1="-2.648" y1="3.175" x2="-2.648" y2="1.905" width="0.2032" layer="21"/>
<wire x1="-2.686" y1="3.175" x2="-2.686" y2="1.905" width="0.2032" layer="22"/>
<pad name="1" x="-1.27" y="2.54" drill="1.016" diameter="1.8796" rot="R270"/>
<pad name="2" x="1.27" y="2.54" drill="1.016" diameter="1.8796" rot="R270"/>
<pad name="3" x="-1.27" y="0" drill="1.016" diameter="1.8796" rot="R270"/>
<pad name="4" x="1.27" y="0" drill="1.016" diameter="1.8796" rot="R270"/>
<pad name="5" x="-1.27" y="-2.54" drill="1.016" diameter="1.8796" rot="R270"/>
<pad name="6" x="1.27" y="-2.54" drill="1.016" diameter="1.8796" rot="R270"/>
<rectangle x1="1.016" y1="2.286" x2="1.524" y2="2.794" layer="51"/>
<rectangle x1="-1.524" y1="2.286" x2="-1.016" y2="2.794" layer="51"/>
<rectangle x1="1.016" y1="-0.254" x2="1.524" y2="0.254" layer="51"/>
<rectangle x1="-1.524" y1="-0.254" x2="-1.016" y2="0.254" layer="51"/>
<rectangle x1="1.016" y1="-2.794" x2="1.524" y2="-2.286" layer="51"/>
<rectangle x1="-1.524" y1="-2.794" x2="-1.016" y2="-2.286" layer="51"/>
<rectangle x1="-1.524" y1="-2.794" x2="-1.016" y2="-2.286" layer="51"/>
<rectangle x1="1.016" y1="-2.794" x2="1.524" y2="-2.286" layer="51"/>
<text x="-3.81" y="7.874" size="0.6096" layer="25" font="vector" ratio="20">&gt;NAME</text>
<text x="-3.81" y="-8.382" size="0.6096" layer="27" font="vector" ratio="20">&gt;VALUE</text>
</package>
<package name="2X3_SMT_POSTS" urn="urn:adsk.eagle:footprint:9340672/1" library_version="2">
<description>&lt;h3&gt;Surface Mount - 2x3 Male Header with Keying Posts&lt;/h3&gt;
&lt;p&gt;Specifications:
&lt;ul&gt;&lt;li&gt;Pin count:6&lt;/li&gt;
&lt;li&gt;Pin pitch:0.1"&lt;/li&gt;
&lt;/ul&gt;&lt;/p&gt;
&lt;p&gt;&lt;a href=”http://www.4uconnector.com/online/object/4udrawing/15881.pdf”&gt;Datasheet referenced for footprint&lt;/a&gt;&lt;/p&gt;
&lt;p&gt;Example device(s):
&lt;ul&gt;&lt;li&gt;CONN_03x2&lt;/li&gt;
&lt;/ul&gt;&lt;/p&gt;</description>
<hole x="-1.27" y="0" drill="1.8"/>
<hole x="1.27" y="0" drill="1.8"/>
<smd name="4" x="0" y="2.54" dx="3.17" dy="1" layer="1" rot="R90"/>
<smd name="3" x="0" y="-2.54" dx="3.17" dy="1" layer="1" rot="R90"/>
<smd name="5" x="2.54" y="-2.54" dx="3.17" dy="1" layer="1" rot="R90"/>
<smd name="6" x="2.54" y="2.54" dx="3.17" dy="1" layer="1" rot="R90"/>
<smd name="2" x="-2.54" y="2.54" dx="3.17" dy="1" layer="1" rot="R90"/>
<smd name="1" x="-2.54" y="-2.54" dx="3.17" dy="1" layer="1" rot="R90"/>
<wire x1="-1.778" y1="2.54" x2="-0.762" y2="2.54" width="0.2032" layer="21"/>
<wire x1="0.762" y1="2.54" x2="1.778" y2="2.54" width="0.2032" layer="21"/>
<wire x1="-1.778" y1="-2.54" x2="-0.889" y2="-2.54" width="0.2032" layer="21"/>
<wire x1="0.762" y1="-2.54" x2="1.778" y2="-2.54" width="0.2032" layer="21"/>
<wire x1="-3.175" y1="2.54" x2="-3.81" y2="2.54" width="0.2032" layer="21"/>
<wire x1="-3.81" y1="2.54" x2="-3.81" y2="-2.54" width="0.2032" layer="21"/>
<wire x1="-3.81" y1="-2.54" x2="-3.175" y2="-2.54" width="0.2032" layer="21"/>
<wire x1="3.175" y1="2.54" x2="3.81" y2="2.54" width="0.2032" layer="21"/>
<wire x1="3.81" y1="2.54" x2="3.81" y2="-2.54" width="0.2032" layer="21"/>
<wire x1="3.81" y1="-2.54" x2="3.175" y2="-2.54" width="0.2032" layer="21"/>
<wire x1="-3.429" y1="-4.064" x2="-3.429" y2="-2.794" width="0.2032" layer="21"/>
<text x="-1.397" y="4.445" size="0.6096" layer="25" font="vector" ratio="20">&gt;NAME</text>
<text x="-1.778" y="-5.08" size="0.6096" layer="27" font="vector" ratio="20">&gt;VALUE</text>
</package>
<package name="2X3_POGO" urn="urn:adsk.eagle:footprint:9340673/1" library_version="2">
<description>&lt;h3&gt;Plated Through Hole - 2x3 Pogo Pins&lt;/h3&gt;
&lt;p&gt;Specifications:
&lt;ul&gt;&lt;li&gt;Pin count:6&lt;/li&gt;
&lt;li&gt;Pin pitch:0.1"&lt;/li&gt;
&lt;/ul&gt;&lt;/p&gt;
&lt;p&gt;Example device(s):
&lt;ul&gt;&lt;li&gt;CONN_03x2&lt;/li&gt;
&lt;/ul&gt;&lt;/p&gt;</description>
<pad name="P$1" x="0" y="0" drill="1.2" diameter="1.8288"/>
<pad name="P$3" x="2.54" y="0" drill="1.2" diameter="1.8288"/>
<pad name="P$5" x="5.08" y="0" drill="1.2" diameter="1.8288"/>
<pad name="P$6" x="5.08" y="2.54" drill="1.2" diameter="1.8288"/>
<pad name="P$4" x="2.54" y="2.54" drill="1.2" diameter="1.8288"/>
<pad name="P$2" x="0" y="2.54" drill="1.2" diameter="1.8288"/>
<wire x1="-0.635" y1="1.27" x2="-1.27" y2="1.905" width="0.2032" layer="21"/>
<wire x1="-1.27" y1="1.905" x2="-1.27" y2="3.175" width="0.2032" layer="21"/>
<wire x1="-1.27" y1="3.175" x2="-0.635" y2="3.81" width="0.2032" layer="21"/>
<wire x1="-0.635" y1="3.81" x2="0.635" y2="3.81" width="0.2032" layer="21"/>
<wire x1="0.635" y1="3.81" x2="1.27" y2="3.175" width="0.2032" layer="21"/>
<wire x1="1.27" y1="3.175" x2="1.905" y2="3.81" width="0.2032" layer="21"/>
<wire x1="1.905" y1="3.81" x2="3.175" y2="3.81" width="0.2032" layer="21"/>
<wire x1="3.175" y1="3.81" x2="3.81" y2="3.175" width="0.2032" layer="21"/>
<wire x1="3.81" y1="3.175" x2="4.445" y2="3.81" width="0.2032" layer="21"/>
<wire x1="4.445" y1="3.81" x2="5.715" y2="3.81" width="0.2032" layer="21"/>
<wire x1="5.715" y1="3.81" x2="6.35" y2="3.175" width="0.2032" layer="21"/>
<wire x1="6.35" y1="3.175" x2="6.35" y2="1.905" width="0.2032" layer="21"/>
<wire x1="6.35" y1="1.905" x2="5.715" y2="1.27" width="0.2032" layer="21"/>
<wire x1="5.715" y1="1.27" x2="6.35" y2="0.635" width="0.2032" layer="21"/>
<wire x1="6.35" y1="0.635" x2="6.35" y2="-0.635" width="0.2032" layer="21"/>
<wire x1="6.35" y1="-0.635" x2="5.715" y2="-1.27" width="0.2032" layer="21"/>
<wire x1="5.715" y1="-1.27" x2="4.445" y2="-1.27" width="0.2032" layer="21"/>
<wire x1="4.445" y1="-1.27" x2="3.81" y2="-0.635" width="0.2032" layer="21"/>
<wire x1="3.81" y1="-0.635" x2="3.175" y2="-1.27" width="0.2032" layer="21"/>
<wire x1="3.175" y1="-1.27" x2="1.905" y2="-1.27" width="0.2032" layer="21"/>
<wire x1="1.905" y1="-1.27" x2="1.27" y2="-0.635" width="0.2032" layer="21"/>
<wire x1="1.27" y1="-0.635" x2="0.635" y2="-1.27" width="0.2032" layer="21"/>
<wire x1="0.635" y1="-1.27" x2="-0.635" y2="-1.27" width="0.2032" layer="21"/>
<wire x1="-0.635" y1="-1.27" x2="-1.27" y2="-0.635" width="0.2032" layer="21"/>
<wire x1="-1.27" y1="-0.635" x2="-1.27" y2="0.635" width="0.2032" layer="21"/>
<wire x1="-1.27" y1="0.635" x2="-0.635" y2="1.27" width="0.2032" layer="21"/>
<wire x1="1.27" y1="2.54" x2="1.27" y2="0" width="0.2032" layer="21"/>
<wire x1="3.81" y1="2.54" x2="3.81" y2="0" width="0.2032" layer="21"/>
<wire x1="-0.635" y1="-1.651" x2="0.635" y2="-1.651" width="0.2032" layer="21"/>
<wire x1="-1.27" y1="-0.635" x2="-0.635" y2="-1.27" width="0.2032" layer="21"/>
<wire x1="-1.27" y1="3.175" x2="-0.635" y2="3.81" width="0.2032" layer="21"/>
<wire x1="0.635" y1="-1.651" x2="-0.635" y2="-1.651" width="0.2032" layer="22"/>
<text x="-1.27" y="4.064" size="0.6096" layer="25" font="vector" ratio="20">&gt;NAME</text>
<text x="-1.27" y="-2.413" size="0.6096" layer="27" font="vector" ratio="20">&gt;VALUE</text>
</package>
<package name="2X3" urn="urn:adsk.eagle:footprint:9340674/1" library_version="2">
<description>&lt;h3&gt;Plated Through Hole - 2x3&lt;/h3&gt;
&lt;p&gt;Specifications:
&lt;ul&gt;&lt;li&gt;Pin count:6&lt;/li&gt;
&lt;li&gt;Pin pitch:0.1"&lt;/li&gt;
&lt;/ul&gt;&lt;/p&gt;
&lt;p&gt;Example device(s):
&lt;ul&gt;&lt;li&gt;CONN_03x2&lt;/li&gt;
&lt;/ul&gt;&lt;/p&gt;</description>
<wire x1="-1.27" y1="-0.635" x2="-0.635" y2="-1.27" width="0.2032" layer="21"/>
<wire x1="0.635" y1="-1.27" x2="1.27" y2="-0.635" width="0.2032" layer="21"/>
<wire x1="1.27" y1="-0.635" x2="1.905" y2="-1.27" width="0.2032" layer="21"/>
<wire x1="3.175" y1="-1.27" x2="3.81" y2="-0.635" width="0.2032" layer="21"/>
<wire x1="3.81" y1="-0.635" x2="4.445" y2="-1.27" width="0.2032" layer="21"/>
<wire x1="5.715" y1="-1.27" x2="6.35" y2="-0.635" width="0.2032" layer="21"/>
<wire x1="-1.27" y1="-0.635" x2="-1.27" y2="3.175" width="0.2032" layer="21"/>
<wire x1="-1.27" y1="3.175" x2="-0.635" y2="3.81" width="0.2032" layer="21"/>
<wire x1="-0.635" y1="3.81" x2="0.635" y2="3.81" width="0.2032" layer="21"/>
<wire x1="0.635" y1="3.81" x2="1.27" y2="3.175" width="0.2032" layer="21"/>
<wire x1="1.27" y1="3.175" x2="1.905" y2="3.81" width="0.2032" layer="21"/>
<wire x1="1.905" y1="3.81" x2="3.175" y2="3.81" width="0.2032" layer="21"/>
<wire x1="3.175" y1="3.81" x2="3.81" y2="3.175" width="0.2032" layer="21"/>
<wire x1="3.81" y1="3.175" x2="4.445" y2="3.81" width="0.2032" layer="21"/>
<wire x1="4.445" y1="3.81" x2="5.715" y2="3.81" width="0.2032" layer="21"/>
<wire x1="5.715" y1="3.81" x2="6.35" y2="3.175" width="0.2032" layer="21"/>
<wire x1="1.27" y1="3.175" x2="1.27" y2="-0.635" width="0.2032" layer="21"/>
<wire x1="3.81" y1="3.175" x2="3.81" y2="-0.635" width="0.2032" layer="21"/>
<wire x1="6.35" y1="3.175" x2="6.35" y2="-0.635" width="0.2032" layer="21"/>
<wire x1="4.445" y1="-1.27" x2="5.715" y2="-1.27" width="0.2032" layer="21"/>
<wire x1="1.905" y1="-1.27" x2="3.175" y2="-1.27" width="0.2032" layer="21"/>
<wire x1="-0.635" y1="-1.27" x2="0.635" y2="-1.27" width="0.2032" layer="21"/>
<wire x1="0.635" y1="-1.605" x2="-0.635" y2="-1.605" width="0.2032" layer="21"/>
<wire x1="-0.635" y1="-1.605" x2="0.635" y2="-1.605" width="0.2032" layer="22"/>
<pad name="1" x="0" y="0" drill="1.016" diameter="1.8796"/>
<pad name="2" x="0" y="2.54" drill="1.016" diameter="1.8796"/>
<pad name="3" x="2.54" y="0" drill="1.016" diameter="1.8796"/>
<pad name="4" x="2.54" y="2.54" drill="1.016" diameter="1.8796"/>
<pad name="5" x="5.08" y="0" drill="1.016" diameter="1.8796"/>
<pad name="6" x="5.08" y="2.54" drill="1.016" diameter="1.8796"/>
<text x="-1.27" y="4.064" size="0.6096" layer="25" font="vector" ratio="20">&gt;NAME</text>
<text x="-1.27" y="-2.413" size="0.6096" layer="27" font="vector" ratio="20">&gt;VALUE</text>
<rectangle x1="-0.254" y1="-0.254" x2="0.254" y2="0.254" layer="51"/>
<rectangle x1="-0.254" y1="2.286" x2="0.254" y2="2.794" layer="51"/>
<rectangle x1="2.286" y1="2.286" x2="2.794" y2="2.794" layer="51"/>
<rectangle x1="2.286" y1="-0.254" x2="2.794" y2="0.254" layer="51"/>
<rectangle x1="4.826" y1="2.286" x2="5.334" y2="2.794" layer="51"/>
<rectangle x1="4.826" y1="-0.254" x2="5.334" y2="0.254" layer="51"/>
</package>
<package name="2X3-NS" urn="urn:adsk.eagle:footprint:9340675/1" library_version="2">
<description>&lt;h3&gt;Plated Through Hole - 2x3 No Silk Outline&lt;/h3&gt;
&lt;p&gt;Specifications:
&lt;ul&gt;&lt;li&gt;Pin count:6&lt;/li&gt;
&lt;li&gt;Pin pitch:0.1"&lt;/li&gt;
&lt;/ul&gt;&lt;/p&gt;
&lt;p&gt;Example device(s):
&lt;ul&gt;&lt;li&gt;CONN_03x2&lt;/li&gt;
&lt;/ul&gt;&lt;/p&gt;</description>
<wire x1="-3.81" y1="-1.905" x2="-3.175" y2="-2.54" width="0.2032" layer="51"/>
<wire x1="-1.905" y1="-2.54" x2="-1.27" y2="-1.905" width="0.2032" layer="51"/>
<wire x1="-1.27" y1="-1.905" x2="-0.635" y2="-2.54" width="0.2032" layer="51"/>
<wire x1="0.635" y1="-2.54" x2="1.27" y2="-1.905" width="0.2032" layer="51"/>
<wire x1="1.27" y1="-1.905" x2="1.905" y2="-2.54" width="0.2032" layer="51"/>
<wire x1="3.175" y1="-2.54" x2="3.81" y2="-1.905" width="0.2032" layer="51"/>
<wire x1="-3.81" y1="-1.905" x2="-3.81" y2="1.905" width="0.2032" layer="51"/>
<wire x1="-3.81" y1="1.905" x2="-3.175" y2="2.54" width="0.2032" layer="51"/>
<wire x1="-3.175" y1="2.54" x2="-1.905" y2="2.54" width="0.2032" layer="51"/>
<wire x1="-1.905" y1="2.54" x2="-1.27" y2="1.905" width="0.2032" layer="51"/>
<wire x1="-1.27" y1="1.905" x2="-0.635" y2="2.54" width="0.2032" layer="51"/>
<wire x1="-0.635" y1="2.54" x2="0.635" y2="2.54" width="0.2032" layer="51"/>
<wire x1="0.635" y1="2.54" x2="1.27" y2="1.905" width="0.2032" layer="51"/>
<wire x1="1.27" y1="1.905" x2="1.905" y2="2.54" width="0.2032" layer="51"/>
<wire x1="1.905" y1="2.54" x2="3.175" y2="2.54" width="0.2032" layer="51"/>
<wire x1="3.175" y1="2.54" x2="3.81" y2="1.905" width="0.2032" layer="51"/>
<wire x1="-1.27" y1="1.905" x2="-1.27" y2="-1.905" width="0.2032" layer="51"/>
<wire x1="1.27" y1="1.905" x2="1.27" y2="-1.905" width="0.2032" layer="51"/>
<wire x1="3.81" y1="1.905" x2="3.81" y2="-1.905" width="0.2032" layer="51"/>
<wire x1="1.905" y1="-2.54" x2="3.175" y2="-2.54" width="0.2032" layer="51"/>
<wire x1="-0.635" y1="-2.54" x2="0.635" y2="-2.54" width="0.2032" layer="51"/>
<wire x1="-3.175" y1="-2.54" x2="-1.905" y2="-2.54" width="0.2032" layer="51"/>
<wire x1="-1.905" y1="-2.875" x2="-3.175" y2="-2.875" width="0.2032" layer="51"/>
<pad name="1" x="-2.54" y="-1.27" drill="1.016" diameter="1.8796"/>
<pad name="2" x="-2.54" y="1.27" drill="1.016" diameter="1.8796"/>
<pad name="3" x="0" y="-1.27" drill="1.016" diameter="1.8796"/>
<pad name="4" x="0" y="1.27" drill="1.016" diameter="1.8796"/>
<pad name="5" x="2.54" y="-1.27" drill="1.016" diameter="1.8796"/>
<pad name="6" x="2.54" y="1.27" drill="1.016" diameter="1.8796"/>
<rectangle x1="-2.794" y1="-1.524" x2="-2.286" y2="-1.016" layer="51"/>
<rectangle x1="-2.794" y1="1.016" x2="-2.286" y2="1.524" layer="51"/>
<rectangle x1="-0.254" y1="1.016" x2="0.254" y2="1.524" layer="51"/>
<rectangle x1="-0.254" y1="-1.524" x2="0.254" y2="-1.016" layer="51"/>
<rectangle x1="2.286" y1="1.016" x2="2.794" y2="1.524" layer="51"/>
<rectangle x1="2.286" y1="-1.524" x2="2.794" y2="-1.016" layer="51"/>
<text x="-3.81" y="2.667" size="0.6096" layer="25" font="vector" ratio="20">&gt;NAME</text>
<text x="-3.81" y="-3.937" size="0.6096" layer="27" font="vector" ratio="20">&gt;VALUE</text>
</package>
<package name="2X3_SMD" urn="urn:adsk.eagle:footprint:9340676/1" library_version="2">
<description>&lt;h3&gt;Surface Mount - 2x3&lt;/h3&gt;
&lt;p&gt;Specifications:
&lt;ul&gt;&lt;li&gt;Pin count:6&lt;/li&gt;
&lt;li&gt;Pin pitch:2.54mm&lt;/li&gt;
&lt;/ul&gt;&lt;/p&gt;
&lt;p&gt;Example device(s):
&lt;ul&gt;&lt;li&gt;CONN_03x2&lt;/li&gt;
&lt;/ul&gt;&lt;/p&gt;</description>
<circle x="0" y="1.27" radius="0.7" width="0.127" layer="51"/>
<circle x="-2.54" y="1.27" radius="0.7" width="0.127" layer="51"/>
<circle x="-2.54" y="-1.27" radius="0.7" width="0.127" layer="51"/>
<circle x="0" y="-1.27" radius="0.7" width="0.127" layer="51"/>
<circle x="2.54" y="-1.27" radius="0.7" width="0.127" layer="51"/>
<circle x="2.54" y="1.27" radius="0.7" width="0.127" layer="51"/>
<wire x1="-3.81" y1="-2.5" x2="-3.81" y2="2.5" width="0.127" layer="51"/>
<wire x1="-3.81" y1="2.5" x2="3.81" y2="2.5" width="0.127" layer="51"/>
<wire x1="3.81" y1="2.5" x2="3.81" y2="-2.5" width="0.127" layer="51"/>
<wire x1="3.81" y1="-2.5" x2="-3.81" y2="-2.5" width="0.127" layer="51"/>
<wire x1="-3.302" y1="-3.683" x2="-3.302" y2="-2.794" width="0.127" layer="21"/>
<rectangle x1="-0.3" y1="2.55" x2="0.3" y2="3.35" layer="51"/>
<rectangle x1="-2.84" y1="2.55" x2="-2.24" y2="3.35" layer="51"/>
<rectangle x1="2.24" y1="2.55" x2="2.84" y2="3.35" layer="51"/>
<rectangle x1="-2.84" y1="-3.35" x2="-2.24" y2="-2.55" layer="51" rot="R180"/>
<rectangle x1="-0.3" y1="-3.35" x2="0.3" y2="-2.55" layer="51" rot="R180"/>
<rectangle x1="2.24" y1="-3.35" x2="2.84" y2="-2.55" layer="51" rot="R180"/>
<smd name="1" x="-2.54" y="-2.85" dx="1.02" dy="1.9" layer="1"/>
<smd name="2" x="-2.54" y="2.85" dx="1.02" dy="1.9" layer="1"/>
<smd name="3" x="0" y="-2.85" dx="1.02" dy="1.9" layer="1"/>
<smd name="4" x="0" y="2.85" dx="1.02" dy="1.9" layer="1"/>
<smd name="5" x="2.54" y="-2.85" dx="1.02" dy="1.9" layer="1"/>
<smd name="6" x="2.54" y="2.85" dx="1.02" dy="1.9" layer="1"/>
<text x="-1.397" y="4.191" size="0.6096" layer="25" font="vector" ratio="20">&gt;NAME</text>
<text x="-1.778" y="-4.826" size="0.6096" layer="27" font="vector" ratio="20">&gt;VALUE</text>
</package>
</packages>
<packages3d>
<package3d name="R1206" urn="urn:adsk.eagle:package:9340725/1" type="box" library_version="2">
<description>&lt;b&gt;RESISTOR&lt;/b&gt;</description>
<packageinstances>
<packageinstance name="R1206"/>
</packageinstances>
</package3d>
<package3d name="R1206W" urn="urn:adsk.eagle:package:23539/2" type="model" library_version="2">
<description>RESISTOR
wave soldering</description>
<packageinstances>
<packageinstance name="R1206W"/>
</packageinstances>
</package3d>
<package3d name="RESC3216X70" urn="urn:adsk.eagle:package:9340722/2" type="model" library_version="2">
<description>Chip, 3.20 X 1.60 X 0.70 mm body
&lt;p&gt;Chip package with body size 3.20 X 1.60 X 0.70 mm&lt;/p&gt;</description>
<packageinstances>
<packageinstance name="R1206FAB"/>
</packageinstances>
</package3d>
<package3d name="LED1206" urn="urn:adsk.eagle:package:9340754/1" type="box" library_version="2">
<description>LED 1206 pads (standard pattern)</description>
<packageinstances>
<packageinstance name="LED1206"/>
</packageinstances>
</package3d>
<package3d name="LED1206FAB" urn="urn:adsk.eagle:package:9340753/2" type="model" library_version="2">
<description>LED1206 FAB style (smaller pads to allow trace between)</description>
<packageinstances>
<packageinstance name="LED1206FAB"/>
</packageinstances>
</package3d>
<package3d name="5MM" urn="urn:adsk.eagle:package:9340755/1" type="box" library_version="2">
<description>5mm round through hole part.</description>
<packageinstances>
<packageinstance name="5MM"/>
</packageinstances>
</package3d>
<package3d name="2X3-SHROUDED" urn="urn:adsk.eagle:package:9340785/1" type="box" library_version="2">
<description>&lt;h3&gt;Plated Through Hole - 2x3 Shrouded Header&lt;/h3&gt;
&lt;p&gt;Specifications:
&lt;ul&gt;&lt;li&gt;Pin count:6&lt;/li&gt;
&lt;li&gt;Pin pitch:0.1"&lt;/li&gt;
&lt;/ul&gt;&lt;/p&gt;
&lt;p&gt;&lt;a href=”https://www.sparkfun.com/datasheets/Prototyping/Shrouded-10pin.pdf”&gt;Datasheet referenced for footprint&lt;/a&gt;&lt;/p&gt;
&lt;p&gt;Example device(s):
&lt;ul&gt;&lt;li&gt;CONN_03x2&lt;/li&gt;
&lt;/ul&gt;&lt;/p&gt;</description>
<packageinstances>
<packageinstance name="2X3-SHROUDED"/>
</packageinstances>
</package3d>
<package3d name="2X3_SMT_POSTS" urn="urn:adsk.eagle:package:9340786/1" type="box" library_version="2">
<description>&lt;h3&gt;Surface Mount - 2x3 Male Header with Keying Posts&lt;/h3&gt;
&lt;p&gt;Specifications:
&lt;ul&gt;&lt;li&gt;Pin count:6&lt;/li&gt;
&lt;li&gt;Pin pitch:0.1"&lt;/li&gt;
&lt;/ul&gt;&lt;/p&gt;
&lt;p&gt;&lt;a href=”http://www.4uconnector.com/online/object/4udrawing/15881.pdf”&gt;Datasheet referenced for footprint&lt;/a&gt;&lt;/p&gt;
&lt;p&gt;Example device(s):
&lt;ul&gt;&lt;li&gt;CONN_03x2&lt;/li&gt;
&lt;/ul&gt;&lt;/p&gt;</description>
<packageinstances>
<packageinstance name="2X3_SMT_POSTS"/>
</packageinstances>
</package3d>
<package3d name="2X3_POGO" urn="urn:adsk.eagle:package:9340787/1" type="box" library_version="2">
<description>&lt;h3&gt;Plated Through Hole - 2x3 Pogo Pins&lt;/h3&gt;
&lt;p&gt;Specifications:
&lt;ul&gt;&lt;li&gt;Pin count:6&lt;/li&gt;
&lt;li&gt;Pin pitch:0.1"&lt;/li&gt;
&lt;/ul&gt;&lt;/p&gt;
&lt;p&gt;Example device(s):
&lt;ul&gt;&lt;li&gt;CONN_03x2&lt;/li&gt;
&lt;/ul&gt;&lt;/p&gt;</description>
<packageinstances>
<packageinstance name="2X3_POGO"/>
</packageinstances>
</package3d>
<package3d name="2X3" urn="urn:adsk.eagle:package:9340788/1" type="box" library_version="2">
<description>&lt;h3&gt;Plated Through Hole - 2x3&lt;/h3&gt;
&lt;p&gt;Specifications:
&lt;ul&gt;&lt;li&gt;Pin count:6&lt;/li&gt;
&lt;li&gt;Pin pitch:0.1"&lt;/li&gt;
&lt;/ul&gt;&lt;/p&gt;
&lt;p&gt;Example device(s):
&lt;ul&gt;&lt;li&gt;CONN_03x2&lt;/li&gt;
&lt;/ul&gt;&lt;/p&gt;</description>
<packageinstances>
<packageinstance name="2X3"/>
</packageinstances>
</package3d>
<package3d name="2X3-NS" urn="urn:adsk.eagle:package:9340789/1" type="box" library_version="2">
<description>&lt;h3&gt;Plated Through Hole - 2x3 No Silk Outline&lt;/h3&gt;
&lt;p&gt;Specifications:
&lt;ul&gt;&lt;li&gt;Pin count:6&lt;/li&gt;
&lt;li&gt;Pin pitch:0.1"&lt;/li&gt;
&lt;/ul&gt;&lt;/p&gt;
&lt;p&gt;Example device(s):
&lt;ul&gt;&lt;li&gt;CONN_03x2&lt;/li&gt;
&lt;/ul&gt;&lt;/p&gt;</description>
<packageinstances>
<packageinstance name="2X3-NS"/>
</packageinstances>
</package3d>
<package3d name="2X3_SMD" urn="urn:adsk.eagle:package:9340790/1" type="box" library_version="2">
<description>&lt;h3&gt;Surface Mount - 2x3&lt;/h3&gt;
&lt;p&gt;Specifications:
&lt;ul&gt;&lt;li&gt;Pin count:6&lt;/li&gt;
&lt;li&gt;Pin pitch:2.54mm&lt;/li&gt;
&lt;/ul&gt;&lt;/p&gt;
&lt;p&gt;Example device(s):
&lt;ul&gt;&lt;li&gt;CONN_03x2&lt;/li&gt;
&lt;/ul&gt;&lt;/p&gt;</description>
<packageinstances>
<packageinstance name="2X3_SMD"/>
</packageinstances>
</package3d>
</packages3d>
<symbols>
<symbol name="R-US" urn="urn:adsk.eagle:symbol:9340552/1" library_version="2">
<wire x1="-2.54" y1="0" x2="-2.159" y2="1.016" width="0.2032" layer="94"/>
<wire x1="-2.159" y1="1.016" x2="-1.524" y2="-1.016" width="0.2032" layer="94"/>
<wire x1="-1.524" y1="-1.016" x2="-0.889" y2="1.016" width="0.2032" layer="94"/>
<wire x1="-0.889" y1="1.016" x2="-0.254" y2="-1.016" width="0.2032" layer="94"/>
<wire x1="-0.254" y1="-1.016" x2="0.381" y2="1.016" width="0.2032" layer="94"/>
<wire x1="0.381" y1="1.016" x2="1.016" y2="-1.016" width="0.2032" layer="94"/>
<wire x1="1.016" y1="-1.016" x2="1.651" y2="1.016" width="0.2032" layer="94"/>
<wire x1="1.651" y1="1.016" x2="2.286" y2="-1.016" width="0.2032" layer="94"/>
<wire x1="2.286" y1="-1.016" x2="2.54" y2="0" width="0.2032" layer="94"/>
<text x="-3.81" y="1.4986" size="1.778" layer="95">&gt;NAME</text>
<text x="-3.81" y="-3.302" size="1.778" layer="96">&gt;VALUE</text>
<pin name="2" x="5.08" y="0" visible="off" length="short" direction="pas" swaplevel="1" rot="R180"/>
<pin name="1" x="-5.08" y="0" visible="off" length="short" direction="pas" swaplevel="1"/>
</symbol>
<symbol name="LED" urn="urn:adsk.eagle:symbol:9340546/1" library_version="2">
<description>LED</description>
<wire x1="1.27" y1="2.54" x2="0" y2="0" width="0.254" layer="94"/>
<wire x1="0" y1="0" x2="-1.27" y2="2.54" width="0.254" layer="94"/>
<wire x1="1.27" y1="0" x2="0" y2="0" width="0.254" layer="94"/>
<wire x1="0" y1="0" x2="-1.27" y2="0" width="0.254" layer="94"/>
<wire x1="1.27" y1="2.54" x2="0" y2="2.54" width="0.254" layer="94"/>
<wire x1="0" y1="2.54" x2="-1.27" y2="2.54" width="0.254" layer="94"/>
<wire x1="0" y1="2.54" x2="0" y2="0" width="0.1524" layer="94"/>
<wire x1="-2.032" y1="1.778" x2="-3.429" y2="0.381" width="0.1524" layer="94"/>
<wire x1="-1.905" y1="0.635" x2="-3.302" y2="-0.762" width="0.1524" layer="94"/>
<text x="3.556" y="-2.032" size="1.778" layer="95" rot="R90">&gt;NAME</text>
<text x="5.715" y="-2.032" size="1.778" layer="96" rot="R90">&gt;VALUE</text>
<pin name="C" x="0" y="-2.54" visible="off" length="short" direction="pas" rot="R90"/>
<pin name="A" x="0" y="5.08" visible="off" length="short" direction="pas" rot="R270"/>
<polygon width="0.1524" layer="94">
<vertex x="-3.429" y="0.381"/>
<vertex x="-3.048" y="1.27"/>
<vertex x="-2.54" y="0.762"/>
</polygon>
<polygon width="0.1524" layer="94">
<vertex x="-3.302" y="-0.762"/>
<vertex x="-2.921" y="0.127"/>
<vertex x="-2.413" y="-0.381"/>
</polygon>
</symbol>
<symbol name="CONN_03X2" urn="urn:adsk.eagle:symbol:9340595/1" library_version="2">
<description>&lt;h3&gt;6 Pin Connection&lt;/h3&gt;
3x2 pin layout</description>
<pin name="1" x="-7.62" y="2.54" visible="pad" length="middle"/>
<pin name="3" x="-7.62" y="0" visible="pad" length="middle"/>
<pin name="5" x="-7.62" y="-2.54" visible="pad" length="middle"/>
<pin name="6" x="7.62" y="-2.54" visible="pad" length="middle" rot="R180"/>
<pin name="4" x="7.62" y="0" visible="pad" length="middle" rot="R180"/>
<pin name="2" x="7.62" y="2.54" visible="pad" length="middle" rot="R180"/>
<text x="-3.556" y="5.588" size="1.778" layer="95" font="vector">&gt;NAME</text>
<text x="-3.302" y="-5.842" size="1.778" layer="96" font="vector" align="top-left">&gt;VALUE</text>
<wire x1="-1.27" y1="-2.54" x2="-2.54" y2="-2.54" width="0.6096" layer="94"/>
<wire x1="-1.27" y1="0" x2="-2.54" y2="0" width="0.6096" layer="94"/>
<wire x1="-1.27" y1="2.54" x2="-2.54" y2="2.54" width="0.6096" layer="94"/>
<wire x1="-3.81" y1="5.08" x2="-3.81" y2="-5.08" width="0.4064" layer="94"/>
<wire x1="3.81" y1="-5.08" x2="-3.81" y2="-5.08" width="0.4064" layer="94"/>
<wire x1="3.81" y1="-5.08" x2="3.81" y2="5.08" width="0.4064" layer="94"/>
<wire x1="-3.81" y1="5.08" x2="3.81" y2="5.08" width="0.4064" layer="94"/>
<wire x1="1.27" y1="-2.54" x2="2.54" y2="-2.54" width="0.6096" layer="94"/>
<wire x1="1.27" y1="0" x2="2.54" y2="0" width="0.6096" layer="94"/>
<wire x1="1.27" y1="2.54" x2="2.54" y2="2.54" width="0.6096" layer="94"/>
</symbol>
</symbols>
<devicesets>
<deviceset name="RES-US" urn="urn:adsk.eagle:component:9340842/2" prefix="R" uservalue="yes" library_version="2">
<description>&lt;b&gt;Resistor (US Symbol)&lt;/b&gt;
&lt;p&gt;
Variants with postfix FAB are widened to allow the routing of internal traces</description>
<gates>
<gate name="G$1" symbol="R-US" x="0" y="0"/>
</gates>
<devices>
<device name="1206" package="R1206">
<connects>
<connect gate="G$1" pin="1" pad="1"/>
<connect gate="G$1" pin="2" pad="2"/>
</connects>
<package3dinstances>
<package3dinstance package3d_urn="urn:adsk.eagle:package:9340725/1"/>
</package3dinstances>
<technologies>
<technology name=""/>
</technologies>
</device>
<device name="1206W" package="R1206W">
<connects>
<connect gate="G$1" pin="1" pad="1"/>
<connect gate="G$1" pin="2" pad="2"/>
</connects>
<package3dinstances>
<package3dinstance package3d_urn="urn:adsk.eagle:package:23539/2"/>
</package3dinstances>
<technologies>
<technology name=""/>
</technologies>
</device>
<device name="1206FAB" package="R1206FAB">
<connects>
<connect gate="G$1" pin="1" pad="1"/>
<connect gate="G$1" pin="2" pad="2"/>
</connects>
<package3dinstances>
<package3dinstance package3d_urn="urn:adsk.eagle:package:9340722/2"/>
</package3dinstances>
<technologies>
<technology name=""/>
</technologies>
</device>
</devices>
</deviceset>
<deviceset name="LED" urn="urn:adsk.eagle:component:9340837/2" library_version="2">
<description>LED</description>
<gates>
<gate name="G$1" symbol="LED" x="0" y="0"/>
</gates>
<devices>
<device name="" package="LED1206">
<connects>
<connect gate="G$1" pin="A" pad="1"/>
<connect gate="G$1" pin="C" pad="2"/>
</connects>
<package3dinstances>
<package3dinstance package3d_urn="urn:adsk.eagle:package:9340754/1"/>
</package3dinstances>
<technologies>
<technology name=""/>
</technologies>
</device>
<device name="FAB1206" package="LED1206FAB">
<connects>
<connect gate="G$1" pin="A" pad="1"/>
<connect gate="G$1" pin="C" pad="2"/>
</connects>
<package3dinstances>
<package3dinstance package3d_urn="urn:adsk.eagle:package:9340753/2"/>
</package3dinstances>
<technologies>
<technology name=""/>
</technologies>
</device>
<device name="5MM" package="5MM">
<connects>
<connect gate="G$1" pin="A" pad="IN"/>
<connect gate="G$1" pin="C" pad="OUT"/>
</connects>
<package3dinstances>
<package3dinstance package3d_urn="urn:adsk.eagle:package:9340755/1"/>
</package3dinstances>
<technologies>
<technology name=""/>
</technologies>
</device>
</devices>
</deviceset>
<deviceset name="CONN_03X2" urn="urn:adsk.eagle:component:9340889/1" prefix="J" uservalue="yes" library_version="2">
<description>&lt;h3&gt;Multi connection point. Often used as Generic Header-pin footprint for 0.1 inch spaced/style header connections&lt;/h3&gt;

&lt;p&gt;&lt;/p&gt;

&lt;p&gt;&lt;/p&gt;
&lt;b&gt;You can populate with any combo of single row headers, but if you'd like an exact match, check these:&lt;/b&gt;
&lt;ul&gt;
&lt;li&gt;&lt;a href="https://www.sparkfun.com/products/12807"&gt; Header - 2x3 (Male, 0.1")&lt;/a&gt; (PRT-12807)&lt;/li&gt;
&lt;li&gt;&lt;a href="https://www.sparkfun.com/products/13010"&gt; Header - 2x3 (Female, 0.1")&lt;/a&gt; (PRT-13010)&lt;/li&gt;
&lt;li&gt;&lt;a href="https://www.sparkfun.com/products/10877"&gt; 2x3 Pin Shrouded Header&lt;/a&gt; (PRT-10877)&lt;/li&gt;
&lt;/ul&gt;

&lt;p&gt;&lt;/p&gt;
&lt;b&gt;On any of the 0.1 inch spaced packages, you can populate with these:&lt;/b&gt;
&lt;ul&gt;
&lt;li&gt;&lt;a href="https://www.sparkfun.com/products/116"&gt; Break Away Headers - Straight&lt;/a&gt; (PRT-00116)&lt;/li&gt;
&lt;li&gt;&lt;a href="https://www.sparkfun.com/products/553"&gt; Break Away Male Headers - Right Angle&lt;/a&gt; (PRT-00553)&lt;/li&gt;
&lt;li&gt;&lt;a href="https://www.sparkfun.com/products/115"&gt; Female Headers&lt;/a&gt; (PRT-00115)&lt;/li&gt;
&lt;li&gt;&lt;a href="https://www.sparkfun.com/products/117"&gt; Break Away Headers - Machine Pin&lt;/a&gt; (PRT-00117)&lt;/li&gt;
&lt;li&gt;&lt;a href="https://www.sparkfun.com/products/743"&gt; Break Away Female Headers - Swiss Machine Pin&lt;/a&gt; (PRT-00743)&lt;/li&gt;
&lt;/ul&gt;

&lt;p&gt;&lt;/p&gt;
&lt;b&gt;Special note: the shrouded connector mates well with our 3x2 ribbon cables:&lt;/b&gt;
&lt;ul&gt;
&lt;li&gt;&lt;a href="https://www.sparkfun.com/products/10651"&gt; Ribbon Crimp Connector - 6-pin (2x3, Female)&lt;/a&gt; (PRT-10651)&lt;/li&gt;
&lt;li&gt;&lt;a href="https://www.sparkfun.com/products/10646"&gt; Ribbon Cable - 6 wire (15ft)&lt;/a&gt; (PRT-10646)&lt;/li&gt;
&lt;/ul&gt;</description>
<gates>
<gate name="G$1" symbol="CONN_03X2" x="0" y="0"/>
</gates>
<devices>
<device name="SHROUD" package="2X3-SHROUDED">
<connects>
<connect gate="G$1" pin="1" pad="1"/>
<connect gate="G$1" pin="2" pad="2"/>
<connect gate="G$1" pin="3" pad="3"/>
<connect gate="G$1" pin="4" pad="4"/>
<connect gate="G$1" pin="5" pad="5"/>
<connect gate="G$1" pin="6" pad="6"/>
</connects>
<package3dinstances>
<package3dinstance package3d_urn="urn:adsk.eagle:package:9340785/1"/>
</package3dinstances>
<technologies>
<technology name="">
<attribute name="PROD_ID" value="CONN-10681"/>
<attribute name="SF_ID" value="PRT_10877" constant="no"/>
</technology>
</technologies>
</device>
<device name="SMT" package="2X3_SMT_POSTS">
<connects>
<connect gate="G$1" pin="1" pad="1"/>
<connect gate="G$1" pin="2" pad="2"/>
<connect gate="G$1" pin="3" pad="3"/>
<connect gate="G$1" pin="4" pad="4"/>
<connect gate="G$1" pin="5" pad="5"/>
<connect gate="G$1" pin="6" pad="6"/>
</connects>
<package3dinstances>
<package3dinstance package3d_urn="urn:adsk.eagle:package:9340786/1"/>
</package3dinstances>
<technologies>
<technology name="">
<attribute name="PROD_ID" value="CONN-11415"/>
</technology>
</technologies>
</device>
<device name="POGO_PINS" package="2X3_POGO">
<connects>
<connect gate="G$1" pin="1" pad="P$1"/>
<connect gate="G$1" pin="2" pad="P$2"/>
<connect gate="G$1" pin="3" pad="P$3"/>
<connect gate="G$1" pin="4" pad="P$4"/>
<connect gate="G$1" pin="5" pad="P$5"/>
<connect gate="G$1" pin="6" pad="P$6"/>
</connects>
<package3dinstances>
<package3dinstance package3d_urn="urn:adsk.eagle:package:9340787/1"/>
</package3dinstances>
<technologies>
<technology name="">
<attribute name="PROD_ID" value="HW-11044"/>
</technology>
</technologies>
</device>
<device name="2X3_SILK_MALE_PTH" package="2X3">
<connects>
<connect gate="G$1" pin="1" pad="1"/>
<connect gate="G$1" pin="2" pad="2"/>
<connect gate="G$1" pin="3" pad="3"/>
<connect gate="G$1" pin="4" pad="4"/>
<connect gate="G$1" pin="5" pad="5"/>
<connect gate="G$1" pin="6" pad="6"/>
</connects>
<package3dinstances>
<package3dinstance package3d_urn="urn:adsk.eagle:package:9340788/1"/>
</package3dinstances>
<technologies>
<technology name="">
<attribute name="PROD_ID" value="CONN-09701"/>
</technology>
</technologies>
</device>
<device name="NO_SILK" package="2X3-NS">
<connects>
<connect gate="G$1" pin="1" pad="1"/>
<connect gate="G$1" pin="2" pad="2"/>
<connect gate="G$1" pin="3" pad="3"/>
<connect gate="G$1" pin="4" pad="4"/>
<connect gate="G$1" pin="5" pad="5"/>
<connect gate="G$1" pin="6" pad="6"/>
</connects>
<package3dinstances>
<package3dinstance package3d_urn="urn:adsk.eagle:package:9340789/1"/>
</package3dinstances>
<technologies>
<technology name=""/>
</technologies>
</device>
<device name="FEMALE_SMD" package="2X3_SMD">
<connects>
<connect gate="G$1" pin="1" pad="1"/>
<connect gate="G$1" pin="2" pad="2"/>
<connect gate="G$1" pin="3" pad="3"/>
<connect gate="G$1" pin="4" pad="4"/>
<connect gate="G$1" pin="5" pad="5"/>
<connect gate="G$1" pin="6" pad="6"/>
</connects>
<package3dinstances>
<package3dinstance package3d_urn="urn:adsk.eagle:package:9340790/1"/>
</package3dinstances>
<technologies>
<technology name="">
<attribute name="PROD_ID" value="CONN-11290"/>
</technology>
</technologies>
</device>
<device name="FEMALE" package="2X3">
<connects>
<connect gate="G$1" pin="1" pad="1"/>
<connect gate="G$1" pin="2" pad="2"/>
<connect gate="G$1" pin="3" pad="3"/>
<connect gate="G$1" pin="4" pad="4"/>
<connect gate="G$1" pin="5" pad="5"/>
<connect gate="G$1" pin="6" pad="6"/>
</connects>
<package3dinstances>
<package3dinstance package3d_urn="urn:adsk.eagle:package:9340788/1"/>
</package3dinstances>
<technologies>
<technology name="">
<attribute name="PROD_ID" value="CONN-11566"/>
<attribute name="VALUE" value="FEMALE 2x3"/>
</technology>
</technologies>
</device>
</devices>
</deviceset>
</devicesets>
</library>
<library name="supply1" urn="urn:adsk.eagle:library:371">
<description>&lt;b&gt;Supply Symbols&lt;/b&gt;&lt;p&gt;
 GND, VCC, 0V, +5V, -5V, etc.&lt;p&gt;
 Please keep in mind, that these devices are necessary for the
 automatic wiring of the supply signals.&lt;p&gt;
 The pin name defined in the symbol is identical to the net which is to be wired automatically.&lt;p&gt;
 In this library the device names are the same as the pin names of the symbols, therefore the correct signal names appear next to the supply symbols in the schematic.&lt;p&gt;
 &lt;author&gt;Created by librarian@cadsoft.de&lt;/author&gt;</description>
<packages>
</packages>
<symbols>
<symbol name="+3V3" urn="urn:adsk.eagle:symbol:26950/1" library_version="1">
<wire x1="1.27" y1="-1.905" x2="0" y2="0" width="0.254" layer="94"/>
<wire x1="0" y1="0" x2="-1.27" y2="-1.905" width="0.254" layer="94"/>
<text x="-2.54" y="-5.08" size="1.778" layer="96" rot="R90">&gt;VALUE</text>
<pin name="+3V3" x="0" y="-2.54" visible="off" length="short" direction="sup" rot="R90"/>
</symbol>
<symbol name="GND" urn="urn:adsk.eagle:symbol:26925/1" library_version="1">
<wire x1="-1.905" y1="0" x2="1.905" y2="0" width="0.254" layer="94"/>
<text x="-2.54" y="-2.54" size="1.778" layer="96">&gt;VALUE</text>
<pin name="GND" x="0" y="2.54" visible="off" length="short" direction="sup" rot="R270"/>
</symbol>
</symbols>
<devicesets>
<deviceset name="+3V3" urn="urn:adsk.eagle:component:26981/1" prefix="+3V3" library_version="1">
<description>&lt;b&gt;SUPPLY SYMBOL&lt;/b&gt;</description>
<gates>
<gate name="G$1" symbol="+3V3" x="0" y="0"/>
</gates>
<devices>
<device name="">
<technologies>
<technology name=""/>
</technologies>
</device>
</devices>
</deviceset>
<deviceset name="GND" urn="urn:adsk.eagle:component:26954/1" prefix="GND" library_version="1">
<description>&lt;b&gt;SUPPLY SYMBOL&lt;/b&gt;</description>
<gates>
<gate name="1" symbol="GND" x="0" y="0"/>
</gates>
<devices>
<device name="">
<technologies>
<technology name=""/>
</technologies>
</device>
</devices>
</deviceset>
</devicesets>
</library>
<library name="frames" urn="urn:adsk.eagle:library:229">
<description>&lt;b&gt;Frames for Sheet and Layout&lt;/b&gt;</description>
<packages>
</packages>
<symbols>
<symbol name="A4L-LOC" urn="urn:adsk.eagle:symbol:13874/1" library_version="1">
<wire x1="256.54" y1="3.81" x2="256.54" y2="8.89" width="0.1016" layer="94"/>
<wire x1="256.54" y1="8.89" x2="256.54" y2="13.97" width="0.1016" layer="94"/>
<wire x1="256.54" y1="13.97" x2="256.54" y2="19.05" width="0.1016" layer="94"/>
<wire x1="256.54" y1="19.05" x2="256.54" y2="24.13" width="0.1016" layer="94"/>
<wire x1="161.29" y1="3.81" x2="161.29" y2="24.13" width="0.1016" layer="94"/>
<wire x1="161.29" y1="24.13" x2="215.265" y2="24.13" width="0.1016" layer="94"/>
<wire x1="215.265" y1="24.13" x2="256.54" y2="24.13" width="0.1016" layer="94"/>
<wire x1="246.38" y1="3.81" x2="246.38" y2="8.89" width="0.1016" layer="94"/>
<wire x1="246.38" y1="8.89" x2="256.54" y2="8.89" width="0.1016" layer="94"/>
<wire x1="246.38" y1="8.89" x2="215.265" y2="8.89" width="0.1016" layer="94"/>
<wire x1="215.265" y1="8.89" x2="215.265" y2="3.81" width="0.1016" layer="94"/>
<wire x1="215.265" y1="8.89" x2="215.265" y2="13.97" width="0.1016" layer="94"/>
<wire x1="215.265" y1="13.97" x2="256.54" y2="13.97" width="0.1016" layer="94"/>
<wire x1="215.265" y1="13.97" x2="215.265" y2="19.05" width="0.1016" layer="94"/>
<wire x1="215.265" y1="19.05" x2="256.54" y2="19.05" width="0.1016" layer="94"/>
<wire x1="215.265" y1="19.05" x2="215.265" y2="24.13" width="0.1016" layer="94"/>
<text x="217.17" y="15.24" size="2.54" layer="94">&gt;DRAWING_NAME</text>
<text x="217.17" y="10.16" size="2.286" layer="94">&gt;LAST_DATE_TIME</text>
<text x="230.505" y="5.08" size="2.54" layer="94">&gt;SHEET</text>
<text x="216.916" y="4.953" size="2.54" layer="94">Sheet:</text>
<frame x1="0" y1="0" x2="260.35" y2="179.07" columns="6" rows="4" layer="94"/>
</symbol>
</symbols>
<devicesets>
<deviceset name="A4L-LOC" urn="urn:adsk.eagle:component:13926/1" prefix="FRAME" uservalue="yes" library_version="1">
<description>&lt;b&gt;FRAME&lt;/b&gt;&lt;p&gt;
DIN A4, landscape with location and doc. field</description>
<gates>
<gate name="G$1" symbol="A4L-LOC" x="0" y="0"/>
</gates>
<devices>
<device name="">
<technologies>
<technology name=""/>
</technologies>
</device>
</devices>
</deviceset>
</devicesets>
</library>
</libraries>
<attributes>
</attributes>
<variantdefs>
</variantdefs>
<classes>
<class number="0" name="default" width="0" drill="0">
</class>
</classes>
<parts>
<part name="R3" library="fab" library_urn="urn:adsk.eagle:library:9340542" deviceset="RES-US" device="1206FAB" package3d_urn="urn:adsk.eagle:package:9340722/2" value="430"/>
<part name="R4" library="fab" library_urn="urn:adsk.eagle:library:9340542" deviceset="RES-US" device="1206FAB" package3d_urn="urn:adsk.eagle:package:9340722/2" value="430"/>
<part name="LED_ALIM" library="fab" library_urn="urn:adsk.eagle:library:9340542" deviceset="LED" device="FAB1206" package3d_urn="urn:adsk.eagle:package:9340753/2"/>
<part name="R5" library="fab" library_urn="urn:adsk.eagle:library:9340542" deviceset="RES-US" device="1206FAB" package3d_urn="urn:adsk.eagle:package:9340722/2"/>
<part name="P+2" library="supply1" library_urn="urn:adsk.eagle:library:371" deviceset="+3V3" device=""/>
<part name="GND2" library="supply1" library_urn="urn:adsk.eagle:library:371" deviceset="GND" device=""/>
<part name="U2" library="OXYMETRE_COVID19" library_urn="urn:adsk.eagle:library:19284696" deviceset="P82B715D" device="" package3d_urn="urn:adsk.eagle:package:19285021/1"/>
<part name="U1" library="OXYMETRE_COVID19" library_urn="urn:adsk.eagle:library:19284696" deviceset="MAXREFDES117" device="" package3d_urn="urn:adsk.eagle:package:19284699/3"/>
<part name="J1" library="fab" library_urn="urn:adsk.eagle:library:9340542" deviceset="CONN_03X2" device="NO_SILK" package3d_urn="urn:adsk.eagle:package:9340789/1"/>
<part name="GND4" library="supply1" library_urn="urn:adsk.eagle:library:371" deviceset="GND" device=""/>
<part name="R6" library="fab" library_urn="urn:adsk.eagle:library:9340542" deviceset="RES-US" device="1206FAB" package3d_urn="urn:adsk.eagle:package:9340722/2"/>
<part name="LED_TEMOIN" library="fab" library_urn="urn:adsk.eagle:library:9340542" deviceset="LED" device="FAB1206" package3d_urn="urn:adsk.eagle:package:9340753/2"/>
<part name="FRAME1" library="frames" library_urn="urn:adsk.eagle:library:229" deviceset="A4L-LOC" device=""/>
</parts>
<sheets>
<sheet>
<plain>
<text x="161.29" y="26.67" size="1.778" layer="97">(1) RJ12 - Paires torsadées</text>
<text x="153.416" y="90.932" size="1.778" layer="97">(1)</text>
</plain>
<instances>
<instance part="R3" gate="G$1" x="137.16" y="109.22" smashed="yes" rot="R90">
<attribute name="NAME" x="137.668" y="112.2426" size="1.778" layer="95"/>
<attribute name="VALUE" x="131.826" y="108.458" size="1.778" layer="96"/>
</instance>
<instance part="R4" gate="G$1" x="144.78" y="109.22" smashed="yes" rot="R90">
<attribute name="NAME" x="145.288" y="112.2426" size="1.778" layer="95"/>
<attribute name="VALUE" x="146.05" y="108.458" size="1.778" layer="96"/>
</instance>
<instance part="LED_ALIM" gate="G$1" x="177.8" y="76.2" smashed="yes">
<attribute name="NAME" x="181.61" y="70.104" size="1.778" layer="95" rot="R90"/>
</instance>
<instance part="R5" gate="G$1" x="177.8" y="88.9" smashed="yes" rot="R90">
<attribute name="NAME" x="176.3014" y="85.09" size="1.778" layer="95" rot="R90"/>
<attribute name="VALUE" x="181.102" y="85.09" size="1.778" layer="96" rot="R90"/>
</instance>
<instance part="P+2" gate="G$1" x="114.3" y="121.92" smashed="yes">
<attribute name="VALUE" x="111.76" y="122.936" size="1.778" layer="96"/>
</instance>
<instance part="GND2" gate="1" x="114.3" y="60.96" smashed="yes">
<attribute name="VALUE" x="111.76" y="58.42" size="1.778" layer="96"/>
</instance>
<instance part="U2" gate="A" x="114.3" y="93.98" smashed="yes">
<attribute name="NAME" x="101.8715" y="107.5175" size="2.08623125" layer="95" ratio="10" rot="SR0"/>
<attribute name="VALUE" x="112.56716875" y="77.5165" size="2.08555" layer="96" ratio="10" rot="SR0"/>
</instance>
<instance part="U1" gate="A" x="68.58" y="96.52" smashed="yes">
<attribute name="NAME" x="68.73878125" y="105.0481" size="2.090490625" layer="95" ratio="10" rot="SR0"/>
<attribute name="VALUE" x="57.05478125" y="85.9981" size="2.090490625" layer="95" ratio="10" rot="SR0"/>
</instance>
<instance part="J1" gate="G$1" x="154.94" y="99.06" smashed="yes">
<attribute name="NAME" x="151.384" y="104.648" size="1.778" layer="95" font="vector"/>
<attribute name="VALUE" x="151.638" y="93.218" size="1.778" layer="96" font="vector" align="top-left"/>
</instance>
<instance part="GND4" gate="1" x="170.18" y="93.98" smashed="yes">
<attribute name="VALUE" x="167.64" y="91.44" size="1.778" layer="96"/>
</instance>
<instance part="R6" gate="G$1" x="165.1" y="88.9" smashed="yes" rot="R90">
<attribute name="NAME" x="163.6014" y="85.09" size="1.778" layer="95" rot="R90"/>
<attribute name="VALUE" x="168.402" y="85.09" size="1.778" layer="96" rot="R90"/>
</instance>
<instance part="LED_TEMOIN" gate="G$1" x="165.1" y="76.2" smashed="yes">
<attribute name="NAME" x="168.91" y="69.088" size="1.778" layer="95" rot="R90"/>
</instance>
<instance part="FRAME1" gate="G$1" x="0" y="0" smashed="yes">
<attribute name="DRAWING_NAME" x="166.37" y="12.7" size="2.54" layer="94"/>
<attribute name="LAST_DATE_TIME" x="217.17" y="10.16" size="2.286" layer="94"/>
<attribute name="SHEET" x="230.505" y="5.08" size="2.54" layer="94"/>
</instance>
</instances>
<busses>
</busses>
<nets>
<net name="N$1" class="0">
<segment>
<wire x1="81.28" y1="96.52" x2="96.52" y2="96.52" width="0.1524" layer="91"/>
<pinref part="U1" gate="A" pin="SDA"/>
<pinref part="U2" gate="A" pin="SX"/>
</segment>
</net>
<net name="N$2" class="0">
<segment>
<wire x1="81.28" y1="93.98" x2="96.52" y2="93.98" width="0.1524" layer="91"/>
<pinref part="U1" gate="A" pin="SCL"/>
<pinref part="U2" gate="A" pin="SY"/>
</segment>
</net>
<net name="GND" class="0">
<segment>
<pinref part="GND4" gate="1" pin="GND"/>
<pinref part="J1" gate="G$1" pin="4"/>
<wire x1="162.56" y1="99.06" x2="170.18" y2="99.06" width="0.1524" layer="91"/>
<wire x1="170.18" y1="99.06" x2="170.18" y2="96.52" width="0.1524" layer="91"/>
</segment>
<segment>
<pinref part="U2" gate="A" pin="GND"/>
<wire x1="96.52" y1="81.28" x2="91.44" y2="81.28" width="0.1524" layer="91"/>
<wire x1="91.44" y1="81.28" x2="91.44" y2="66.04" width="0.1524" layer="91"/>
<wire x1="91.44" y1="66.04" x2="114.3" y2="66.04" width="0.1524" layer="91"/>
<pinref part="LED_TEMOIN" gate="G$1" pin="C"/>
<wire x1="114.3" y1="66.04" x2="165.1" y2="66.04" width="0.1524" layer="91"/>
<wire x1="165.1" y1="66.04" x2="165.1" y2="73.66" width="0.1524" layer="91"/>
<pinref part="LED_ALIM" gate="G$1" pin="C"/>
<wire x1="165.1" y1="66.04" x2="177.8" y2="66.04" width="0.1524" layer="91"/>
<wire x1="177.8" y1="66.04" x2="177.8" y2="73.66" width="0.1524" layer="91"/>
<junction x="165.1" y="66.04"/>
<pinref part="GND2" gate="1" pin="GND"/>
<wire x1="114.3" y1="63.5" x2="114.3" y2="66.04" width="0.1524" layer="91"/>
<junction x="114.3" y="66.04"/>
<wire x1="81.28" y1="91.44" x2="86.36" y2="91.44" width="0.1524" layer="91"/>
<pinref part="U1" gate="A" pin="GND"/>
<wire x1="86.36" y1="91.44" x2="86.36" y2="81.28" width="0.1524" layer="91"/>
<wire x1="86.36" y1="81.28" x2="91.44" y2="81.28" width="0.1524" layer="91"/>
<junction x="91.44" y="81.28"/>
</segment>
</net>
<net name="N$5" class="0">
<segment>
<pinref part="R5" gate="G$1" pin="1"/>
<pinref part="LED_ALIM" gate="G$1" pin="A"/>
<wire x1="177.8" y1="81.28" x2="177.8" y2="83.82" width="0.1524" layer="91"/>
</segment>
</net>
<net name="N$3" class="0">
<segment>
<pinref part="R3" gate="G$1" pin="1"/>
<wire x1="137.16" y1="104.14" x2="137.16" y2="101.6" width="0.1524" layer="91"/>
<pinref part="U2" gate="A" pin="LX"/>
<wire x1="137.16" y1="101.6" x2="132.08" y2="101.6" width="0.1524" layer="91"/>
<wire x1="137.16" y1="101.6" x2="147.32" y2="101.6" width="0.1524" layer="91"/>
<junction x="137.16" y="101.6"/>
<pinref part="J1" gate="G$1" pin="1"/>
</segment>
</net>
<net name="N$6" class="0">
<segment>
<pinref part="U2" gate="A" pin="LY"/>
<wire x1="132.08" y1="99.06" x2="144.78" y2="99.06" width="0.1524" layer="91"/>
<pinref part="R4" gate="G$1" pin="1"/>
<wire x1="144.78" y1="99.06" x2="144.78" y2="104.14" width="0.1524" layer="91"/>
<wire x1="144.78" y1="99.06" x2="147.32" y2="99.06" width="0.1524" layer="91"/>
<junction x="144.78" y="99.06"/>
<pinref part="J1" gate="G$1" pin="3"/>
</segment>
</net>
<net name="INT" class="0">
<segment>
<pinref part="J1" gate="G$1" pin="5"/>
<wire x1="147.32" y1="96.52" x2="144.78" y2="93.98" width="0.1524" layer="91"/>
<wire x1="144.78" y1="93.98" x2="134.62" y2="93.98" width="0.1524" layer="91"/>
<label x="134.62" y="94.742" size="1.778" layer="95"/>
</segment>
<segment>
<pinref part="U1" gate="A" pin="INT"/>
<wire x1="81.28" y1="99.06" x2="83.82" y2="99.06" width="0.1524" layer="91"/>
<label x="84.328" y="98.552" size="1.778" layer="95"/>
</segment>
</net>
<net name="N$4" class="0">
<segment>
<pinref part="R6" gate="G$1" pin="1"/>
<pinref part="LED_TEMOIN" gate="G$1" pin="A"/>
<wire x1="165.1" y1="83.82" x2="165.1" y2="81.28" width="0.1524" layer="91"/>
</segment>
</net>
<net name="N$7" class="0">
<segment>
<pinref part="J1" gate="G$1" pin="6"/>
<wire x1="162.56" y1="96.52" x2="165.1" y2="96.52" width="0.1524" layer="91"/>
<pinref part="R6" gate="G$1" pin="2"/>
<wire x1="165.1" y1="96.52" x2="165.1" y2="93.98" width="0.1524" layer="91"/>
</segment>
</net>
<net name="+5V" class="0">
<segment>
<wire x1="81.28" y1="101.6" x2="91.44" y2="101.6" width="0.1524" layer="91"/>
<pinref part="U1" gate="A" pin="VIN"/>
<pinref part="U2" gate="A" pin="VCC"/>
<wire x1="96.52" y1="101.6" x2="91.44" y2="101.6" width="0.1524" layer="91"/>
<wire x1="91.44" y1="101.6" x2="91.44" y2="116.84" width="0.1524" layer="91"/>
<wire x1="91.44" y1="116.84" x2="114.3" y2="116.84" width="0.1524" layer="91"/>
<pinref part="R4" gate="G$1" pin="2"/>
<wire x1="114.3" y1="116.84" x2="137.16" y2="116.84" width="0.1524" layer="91"/>
<wire x1="137.16" y1="116.84" x2="144.78" y2="116.84" width="0.1524" layer="91"/>
<wire x1="144.78" y1="116.84" x2="144.78" y2="114.3" width="0.1524" layer="91"/>
<pinref part="R3" gate="G$1" pin="2"/>
<wire x1="137.16" y1="114.3" x2="137.16" y2="116.84" width="0.1524" layer="91"/>
<junction x="137.16" y="116.84"/>
<junction x="144.78" y="116.84"/>
<wire x1="144.78" y1="116.84" x2="170.18" y2="116.84" width="0.1524" layer="91"/>
<wire x1="170.18" y1="116.84" x2="170.18" y2="101.6" width="0.1524" layer="91"/>
<pinref part="J1" gate="G$1" pin="2"/>
<wire x1="170.18" y1="101.6" x2="162.56" y2="101.6" width="0.1524" layer="91"/>
<wire x1="170.18" y1="116.84" x2="177.8" y2="116.84" width="0.1524" layer="91"/>
<junction x="170.18" y="116.84"/>
<pinref part="R5" gate="G$1" pin="2"/>
<wire x1="177.8" y1="116.84" x2="177.8" y2="93.98" width="0.1524" layer="91"/>
<pinref part="P+2" gate="G$1" pin="+3V3"/>
<wire x1="114.3" y1="119.38" x2="114.3" y2="116.84" width="0.1524" layer="91"/>
<junction x="114.3" y="116.84"/>
<junction x="91.44" y="101.6"/>
</segment>
</net>
</nets>
</sheet>
</sheets>
</schematic>
</drawing>
<compatibility>
<note version="8.2" severity="warning">
Since Version 8.2, EAGLE supports online libraries. The ids
of those online libraries will not be understood (or retained)
with this version.
</note>
<note version="8.3" severity="warning">
Since Version 8.3, EAGLE supports URNs for individual library
assets (packages, symbols, and devices). The URNs of those assets
will not be understood (or retained) with this version.
</note>
<note version="8.3" severity="warning">
Since Version 8.3, EAGLE supports the association of 3D packages
with devices in libraries, schematics, and board files. Those 3D
packages will not be understood (or retained) with this version.
</note>
<note version="8.5" severity="warning">
Since Version 8.5, EAGLE supports locking for holes, vias, wires and polygons. 
The locking property on all objects of these types will not be understood in this version. 
</note>
</compatibility>
</eagle>
