INDEX VERSION 1.126+/home/lamnt/Workspace/20192/nprog/.metadata/.plugins/org.eclipse.jdt.core
1855855242.index
389902914.index
1628687906.index
3927879410.index
3883508318.index
3512161136.index
925982370.index
3530540584.index
502732891.index
462052834.index
3066711521.index
281680745.index
2253745042.index
1089239932.index
3485262699.index
2359322674.index
3634920015.index
813341167.index
3539432263.index
2799842069.index
2744878784.index
821608291.index
