{
  "/usr/lib/jvm/java-8-openjdk-amd64/jre/lib/rt.jar": {
    "location": "/usr/lib/jvm/java-8-openjdk-amd64/jre/lib/rt.jar",
    "status": "UNRESOLVED",
    "error": "No call model found for \u0027/usr/lib/jvm/java-8-openjdk-amd64/jre/lib/rt.jar\u0027. Neither fingerprint \u002707bbffd342f3bd6c5a3835b790765a676d46bb9e\u0027 nor symbolic name \u0027jre\u0027 are known."
  },
  "/home/lamnt/Workspace/20192/nprog/Synchronization/src": {
    "location": "/home/lamnt/Workspace/20192/nprog/Synchronization/src",
    "status": "UNRESOLVED",
    "error": "No class path info available for \u0027/home/lamnt/Workspace/20192/nprog/Synchronization/src\u0027. Skipped."
  },
  "/home/lamnt/Workspace/20192/nprog/SynchronizationTest/src": {
    "location": "/home/lamnt/Workspace/20192/nprog/SynchronizationTest/src",
    "status": "UNRESOLVED",
    "error": "No class path info available for \u0027/home/lamnt/Workspace/20192/nprog/SynchronizationTest/src\u0027. Skipped."
  }
}