<svg xmlns="http://www.w3.org/2000/svg" width="118.017" height="30.582" viewBox="0 0 118.017 30.582">
  <g id="Group_49728" data-name="Group 49728" transform="translate(0 0)">
    <g id="SvgjsG1402" transform="translate(0 0)">
      <path id="Path_24" data-name="Path 24" d="M287.642,81.154a7.183,7.183,0,0,0,4.448,10.159,7.192,7.192,0,0,0-4.448-10.159Z" transform="translate(-278.723 -81.154)" fill="#fd7b02"/>
      <path id="Path_25" data-name="Path 25" d="M90.276,287.826a7.192,7.192,0,0,0-10.4-4.42,7.187,7.187,0,0,0,10.4,4.42Z" transform="translate(-79.874 -274.597)" fill="#fd7b02"/>
      <path id="Path_26" data-name="Path 26" d="M501.468,592.952A7.185,7.185,0,0,0,505.54,603.4a7.19,7.19,0,0,0-4.073-10.448Z" transform="translate(-483.961 -572.818)" fill="#fd7b02"/>
      <path id="Path_27" data-name="Path 27" d="M597.908,501.953a7.193,7.193,0,0,0,10.2,4.132,7.189,7.189,0,0,0-10.2-4.132Z" transform="translate(-577.529 -484.6)" fill="#fd7b02"/>
      <path id="Path_28" data-name="Path 28" d="M286.866,599.815a7.155,7.155,0,0,0,.961,3.58,7.185,7.185,0,0,0,4.072-10.449A7.2,7.2,0,0,0,286.866,599.815Z" transform="translate(-278.723 -572.812)" fill="#fd7b02"/>
      <path id="Path_29" data-name="Path 29" d="M92.717,501.939a7.188,7.188,0,0,0-10.2,4.133,7.193,7.193,0,0,0,10.2-4.133Z" transform="translate(-82.413 -484.586)" fill="#fd7b02"/>
      <path id="Path_30" data-name="Path 30" d="M506.462,84.385a7.155,7.155,0,0,0-.777-3.239,7.193,7.193,0,0,0-4.446,10.159A7.2,7.2,0,0,0,506.462,84.385Z" transform="translate(-483.922 -81.146)" fill="#fd7b02"/>
      <path id="Path_31" data-name="Path 31" d="M595.43,287.826a7.186,7.186,0,0,0,10.4-4.42,7.192,7.192,0,0,0-10.4,4.42Z" transform="translate(-575.148 -274.597)" fill="#fd7b02"/>
    </g>
    <g id="SvgjsG1403" transform="translate(37.015 1.595)">
      <path id="Path_32" data-name="Path 32" d="M73.745,249.024a5.459,5.459,0,0,1-2.374,1.107,13.5,13.5,0,0,1-3.073.349q-.786,0-2.432-.029t-4.209-.087l-.2-.175v-19.6l.2-.175q1.689-.058,3.393-.087t3.481-.029a9.268,9.268,0,0,1,4.063.786,6.567,6.567,0,0,1,2.578,2.17,8.807,8.807,0,0,1,1.354,3.219,18.747,18.747,0,0,1,.393,3.932,17.049,17.049,0,0,1-.655,5.024A7.313,7.313,0,0,1,73.745,249.024Zm-1.6-13.311a3.48,3.48,0,0,0-3.612-2.33H66.726l-1.369-.029v14.068q.553-.029,1.267-.029t1.442-.029q.728-.029,1.354-.117a3.366,3.366,0,0,0,1.034-.291,3.538,3.538,0,0,0,1.238-1.092,5.348,5.348,0,0,0,.743-1.573,10.39,10.39,0,0,0,.364-1.922q.1-1.034.1-2.141a15.878,15.878,0,0,0-.16-2.33A9.917,9.917,0,0,0,72.143,235.713Zm12.321,9.641-.029,1.806,2.039-.058H93.61a8.786,8.786,0,0,1-.087,1.427,2.19,2.19,0,0,1-2.5,1.864H82.833a2.166,2.166,0,0,1-1.646-.626,2.368,2.368,0,0,1-.6-1.7V230.645l.2-.2H92.94A7.939,7.939,0,0,1,93.086,232a5.177,5.177,0,0,1-.32,1.733h-8.33l.029,2.01v3l1.893-.029H91.28a5.623,5.623,0,0,1,0,3.2H84.464Zm22.748.466-1.427.029h-4.078l-1.427-.029-1.369,4.544a7.912,7.912,0,0,1-1.733.146,5.275,5.275,0,0,1-1.82-.262l-.146-.2,6.5-19.6a17.437,17.437,0,0,1,2.33-.146,11.991,11.991,0,0,1,2.185.175l6.379,19.6a3.934,3.934,0,0,1-2.024.5,2.593,2.593,0,0,1-1.689-.437,3.439,3.439,0,0,1-.859-1.66Zm-5.971-3.087,1.311-.029h2.5l1.223.029-.874-2.971q-.99-3.321-1.573-5.651h-.175q-.262,1.252-1.282,4.922Zm20.738,4.282H127.4a8.08,8.08,0,0,1-.117,1.485q-.32,1.893-2.534,1.893h-7.078a2.214,2.214,0,0,1-1.66-.626,2.334,2.334,0,0,1-.612-1.7V230.47l.2-.2h1.456a2.238,2.238,0,0,1,1.719.6,2.748,2.748,0,0,1,.553,1.908v14.36Q120.581,247.014,121.98,247.014Zm15.059,0h5.418a8.083,8.083,0,0,1-.117,1.485q-.32,1.893-2.534,1.893h-7.078a2.214,2.214,0,0,1-1.66-.626,2.334,2.334,0,0,1-.612-1.7V230.47l.2-.2h1.456a2.237,2.237,0,0,1,1.718.6,2.748,2.748,0,0,1,.553,1.908v14.36Q135.64,247.014,137.038,247.014Z" transform="translate(-61.454 -230.266)" fill="#fff"/>
    </g>
    <g id="SvgjsG1404" transform="translate(51.056 25.209)">
      <path id="Path_33" data-name="Path 33" d="M8.7,39.657v3.786H8.248V39.657Zm6.069,0v.422H13.717v3.364h-.449V40.079H12.214v-.422Zm3.83,0V40.6h-.449v-.946Zm4.436-.065a1.283,1.283,0,0,1,1.184.795l-.341.184A.921.921,0,0,0,23.032,40c-.416,0-.7.238-.7.568,0,.308.195.5.606.66l.276.1c.681.254,1.109.546,1.109,1.147a1.159,1.159,0,0,1-1.265,1.049,1.327,1.327,0,0,1-1.32-.93l.362-.173a.971.971,0,0,0,.957.692c.433,0,.8-.249.8-.633,0-.433-.3-.595-.752-.768l-.281-.108c-.573-.216-.941-.514-.941-1.049A1.04,1.04,0,0,1,23.032,39.592Zm12.484.065L34.1,41.7v1.747h-.449V41.7l-1.412-2.039h.514l1.119,1.628L35,39.657Zm5.317-.054A1.947,1.947,0,1,1,38.9,41.55,1.949,1.949,0,0,1,40.833,39.6Zm0,3.467a1.52,1.52,0,1,0-1.471-1.52A1.508,1.508,0,0,0,40.833,43.07Zm7.778-3.412h.449v2.412a1.376,1.376,0,1,1-2.747,0V39.657h.449v2.412a.93.93,0,1,0,1.85,0Zm6.853,3.786h-.487L54.02,42.08h-.887v1.363h-.449V39.657h1.233a1.207,1.207,0,0,1,1.341,1.222A1.118,1.118,0,0,1,54.447,42Zm-2.331-3.364v1.6h.773c.546,0,.9-.281.9-.8s-.357-.8-.9-.8Zm6.848-.487a1.283,1.283,0,0,1,1.184.795l-.341.184A.921.921,0,0,0,59.981,40c-.416,0-.7.238-.7.568,0,.308.195.5.606.66l.276.1c.681.254,1.109.546,1.109,1.147A1.159,1.159,0,0,1,60,43.524a1.327,1.327,0,0,1-1.32-.93l.362-.173a.971.971,0,0,0,.957.692c.433,0,.8-.249.8-.633,0-.433-.3-.595-.752-.768L59.77,41.6c-.573-.216-.941-.514-.941-1.049a1.04,1.04,0,0,1,1.152-.963Z" transform="translate(-8.248 -39.592)" fill="#fff"/>
    </g>
  </g>
</svg>
