{
  "type": "service_account",
  "project_id": "vernal-day-212908",
  "private_key_id": "d136fcbd8e3a5cbfd303e85860400f8b7d94d3e2",
  "private_key": "-----BEGIN PRIVATE KEY-----\nMIIEvwIBADANBgkqhkiG9w0BAQEFAASCBKkwggSlAgEAAoIBAQCusuRRXhRCTjeq\nzET4Pcyog4m9mJ1jjyqAaHiZMfI6ajLV+jGDIIqjbYXGov/fZzKhUqiR8cD923jZ\n23x4nCoM71dmgpG+bYnmyxZsZSrBrpUbpQ08Df1JO/cuaNqyqwiC+oqKq8qHYtFZ\nJ6vtgVUBuGDUlcI0X+snbThdpsJ7Zzf8PvuvD7iyza4iRyOCXBpJwnfMa39n05nb\nJRR7KQE5OIIILLY9MuVSv4JDcOTWfDNLhILNB2++KB22GnZSy9xqQwzWC60KUFqm\ncmxD0kq7WNNuRWRPASGAXrjUsoAXIVdZsitLwBr1SDnepkNQzG0yJ1noRDqAfxta\nTwWrI+JRAgMBAAECggEAB5sFLUpYZ8c/otbFcpM/hjSXz2Jws7ASFx4KkLd9HAWZ\n6fk8T5ZKmDEr9PO4ClypS8mtShFJfXkhFUb6GnFzXosgSyJdwE8aL6s2x4hN/g72\nMd++fZdUUsG4Ef6sSsFUcQisSxDjPn/9rOZ5FIbKvHTvo5b+KfPlE8XXAYjBiHK/\nA6YdDpeaAAaPQUvKWAc6Syi6t5Zhz0/IzVLJieR5hYI89b/A5CKM/cNYhaLp4lSw\noCxueXeTFWSmNKwIZ4OnIqlZMNYpPMKT4klXIrXeA+TwkKF7/Tj9APagS/SCmXuu\nC2vkGj+Mp9CQg3rp12oLIcQ0P2/lsELSr1hQ31heewKBgQDcKgI5QDfnzJ151DMz\nkXVmFdbrPAHze9IO+Vb16Ud4KQOvelYm30Nnt0SIbVNctPcDNhS/m/bPbNRGNbln\nHQakmUt39gEo4Bz33jI7LZRLLwUvElAxyAlV3l3WF9SzDr0hXkk4kIFimoJJ6tP8\nwiH0oa6DYjj4Ig8xtZ1lR0ij7wKBgQDLImUh1kBtSwx0JGlblQ+1jxBFyaIFy7Yp\n1b59YMFkRxCTkX9o3rnPFEtpPxG+/Z+pGtwbXtH6kZ/YR7n0d8IE9XyRKjZD9XWH\ns4Tl6GhQLCF5erbMRGTlQOyoyHz3yYtEwzumYMYUJ8KDZXMUHhJO8vW0LR0WmU+D\nCvcVfxidvwKBgQCoLXbRYNrTuJu6inwqMjzppFkuDAK5iaYmRhVFd9NeWIY2L09M\nFlQZEAfL5yc8tAfUbiVfULYyMMHed/+OYr/GUEsz8bllDf1S4mqgheq3m81r7aNQ\nw6tN6rTnbADQXrvel3V7Pfd36OsJp9YTSABELJVwS0GVWf8dS8xVpyQ4BQKBgQCP\nb/EjrIt/4V+g31k6Hw6hsKzX6qIrH4a5EcJZ/ClzKq8s1K+4GJXyAK2jWrKoP6Uv\nHtVPymvRWGUbrsJDOxFYuRPF2Z3J7RiZwwzT34FRI2hbxGgx4xWvwGGcaT29Jqbd\n3lJPkMQt1UmHyOoyyW06LFuNZ9HDdGxt5x9EIaP7NwKBgQDOWQDoDUeE3zKGnZry\nULrEuaVHVHQAnX3twrDcgpgNnWylDKSeEdZMYQo1PvuAOU9MVd5KKDZ38I/IrkOb\nlaHaj/IAWwahOmP3WQQRuZeDD28My5Dhe9rPnRPHK17aISTCmd9lhsY2i4l7OULA\nj0Jeu/O4u1NQSfbcc5hOqc9rxw==\n-----END PRIVATE KEY-----\n",
  "client_email": "lakkanna@vernal-day-212908.iam.gserviceaccount.com",
  "client_id": "101839990087099071863",
  "auth_uri": "https://accounts.google.com/o/oauth2/auth",
  "token_uri": "https://oauth2.googleapis.com/token",
  "auth_provider_x509_cert_url": "https://www.googleapis.com/oauth2/v1/certs",
  "client_x509_cert_url": "https://www.googleapis.com/robot/v1/metadata/x509/lakkanna%40vernal-day-212908.iam.gserviceaccount.com"
}
