<svg width="14" height="8" viewBox="0 0 14 8" fill="none" xmlns="http://www.w3.org/2000/svg">
<path d="M7.00072 5.17205L11.9507 0.222046L13.3647 1.63605L7.00072 8.00005L0.636719 1.63605L2.05072 0.222046L7.00072 5.17205Z" fill="white"/>
</svg>
